SuccessConsole Output

11:30:37 [2020-10-06T15:30:37.606Z] + mvn clean verify -f developers/org.eclipse.ease.helpgenerator/pom.xml
11:30:37 [2020-10-06T15:30:37.607Z] ----- withMaven Wrapper script -----
11:30:38 [2020-10-06T15:30:38.638Z] Picked up JAVA_TOOL_OPTIONS: -Dmaven.ext.class.path="/home/jenkins/agent/workspace/ease.verify.core.gerrit@tmp/withMavenec756adb/pipeline-maven-spy.jar" -Dorg.jenkinsci.plugins.pipeline.maven.reportsFolder="/home/jenkins/agent/workspace/ease.verify.core.gerrit@tmp/withMavenec756adb" 
11:30:39 [2020-10-06T15:30:39.202Z] Apache Maven 3.6.3 (cecedd343002696d0abb50b32b541b8a6ba2883f)
11:30:39 [2020-10-06T15:30:39.202Z] Maven home: /opt/tools/apache-maven/latest
11:30:39 [2020-10-06T15:30:39.202Z] Java version: 9.0.4, vendor: Oracle Corporation, runtime: /opt/tools/java/oracle/jdk-9/9.0.4
11:30:39 [2020-10-06T15:30:39.202Z] Default locale: en_US, platform encoding: UTF-8
11:30:39 [2020-10-06T15:30:39.202Z] OS name: "linux", version: "3.10.0-1062.el7.x86_64", arch: "amd64", family: "unix"
11:30:41 [2020-10-06T15:30:41.211Z] [INFO] [jenkins-event-spy] Generate /home/jenkins/agent/workspace/ease.verify.core.gerrit@tmp/withMavenec756adb/maven-spy-20201006-153041-2311951687192273435110.log.tmp ...
11:30:41 [2020-10-06T15:30:41.795Z] [INFO] Scanning for projects...
11:30:42 [2020-10-06T15:30:42.088Z] [WARNING] The project org.eclipse.ease:org.eclipse.ease.helpgenerator:jar:0.8.0-SNAPSHOT uses prerequisites which is only intended for maven-plugin projects but not for non maven-plugin projects. For such purposes you should use the maven-enforcer-plugin. See https://maven.apache.org/enforcer/enforcer-rules/requireMavenVersion.html
11:30:42 [2020-10-06T15:30:42.088Z] [INFO] 
11:30:42 [2020-10-06T15:30:42.088Z] [INFO] ----------< org.eclipse.ease:org.eclipse.ease.helpgenerator >-----------
11:30:42 [2020-10-06T15:30:42.088Z] [INFO] Building org.eclipse.ease.helpgenerator 0.8.0-SNAPSHOT
11:30:42 [2020-10-06T15:30:42.088Z] [INFO] --------------------------------[ jar ]---------------------------------
11:30:44 [2020-10-06T15:30:44.086Z] [INFO] 
11:30:44 [2020-10-06T15:30:44.086Z] [INFO] --- maven-clean-plugin:2.5:clean (default-clean) @ org.eclipse.ease.helpgenerator ---
11:30:44 [2020-10-06T15:30:44.343Z] [INFO] 
11:30:44 [2020-10-06T15:30:44.343Z] [INFO] --- maven-resources-plugin:2.6:resources (default-resources) @ org.eclipse.ease.helpgenerator ---
11:30:45 [2020-10-06T15:30:45.724Z] [INFO] Using 'UTF-8' encoding to copy filtered resources.
11:30:45 [2020-10-06T15:30:45.724Z] [INFO] skip non existing resourceDirectory /home/jenkins/agent/workspace/ease.verify.core.gerrit/developers/org.eclipse.ease.helpgenerator/src/main/resources
11:30:45 [2020-10-06T15:30:45.724Z] [INFO] 
11:30:45 [2020-10-06T15:30:45.724Z] [INFO] --- maven-compiler-plugin:3.6.1:compile (default-compile) @ org.eclipse.ease.helpgenerator ---
11:30:48 [2020-10-06T15:30:48.286Z] [INFO] Changes detected - recompiling the module!
11:30:48 [2020-10-06T15:30:48.286Z] [INFO] Compiling 24 source files to /home/jenkins/agent/workspace/ease.verify.core.gerrit/developers/org.eclipse.ease.helpgenerator/target/classes
11:30:52 [2020-10-06T15:30:52.891Z] [INFO] /home/jenkins/agent/workspace/ease.verify.core.gerrit/developers/org.eclipse.ease.helpgenerator/src/org/eclipse/ease/helpgenerator/sunapi/Java5ClassModel.java: Some input files use or override a deprecated API.
11:30:52 [2020-10-06T15:30:52.892Z] [INFO] /home/jenkins/agent/workspace/ease.verify.core.gerrit/developers/org.eclipse.ease.helpgenerator/src/org/eclipse/ease/helpgenerator/sunapi/Java5ClassModel.java: Recompile with -Xlint:deprecation for details.
11:30:52 [2020-10-06T15:30:52.892Z] [INFO] /home/jenkins/agent/workspace/ease.verify.core.gerrit/developers/org.eclipse.ease.helpgenerator/src/org/eclipse/ease/helpgenerator/XMLMemento.java: /home/jenkins/agent/workspace/ease.verify.core.gerrit/developers/org.eclipse.ease.helpgenerator/src/org/eclipse/ease/helpgenerator/XMLMemento.java uses unchecked or unsafe operations.
11:30:52 [2020-10-06T15:30:52.892Z] [INFO] /home/jenkins/agent/workspace/ease.verify.core.gerrit/developers/org.eclipse.ease.helpgenerator/src/org/eclipse/ease/helpgenerator/XMLMemento.java: Recompile with -Xlint:unchecked for details.
11:30:52 [2020-10-06T15:30:52.892Z] [INFO] 
11:30:52 [2020-10-06T15:30:52.893Z] [INFO] --- maven-resources-plugin:2.6:testResources (default-testResources) @ org.eclipse.ease.helpgenerator ---
11:30:52 [2020-10-06T15:30:52.893Z] [INFO] Using 'UTF-8' encoding to copy filtered resources.
11:30:52 [2020-10-06T15:30:52.893Z] [INFO] skip non existing resourceDirectory /home/jenkins/agent/workspace/ease.verify.core.gerrit/developers/org.eclipse.ease.helpgenerator/src/test/resources
11:30:52 [2020-10-06T15:30:52.893Z] [INFO] 
11:30:52 [2020-10-06T15:30:52.893Z] [INFO] --- maven-compiler-plugin:3.6.1:testCompile (default-testCompile) @ org.eclipse.ease.helpgenerator ---
11:30:52 [2020-10-06T15:30:52.893Z] [INFO] Changes detected - recompiling the module!
11:30:52 [2020-10-06T15:30:52.893Z] [INFO] Compiling 4 source files to /home/jenkins/agent/workspace/ease.verify.core.gerrit/developers/org.eclipse.ease.helpgenerator/target/test-classes
11:30:52 [2020-10-06T15:30:52.893Z] [INFO] /home/jenkins/agent/workspace/ease.verify.core.gerrit/developers/org.eclipse.ease.helpgenerator/test/org/eclipse/ease/helpgenerator/IntegrationTestJava5API.java: /home/jenkins/agent/workspace/ease.verify.core.gerrit/developers/org.eclipse.ease.helpgenerator/test/org/eclipse/ease/helpgenerator/IntegrationTestJava5API.java uses or overrides a deprecated API.
11:30:52 [2020-10-06T15:30:52.893Z] [INFO] /home/jenkins/agent/workspace/ease.verify.core.gerrit/developers/org.eclipse.ease.helpgenerator/test/org/eclipse/ease/helpgenerator/IntegrationTestJava5API.java: Recompile with -Xlint:deprecation for details.
11:30:52 [2020-10-06T15:30:52.893Z] [INFO] 
11:30:52 [2020-10-06T15:30:52.893Z] [INFO] --- maven-surefire-plugin:2.22.0:test (default-test) @ org.eclipse.ease.helpgenerator ---
11:30:56 [2020-10-06T15:30:56.287Z] [INFO] 
11:30:56 [2020-10-06T15:30:56.287Z] [INFO] -------------------------------------------------------
11:30:56 [2020-10-06T15:30:56.287Z] [INFO]  T E S T S
11:30:56 [2020-10-06T15:30:56.287Z] [INFO] -------------------------------------------------------
11:30:57 [2020-10-06T15:30:57.286Z] [INFO] Running org.eclipse.ease.helpgenerator.IntegrationTestJava11API
11:30:58 [2020-10-06T15:30:58.214Z] Loading source files for package org.eclipse.ease.helpgenerator.testproject.valid...
11:30:58 [2020-10-06T15:30:58.214Z] Constructing Javadoc information...
11:30:58 [2020-10-06T15:30:58.797Z] javadoc: warning - No class definition found for module "Invalid XML Module"
11:30:58 [2020-10-06T15:30:58.797Z] javadoc: warning - No class definition found for module "Missing Documentation Module"
11:30:59 [2020-10-06T15:30:59.091Z] 2 warnings
11:30:59 [2020-10-06T15:30:59.091Z] Loading source files for package org.eclipse.ease.helpgenerator.testproject.valid...
11:30:59 [2020-10-06T15:30:59.091Z] Constructing Javadoc information...
11:30:59 [2020-10-06T15:30:59.386Z] javadoc: warning - No class definition found for module "Invalid XML Module"
11:30:59 [2020-10-06T15:30:59.386Z] javadoc: warning - No class definition found for module "Missing Documentation Module"
11:30:59 [2020-10-06T15:30:59.386Z] 2 warnings
11:30:59 [2020-10-06T15:30:59.386Z] Loading source files for package org.eclipse.ease.helpgenerator.testproject.invalidxml...
11:30:59 [2020-10-06T15:30:59.386Z] Constructing Javadoc information...
11:30:59 [2020-10-06T15:30:59.386Z] javadoc: error - invalid file content for org.eclipse.ease.helpgenerator.testproject.invalidxml.InvalidXmlModule:	The element type "some" must be terminated by the matching end-tag "</some>".
11:30:59 [2020-10-06T15:30:59.386Z] javadoc: warning - No class definition found for module "Valid Test Module"
11:30:59 [2020-10-06T15:30:59.386Z] javadoc: warning - No class definition found for module "Deprecated Module"
11:30:59 [2020-10-06T15:30:59.386Z] javadoc: warning - No class definition found for module "Missing Documentation Module"
11:30:59 [2020-10-06T15:30:59.386Z] 1 error
11:30:59 [2020-10-06T15:30:59.386Z] 3 warnings
11:30:59 [2020-10-06T15:30:59.687Z] Loading source files for package org.eclipse.ease.helpgenerator.testproject.missingdocs...
11:30:59 [2020-10-06T15:30:59.687Z] Constructing Javadoc information...
11:30:59 [2020-10-06T15:30:59.687Z] javadoc: warning - No class definition found for module "Valid Test Module"
11:30:59 [2020-10-06T15:30:59.687Z] javadoc: error - Missing class comment for org.eclipse.ease.helpgenerator.testproject.missingdocs.MissingDocsModule
11:30:59 [2020-10-06T15:30:59.687Z] javadoc: error - Field documentation missing for org.eclipse.ease.helpgenerator.testproject.missingdocs.MissingDocsModule.UNIVERSAL_TRUTH
11:30:59 [2020-10-06T15:30:59.687Z] javadoc: error - Missing parameter documentation for org.eclipse.ease.helpgenerator.testproject.missingdocs.MissingDocsModule.baseParameters(b)
11:30:59 [2020-10-06T15:30:59.687Z] javadoc: error - Missing parameter documentation for org.eclipse.ease.helpgenerator.testproject.missingdocs.MissingDocsModule.baseParameters(data)
11:30:59 [2020-10-06T15:30:59.687Z] javadoc: error - Missing exception documentation for org.eclipse.ease.helpgenerator.testproject.missingdocs.MissingDocsModule.pleaseThrow() - java.io.IOException
11:30:59 [2020-10-06T15:30:59.687Z] javadoc: error - Missing comment for org.eclipse.ease.helpgenerator.testproject.missingdocs.MissingDocsModule.simple()
11:30:59 [2020-10-06T15:30:59.687Z] javadoc: error - Missing return statement documentation for org.eclipse.ease.helpgenerator.testproject.missingdocs.MissingDocsModule.thisIsAMethodWithALongName()
11:30:59 [2020-10-06T15:30:59.687Z] javadoc: warning - No class definition found for module "Deprecated Module"
11:30:59 [2020-10-06T15:30:59.687Z] javadoc: warning - No class definition found for module "Invalid XML Module"
11:30:59 [2020-10-06T15:30:59.687Z] 7 errors
11:30:59 [2020-10-06T15:30:59.687Z] 3 warnings
11:30:59 [2020-10-06T15:30:59.687Z] Loading source files for package org.eclipse.ease.helpgenerator.testproject.valid...
11:30:59 [2020-10-06T15:30:59.687Z] Constructing Javadoc information...
11:30:59 [2020-10-06T15:30:59.993Z] javadoc: warning - No class definition found for module "Missing Documentation Module"
11:30:59 [2020-10-06T15:30:59.993Z] javadoc: warning - No class definition found for module "Invalid XML Module"
11:30:59 [2020-10-06T15:30:59.993Z] 2 warnings
11:30:59 [2020-10-06T15:30:59.993Z] Loading source files for package org.eclipse.ease.helpgenerator.testproject.invalidxml...
11:30:59 [2020-10-06T15:30:59.993Z] Constructing Javadoc information...
11:30:59 [2020-10-06T15:30:59.993Z] javadoc: warning - No class definition found for module "Deprecated Module"
11:30:59 [2020-10-06T15:30:59.993Z] javadoc: warning - invalid file content for org.eclipse.ease.helpgenerator.testproject.invalidxml.InvalidXmlModule:	The element type "some" must be terminated by the matching end-tag "</some>".
11:30:59 [2020-10-06T15:30:59.993Z] javadoc: warning - No class definition found for module "Missing Documentation Module"
11:30:59 [2020-10-06T15:30:59.993Z] javadoc: warning - No class definition found for module "Valid Test Module"
11:30:59 [2020-10-06T15:30:59.993Z] 4 warnings
11:30:59 [2020-10-06T15:30:59.993Z] Loading source files for package org.eclipse.ease.helpgenerator.testproject.missingdocs...
11:30:59 [2020-10-06T15:30:59.993Z] Constructing Javadoc information...
11:31:00 [2020-10-06T15:31:00.291Z] javadoc: warning - No class definition found for module "Valid Test Module"
11:31:00 [2020-10-06T15:31:00.291Z] javadoc: warning - Missing class comment for org.eclipse.ease.helpgenerator.testproject.missingdocs.MissingDocsModule
11:31:00 [2020-10-06T15:31:00.291Z] javadoc: warning - Field documentation missing for org.eclipse.ease.helpgenerator.testproject.missingdocs.MissingDocsModule.UNIVERSAL_TRUTH
11:31:00 [2020-10-06T15:31:00.291Z] javadoc: warning - Missing parameter documentation for org.eclipse.ease.helpgenerator.testproject.missingdocs.MissingDocsModule.baseParameters(b)
11:31:00 [2020-10-06T15:31:00.291Z] javadoc: warning - Missing parameter documentation for org.eclipse.ease.helpgenerator.testproject.missingdocs.MissingDocsModule.baseParameters(data)
11:31:00 [2020-10-06T15:31:00.291Z] javadoc: warning - Missing exception documentation for org.eclipse.ease.helpgenerator.testproject.missingdocs.MissingDocsModule.pleaseThrow() - java.io.IOException
11:31:00 [2020-10-06T15:31:00.291Z] javadoc: warning - Missing comment for org.eclipse.ease.helpgenerator.testproject.missingdocs.MissingDocsModule.simple()
11:31:00 [2020-10-06T15:31:00.291Z] javadoc: warning - Missing return statement documentation for org.eclipse.ease.helpgenerator.testproject.missingdocs.MissingDocsModule.thisIsAMethodWithALongName()
11:31:00 [2020-10-06T15:31:00.291Z] javadoc: warning - No class definition found for module "Deprecated Module"
11:31:00 [2020-10-06T15:31:00.291Z] javadoc: warning - No class definition found for module "Invalid XML Module"
11:31:00 [2020-10-06T15:31:00.291Z] 10 warnings
11:31:00 [2020-10-06T15:31:00.291Z] [INFO] Tests run: 7, Failures: 0, Errors: 0, Skipped: 0, Time elapsed: 3.107 s - in org.eclipse.ease.helpgenerator.IntegrationTestJava11API
11:31:00 [2020-10-06T15:31:00.291Z] [INFO] Running org.eclipse.ease.helpgenerator.LinkProviderTest
11:31:00 [2020-10-06T15:31:00.291Z] [INFO] Tests run: 18, Failures: 0, Errors: 0, Skipped: 0, Time elapsed: 0.001 s - in org.eclipse.ease.helpgenerator.LinkProviderTest
11:31:00 [2020-10-06T15:31:00.291Z] [INFO] Running org.eclipse.ease.helpgenerator.IntegrationTestJava5API
11:31:00 [2020-10-06T15:31:00.593Z] Loading source files for package org.eclipse.ease.helpgenerator.testproject.valid...
11:31:00 [2020-10-06T15:31:00.593Z] Constructing Javadoc information...
11:31:00 [2020-10-06T15:31:00.593Z] WARNING: No class definition found for module "Invalid XML Module"
11:31:00 [2020-10-06T15:31:00.593Z] WARNING: No class definition found for module "Missing Documentation Module"
11:31:00 [2020-10-06T15:31:00.906Z] Loading source files for package org.eclipse.ease.helpgenerator.testproject.valid...
11:31:00 [2020-10-06T15:31:00.906Z] Constructing Javadoc information...
11:31:00 [2020-10-06T15:31:00.906Z] WARNING: No class definition found for module "Missing Documentation Module"
11:31:00 [2020-10-06T15:31:00.906Z] WARNING: No class definition found for module "Invalid XML Module"
11:31:00 [2020-10-06T15:31:00.906Z] Loading source files for package org.eclipse.ease.helpgenerator.testproject.invalidxml...
11:31:00 [2020-10-06T15:31:00.906Z] Constructing Javadoc information...
11:31:01 [2020-10-06T15:31:01.290Z] WARNING: No class definition found for module "Valid Test Module"
11:31:01 [2020-10-06T15:31:01.290Z] WARNING: No class definition found for module "Deprecated Module"
11:31:01 [2020-10-06T15:31:01.290Z] WARNING: No class definition found for module "Missing Documentation Module"
11:31:01 [2020-10-06T15:31:01.290Z] ERROR: invalid file content for InvalidXmlModule:	The element type "some" must be terminated by the matching end-tag "</some>".
11:31:01 [2020-10-06T15:31:01.290Z] Loading source files for package org.eclipse.ease.helpgenerator.testproject.missingdocs...
11:31:01 [2020-10-06T15:31:01.290Z] Constructing Javadoc information...
11:31:01 [2020-10-06T15:31:01.290Z] WARNING: No class definition found for module "Invalid XML Module"
11:31:01 [2020-10-06T15:31:01.290Z] WARNING: No class definition found for module "Valid Test Module"
11:31:01 [2020-10-06T15:31:01.290Z] ERROR: Missing class comment for MissingDocsModule
11:31:01 [2020-10-06T15:31:01.290Z] ERROR: Field documentation missing for org.eclipse.ease.helpgenerator.testproject.missingdocs.MissingDocsModule.UNIVERSAL_TRUTH
11:31:01 [2020-10-06T15:31:01.290Z] ERROR: Missing parameter documentation for MissingDocsModule.baseParameters(b)
11:31:01 [2020-10-06T15:31:01.290Z] ERROR: Missing parameter documentation for MissingDocsModule.baseParameters(data)
11:31:01 [2020-10-06T15:31:01.290Z] ERROR: Missing exception documentation for MissingDocsModule.pleaseThrow() - java.io.IOException
11:31:01 [2020-10-06T15:31:01.290Z] ERROR: Missing comment for MissingDocsModule.simple()
11:31:01 [2020-10-06T15:31:01.290Z] ERROR: Missing return statement documentation for MissingDocsModule.thisIsAMethodWithALongName()
11:31:01 [2020-10-06T15:31:01.290Z] WARNING: No class definition found for module "Deprecated Module"
11:31:01 [2020-10-06T15:31:01.290Z] Loading source files for package org.eclipse.ease.helpgenerator.testproject.valid...
11:31:01 [2020-10-06T15:31:01.290Z] Constructing Javadoc information...
11:31:01 [2020-10-06T15:31:01.590Z] WARNING: No class definition found for module "Missing Documentation Module"
11:31:01 [2020-10-06T15:31:01.590Z] WARNING: No class definition found for module "Invalid XML Module"
11:31:01 [2020-10-06T15:31:01.590Z] Loading source files for package org.eclipse.ease.helpgenerator.testproject.invalidxml...
11:31:01 [2020-10-06T15:31:01.590Z] Constructing Javadoc information...
11:31:01 [2020-10-06T15:31:01.590Z] WARNING: No class definition found for module "Valid Test Module"
11:31:01 [2020-10-06T15:31:01.590Z] WARNING: No class definition found for module "Deprecated Module"
11:31:01 [2020-10-06T15:31:01.590Z] WARNING: No class definition found for module "Missing Documentation Module"
11:31:01 [2020-10-06T15:31:01.590Z] WARNING: invalid file content for InvalidXmlModule:	The element type "some" must be terminated by the matching end-tag "</some>".
11:31:01 [2020-10-06T15:31:01.590Z] Loading source files for package org.eclipse.ease.helpgenerator.testproject.missingdocs...
11:31:01 [2020-10-06T15:31:01.590Z] Constructing Javadoc information...
11:31:01 [2020-10-06T15:31:01.590Z] WARNING: No class definition found for module "Deprecated Module"
11:31:01 [2020-10-06T15:31:01.590Z] WARNING: Missing class comment for MissingDocsModule
11:31:01 [2020-10-06T15:31:01.590Z] WARNING: Field documentation missing for org.eclipse.ease.helpgenerator.testproject.missingdocs.MissingDocsModule.UNIVERSAL_TRUTH
11:31:01 [2020-10-06T15:31:01.590Z] WARNING: Missing parameter documentation for MissingDocsModule.baseParameters(b)
11:31:01 [2020-10-06T15:31:01.590Z] WARNING: Missing parameter documentation for MissingDocsModule.baseParameters(data)
11:31:01 [2020-10-06T15:31:01.590Z] WARNING: Missing exception documentation for MissingDocsModule.pleaseThrow() - java.io.IOException
11:31:01 [2020-10-06T15:31:01.590Z] WARNING: Missing comment for MissingDocsModule.simple()
11:31:01 [2020-10-06T15:31:01.590Z] WARNING: Missing return statement documentation for MissingDocsModule.thisIsAMethodWithALongName()
11:31:01 [2020-10-06T15:31:01.590Z] WARNING: No class definition found for module "Invalid XML Module"
11:31:01 [2020-10-06T15:31:01.590Z] WARNING: No class definition found for module "Valid Test Module"
11:31:01 [2020-10-06T15:31:01.590Z] [INFO] Tests run: 7, Failures: 0, Errors: 0, Skipped: 0, Time elapsed: 1.398 s - in org.eclipse.ease.helpgenerator.IntegrationTestJava5API
11:31:02 [2020-10-06T15:31:02.185Z] [INFO] 
11:31:02 [2020-10-06T15:31:02.185Z] [INFO] Results:
11:31:02 [2020-10-06T15:31:02.185Z] [INFO] 
11:31:02 [2020-10-06T15:31:02.185Z] [INFO] Tests run: 32, Failures: 0, Errors: 0, Skipped: 0
11:31:02 [2020-10-06T15:31:02.185Z] [INFO] 
11:31:02 [2020-10-06T15:31:02.185Z] [INFO] 
11:31:02 [2020-10-06T15:31:02.185Z] [INFO] --- maven-jar-plugin:2.4:jar (default-jar) @ org.eclipse.ease.helpgenerator ---
11:31:02 [2020-10-06T15:31:02.487Z] [INFO] Building jar: /home/jenkins/agent/workspace/ease.verify.core.gerrit/developers/org.eclipse.ease.helpgenerator/target/ease.module.doclet.jar
11:31:02 [2020-10-06T15:31:02.743Z] [INFO] ------------------------------------------------------------------------
11:31:02 [2020-10-06T15:31:02.743Z] [INFO] BUILD SUCCESS
11:31:02 [2020-10-06T15:31:02.743Z] [INFO] ------------------------------------------------------------------------
11:31:02 [2020-10-06T15:31:02.743Z] [INFO] Total time:  21.275 s
11:31:02 [2020-10-06T15:31:02.743Z] [INFO] Finished at: 2020-10-06T15:31:02Z
11:31:02 [2020-10-06T15:31:02.743Z] [INFO] ------------------------------------------------------------------------
11:31:02 [2020-10-06T15:31:02.743Z] [INFO] [jenkins-event-spy] Generated /home/jenkins/agent/workspace/ease.verify.core.gerrit@tmp/withMavenec756adb/maven-spy-20201006-153041-2311951687192273435110.log