SuccessConsole Output

Skipping 767 KB.. Full Log
.RhinoDebuggerEngineTest)  Time elapsed: 0.036 s
11:34:29 [2020-10-06T15:34:29.197Z] causeSyntaxErrorException(org.eclipse.ease.lang.javascript.rhino.RhinoDebuggerEngineTest)  Time elapsed: 0.008 s
11:34:29 [2020-10-06T15:34:29.197Z] Running org.eclipse.ease.lang.javascript.rhino.RhinoEnvironmentTest
11:34:29 [2020-10-06T15:34:29.485Z] Tests run: 5, Failures: 0, Errors: 0, Skipped: 0, Time elapsed: 0.138 s - in org.eclipse.ease.lang.javascript.rhino.RhinoEnvironmentTest
11:34:29 [2020-10-06T15:34:29.485Z] reloadEnvironment(org.eclipse.ease.lang.javascript.rhino.RhinoEnvironmentTest)  Time elapsed: 0.045 s
11:34:29 [2020-10-06T15:34:29.485Z] bootstrappedEnvironment(org.eclipse.ease.lang.javascript.rhino.RhinoEnvironmentTest)  Time elapsed: 0.045 s
11:34:29 [2020-10-06T15:34:29.485Z] postMethodCallback(org.eclipse.ease.lang.javascript.rhino.RhinoEnvironmentTest)  Time elapsed: 0.018 s
11:34:29 [2020-10-06T15:34:29.485Z] preMethodCallback(org.eclipse.ease.lang.javascript.rhino.RhinoEnvironmentTest)  Time elapsed: 0.013 s
11:34:29 [2020-10-06T15:34:29.485Z] reloadFunctionDefinitions(org.eclipse.ease.lang.javascript.rhino.RhinoEnvironmentTest)  Time elapsed: 0.016 s
11:34:29 [2020-10-06T15:34:29.485Z] Running org.eclipse.ease.lang.javascript.rhino.RhinoScriptEngineTest
11:34:29 [2020-10-06T15:34:29.485Z] org.eclipse.ease.ScriptExecutionException: JavaError: NotThere cannot be found by org.mozilla.javascript_1.7.10.v20190430-1943
11:34:29 [2020-10-06T15:34:29.485Z] 	at <unknown source>
11:34:29 [2020-10-06T15:34:29.485Z] 
11:34:29 [2020-10-06T15:34:29.485Z] Java Stacktrace:
11:34:29 [2020-10-06T15:34:29.486Z] java.lang.ClassNotFoundException: NotThere cannot be found by org.mozilla.javascript_1.7.10.v20190430-1943
11:34:29 [2020-10-06T15:34:29.486Z] 	at org.eclipse.osgi.internal.loader.BundleLoader.findClass(BundleLoader.java:516)
11:34:29 [2020-10-06T15:34:29.486Z] 	at org.eclipse.osgi.internal.loader.ModuleClassLoader.loadClass(ModuleClassLoader.java:171)
11:34:29 [2020-10-06T15:34:29.486Z] 	at java.base/java.lang.ClassLoader.loadClass(ClassLoader.java:521)
11:34:29 [2020-10-06T15:34:29.486Z] 	at java.base/java.lang.Class.forName0(Native Method)
11:34:29 [2020-10-06T15:34:29.486Z] 	at java.base/java.lang.Class.forName(Class.java:315)
11:34:29 [2020-10-06T15:34:29.486Z] 	at java.base/jdk.internal.reflect.NativeMethodAccessorImpl.invoke0(Native Method)
11:34:29 [2020-10-06T15:34:29.486Z] 	at java.base/jdk.internal.reflect.NativeMethodAccessorImpl.invoke(NativeMethodAccessorImpl.java:62)
11:34:29 [2020-10-06T15:34:29.486Z] 	at java.base/jdk.internal.reflect.DelegatingMethodAccessorImpl.invoke(DelegatingMethodAccessorImpl.java:43)
11:34:29 [2020-10-06T15:34:29.486Z] 	at java.base/java.lang.reflect.Method.invoke(Method.java:566)
11:34:29 [2020-10-06T15:34:29.486Z] 	at org.mozilla.javascript.MemberBox.invoke(MemberBox.java:126)
11:34:29 [2020-10-06T15:34:29.486Z] 	at org.mozilla.javascript.NativeJavaMethod.call(NativeJavaMethod.java:225)
11:34:29 [2020-10-06T15:34:29.486Z] 	at org.mozilla.javascript.optimizer.OptRuntime.call1(OptRuntime.java:32)
11:34:29 [2020-10-06T15:34:29.486Z] 	at org.mozilla.javascript.gen.c_27._c_script_0(Unknown Source)
11:34:29 [2020-10-06T15:34:29.486Z] 	at org.mozilla.javascript.gen.c_27.call(Unknown Source)
11:34:29 [2020-10-06T15:34:29.486Z] 	at org.mozilla.javascript.ContextFactory.doTopCall(ContextFactory.java:405)
11:34:29 [2020-10-06T15:34:29.486Z] 	at org.mozilla.javascript.ScriptRuntime.doTopCall(ScriptRuntime.java:3508)
11:34:29 [2020-10-06T15:34:29.486Z] 	at org.mozilla.javascript.gen.c_27.call(Unknown Source)
11:34:29 [2020-10-06T15:34:29.486Z] 	at org.mozilla.javascript.gen.c_27.exec(Unknown Source)
11:34:29 [2020-10-06T15:34:29.486Z] 	at org.mozilla.javascript.Context.evaluateReader(Context.java:1293)
11:34:29 [2020-10-06T15:34:29.486Z] 	at org.eclipse.ease.lang.javascript.rhino.RhinoScriptEngine.internalExecute(RhinoScriptEngine.java:222)
11:34:29 [2020-10-06T15:34:29.486Z] 	at org.eclipse.ease.lang.javascript.rhino.RhinoScriptEngine.execute(RhinoScriptEngine.java:201)
11:34:29 [2020-10-06T15:34:29.486Z] 	at org.eclipse.ease.AbstractScriptEngine.inject(AbstractScriptEngine.java:222)
11:34:29 [2020-10-06T15:34:29.486Z] 	at org.eclipse.ease.AbstractScriptEngine.run(AbstractScriptEngine.java:272)
11:34:29 [2020-10-06T15:34:29.486Z] 	at org.eclipse.core.internal.jobs.Worker.run(Worker.java:63)
11:34:29 [2020-10-06T15:34:29.486Z] org.eclipse.ease.ScriptExecutionException: TypeError: Cannot call method "foobar" of undefined
11:34:29 [2020-10-06T15:34:29.486Z] 	at <unknown source>
11:34:29 [2020-10-06T15:34:29.486Z] org.eclipse.ease.ScriptExecutionException: ScriptException: test
11:34:29 [2020-10-06T15:34:29.486Z] 	at <unknown source>
11:34:29 [2020-10-06T15:34:29.486Z] org.eclipse.ease.ScriptExecutionException: JavaError: java.lang.Exception
11:34:29 [2020-10-06T15:34:29.486Z] 	at <unknown source>
11:34:29 [2020-10-06T15:34:29.486Z] 
11:34:29 [2020-10-06T15:34:29.486Z] Java Stacktrace:
11:34:29 [2020-10-06T15:34:29.486Z] java.lang.Exception
11:34:29 [2020-10-06T15:34:29.486Z] 	at java.base/jdk.internal.reflect.NativeConstructorAccessorImpl.newInstance0(Native Method)
11:34:29 [2020-10-06T15:34:29.486Z] 	at java.base/jdk.internal.reflect.NativeConstructorAccessorImpl.newInstance(NativeConstructorAccessorImpl.java:62)
11:34:29 [2020-10-06T15:34:29.486Z] 	at java.base/jdk.internal.reflect.DelegatingConstructorAccessorImpl.newInstance(DelegatingConstructorAccessorImpl.java:45)
11:34:29 [2020-10-06T15:34:29.486Z] 	at java.base/java.lang.reflect.Constructor.newInstance(Constructor.java:490)
11:34:29 [2020-10-06T15:34:29.486Z] 	at org.mozilla.javascript.MemberBox.newInstance(MemberBox.java:159)
11:34:29 [2020-10-06T15:34:29.486Z] 	at org.mozilla.javascript.NativeJavaClass.constructInternal(NativeJavaClass.java:266)
11:34:29 [2020-10-06T15:34:29.486Z] 	at org.mozilla.javascript.NativeJavaClass.constructSpecific(NativeJavaClass.java:205)
11:34:29 [2020-10-06T15:34:29.486Z] 	at org.mozilla.javascript.NativeJavaClass.construct(NativeJavaClass.java:166)
11:34:29 [2020-10-06T15:34:29.486Z] 	at org.mozilla.javascript.ScriptRuntime.newObject(ScriptRuntime.java:2655)
11:34:29 [2020-10-06T15:34:29.486Z] 	at org.mozilla.javascript.gen.c_45._c_script_0(Unknown Source)
11:34:29 [2020-10-06T15:34:29.486Z] 	at org.mozilla.javascript.gen.c_45.call(Unknown Source)
11:34:29 [2020-10-06T15:34:29.486Z] 	at org.mozilla.javascript.ContextFactory.doTopCall(ContextFactory.java:405)
11:34:29 [2020-10-06T15:34:29.486Z] 	at org.mozilla.javascript.ScriptRuntime.doTopCall(ScriptRuntime.java:3508)
11:34:29 [2020-10-06T15:34:29.486Z] 	at org.mozilla.javascript.gen.c_45.call(Unknown Source)
11:34:29 [2020-10-06T15:34:29.486Z] 	at org.mozilla.javascript.gen.c_45.exec(Unknown Source)
11:34:29 [2020-10-06T15:34:29.486Z] 	at org.mozilla.javascript.Context.evaluateReader(Context.java:1293)
11:34:29 [2020-10-06T15:34:29.486Z] 	at org.eclipse.ease.lang.javascript.rhino.RhinoScriptEngine.internalExecute(RhinoScriptEngine.java:222)
11:34:29 [2020-10-06T15:34:29.486Z] 	at org.eclipse.ease.lang.javascript.rhino.RhinoScriptEngine.execute(RhinoScriptEngine.java:201)
11:34:29 [2020-10-06T15:34:29.486Z] 	at org.eclipse.ease.AbstractScriptEngine.inject(AbstractScriptEngine.java:222)
11:34:29 [2020-10-06T15:34:29.486Z] 	at org.eclipse.ease.AbstractScriptEngine.run(AbstractScriptEngine.java:272)
11:34:29 [2020-10-06T15:34:29.486Z] 	at org.eclipse.core.internal.jobs.Worker.run(Worker.java:63)
11:34:29 [2020-10-06T15:34:29.741Z] org.eclipse.ease.ScriptExecutionException: ScriptException: JavaScript
11:34:29 [2020-10-06T15:34:29.741Z] 	at <unknown source>
11:34:29 [2020-10-06T15:34:29.741Z] org.eclipse.ease.ScriptExecutionException: SyntaxError: unterminated string literal (#1)
11:34:29 [2020-10-06T15:34:29.741Z] 'asdf
11:34:29 [2020-10-06T15:34:29.741Z]     ^
11:34:29 [2020-10-06T15:34:29.741Z] 	at <unknown source>
11:34:29 [2020-10-06T15:34:29.741Z] Tests run: 11, Failures: 0, Errors: 0, Skipped: 0, Time elapsed: 0.139 s - in org.eclipse.ease.lang.javascript.rhino.RhinoScriptEngineTest
11:34:29 [2020-10-06T15:34:29.741Z] causeWrappedException(org.eclipse.ease.lang.javascript.rhino.RhinoScriptEngineTest)  Time elapsed: 0.025 s
11:34:29 [2020-10-06T15:34:29.741Z] optionalModuleParameters(org.eclipse.ease.lang.javascript.rhino.RhinoScriptEngineTest)  Time elapsed: 0.011 s
11:34:29 [2020-10-06T15:34:29.741Z] simpleScriptCode(org.eclipse.ease.lang.javascript.rhino.RhinoScriptEngineTest)  Time elapsed: 0.008 s
11:34:29 [2020-10-06T15:34:29.741Z] causeRuntimeErrorException(org.eclipse.ease.lang.javascript.rhino.RhinoScriptEngineTest)  Time elapsed: 0.008 s
11:34:29 [2020-10-06T15:34:29.741Z] callModuleCode(org.eclipse.ease.lang.javascript.rhino.RhinoScriptEngineTest)  Time elapsed: 0.008 s
11:34:29 [2020-10-06T15:34:29.742Z] throwJavaClass(org.eclipse.ease.lang.javascript.rhino.RhinoScriptEngineTest)  Time elapsed: 0.012 s
11:34:29 [2020-10-06T15:34:29.742Z] throwJavaException(org.eclipse.ease.lang.javascript.rhino.RhinoScriptEngineTest)  Time elapsed: 0.008 s
11:34:29 [2020-10-06T15:34:29.742Z] accessJavaClasses(org.eclipse.ease.lang.javascript.rhino.RhinoScriptEngineTest)  Time elapsed: 0.007 s
11:34:29 [2020-10-06T15:34:29.742Z] accessEclipseClasses(org.eclipse.ease.lang.javascript.rhino.RhinoScriptEngineTest)  Time elapsed: 0.034 s
11:34:29 [2020-10-06T15:34:29.742Z] throwJavaScriptException(org.eclipse.ease.lang.javascript.rhino.RhinoScriptEngineTest)  Time elapsed: 0.011 s
11:34:29 [2020-10-06T15:34:29.742Z] causeSyntaxErrorException(org.eclipse.ease.lang.javascript.rhino.RhinoScriptEngineTest)  Time elapsed: 0.006 s
11:34:29 [2020-10-06T15:34:29.742Z] 
11:34:29 [2020-10-06T15:34:29.742Z] Results:
11:34:29 [2020-10-06T15:34:29.742Z] 
11:34:29 [2020-10-06T15:34:29.742Z] Tests run: 70, Failures: 0, Errors: 0, Skipped: 0
11:34:29 [2020-10-06T15:34:29.742Z] 
11:34:30 [2020-10-06T15:34:30.302Z] [INFO] All tests passed!
11:34:30 [2020-10-06T15:34:30.302Z] [INFO] 
11:34:30 [2020-10-06T15:34:30.302Z] [INFO] -------< org.eclipse.ease:org.eclipse.ease.lang.javascript.test >-------
11:34:30 [2020-10-06T15:34:30.302Z] [INFO] Building org.eclipse.ease.lang.javascript.test 0.8.0-SNAPSHOT    [41/48]
11:34:30 [2020-10-06T15:34:30.302Z] [INFO] ------------------------[ eclipse-test-plugin ]-------------------------
11:34:30 [2020-10-06T15:34:30.302Z] [INFO] 
11:34:30 [2020-10-06T15:34:30.302Z] [INFO] --- maven-clean-plugin:2.5:clean (default-clean) @ org.eclipse.ease.lang.javascript.test ---
11:34:30 [2020-10-06T15:34:30.302Z] [INFO] 
11:34:30 [2020-10-06T15:34:30.302Z] [INFO] --- tycho-packaging-plugin:1.5.0:build-qualifier (default-build-qualifier) @ org.eclipse.ease.lang.javascript.test ---
11:34:30 [2020-10-06T15:34:30.302Z] [INFO] The project's OSGi version is 0.8.0.I201910171213
11:34:30 [2020-10-06T15:34:30.302Z] [INFO] 
11:34:30 [2020-10-06T15:34:30.302Z] [INFO] --- tycho-packaging-plugin:1.5.0:validate-id (default-validate-id) @ org.eclipse.ease.lang.javascript.test ---
11:34:30 [2020-10-06T15:34:30.302Z] [INFO] 
11:34:30 [2020-10-06T15:34:30.302Z] [INFO] --- tycho-packaging-plugin:1.5.0:validate-version (default-validate-version) @ org.eclipse.ease.lang.javascript.test ---
11:34:30 [2020-10-06T15:34:30.302Z] [INFO] 
11:34:30 [2020-10-06T15:34:30.302Z] [INFO] >>> maven-javadoc-plugin:2.9.1:javadoc (build-docs) > generate-sources @ org.eclipse.ease.lang.javascript.test >>>
11:34:30 [2020-10-06T15:34:30.302Z] [INFO] 
11:34:30 [2020-10-06T15:34:30.303Z] [INFO] --- tycho-packaging-plugin:1.5.0:build-qualifier (default-build-qualifier) @ org.eclipse.ease.lang.javascript.test ---
11:34:30 [2020-10-06T15:34:30.303Z] [INFO] The project's OSGi version is 0.8.0.I201910171213
11:34:30 [2020-10-06T15:34:30.303Z] [INFO] 
11:34:30 [2020-10-06T15:34:30.303Z] [INFO] --- tycho-packaging-plugin:1.5.0:validate-id (default-validate-id) @ org.eclipse.ease.lang.javascript.test ---
11:34:30 [2020-10-06T15:34:30.303Z] [INFO] 
11:34:30 [2020-10-06T15:34:30.303Z] [INFO] --- tycho-packaging-plugin:1.5.0:validate-version (default-validate-version) @ org.eclipse.ease.lang.javascript.test ---
11:34:30 [2020-10-06T15:34:30.303Z] [INFO] 
11:34:30 [2020-10-06T15:34:30.303Z] [INFO] <<< maven-javadoc-plugin:2.9.1:javadoc (build-docs) < generate-sources @ org.eclipse.ease.lang.javascript.test <<<
11:34:30 [2020-10-06T15:34:30.303Z] [INFO] 
11:34:30 [2020-10-06T15:34:30.303Z] [INFO] 
11:34:30 [2020-10-06T15:34:30.303Z] [INFO] --- maven-javadoc-plugin:2.9.1:javadoc (build-docs) @ org.eclipse.ease.lang.javascript.test ---
11:34:30 [2020-10-06T15:34:30.303Z] [ERROR] Error fetching link: http://help.eclipse.org/oxygen/topic/org.eclipse.platform.doc.isv/reference/api/package-list. Ignored it.
11:34:30 [2020-10-06T15:34:30.558Z] [ERROR] Error fetching link: https://ci.eclipse.org/ease/job/ease.build.core/JavaDoc/package-list. Ignored it.
11:34:31 [2020-10-06T15:34:31.512Z] [INFO] 
11:34:31 [2020-10-06T15:34:31.512Z] Loading source files for package org.eclipse.ease.lang.javascript...
11:34:31 [2020-10-06T15:34:31.512Z] Constructing Javadoc information...
11:34:31 [2020-10-06T15:34:31.512Z] WARNING: Cannot open location "/home/jenkins/agent/workspace/ease.verify.core.gerrit/tests/org.eclipse.ease.lang.javascript.test/target/javadoc-bundle-options/package-list"
11:34:31 [2020-10-06T15:34:31.512Z] No plugin definition found, skipping
11:34:31 [2020-10-06T15:34:31.512Z] No plugin definition found, skipping
11:34:31 [2020-10-06T15:34:31.512Z] [WARNING] Javadoc Warnings
11:34:31 [2020-10-06T15:34:31.512Z] [WARNING] Picked up JAVA_TOOL_OPTIONS: -Dmaven.ext.class.path="/home/jenkins/agent/workspace/ease.verify.core.gerrit@tmp/withMaven06edad13/pipeline-maven-spy.jar" -Dorg.jenkinsci.plugins.pipeline.maven.reportsFolder="/home/jenkins/agent/workspace/ease.verify.core.gerrit@tmp/withMaven06edad13"
11:34:31 [2020-10-06T15:34:31.512Z] [WARNING] javadoc: warning - The old Doclet and Taglet APIs in the packages
11:34:31 [2020-10-06T15:34:31.512Z] [WARNING] com.sun.javadoc, com.sun.tools.doclets and their implementations
11:34:31 [2020-10-06T15:34:31.512Z] [WARNING] are planned to be removed in a future JDK release. These
11:34:31 [2020-10-06T15:34:31.512Z] [WARNING] components have been superseded by the new APIs in jdk.javadoc.doclet.
11:34:31 [2020-10-06T15:34:31.512Z] [WARNING] Users are strongly recommended to migrate to the new APIs.
11:34:31 [2020-10-06T15:34:31.512Z] [INFO] 
11:34:31 [2020-10-06T15:34:31.512Z] [INFO] --- build-helper-maven-plugin:1.9.1:add-resource (add_help) @ org.eclipse.ease.lang.javascript.test ---
11:34:31 [2020-10-06T15:34:31.512Z] [INFO] 
11:34:31 [2020-10-06T15:34:31.512Z] [INFO] --- maven-resources-plugin:2.4.3:resources (default-resources) @ org.eclipse.ease.lang.javascript.test ---
11:34:31 [2020-10-06T15:34:31.512Z] [INFO] Using 'UTF-8' encoding to copy filtered resources.
11:34:31 [2020-10-06T15:34:31.512Z] [INFO] skip non existing resourceDirectory /home/jenkins/agent/workspace/ease.verify.core.gerrit/tests/org.eclipse.ease.lang.javascript.test/src/main/resources
11:34:31 [2020-10-06T15:34:31.512Z] [INFO] skip non existing resourceDirectory /home/jenkins/agent/workspace/ease.verify.core.gerrit/tests/org.eclipse.ease.lang.javascript.test/help
11:34:31 [2020-10-06T15:34:31.512Z] [INFO] 
11:34:31 [2020-10-06T15:34:31.512Z] [INFO] --- tycho-compiler-plugin:1.5.0:compile (default-compile) @ org.eclipse.ease.lang.javascript.test ---
11:34:31 [2020-10-06T15:34:31.512Z] [INFO] Compiling 2 source files to /home/jenkins/agent/workspace/ease.verify.core.gerrit/tests/org.eclipse.ease.lang.javascript.test/target/classes
11:34:31 [2020-10-06T15:34:31.512Z] [INFO] 
11:34:31 [2020-10-06T15:34:31.513Z] [INFO] --- maven-resources-plugin:2.4.3:testResources (default-testResources) @ org.eclipse.ease.lang.javascript.test ---
11:34:31 [2020-10-06T15:34:31.513Z] [INFO] Using 'UTF-8' encoding to copy filtered resources.
11:34:31 [2020-10-06T15:34:31.513Z] [INFO] skip non existing resourceDirectory /home/jenkins/agent/workspace/ease.verify.core.gerrit/tests/org.eclipse.ease.lang.javascript.test/src/test/resources
11:34:31 [2020-10-06T15:34:31.513Z] [INFO] 
11:34:31 [2020-10-06T15:34:31.513Z] [INFO] --- tycho-source-plugin:1.5.0:plugin-source (plugin-source) @ org.eclipse.ease.lang.javascript.test ---
11:34:31 [2020-10-06T15:34:31.513Z] [WARNING] Bundle-Vendor header not found in /home/jenkins/agent/workspace/ease.verify.core.gerrit/tests/org.eclipse.ease.lang.javascript.test/META-INF/MANIFEST.MF, fallback to 'unknown' for source bundle
11:34:31 [2020-10-06T15:34:31.513Z] [INFO] Building jar: /home/jenkins/agent/workspace/ease.verify.core.gerrit/tests/org.eclipse.ease.lang.javascript.test/target/org.eclipse.ease.lang.javascript.test-0.8.0-SNAPSHOT-sources.jar
11:34:31 [2020-10-06T15:34:31.513Z] [INFO] 
11:34:31 [2020-10-06T15:34:31.513Z] [INFO] --- target-platform-configuration:1.5.0:target-platform (default-target-platform) @ org.eclipse.ease.lang.javascript.test ---
11:34:31 [2020-10-06T15:34:31.513Z] [INFO] 
11:34:31 [2020-10-06T15:34:31.513Z] [INFO] --- tycho-packaging-plugin:1.5.0:package-plugin (default-package-plugin) @ org.eclipse.ease.lang.javascript.test ---
11:34:31 [2020-10-06T15:34:31.513Z] [INFO] Building jar: /home/jenkins/agent/workspace/ease.verify.core.gerrit/tests/org.eclipse.ease.lang.javascript.test/target/org.eclipse.ease.lang.javascript.test-0.8.0-SNAPSHOT.jar
11:34:31 [2020-10-06T15:34:31.513Z] [INFO] 
11:34:31 [2020-10-06T15:34:31.513Z] [INFO] --- tycho-p2-plugin:1.5.0:p2-metadata-default (default-p2-metadata-default) @ org.eclipse.ease.lang.javascript.test ---
11:34:31 [2020-10-06T15:34:31.513Z] [INFO] 
11:34:31 [2020-10-06T15:34:31.513Z] [INFO] --- tycho-source-feature-plugin:1.5.0:source-feature (source-feature) @ org.eclipse.ease.lang.javascript.test ---
11:34:31 [2020-10-06T15:34:31.513Z] [INFO] 
11:34:31 [2020-10-06T15:34:31.513Z] [INFO] --- tycho-p2-plugin:1.5.0:p2-metadata (attached-p2-metadata) @ org.eclipse.ease.lang.javascript.test ---
11:34:31 [2020-10-06T15:34:31.513Z] [INFO] 
11:34:31 [2020-10-06T15:34:31.513Z] [INFO] --- tycho-surefire-plugin:1.5.0:test (default-test) @ org.eclipse.ease.lang.javascript.test ---
11:34:31 [2020-10-06T15:34:31.513Z] [INFO] Expected eclipse log file: /home/jenkins/agent/workspace/ease.verify.core.gerrit/tests/org.eclipse.ease.lang.javascript.test/target/work/data/.metadata/.log
11:34:31 [2020-10-06T15:34:31.513Z] [INFO] Command line:
11:34:31 [2020-10-06T15:34:31.513Z] 	[/opt/tools/java/openjdk/jdk-11/11.0.2+9/bin/java, -Dosgi.noShutdown=false, -Dosgi.os=linux, -Dosgi.ws=gtk, -Dosgi.arch=x86_64, -Dosgi.clean=true, -jar, /home/jenkins/.m2/repository/p2/osgi/bundle/org.eclipse.equinox.launcher/1.5.800.v20200727-1323/org.eclipse.equinox.launcher-1.5.800.v20200727-1323.jar, -data, /home/jenkins/agent/workspace/ease.verify.core.gerrit/tests/org.eclipse.ease.lang.javascript.test/target/work/data, -install, /home/jenkins/agent/workspace/ease.verify.core.gerrit/tests/org.eclipse.ease.lang.javascript.test/target/work, -configuration, /home/jenkins/agent/workspace/ease.verify.core.gerrit/tests/org.eclipse.ease.lang.javascript.test/target/work/configuration, -application, org.eclipse.tycho.surefire.osgibooter.headlesstest, -testproperties, /home/jenkins/agent/workspace/ease.verify.core.gerrit/tests/org.eclipse.ease.lang.javascript.test/target/surefire.properties]
11:34:31 [2020-10-06T15:34:31.513Z] Picked up JAVA_TOOL_OPTIONS: -Dmaven.ext.class.path="/home/jenkins/agent/workspace/ease.verify.core.gerrit@tmp/withMaven06edad13/pipeline-maven-spy.jar" -Dorg.jenkinsci.plugins.pipeline.maven.reportsFolder="/home/jenkins/agent/workspace/ease.verify.core.gerrit@tmp/withMaven06edad13" 
11:34:33 [2020-10-06T15:34:33.451Z] Running org.eclipse.ease.lang.javascript.JavaScriptCompletionContextTest
11:34:33 [2020-10-06T15:34:33.451Z] Tests run: 8, Failures: 0, Errors: 0, Skipped: 0, Time elapsed: 0.274 s - in org.eclipse.ease.lang.javascript.JavaScriptCompletionContextTest
11:34:33 [2020-10-06T15:34:33.451Z] verifyStaticClassTypes(org.eclipse.ease.lang.javascript.JavaScriptCompletionContextTest)  Time elapsed: 0.004 s
11:34:33 [2020-10-06T15:34:33.451Z] verifyClassInstanceTypes(org.eclipse.ease.lang.javascript.JavaScriptCompletionContextTest)  Time elapsed: 0.005 s
11:34:33 [2020-10-06T15:34:33.451Z] verifyTypesForScriptEngine(org.eclipse.ease.lang.javascript.JavaScriptCompletionContextTest)  Time elapsed: 0.136 s
11:34:33 [2020-10-06T15:34:33.451Z] verifyPackageTypes(org.eclipse.ease.lang.javascript.JavaScriptCompletionContextTest)  Time elapsed: 0.001 s
11:34:33 [2020-10-06T15:34:33.451Z] definedVariableTypes(org.eclipse.ease.lang.javascript.JavaScriptCompletionContextTest)  Time elapsed: 0 s
11:34:33 [2020-10-06T15:34:33.451Z] verifyStringLiteralTypes(org.eclipse.ease.lang.javascript.JavaScriptCompletionContextTest)  Time elapsed: 0.001 s
11:34:33 [2020-10-06T15:34:33.451Z] verifyUnknownTypes(org.eclipse.ease.lang.javascript.JavaScriptCompletionContextTest)  Time elapsed: 0 s
11:34:33 [2020-10-06T15:34:33.451Z] verifyNoneTypes(org.eclipse.ease.lang.javascript.JavaScriptCompletionContextTest)  Time elapsed: 0 s
11:34:33 [2020-10-06T15:34:33.451Z] Running org.eclipse.ease.lang.javascript.JavaScriptCodeFactoryTest
11:34:33 [2020-10-06T15:34:33.451Z] Tests run: 1, Failures: 0, Errors: 0, Skipped: 0, Time elapsed: 0.002 s - in org.eclipse.ease.lang.javascript.JavaScriptCodeFactoryTest
11:34:33 [2020-10-06T15:34:33.451Z] testCommentCreator(org.eclipse.ease.lang.javascript.JavaScriptCodeFactoryTest)  Time elapsed: 0.001 s
11:34:33 [2020-10-06T15:34:33.451Z] 
11:34:33 [2020-10-06T15:34:33.451Z] Results:
11:34:33 [2020-10-06T15:34:33.451Z] 
11:34:33 [2020-10-06T15:34:33.451Z] Tests run: 9, Failures: 0, Errors: 0, Skipped: 0
11:34:33 [2020-10-06T15:34:33.451Z] 
11:34:34 [2020-10-06T15:34:34.380Z] [INFO] All tests passed!
11:34:34 [2020-10-06T15:34:34.380Z] [INFO] 
11:34:34 [2020-10-06T15:34:34.380Z] [INFO] ---------< org.eclipse.ease:org.eclipse.ease.lang.python.test >---------
11:34:34 [2020-10-06T15:34:34.380Z] [INFO] Building org.eclipse.ease.lang.python.test 0.8.0-SNAPSHOT        [42/48]
11:34:34 [2020-10-06T15:34:34.380Z] [INFO] ------------------------[ eclipse-test-plugin ]-------------------------
11:34:34 [2020-10-06T15:34:34.380Z] [INFO] 
11:34:34 [2020-10-06T15:34:34.380Z] [INFO] --- maven-clean-plugin:2.5:clean (default-clean) @ org.eclipse.ease.lang.python.test ---
11:34:34 [2020-10-06T15:34:34.380Z] [INFO] 
11:34:34 [2020-10-06T15:34:34.380Z] [INFO] --- tycho-packaging-plugin:1.5.0:build-qualifier (default-build-qualifier) @ org.eclipse.ease.lang.python.test ---
11:34:34 [2020-10-06T15:34:34.380Z] [INFO] The project's OSGi version is 0.8.0.I201910171213
11:34:34 [2020-10-06T15:34:34.380Z] [INFO] 
11:34:34 [2020-10-06T15:34:34.380Z] [INFO] --- tycho-packaging-plugin:1.5.0:validate-id (default-validate-id) @ org.eclipse.ease.lang.python.test ---
11:34:34 [2020-10-06T15:34:34.380Z] [INFO] 
11:34:34 [2020-10-06T15:34:34.381Z] [INFO] --- tycho-packaging-plugin:1.5.0:validate-version (default-validate-version) @ org.eclipse.ease.lang.python.test ---
11:34:34 [2020-10-06T15:34:34.381Z] [INFO] 
11:34:34 [2020-10-06T15:34:34.381Z] [INFO] >>> maven-javadoc-plugin:2.9.1:javadoc (build-docs) > generate-sources @ org.eclipse.ease.lang.python.test >>>
11:34:34 [2020-10-06T15:34:34.381Z] [INFO] 
11:34:34 [2020-10-06T15:34:34.381Z] [INFO] --- tycho-packaging-plugin:1.5.0:build-qualifier (default-build-qualifier) @ org.eclipse.ease.lang.python.test ---
11:34:34 [2020-10-06T15:34:34.381Z] [INFO] The project's OSGi version is 0.8.0.I201910171213
11:34:34 [2020-10-06T15:34:34.381Z] [INFO] 
11:34:34 [2020-10-06T15:34:34.381Z] [INFO] --- tycho-packaging-plugin:1.5.0:validate-id (default-validate-id) @ org.eclipse.ease.lang.python.test ---
11:34:34 [2020-10-06T15:34:34.381Z] [INFO] 
11:34:34 [2020-10-06T15:34:34.381Z] [INFO] --- tycho-packaging-plugin:1.5.0:validate-version (default-validate-version) @ org.eclipse.ease.lang.python.test ---
11:34:34 [2020-10-06T15:34:34.381Z] [INFO] 
11:34:34 [2020-10-06T15:34:34.381Z] [INFO] <<< maven-javadoc-plugin:2.9.1:javadoc (build-docs) < generate-sources @ org.eclipse.ease.lang.python.test <<<
11:34:34 [2020-10-06T15:34:34.381Z] [INFO] 
11:34:34 [2020-10-06T15:34:34.381Z] [INFO] 
11:34:34 [2020-10-06T15:34:34.381Z] [INFO] --- maven-javadoc-plugin:2.9.1:javadoc (build-docs) @ org.eclipse.ease.lang.python.test ---
11:34:34 [2020-10-06T15:34:34.381Z] [ERROR] Error fetching link: http://help.eclipse.org/oxygen/topic/org.eclipse.platform.doc.isv/reference/api/package-list. Ignored it.
11:34:34 [2020-10-06T15:34:34.381Z] [ERROR] Error fetching link: https://ci.eclipse.org/ease/job/ease.build.core/JavaDoc/package-list. Ignored it.
11:34:35 [2020-10-06T15:34:35.311Z] [INFO] 
11:34:35 [2020-10-06T15:34:35.311Z] Loading source files for package org.eclipse.ease.lang.python...
11:34:35 [2020-10-06T15:34:35.311Z] Constructing Javadoc information...
11:34:35 [2020-10-06T15:34:35.311Z] WARNING: Cannot open location "/home/jenkins/agent/workspace/ease.verify.core.gerrit/tests/org.eclipse.ease.lang.python.test/target/javadoc-bundle-options/package-list"
11:34:35 [2020-10-06T15:34:35.311Z] No plugin definition found, skipping
11:34:35 [2020-10-06T15:34:35.311Z] No plugin definition found, skipping
11:34:35 [2020-10-06T15:34:35.311Z] [WARNING] Javadoc Warnings
11:34:35 [2020-10-06T15:34:35.311Z] [WARNING] Picked up JAVA_TOOL_OPTIONS: -Dmaven.ext.class.path="/home/jenkins/agent/workspace/ease.verify.core.gerrit@tmp/withMaven06edad13/pipeline-maven-spy.jar" -Dorg.jenkinsci.plugins.pipeline.maven.reportsFolder="/home/jenkins/agent/workspace/ease.verify.core.gerrit@tmp/withMaven06edad13"
11:34:35 [2020-10-06T15:34:35.311Z] [WARNING] javadoc: warning - The old Doclet and Taglet APIs in the packages
11:34:35 [2020-10-06T15:34:35.311Z] [WARNING] com.sun.javadoc, com.sun.tools.doclets and their implementations
11:34:35 [2020-10-06T15:34:35.311Z] [WARNING] are planned to be removed in a future JDK release. These
11:34:35 [2020-10-06T15:34:35.311Z] [WARNING] components have been superseded by the new APIs in jdk.javadoc.doclet.
11:34:35 [2020-10-06T15:34:35.311Z] [WARNING] Users are strongly recommended to migrate to the new APIs.
11:34:35 [2020-10-06T15:34:35.311Z] [INFO] 
11:34:35 [2020-10-06T15:34:35.311Z] [INFO] --- build-helper-maven-plugin:1.9.1:add-resource (add_help) @ org.eclipse.ease.lang.python.test ---
11:34:35 [2020-10-06T15:34:35.311Z] [INFO] 
11:34:35 [2020-10-06T15:34:35.311Z] [INFO] --- maven-resources-plugin:2.4.3:resources (default-resources) @ org.eclipse.ease.lang.python.test ---
11:34:35 [2020-10-06T15:34:35.311Z] [INFO] Using 'UTF-8' encoding to copy filtered resources.
11:34:35 [2020-10-06T15:34:35.311Z] [INFO] skip non existing resourceDirectory /home/jenkins/agent/workspace/ease.verify.core.gerrit/tests/org.eclipse.ease.lang.python.test/src/main/resources
11:34:35 [2020-10-06T15:34:35.311Z] [INFO] skip non existing resourceDirectory /home/jenkins/agent/workspace/ease.verify.core.gerrit/tests/org.eclipse.ease.lang.python.test/help
11:34:35 [2020-10-06T15:34:35.311Z] [INFO] 
11:34:35 [2020-10-06T15:34:35.311Z] [INFO] --- tycho-compiler-plugin:1.5.0:compile (default-compile) @ org.eclipse.ease.lang.python.test ---
11:34:35 [2020-10-06T15:34:35.311Z] [INFO] Compiling 1 source file to /home/jenkins/agent/workspace/ease.verify.core.gerrit/tests/org.eclipse.ease.lang.python.test/target/classes
11:34:35 [2020-10-06T15:34:35.311Z] [INFO] 
11:34:35 [2020-10-06T15:34:35.312Z] [INFO] --- maven-resources-plugin:2.4.3:testResources (default-testResources) @ org.eclipse.ease.lang.python.test ---
11:34:35 [2020-10-06T15:34:35.312Z] [INFO] Using 'UTF-8' encoding to copy filtered resources.
11:34:35 [2020-10-06T15:34:35.312Z] [INFO] skip non existing resourceDirectory /home/jenkins/agent/workspace/ease.verify.core.gerrit/tests/org.eclipse.ease.lang.python.test/src/test/resources
11:34:35 [2020-10-06T15:34:35.312Z] [INFO] 
11:34:35 [2020-10-06T15:34:35.312Z] [INFO] --- tycho-source-plugin:1.5.0:plugin-source (plugin-source) @ org.eclipse.ease.lang.python.test ---
11:34:35 [2020-10-06T15:34:35.312Z] [WARNING] Bundle-Vendor header not found in /home/jenkins/agent/workspace/ease.verify.core.gerrit/tests/org.eclipse.ease.lang.python.test/META-INF/MANIFEST.MF, fallback to 'unknown' for source bundle
11:34:35 [2020-10-06T15:34:35.312Z] [INFO] Building jar: /home/jenkins/agent/workspace/ease.verify.core.gerrit/tests/org.eclipse.ease.lang.python.test/target/org.eclipse.ease.lang.python.test-0.8.0-SNAPSHOT-sources.jar
11:34:35 [2020-10-06T15:34:35.312Z] [INFO] 
11:34:35 [2020-10-06T15:34:35.312Z] [INFO] --- target-platform-configuration:1.5.0:target-platform (default-target-platform) @ org.eclipse.ease.lang.python.test ---
11:34:35 [2020-10-06T15:34:35.312Z] [INFO] 
11:34:35 [2020-10-06T15:34:35.312Z] [INFO] --- tycho-packaging-plugin:1.5.0:package-plugin (default-package-plugin) @ org.eclipse.ease.lang.python.test ---
11:34:35 [2020-10-06T15:34:35.312Z] [INFO] Building jar: /home/jenkins/agent/workspace/ease.verify.core.gerrit/tests/org.eclipse.ease.lang.python.test/target/org.eclipse.ease.lang.python.test-0.8.0-SNAPSHOT.jar
11:34:35 [2020-10-06T15:34:35.312Z] [INFO] 
11:34:35 [2020-10-06T15:34:35.312Z] [INFO] --- tycho-p2-plugin:1.5.0:p2-metadata-default (default-p2-metadata-default) @ org.eclipse.ease.lang.python.test ---
11:34:35 [2020-10-06T15:34:35.312Z] [INFO] 
11:34:35 [2020-10-06T15:34:35.312Z] [INFO] --- tycho-source-feature-plugin:1.5.0:source-feature (source-feature) @ org.eclipse.ease.lang.python.test ---
11:34:35 [2020-10-06T15:34:35.312Z] [INFO] 
11:34:35 [2020-10-06T15:34:35.312Z] [INFO] --- tycho-p2-plugin:1.5.0:p2-metadata (attached-p2-metadata) @ org.eclipse.ease.lang.python.test ---
11:34:35 [2020-10-06T15:34:35.312Z] [INFO] 
11:34:35 [2020-10-06T15:34:35.312Z] [INFO] --- tycho-surefire-plugin:1.5.0:test (default-test) @ org.eclipse.ease.lang.python.test ---
11:34:35 [2020-10-06T15:34:35.585Z] [INFO] Expected eclipse log file: /home/jenkins/agent/workspace/ease.verify.core.gerrit/tests/org.eclipse.ease.lang.python.test/target/work/data/.metadata/.log
11:34:35 [2020-10-06T15:34:35.585Z] [INFO] Command line:
11:34:35 [2020-10-06T15:34:35.585Z] 	[/opt/tools/java/openjdk/jdk-11/11.0.2+9/bin/java, -Dosgi.noShutdown=false, -Dosgi.os=linux, -Dosgi.ws=gtk, -Dosgi.arch=x86_64, -Dosgi.clean=true, -jar, /home/jenkins/.m2/repository/p2/osgi/bundle/org.eclipse.equinox.launcher/1.5.800.v20200727-1323/org.eclipse.equinox.launcher-1.5.800.v20200727-1323.jar, -data, /home/jenkins/agent/workspace/ease.verify.core.gerrit/tests/org.eclipse.ease.lang.python.test/target/work/data, -install, /home/jenkins/agent/workspace/ease.verify.core.gerrit/tests/org.eclipse.ease.lang.python.test/target/work, -configuration, /home/jenkins/agent/workspace/ease.verify.core.gerrit/tests/org.eclipse.ease.lang.python.test/target/work/configuration, -application, org.eclipse.tycho.surefire.osgibooter.headlesstest, -testproperties, /home/jenkins/agent/workspace/ease.verify.core.gerrit/tests/org.eclipse.ease.lang.python.test/target/surefire.properties]
11:34:35 [2020-10-06T15:34:35.586Z] Picked up JAVA_TOOL_OPTIONS: -Dmaven.ext.class.path="/home/jenkins/agent/workspace/ease.verify.core.gerrit@tmp/withMaven06edad13/pipeline-maven-spy.jar" -Dorg.jenkinsci.plugins.pipeline.maven.reportsFolder="/home/jenkins/agent/workspace/ease.verify.core.gerrit@tmp/withMaven06edad13" 
11:34:37 [2020-10-06T15:34:37.222Z] Running org.eclipse.ease.lang.python.PythonCodeFactoryTest
11:34:37 [2020-10-06T15:34:37.222Z] Tests run: 1, Failures: 0, Errors: 0, Skipped: 0, Time elapsed: 0.034 s - in org.eclipse.ease.lang.python.PythonCodeFactoryTest
11:34:37 [2020-10-06T15:34:37.222Z] testCommentCreator(org.eclipse.ease.lang.python.PythonCodeFactoryTest)  Time elapsed: 0.004 s
11:34:37 [2020-10-06T15:34:37.222Z] 
11:34:37 [2020-10-06T15:34:37.222Z] Results:
11:34:37 [2020-10-06T15:34:37.222Z] 
11:34:37 [2020-10-06T15:34:37.222Z] Tests run: 1, Failures: 0, Errors: 0, Skipped: 0
11:34:37 [2020-10-06T15:34:37.222Z] 
11:34:37 [2020-10-06T15:34:37.783Z] [INFO] All tests passed!
11:34:37 [2020-10-06T15:34:37.783Z] [INFO] 
11:34:37 [2020-10-06T15:34:37.783Z] [INFO] -----< org.eclipse.ease:org.eclipse.ease.lang.python.jython.test >------
11:34:37 [2020-10-06T15:34:37.783Z] [INFO] Building org.eclipse.ease.lang.python.jython.test 0.8.0-SNAPSHOT [43/48]
11:34:37 [2020-10-06T15:34:37.783Z] [INFO] ------------------------[ eclipse-test-plugin ]-------------------------
11:34:37 [2020-10-06T15:34:37.783Z] [INFO] 
11:34:37 [2020-10-06T15:34:37.783Z] [INFO] --- maven-clean-plugin:2.5:clean (default-clean) @ org.eclipse.ease.lang.python.jython.test ---
11:34:37 [2020-10-06T15:34:37.783Z] [INFO] 
11:34:37 [2020-10-06T15:34:37.783Z] [INFO] --- tycho-packaging-plugin:1.5.0:build-qualifier (default-build-qualifier) @ org.eclipse.ease.lang.python.jython.test ---
11:34:37 [2020-10-06T15:34:37.783Z] [INFO] The project's OSGi version is 0.8.0.I201911291239
11:34:37 [2020-10-06T15:34:37.783Z] [INFO] 
11:34:37 [2020-10-06T15:34:37.783Z] [INFO] --- tycho-packaging-plugin:1.5.0:validate-id (default-validate-id) @ org.eclipse.ease.lang.python.jython.test ---
11:34:37 [2020-10-06T15:34:37.783Z] [INFO] 
11:34:37 [2020-10-06T15:34:37.783Z] [INFO] --- tycho-packaging-plugin:1.5.0:validate-version (default-validate-version) @ org.eclipse.ease.lang.python.jython.test ---
11:34:37 [2020-10-06T15:34:37.783Z] [INFO] 
11:34:37 [2020-10-06T15:34:37.783Z] [INFO] >>> maven-javadoc-plugin:2.9.1:javadoc (build-docs) > generate-sources @ org.eclipse.ease.lang.python.jython.test >>>
11:34:37 [2020-10-06T15:34:37.783Z] [INFO] 
11:34:37 [2020-10-06T15:34:37.783Z] [INFO] --- tycho-packaging-plugin:1.5.0:build-qualifier (default-build-qualifier) @ org.eclipse.ease.lang.python.jython.test ---
11:34:37 [2020-10-06T15:34:37.783Z] [INFO] The project's OSGi version is 0.8.0.I201911291239
11:34:37 [2020-10-06T15:34:37.783Z] [INFO] 
11:34:37 [2020-10-06T15:34:37.783Z] [INFO] --- tycho-packaging-plugin:1.5.0:validate-id (default-validate-id) @ org.eclipse.ease.lang.python.jython.test ---
11:34:37 [2020-10-06T15:34:37.783Z] [INFO] 
11:34:37 [2020-10-06T15:34:37.783Z] [INFO] --- tycho-packaging-plugin:1.5.0:validate-version (default-validate-version) @ org.eclipse.ease.lang.python.jython.test ---
11:34:37 [2020-10-06T15:34:37.783Z] [INFO] 
11:34:37 [2020-10-06T15:34:37.783Z] [INFO] <<< maven-javadoc-plugin:2.9.1:javadoc (build-docs) < generate-sources @ org.eclipse.ease.lang.python.jython.test <<<
11:34:37 [2020-10-06T15:34:37.783Z] [INFO] 
11:34:37 [2020-10-06T15:34:37.783Z] [INFO] 
11:34:37 [2020-10-06T15:34:37.784Z] [INFO] --- maven-javadoc-plugin:2.9.1:javadoc (build-docs) @ org.eclipse.ease.lang.python.jython.test ---
11:34:38 [2020-10-06T15:34:38.039Z] [ERROR] Error fetching link: http://help.eclipse.org/oxygen/topic/org.eclipse.platform.doc.isv/reference/api/package-list. Ignored it.
11:34:38 [2020-10-06T15:34:38.039Z] [ERROR] Error fetching link: https://ci.eclipse.org/ease/job/ease.build.core/JavaDoc/package-list. Ignored it.
11:34:38 [2020-10-06T15:34:38.985Z] [INFO] 
11:34:38 [2020-10-06T15:34:38.985Z] Loading source files for package org.eclipse.ease.lang.python.jython.debugger...
11:34:38 [2020-10-06T15:34:38.985Z] Constructing Javadoc information...
11:34:38 [2020-10-06T15:34:38.985Z] WARNING: Cannot open location "/home/jenkins/agent/workspace/ease.verify.core.gerrit/tests/org.eclipse.ease.lang.python.jython.test/target/javadoc-bundle-options/package-list"
11:34:38 [2020-10-06T15:34:38.985Z] No plugin definition found, skipping
11:34:38 [2020-10-06T15:34:38.985Z] No plugin definition found, skipping
11:34:38 [2020-10-06T15:34:38.985Z] [WARNING] Javadoc Warnings
11:34:38 [2020-10-06T15:34:38.985Z] [WARNING] Picked up JAVA_TOOL_OPTIONS: -Dmaven.ext.class.path="/home/jenkins/agent/workspace/ease.verify.core.gerrit@tmp/withMaven06edad13/pipeline-maven-spy.jar" -Dorg.jenkinsci.plugins.pipeline.maven.reportsFolder="/home/jenkins/agent/workspace/ease.verify.core.gerrit@tmp/withMaven06edad13"
11:34:38 [2020-10-06T15:34:38.985Z] [WARNING] javadoc: warning - The old Doclet and Taglet APIs in the packages
11:34:38 [2020-10-06T15:34:38.985Z] [WARNING] com.sun.javadoc, com.sun.tools.doclets and their implementations
11:34:38 [2020-10-06T15:34:38.985Z] [WARNING] are planned to be removed in a future JDK release. These
11:34:38 [2020-10-06T15:34:38.985Z] [WARNING] components have been superseded by the new APIs in jdk.javadoc.doclet.
11:34:38 [2020-10-06T15:34:38.985Z] [WARNING] Users are strongly recommended to migrate to the new APIs.
11:34:38 [2020-10-06T15:34:38.986Z] [INFO] 
11:34:38 [2020-10-06T15:34:38.986Z] [INFO] --- build-helper-maven-plugin:1.9.1:add-resource (add_help) @ org.eclipse.ease.lang.python.jython.test ---
11:34:38 [2020-10-06T15:34:38.986Z] [INFO] 
11:34:38 [2020-10-06T15:34:38.986Z] [INFO] --- maven-resources-plugin:2.4.3:resources (default-resources) @ org.eclipse.ease.lang.python.jython.test ---
11:34:38 [2020-10-06T15:34:38.986Z] [INFO] Using 'UTF-8' encoding to copy filtered resources.
11:34:38 [2020-10-06T15:34:38.986Z] [INFO] skip non existing resourceDirectory /home/jenkins/agent/workspace/ease.verify.core.gerrit/tests/org.eclipse.ease.lang.python.jython.test/src/main/resources
11:34:38 [2020-10-06T15:34:38.986Z] [INFO] skip non existing resourceDirectory /home/jenkins/agent/workspace/ease.verify.core.gerrit/tests/org.eclipse.ease.lang.python.jython.test/help
11:34:38 [2020-10-06T15:34:38.986Z] [INFO] 
11:34:38 [2020-10-06T15:34:38.986Z] [INFO] --- tycho-compiler-plugin:1.5.0:compile (default-compile) @ org.eclipse.ease.lang.python.jython.test ---
11:34:38 [2020-10-06T15:34:38.986Z] [INFO] Compiling 1 source file to /home/jenkins/agent/workspace/ease.verify.core.gerrit/tests/org.eclipse.ease.lang.python.jython.test/target/classes
11:34:38 [2020-10-06T15:34:38.986Z] [INFO] 
11:34:38 [2020-10-06T15:34:38.986Z] [INFO] --- maven-resources-plugin:2.4.3:testResources (default-testResources) @ org.eclipse.ease.lang.python.jython.test ---
11:34:38 [2020-10-06T15:34:38.986Z] [INFO] Using 'UTF-8' encoding to copy filtered resources.
11:34:38 [2020-10-06T15:34:38.986Z] [INFO] skip non existing resourceDirectory /home/jenkins/agent/workspace/ease.verify.core.gerrit/tests/org.eclipse.ease.lang.python.jython.test/src/test/resources
11:34:38 [2020-10-06T15:34:38.986Z] [INFO] 
11:34:38 [2020-10-06T15:34:38.986Z] [INFO] --- tycho-source-plugin:1.5.0:plugin-source (plugin-source) @ org.eclipse.ease.lang.python.jython.test ---
11:34:38 [2020-10-06T15:34:38.986Z] [WARNING] Bundle-Vendor header not found in /home/jenkins/agent/workspace/ease.verify.core.gerrit/tests/org.eclipse.ease.lang.python.jython.test/META-INF/MANIFEST.MF, fallback to 'unknown' for source bundle
11:34:38 [2020-10-06T15:34:38.986Z] [INFO] Building jar: /home/jenkins/agent/workspace/ease.verify.core.gerrit/tests/org.eclipse.ease.lang.python.jython.test/target/org.eclipse.ease.lang.python.jython.test-0.8.0-SNAPSHOT-sources.jar
11:34:38 [2020-10-06T15:34:38.986Z] [INFO] 
11:34:38 [2020-10-06T15:34:38.986Z] [INFO] --- target-platform-configuration:1.5.0:target-platform (default-target-platform) @ org.eclipse.ease.lang.python.jython.test ---
11:34:38 [2020-10-06T15:34:38.986Z] [INFO] 
11:34:38 [2020-10-06T15:34:38.986Z] [INFO] --- tycho-packaging-plugin:1.5.0:package-plugin (default-package-plugin) @ org.eclipse.ease.lang.python.jython.test ---
11:34:38 [2020-10-06T15:34:38.986Z] [INFO] Building jar: /home/jenkins/agent/workspace/ease.verify.core.gerrit/tests/org.eclipse.ease.lang.python.jython.test/target/org.eclipse.ease.lang.python.jython.test-0.8.0-SNAPSHOT.jar
11:34:38 [2020-10-06T15:34:38.986Z] [INFO] 
11:34:38 [2020-10-06T15:34:38.986Z] [INFO] --- tycho-p2-plugin:1.5.0:p2-metadata-default (default-p2-metadata-default) @ org.eclipse.ease.lang.python.jython.test ---
11:34:38 [2020-10-06T15:34:38.986Z] [INFO] 
11:34:38 [2020-10-06T15:34:38.986Z] [INFO] --- tycho-source-feature-plugin:1.5.0:source-feature (source-feature) @ org.eclipse.ease.lang.python.jython.test ---
11:34:39 [2020-10-06T15:34:39.243Z] [INFO] 
11:34:39 [2020-10-06T15:34:39.243Z] [INFO] --- tycho-p2-plugin:1.5.0:p2-metadata (attached-p2-metadata) @ org.eclipse.ease.lang.python.jython.test ---
11:34:39 [2020-10-06T15:34:39.243Z] [INFO] 
11:34:39 [2020-10-06T15:34:39.243Z] [INFO] --- tycho-surefire-plugin:1.5.0:test (default-test) @ org.eclipse.ease.lang.python.jython.test ---
11:34:39 [2020-10-06T15:34:39.804Z] [INFO] Expected eclipse log file: /home/jenkins/agent/workspace/ease.verify.core.gerrit/tests/org.eclipse.ease.lang.python.jython.test/target/work/data/.metadata/.log
11:34:39 [2020-10-06T15:34:39.804Z] [INFO] Command line:
11:34:39 [2020-10-06T15:34:39.804Z] 	[/opt/tools/java/openjdk/jdk-11/11.0.2+9/bin/java, -Dosgi.noShutdown=false, -Dosgi.os=linux, -Dosgi.ws=gtk, -Dosgi.arch=x86_64, -Dosgi.clean=true, -jar, /home/jenkins/.m2/repository/p2/osgi/bundle/org.eclipse.equinox.launcher/1.5.800.v20200727-1323/org.eclipse.equinox.launcher-1.5.800.v20200727-1323.jar, -data, /home/jenkins/agent/workspace/ease.verify.core.gerrit/tests/org.eclipse.ease.lang.python.jython.test/target/work/data, -install, /home/jenkins/agent/workspace/ease.verify.core.gerrit/tests/org.eclipse.ease.lang.python.jython.test/target/work, -configuration, /home/jenkins/agent/workspace/ease.verify.core.gerrit/tests/org.eclipse.ease.lang.python.jython.test/target/work/configuration, -application, org.eclipse.tycho.surefire.osgibooter.headlesstest, -testproperties, /home/jenkins/agent/workspace/ease.verify.core.gerrit/tests/org.eclipse.ease.lang.python.jython.test/target/surefire.properties]
11:34:39 [2020-10-06T15:34:39.804Z] Picked up JAVA_TOOL_OPTIONS: -Dmaven.ext.class.path="/home/jenkins/agent/workspace/ease.verify.core.gerrit@tmp/withMaven06edad13/pipeline-maven-spy.jar" -Dorg.jenkinsci.plugins.pipeline.maven.reportsFolder="/home/jenkins/agent/workspace/ease.verify.core.gerrit@tmp/withMaven06edad13" 
11:34:41 [2020-10-06T15:34:41.223Z] WARNING: An illegal reflective access operation has occurred
11:34:41 [2020-10-06T15:34:41.223Z] WARNING: Illegal reflective access by org.python.core.PySystemState (file:/home/jenkins/agent/workspace/ease.verify.core.gerrit/tests/org.eclipse.ease.lang.python.jython.test/target/work/plugins/org.jython_2.7.0.I201609090924/jython.jar) to method java.io.Console.encoding()
11:34:41 [2020-10-06T15:34:41.223Z] WARNING: Please consider reporting this to the maintainers of org.python.core.PySystemState
11:34:41 [2020-10-06T15:34:41.223Z] WARNING: Use --illegal-access=warn to enable warnings of further illegal reflective access operations
11:34:41 [2020-10-06T15:34:41.223Z] WARNING: All illegal access operations will be denied in a future release
11:34:41 [2020-10-06T15:34:41.485Z] Running org.eclipse.ease.lang.python.jython.debugger.JythonDebugTest
11:34:43 [2020-10-06T15:34:43.374Z] Start of script
11:34:43 [2020-10-06T15:34:43.374Z] include file start
11:34:43 [2020-10-06T15:34:43.374Z] include file processed
11:34:43 [2020-10-06T15:34:43.374Z] Result of testMethod = 5
11:34:43 [2020-10-06T15:34:43.374Z] End of script
11:34:43 [2020-10-06T15:34:43.374Z] Start of script
11:34:43 [2020-10-06T15:34:43.374Z] include file start
11:34:43 [2020-10-06T15:34:43.374Z] include file processed
11:34:43 [2020-10-06T15:34:43.374Z] Result of testMethod = 5
11:34:43 [2020-10-06T15:34:43.374Z] End of script
11:34:43 [2020-10-06T15:34:43.374Z] Start of script
11:34:43 [2020-10-06T15:34:43.374Z] include file start
11:34:43 [2020-10-06T15:34:43.374Z] include file processed
11:34:43 [2020-10-06T15:34:43.374Z] Result of testMethod = 5
11:34:43 [2020-10-06T15:34:43.629Z] Traceback (most recent call last):
11:34:43 [2020-10-06T15:34:43.629Z]   File "(none)", line 184, in run
11:34:43 [2020-10-06T15:34:43.629Z]   File "__ref_L/Debug Test/Main.py_ggidqbjflt", line 23, in <module>
11:34:43 [2020-10-06T15:34:43.629Z]   File "(none)", line 161, in trace_dispatch
11:34:43 [2020-10-06T15:34:43.629Z] org.eclipse.ease.ExitException: 
11:34:43 [2020-10-06T15:34:43.629Z] 
11:34:43 [2020-10-06T15:34:43.629Z] org.eclipse.ease.ExitException: org.eclipse.ease.ExitException: 
11:34:43 [2020-10-06T15:34:43.885Z] Start of script
11:34:43 [2020-10-06T15:34:43.885Z] include file start
11:34:43 [2020-10-06T15:34:43.885Z] include file processed
11:34:43 [2020-10-06T15:34:43.885Z] Result of testMethod = 5
11:34:43 [2020-10-06T15:34:43.885Z] End of script
11:34:44 [2020-10-06T15:34:44.447Z] Start of script
11:34:44 [2020-10-06T15:34:44.447Z] include file start
11:34:44 [2020-10-06T15:34:44.447Z] include file processed
11:34:44 [2020-10-06T15:34:44.447Z] Result of testMethod = 5
11:34:44 [2020-10-06T15:34:44.447Z] End of script
11:34:44 [2020-10-06T15:34:44.447Z] Start of script
11:34:44 [2020-10-06T15:34:44.447Z] include file start
11:34:44 [2020-10-06T15:34:44.447Z] include file processed
11:34:44 [2020-10-06T15:34:44.702Z] Result of testMethod = 5
11:34:44 [2020-10-06T15:34:44.702Z] End of script
11:34:44 [2020-10-06T15:34:44.702Z] Start of script
11:34:44 [2020-10-06T15:34:44.702Z] include file start
11:34:44 [2020-10-06T15:34:44.702Z] include file processed
11:34:44 [2020-10-06T15:34:44.702Z] Result of testMethod = 5
11:34:44 [2020-10-06T15:34:44.958Z] Traceback (most recent call last):
11:34:44 [2020-10-06T15:34:44.958Z]   File "(none)", line 184, in run
11:34:44 [2020-10-06T15:34:44.958Z]   File "__ref_L/Debug Test/Main.py_dbsemdyizr", line 23, in <module>
11:34:44 [2020-10-06T15:34:44.958Z]   File "(none)", line 161, in trace_dispatch
11:34:44 [2020-10-06T15:34:44.958Z] org.eclipse.ease.ExitException: 
11:34:44 [2020-10-06T15:34:44.958Z] 
11:34:44 [2020-10-06T15:34:44.958Z] org.eclipse.ease.ExitException: org.eclipse.ease.ExitException: 
11:34:44 [2020-10-06T15:34:44.958Z] Start of script
11:34:44 [2020-10-06T15:34:44.958Z] include file start
11:34:44 [2020-10-06T15:34:44.958Z] include file processed
11:34:45 [2020-10-06T15:34:45.214Z] Result of testMethod = 5
11:34:45 [2020-10-06T15:34:45.214Z] End of script
11:34:45 [2020-10-06T15:34:45.471Z] Start of script
11:34:45 [2020-10-06T15:34:45.471Z] include file start
11:34:45 [2020-10-06T15:34:45.471Z] include file processed
11:34:45 [2020-10-06T15:34:45.471Z] Result of testMethod = 5
11:34:45 [2020-10-06T15:34:45.471Z] End of script
11:34:45 [2020-10-06T15:34:45.471Z] Start of script
11:34:45 [2020-10-06T15:34:45.471Z] include file start
11:34:45 [2020-10-06T15:34:45.471Z] include file processed
11:34:46 [2020-10-06T15:34:46.032Z] Traceback (most recent call last):
11:34:46 [2020-10-06T15:34:46.032Z]   File "(none)", line 184, in run
11:34:46 [2020-10-06T15:34:46.032Z]   File "__ref_L/Debug Test/Main.py_wbjrbreqjb", line 22, in <module>
11:34:46 [2020-10-06T15:34:46.032Z]   File "(none)", line 161, in trace_dispatch
11:34:46 [2020-10-06T15:34:46.032Z] org.eclipse.ease.ExitException: 
11:34:46 [2020-10-06T15:34:46.032Z] 
11:34:46 [2020-10-06T15:34:46.032Z] org.eclipse.ease.ExitException: org.eclipse.ease.ExitException: 
11:34:46 [2020-10-06T15:34:46.032Z] Start of script
11:34:46 [2020-10-06T15:34:46.032Z] include file start
11:34:46 [2020-10-06T15:34:46.032Z] include file processed
11:34:46 [2020-10-06T15:34:46.032Z] Result of testMethod = 5
11:34:46 [2020-10-06T15:34:46.032Z] End of script
11:34:46 [2020-10-06T15:34:46.288Z] Start of script
11:34:46 [2020-10-06T15:34:46.288Z] include file start
11:34:46 [2020-10-06T15:34:46.288Z] include file processed
11:34:46 [2020-10-06T15:34:46.543Z] Result of testMethod = 5
11:34:46 [2020-10-06T15:34:46.543Z] End of script
11:34:46 [2020-10-06T15:34:46.543Z] Traceback (most recent call last):
11:34:46 [2020-10-06T15:34:46.543Z]   File "(none)", line 184, in run
11:34:46 [2020-10-06T15:34:46.543Z]   File "__ref_L/Debug Test/Main.py_bdsqmisiib", line 1, in <module>
11:34:46 [2020-10-06T15:34:46.543Z]   File "(none)", line 161, in trace_dispatch
11:34:46 [2020-10-06T15:34:46.543Z] org.eclipse.ease.ExitException: 
11:34:46 [2020-10-06T15:34:46.543Z] 
11:34:46 [2020-10-06T15:34:46.543Z] org.eclipse.ease.ExitException: org.eclipse.ease.ExitException: 
11:34:46 [2020-10-06T15:34:46.798Z] Start of script
11:34:46 [2020-10-06T15:34:46.798Z] include file start
11:34:46 [2020-10-06T15:34:46.798Z] include file processed
11:34:46 [2020-10-06T15:34:46.798Z] Result of testMethod = 5
11:34:46 [2020-10-06T15:34:46.798Z] End of script
11:34:47 [2020-10-06T15:34:47.053Z] Start of script
11:34:47 [2020-10-06T15:34:47.053Z] include file start
11:34:47 [2020-10-06T15:34:47.053Z] include file processed
11:34:47 [2020-10-06T15:34:47.053Z] Result of testMethod = 5
11:34:47 [2020-10-06T15:34:47.053Z] End of script
11:34:47 [2020-10-06T15:34:47.309Z] Start of script
11:34:47 [2020-10-06T15:34:47.309Z] include file start
11:34:47 [2020-10-06T15:34:47.309Z] include file processed
11:34:47 [2020-10-06T15:34:47.309Z] Result of testMethod = 5
11:34:47 [2020-10-06T15:34:47.564Z] Traceback (most recent call last):
11:34:47 [2020-10-06T15:34:47.564Z]   File "(none)", line 184, in run
11:34:47 [2020-10-06T15:34:47.564Z]   File "__ref_L/Debug Test/Main.py_etejwuuyag", line 23, in <module>
11:34:47 [2020-10-06T15:34:47.564Z]   File "(none)", line 161, in trace_dispatch
11:34:47 [2020-10-06T15:34:47.564Z] org.eclipse.ease.ExitException: 
11:34:47 [2020-10-06T15:34:47.564Z] 
11:34:47 [2020-10-06T15:34:47.564Z] org.eclipse.ease.ExitException: org.eclipse.ease.ExitException: 
11:34:47 [2020-10-06T15:34:47.564Z] Start of script
11:34:47 [2020-10-06T15:34:47.564Z] include file start
11:34:47 [2020-10-06T15:34:47.564Z] include file processed
11:34:47 [2020-10-06T15:34:47.819Z] Result of testMethod = 5
11:34:47 [2020-10-06T15:34:47.819Z] End of script
11:34:48 [2020-10-06T15:34:48.075Z] Traceback (most recent call last):
11:34:48 [2020-10-06T15:34:48.075Z]   File "(none)", line 184, in run
11:34:48 [2020-10-06T15:34:48.075Z]   File "__ref_L/Debug Test/Main.py_hqmbwyicwn", line 1, in <module>
11:34:48 [2020-10-06T15:34:48.075Z]   File "(none)", line 161, in trace_dispatch
11:34:48 [2020-10-06T15:34:48.075Z] org.eclipse.ease.ExitException: 
11:34:48 [2020-10-06T15:34:48.075Z] 
11:34:48 [2020-10-06T15:34:48.075Z] org.eclipse.ease.ExitException: org.eclipse.ease.ExitException: 
11:34:48 [2020-10-06T15:34:48.075Z] Start of script
11:34:48 [2020-10-06T15:34:48.075Z] include file start
11:34:48 [2020-10-06T15:34:48.075Z] include file processed
11:34:48 [2020-10-06T15:34:48.075Z] Result of testMethod = 5
11:34:48 [2020-10-06T15:34:48.075Z] End of script
11:34:48 [2020-10-06T15:34:48.332Z] Start of script
11:34:48 [2020-10-06T15:34:48.332Z] include file start
11:34:48 [2020-10-06T15:34:48.332Z] include file processed
11:34:48 [2020-10-06T15:34:48.587Z] Result of testMethod = 5
11:34:48 [2020-10-06T15:34:48.587Z] End of script
11:34:48 [2020-10-06T15:34:48.587Z] Traceback (most recent call last):
11:34:48 [2020-10-06T15:34:48.587Z]   File "(none)", line 184, in run
11:34:48 [2020-10-06T15:34:48.587Z]   File "__ref_L/Debug Test/Main.py_uvgvjqvyxx", line 1, in <module>
11:34:48 [2020-10-06T15:34:48.587Z]   File "(none)", line 161, in trace_dispatch
11:34:48 [2020-10-06T15:34:48.587Z] org.eclipse.ease.ExitException: 
11:34:48 [2020-10-06T15:34:48.587Z] 
11:34:48 [2020-10-06T15:34:48.587Z] org.eclipse.ease.ExitException: org.eclipse.ease.ExitException: 
11:34:48 [2020-10-06T15:34:48.842Z] Start of script
11:34:48 [2020-10-06T15:34:48.842Z] include file start
11:34:48 [2020-10-06T15:34:48.842Z] include file processed
11:34:49 [2020-10-06T15:34:49.097Z] Result of testMethod = 5
11:34:49 [2020-10-06T15:34:49.097Z] End of script
11:34:49 [2020-10-06T15:34:49.097Z] Start of script
11:34:49 [2020-10-06T15:34:49.097Z] include file start
11:34:49 [2020-10-06T15:34:49.097Z] include file processed
11:34:49 [2020-10-06T15:34:49.097Z] Result of testMethod = 5
11:34:49 [2020-10-06T15:34:49.353Z] Traceback (most recent call last):
11:34:49 [2020-10-06T15:34:49.353Z]   File "(none)", line 184, in run
11:34:49 [2020-10-06T15:34:49.353Z]   File "__ref_L/Debug Test/Main.py_wvipiuumgi", line 23, in <module>
11:34:49 [2020-10-06T15:34:49.353Z]   File "(none)", line 161, in trace_dispatch
11:34:49 [2020-10-06T15:34:49.353Z] org.eclipse.ease.ExitException: 
11:34:49 [2020-10-06T15:34:49.353Z] 
11:34:49 [2020-10-06T15:34:49.353Z] org.eclipse.ease.ExitException: org.eclipse.ease.ExitException: 
11:34:49 [2020-10-06T15:34:49.608Z] Start of script
11:34:49 [2020-10-06T15:34:49.608Z] include file start
11:34:49 [2020-10-06T15:34:49.608Z] include file processed
11:34:49 [2020-10-06T15:34:49.608Z] Result of testMethod = 5
11:34:49 [2020-10-06T15:34:49.608Z] End of script
11:34:49 [2020-10-06T15:34:49.608Z] Start of script
11:34:49 [2020-10-06T15:34:49.608Z] include file start
11:34:49 [2020-10-06T15:34:49.608Z] include file processed
11:34:49 [2020-10-06T15:34:49.863Z] Result of testMethod = 5
11:34:49 [2020-10-06T15:34:49.863Z] End of script
11:34:49 [2020-10-06T15:34:49.863Z] Start of script
11:34:49 [2020-10-06T15:34:49.863Z] include file start
11:34:49 [2020-10-06T15:34:49.863Z] include file processed
11:34:49 [2020-10-06T15:34:49.863Z] Result of testMethod = 5
11:34:49 [2020-10-06T15:34:49.863Z] End of script
11:34:50 [2020-10-06T15:34:50.118Z] Start of script
11:34:50 [2020-10-06T15:34:50.119Z] include file start
11:34:50 [2020-10-06T15:34:50.119Z] include file processed
11:34:50 [2020-10-06T15:34:50.373Z] Result of testMethod = 5
11:34:50 [2020-10-06T15:34:50.373Z] End of script
11:34:50 [2020-10-06T15:34:50.373Z] Start of script
11:34:50 [2020-10-06T15:34:50.373Z] include file start
11:34:50 [2020-10-06T15:34:50.373Z] include file processed
11:34:50 [2020-10-06T15:34:50.629Z] Traceback (most recent call last):
11:34:50 [2020-10-06T15:34:50.629Z]   File "(none)", line 184, in run
11:34:50 [2020-10-06T15:34:50.629Z]   File "__ref_L/Debug Test/Main.py_googrclfrg", line 21, in <module>
11:34:50 [2020-10-06T15:34:50.629Z]   File "__ref_L/Debug Test/Main.py_googrclfrg", line 18, in testMethod
11:34:50 [2020-10-06T15:34:50.629Z]   File "(none)", line 161, in trace_dispatch
11:34:50 [2020-10-06T15:34:50.629Z] org.eclipse.ease.ExitException: 
11:34:50 [2020-10-06T15:34:50.629Z] 
11:34:50 [2020-10-06T15:34:50.629Z] org.eclipse.ease.ExitException: org.eclipse.ease.ExitException: 
11:34:50 [2020-10-06T15:34:50.629Z] Start of script
11:34:50 [2020-10-06T15:34:50.884Z] include file start
11:34:50 [2020-10-06T15:34:50.884Z] include file processed
11:34:50 [2020-10-06T15:34:50.884Z] Result of testMethod = 5
11:34:50 [2020-10-06T15:34:50.884Z] End of script
11:34:50 [2020-10-06T15:34:50.884Z] Start of script
11:34:50 [2020-10-06T15:34:50.884Z] include file start
11:34:50 [2020-10-06T15:34:50.884Z] include file processed
11:34:50 [2020-10-06T15:34:50.884Z] Result of testMethod = 5
11:34:51 [2020-10-06T15:34:51.140Z] Traceback (most recent call last):
11:34:51 [2020-10-06T15:34:51.140Z]   File "(none)", line 184, in run
11:34:51 [2020-10-06T15:34:51.140Z]   File "__ref_L/Debug Test/Main.py_sweopomxil", line 23, in <module>
11:34:51 [2020-10-06T15:34:51.140Z]   File "(none)", line 161, in trace_dispatch
11:34:51 [2020-10-06T15:34:51.140Z] org.eclipse.ease.ExitException: 
11:34:51 [2020-10-06T15:34:51.140Z] 
11:34:51 [2020-10-06T15:34:51.140Z] org.eclipse.ease.ExitException: org.eclipse.ease.ExitException: 
11:34:51 [2020-10-06T15:34:51.395Z] Start of script
11:34:51 [2020-10-06T15:34:51.395Z] include file start
11:34:51 [2020-10-06T15:34:51.395Z] include file processed
11:34:51 [2020-10-06T15:34:51.395Z] Result of testMethod = 5
11:34:51 [2020-10-06T15:34:51.395Z] End of script
11:34:51 [2020-10-06T15:34:51.395Z] Start of script
11:34:51 [2020-10-06T15:34:51.395Z] include file start
11:34:51 [2020-10-06T15:34:51.395Z] include file processed
11:34:51 [2020-10-06T15:34:51.650Z] Result of testMethod = 5
11:34:51 [2020-10-06T15:34:51.650Z] End of script
11:34:51 [2020-10-06T15:34:51.906Z] Start of script
11:34:51 [2020-10-06T15:34:51.906Z] include file start
11:34:51 [2020-10-06T15:34:51.906Z] include file processed
11:34:51 [2020-10-06T15:34:51.906Z] Result of testMethod = 5
11:34:51 [2020-10-06T15:34:51.906Z] End of script
11:34:52 [2020-10-06T15:34:52.163Z] Start of script
11:34:52 [2020-10-06T15:34:52.163Z] include file start
11:34:52 [2020-10-06T15:34:52.163Z] include file processed
11:34:52 [2020-10-06T15:34:52.163Z] Result of testMethod = 5
11:34:52 [2020-10-06T15:34:52.163Z] End of script
11:34:52 [2020-10-06T15:34:52.419Z] Start of script
11:34:52 [2020-10-06T15:34:52.419Z] include file start
11:34:52 [2020-10-06T15:34:52.419Z] include file processed
11:34:52 [2020-10-06T15:34:52.419Z] Result of testMethod = 5
11:34:52 [2020-10-06T15:34:52.419Z] Traceback (most recent call last):
11:34:52 [2020-10-06T15:34:52.419Z]   File "(none)", line 184, in run
11:34:52 [2020-10-06T15:34:52.419Z]   File "__ref_L/Debug Test/Main.py_ujfprhxsor", line 23, in <module>
11:34:52 [2020-10-06T15:34:52.419Z]   File "(none)", line 161, in trace_dispatch
11:34:52 [2020-10-06T15:34:52.419Z] org.eclipse.ease.ExitException: 
11:34:52 [2020-10-06T15:34:52.419Z] 
11:34:52 [2020-10-06T15:34:52.419Z] org.eclipse.ease.ExitException: org.eclipse.ease.ExitException: 
11:34:52 [2020-10-06T15:34:52.674Z] Start of script
11:34:52 [2020-10-06T15:34:52.674Z] include file start
11:34:52 [2020-10-06T15:34:52.674Z] include file processed
11:34:52 [2020-10-06T15:34:52.674Z] Result of testMethod = 5
11:34:52 [2020-10-06T15:34:52.674Z] End of script
11:34:52 [2020-10-06T15:34:52.930Z] Start of script
11:34:52 [2020-10-06T15:34:52.930Z] include file start
11:34:52 [2020-10-06T15:34:52.930Z] include file processed
11:34:52 [2020-10-06T15:34:52.930Z] Result of testMethod = 5
11:34:52 [2020-10-06T15:34:52.930Z] Traceback (most recent call last):
11:34:52 [2020-10-06T15:34:52.930Z]   File "(none)", line 184, in run
11:34:52 [2020-10-06T15:34:52.930Z]   File "__ref_L/Debug Test/Main.py_zvoouwkxdw", line 23, in <module>
11:34:52 [2020-10-06T15:34:52.930Z]   File "(none)", line 161, in trace_dispatch
11:34:52 [2020-10-06T15:34:52.930Z] org.eclipse.ease.ExitException: 
11:34:52 [2020-10-06T15:34:52.930Z] 
11:34:52 [2020-10-06T15:34:52.930Z] org.eclipse.ease.ExitException: org.eclipse.ease.ExitException: 
11:34:53 [2020-10-06T15:34:53.185Z] Traceback (most recent call last):
11:34:53 [2020-10-06T15:34:53.185Z]   File "(none)", line 184, in run
11:34:53 [2020-10-06T15:34:53.185Z]   File "__ref_L/Debug Test/Main.py_rztpquodnh", line 1, in <module>
11:34:53 [2020-10-06T15:34:53.185Z]   File "(none)", line 161, in trace_dispatch
11:34:53 [2020-10-06T15:34:53.185Z] org.eclipse.ease.ExitException: 
11:34:53 [2020-10-06T15:34:53.185Z] 
11:34:53 [2020-10-06T15:34:53.185Z] org.eclipse.ease.ExitException: org.eclipse.ease.ExitException: 
11:34:53 [2020-10-06T15:34:53.441Z] Start of script
11:34:53 [2020-10-06T15:34:53.441Z] include file start
11:34:53 [2020-10-06T15:34:53.441Z] include file processed
11:34:53 [2020-10-06T15:34:53.441Z] Result of testMethod = 5
11:34:53 [2020-10-06T15:34:53.441Z] End of script
11:34:53 [2020-10-06T15:34:53.441Z] Start of script
11:34:53 [2020-10-06T15:34:53.441Z] include file start
11:34:53 [2020-10-06T15:34:53.441Z] include file processed
11:34:53 [2020-10-06T15:34:53.696Z] Result of testMethod = 5
11:34:53 [2020-10-06T15:34:53.696Z] End of script
11:34:53 [2020-10-06T15:34:53.954Z] Start of script
11:34:53 [2020-10-06T15:34:53.954Z] include file start
11:34:53 [2020-10-06T15:34:53.954Z] include file processed
11:34:53 [2020-10-06T15:34:53.954Z] Result of testMethod = 5
11:34:53 [2020-10-06T15:34:53.954Z] End of script
11:34:53 [2020-10-06T15:34:53.954Z] Tests run: 42, Failures: 0, Errors: 0, Skipped: 0, Time elapsed: 12.603 s - in org.eclipse.ease.lang.python.jython.debugger.JythonDebugTest
11:34:53 [2020-10-06T15:34:53.954Z] disconnectProcessInSuspendedState(org.eclipse.ease.lang.python.jython.debugger.JythonDebugTest)  Time elapsed: 1.783 s
11:34:53 [2020-10-06T15:34:53.954Z] stepReturnIncludeCommand(org.eclipse.ease.lang.python.jython.debugger.JythonDebugTest)  Time elapsed: 0.213 s
11:34:53 [2020-10-06T15:34:53.954Z] arrayVariableSorting(org.eclipse.ease.lang.python.jython.debugger.JythonDebugTest)  Time elapsed: 0.31 s
11:34:53 [2020-10-06T15:34:53.954Z] stepOverOnDebugTarget(org.eclipse.ease.lang.python.jython.debugger.JythonDebugTest)  Time elapsed: 0.309 s
11:34:53 [2020-10-06T15:34:53.954Z] hasDebugTarget(org.eclipse.ease.lang.python.jython.debugger.JythonDebugTest)  Time elapsed: 0.104 s
11:34:53 [2020-10-06T15:34:53.954Z] disconnectThreadInSuspendedState(org.eclipse.ease.lang.python.jython.debugger.JythonDebugTest)  Time elapsed: 0.207 s
11:34:53 [2020-10-06T15:34:53.954Z] stepReturnOnDebugTarget(org.eclipse.ease.lang.python.jython.debugger.JythonDebugTest)  Time elapsed: 0.309 s
11:34:53 [2020-10-06T15:34:53.954Z] nullVariable(org.eclipse.ease.lang.python.jython.debugger.JythonDebugTest)  Time elapsed: 0.307 s
11:34:53 [2020-10-06T15:34:53.954Z] stepOverOnStackFrame(org.eclipse.ease.lang.python.jython.debugger.JythonDebugTest)  Time elapsed: 0.31 s
11:34:53 [2020-10-06T15:34:53.954Z] resumeOnDebugTarget(org.eclipse.ease.lang.python.jython.debugger.JythonDebugTest)  Time elapsed: 0.207 s
11:34:53 [2020-10-06T15:34:53.954Z] modifyVariableKeepingType(org.eclipse.ease.lang.python.jython.debugger.JythonDebugTest)  Time elapsed: 0.505 s
11:34:53 [2020-10-06T15:34:53.954Z] resumeOnLastIncludeLine(org.eclipse.ease.lang.python.jython.debugger.JythonDebugTest)  Time elapsed: 0.208 s
11:34:53 [2020-10-06T15:34:53.954Z] stepReturnOnStackFrame(org.eclipse.ease.lang.python.jython.debugger.JythonDebugTest)  Time elapsed: 0.308 s
11:34:53 [2020-10-06T15:34:53.954Z] terminateStackFrameInSuspendedState(org.eclipse.ease.lang.python.jython.debugger.JythonDebugTest)  Time elapsed: 0.208 s
11:34:53 [2020-10-06T15:34:53.954Z] breakpointLocation(org.eclipse.ease.lang.python.jython.debugger.JythonDebugTest)  Time elapsed: 0.209 s
11:34:53 [2020-10-06T15:34:53.954Z] stepReturnOnThread(org.eclipse.ease.lang.python.jython.debugger.JythonDebugTest)  Time elapsed: 0.308 s
11:34:53 [2020-10-06T15:34:53.954Z] javaClassVariable(org.eclipse.ease.lang.python.jython.debugger.JythonDebugTest)  Time elapsed: 0.307 s
11:34:53 [2020-10-06T15:34:53.954Z] stepIntoOnThread(org.eclipse.ease.lang.python.jython.debugger.JythonDebugTest)  Time elapsed: 0.308 s
11:34:53 [2020-10-06T15:34:53.954Z] terminateThreadInSuspendedState(org.eclipse.ease.lang.python.jython.debugger.JythonDebugTest)  Time elapsed: 0.206 s
11:34:53 [2020-10-06T15:34:53.954Z] resumeOnThread(org.eclipse.ease.lang.python.jython.debugger.JythonDebugTest)  Time elapsed: 0.206 s
11:34:53 [2020-10-06T15:34:53.954Z] stepIntoOnStackFrame(org.eclipse.ease.lang.python.jython.debugger.JythonDebugTest)  Time elapsed: 0.307 s
11:34:53 [2020-10-06T15:34:53.954Z] terminateProcessInSuspendedState(org.eclipse.ease.lang.python.jython.debugger.JythonDebugTest)  Time elapsed: 0.207 s
11:34:53 [2020-10-06T15:34:53.954Z] stepOverOnProcess(org.eclipse.ease.lang.python.jython.debugger.JythonDebugTest)  Time elapsed: 0.307 s
11:34:53 [2020-10-06T15:34:53.954Z] nativeArrayVariable(org.eclipse.ease.lang.python.jython.debugger.JythonDebugTest)  Time elapsed: 0.306 s
11:34:53 [2020-10-06T15:34:53.954Z] disconnectDebugTargetInSuspendedState(org.eclipse.ease.lang.python.jython.debugger.JythonDebugTest)  Time elapsed: 0.206 s
11:34:53 [2020-10-06T15:34:53.954Z] stepIntoOnProcess(org.eclipse.ease.lang.python.jython.debugger.JythonDebugTest)  Time elapsed: 0.307 s
11:34:53 [2020-10-06T15:34:53.954Z] terminatedState(org.eclipse.ease.lang.python.jython.debugger.JythonDebugTest)  Time elapsed: 0.105 s
11:34:53 [2020-10-06T15:34:53.954Z] stepOverIncludeCommand(org.eclipse.ease.lang.python.jython.debugger.JythonDebugTest)  Time elapsed: 0.305 s
11:34:53 [2020-10-06T15:34:53.954Z] innerScopeVariableBeforeOuterScopeVariable(org.eclipse.ease.lang.python.jython.debugger.JythonDebugTest)  Time elapsed: 0.305 s
11:34:53 [2020-10-06T15:34:53.954Z] stepIntoIncludeCommand(org.eclipse.ease.lang.python.jython.debugger.JythonDebugTest)  Time elapsed: 0.305 s
11:34:53 [2020-10-06T15:34:53.954Z] primitiveStringVariable(org.eclipse.ease.lang.python.jython.debugger.JythonDebugTest)  Time elapsed: 0.306 s
11:34:53 [2020-10-06T15:34:53.954Z] resumeOnProcess(org.eclipse.ease.lang.python.jython.debugger.JythonDebugTest)  Time elapsed: 0.206 s
11:34:53 [2020-10-06T15:34:53.954Z] stepIntoOnDebugTarget(org.eclipse.ease.lang.python.jython.debugger.JythonDebugTest)  Time elapsed: 0.307 s
11:34:53 [2020-10-06T15:34:53.954Z] stepOverOnThread(org.eclipse.ease.lang.python.jython.debugger.JythonDebugTest)  Time elapsed: 0.306 s
11:34:53 [2020-10-06T15:34:53.954Z] suspendedState(org.eclipse.ease.lang.python.jython.debugger.JythonDebugTest)  Time elapsed: 0.206 s
11:34:53 [2020-10-06T15:34:53.954Z] primitiveDoubleVariable(org.eclipse.ease.lang.python.jython.debugger.JythonDebugTest)  Time elapsed: 0.306 s
11:34:53 [2020-10-06T15:34:53.954Z] resumeOnStackFrame(org.eclipse.ease.lang.python.jython.debugger.JythonDebugTest)  Time elapsed: 0.205 s
11:34:53 [2020-10-06T15:34:53.954Z] nativeObjectVariable(org.eclipse.ease.lang.python.jython.debugger.JythonDebugTest)  Time elapsed: 0.305 s
11:34:53 [2020-10-06T15:34:53.954Z] terminateDebugTargetInSuspendedState(org.eclipse.ease.lang.python.jython.debugger.JythonDebugTest)  Time elapsed: 0.205 s
11:34:53 [2020-10-06T15:34:53.954Z] disconnectStackFrameInSuspendedState(org.eclipse.ease.lang.python.jython.debugger.JythonDebugTest)  Time elapsed: 0.206 s
11:34:53 [2020-10-06T15:34:53.954Z] stepReturnOnProcess(org.eclipse.ease.lang.python.jython.debugger.JythonDebugTest)  Time elapsed: 0.306 s
11:34:53 [2020-10-06T15:34:53.954Z] evaluateWatchExpression(org.eclipse.ease.lang.python.jython.debugger.JythonDebugTest)  Time elapsed: 0.222 s
11:34:53 [2020-10-06T15:34:53.954Z] 
11:34:53 [2020-10-06T15:34:53.954Z] Results:
11:34:53 [2020-10-06T15:34:53.954Z] 
11:34:53 [2020-10-06T15:34:53.954Z] Tests run: 42, Failures: 0, Errors: 0, Skipped: 0
11:34:53 [2020-10-06T15:34:53.954Z] 
11:35:02 [2020-10-06T15:35:02.037Z] [INFO] All tests passed!
11:35:02 [2020-10-06T15:35:02.037Z] [INFO] 
11:35:02 [2020-10-06T15:35:02.037Z] [INFO] -----< org.eclipse.ease:org.eclipse.ease.lang.scriptarchive.test >------
11:35:02 [2020-10-06T15:35:02.037Z] [INFO] Building org.eclipse.ease.lang.scriptarchive.test 0.8.0-SNAPSHOT [44/48]
11:35:02 [2020-10-06T15:35:02.037Z] [INFO] ------------------------[ eclipse-test-plugin ]-------------------------
11:35:02 [2020-10-06T15:35:02.037Z] [INFO] 
11:35:02 [2020-10-06T15:35:02.037Z] [INFO] --- maven-clean-plugin:2.5:clean (default-clean) @ org.eclipse.ease.lang.scriptarchive.test ---
11:35:02 [2020-10-06T15:35:02.037Z] [INFO] 
11:35:02 [2020-10-06T15:35:02.037Z] [INFO] --- tycho-packaging-plugin:1.5.0:build-qualifier (default-build-qualifier) @ org.eclipse.ease.lang.scriptarchive.test ---
11:35:02 [2020-10-06T15:35:02.037Z] [INFO] The project's OSGi version is 0.8.0.I201910171213
11:35:02 [2020-10-06T15:35:02.037Z] [INFO] 
11:35:02 [2020-10-06T15:35:02.037Z] [INFO] --- tycho-packaging-plugin:1.5.0:validate-id (default-validate-id) @ org.eclipse.ease.lang.scriptarchive.test ---
11:35:02 [2020-10-06T15:35:02.037Z] [INFO] 
11:35:02 [2020-10-06T15:35:02.037Z] [INFO] --- tycho-packaging-plugin:1.5.0:validate-version (default-validate-version) @ org.eclipse.ease.lang.scriptarchive.test ---
11:35:02 [2020-10-06T15:35:02.037Z] [INFO] 
11:35:02 [2020-10-06T15:35:02.037Z] [INFO] >>> maven-javadoc-plugin:2.9.1:javadoc (build-docs) > generate-sources @ org.eclipse.ease.lang.scriptarchive.test >>>
11:35:02 [2020-10-06T15:35:02.037Z] [INFO] 
11:35:02 [2020-10-06T15:35:02.037Z] [INFO] --- tycho-packaging-plugin:1.5.0:build-qualifier (default-build-qualifier) @ org.eclipse.ease.lang.scriptarchive.test ---
11:35:02 [2020-10-06T15:35:02.037Z] [INFO] The project's OSGi version is 0.8.0.I201910171213
11:35:02 [2020-10-06T15:35:02.037Z] [INFO] 
11:35:02 [2020-10-06T15:35:02.037Z] [INFO] --- tycho-packaging-plugin:1.5.0:validate-id (default-validate-id) @ org.eclipse.ease.lang.scriptarchive.test ---
11:35:02 [2020-10-06T15:35:02.037Z] [INFO] 
11:35:02 [2020-10-06T15:35:02.037Z] [INFO] --- tycho-packaging-plugin:1.5.0:validate-version (default-validate-version) @ org.eclipse.ease.lang.scriptarchive.test ---
11:35:02 [2020-10-06T15:35:02.037Z] [INFO] 
11:35:02 [2020-10-06T15:35:02.037Z] [INFO] <<< maven-javadoc-plugin:2.9.1:javadoc (build-docs) < generate-sources @ org.eclipse.ease.lang.scriptarchive.test <<<
11:35:02 [2020-10-06T15:35:02.037Z] [INFO] 
11:35:02 [2020-10-06T15:35:02.037Z] [INFO] 
11:35:02 [2020-10-06T15:35:02.037Z] [INFO] --- maven-javadoc-plugin:2.9.1:javadoc (build-docs) @ org.eclipse.ease.lang.scriptarchive.test ---
11:35:02 [2020-10-06T15:35:02.037Z] [ERROR] Error fetching link: http://help.eclipse.org/oxygen/topic/org.eclipse.platform.doc.isv/reference/api/package-list. Ignored it.
11:35:02 [2020-10-06T15:35:02.037Z] [ERROR] Error fetching link: https://ci.eclipse.org/ease/job/ease.build.core/JavaDoc/package-list. Ignored it.
11:35:02 [2020-10-06T15:35:02.337Z] [INFO] 
11:35:02 [2020-10-06T15:35:02.337Z] Loading source files for package org.eclipse.ease.lang.scriptarchive...
11:35:02 [2020-10-06T15:35:02.337Z] Constructing Javadoc information...
11:35:02 [2020-10-06T15:35:02.337Z] WARNING: Cannot open location "/home/jenkins/agent/workspace/ease.verify.core.gerrit/tests/org.eclipse.ease.lang.scriptarchive.test/target/javadoc-bundle-options/package-list"
11:35:02 [2020-10-06T15:35:02.337Z] No plugin definition found, skipping
11:35:02 [2020-10-06T15:35:02.337Z] No plugin definition found, skipping
11:35:02 [2020-10-06T15:35:02.337Z] [WARNING] Javadoc Warnings
11:35:02 [2020-10-06T15:35:02.337Z] [WARNING] Picked up JAVA_TOOL_OPTIONS: -Dmaven.ext.class.path="/home/jenkins/agent/workspace/ease.verify.core.gerrit@tmp/withMaven06edad13/pipeline-maven-spy.jar" -Dorg.jenkinsci.plugins.pipeline.maven.reportsFolder="/home/jenkins/agent/workspace/ease.verify.core.gerrit@tmp/withMaven06edad13"
11:35:02 [2020-10-06T15:35:02.337Z] [WARNING] javadoc: warning - The old Doclet and Taglet APIs in the packages
11:35:02 [2020-10-06T15:35:02.337Z] [WARNING] com.sun.javadoc, com.sun.tools.doclets and their implementations
11:35:02 [2020-10-06T15:35:02.337Z] [WARNING] are planned to be removed in a future JDK release. These
11:35:02 [2020-10-06T15:35:02.337Z] [WARNING] components have been superseded by the new APIs in jdk.javadoc.doclet.
11:35:02 [2020-10-06T15:35:02.337Z] [WARNING] Users are strongly recommended to migrate to the new APIs.
11:35:02 [2020-10-06T15:35:02.337Z] [INFO] 
11:35:02 [2020-10-06T15:35:02.337Z] [INFO] --- build-helper-maven-plugin:1.9.1:add-resource (add_help) @ org.eclipse.ease.lang.scriptarchive.test ---
11:35:02 [2020-10-06T15:35:02.337Z] [INFO] 
11:35:02 [2020-10-06T15:35:02.337Z] [INFO] --- maven-resources-plugin:2.4.3:resources (default-resources) @ org.eclipse.ease.lang.scriptarchive.test ---
11:35:02 [2020-10-06T15:35:02.337Z] [INFO] Using 'UTF-8' encoding to copy filtered resources.
11:35:02 [2020-10-06T15:35:02.594Z] [INFO] skip non existing resourceDirectory /home/jenkins/agent/workspace/ease.verify.core.gerrit/tests/org.eclipse.ease.lang.scriptarchive.test/src/main/resources
11:35:02 [2020-10-06T15:35:02.594Z] [INFO] skip non existing resourceDirectory /home/jenkins/agent/workspace/ease.verify.core.gerrit/tests/org.eclipse.ease.lang.scriptarchive.test/help
11:35:02 [2020-10-06T15:35:02.594Z] [INFO] 
11:35:02 [2020-10-06T15:35:02.594Z] [INFO] --- tycho-compiler-plugin:1.5.0:compile (default-compile) @ org.eclipse.ease.lang.scriptarchive.test ---
11:35:02 [2020-10-06T15:35:02.594Z] [INFO] Compiling 1 source file to /home/jenkins/agent/workspace/ease.verify.core.gerrit/tests/org.eclipse.ease.lang.scriptarchive.test/target/classes
11:35:02 [2020-10-06T15:35:02.594Z] [INFO] 
11:35:02 [2020-10-06T15:35:02.594Z] [INFO] --- maven-resources-plugin:2.4.3:testResources (default-testResources) @ org.eclipse.ease.lang.scriptarchive.test ---
11:35:02 [2020-10-06T15:35:02.594Z] [INFO] Using 'UTF-8' encoding to copy filtered resources.
11:35:02 [2020-10-06T15:35:02.594Z] [INFO] skip non existing resourceDirectory /home/jenkins/agent/workspace/ease.verify.core.gerrit/tests/org.eclipse.ease.lang.scriptarchive.test/src/test/resources
11:35:02 [2020-10-06T15:35:02.594Z] [INFO] 
11:35:02 [2020-10-06T15:35:02.594Z] [INFO] --- tycho-source-plugin:1.5.0:plugin-source (plugin-source) @ org.eclipse.ease.lang.scriptarchive.test ---
11:35:02 [2020-10-06T15:35:02.595Z] [INFO] Building jar: /home/jenkins/agent/workspace/ease.verify.core.gerrit/tests/org.eclipse.ease.lang.scriptarchive.test/target/org.eclipse.ease.lang.scriptarchive.test-0.8.0-SNAPSHOT-sources.jar
11:35:02 [2020-10-06T15:35:02.595Z] [INFO] 
11:35:02 [2020-10-06T15:35:02.595Z] [INFO] --- target-platform-configuration:1.5.0:target-platform (default-target-platform) @ org.eclipse.ease.lang.scriptarchive.test ---
11:35:02 [2020-10-06T15:35:02.595Z] [INFO] 
11:35:02 [2020-10-06T15:35:02.595Z] [INFO] --- tycho-packaging-plugin:1.5.0:package-plugin (default-package-plugin) @ org.eclipse.ease.lang.scriptarchive.test ---
11:35:02 [2020-10-06T15:35:02.595Z] [INFO] Building jar: /home/jenkins/agent/workspace/ease.verify.core.gerrit/tests/org.eclipse.ease.lang.scriptarchive.test/target/org.eclipse.ease.lang.scriptarchive.test-0.8.0-SNAPSHOT.jar
11:35:02 [2020-10-06T15:35:02.595Z] [INFO] 
11:35:02 [2020-10-06T15:35:02.595Z] [INFO] --- tycho-p2-plugin:1.5.0:p2-metadata-default (default-p2-metadata-default) @ org.eclipse.ease.lang.scriptarchive.test ---
11:35:02 [2020-10-06T15:35:02.887Z] [INFO] 
11:35:02 [2020-10-06T15:35:02.887Z] [INFO] --- tycho-source-feature-plugin:1.5.0:source-feature (source-feature) @ org.eclipse.ease.lang.scriptarchive.test ---
11:35:02 [2020-10-06T15:35:02.887Z] [INFO] 
11:35:02 [2020-10-06T15:35:02.887Z] [INFO] --- tycho-p2-plugin:1.5.0:p2-metadata (attached-p2-metadata) @ org.eclipse.ease.lang.scriptarchive.test ---
11:35:02 [2020-10-06T15:35:02.887Z] [INFO] 
11:35:02 [2020-10-06T15:35:02.887Z] [INFO] --- tycho-surefire-plugin:1.5.0:test (default-test) @ org.eclipse.ease.lang.scriptarchive.test ---
11:35:02 [2020-10-06T15:35:02.887Z] [INFO] Expected eclipse log file: /home/jenkins/agent/workspace/ease.verify.core.gerrit/tests/org.eclipse.ease.lang.scriptarchive.test/target/work/data/.metadata/.log
11:35:02 [2020-10-06T15:35:02.887Z] [INFO] Command line:
11:35:02 [2020-10-06T15:35:02.887Z] 	[/opt/tools/java/openjdk/jdk-11/11.0.2+9/bin/java, -Dosgi.noShutdown=false, -Dosgi.os=linux, -Dosgi.ws=gtk, -Dosgi.arch=x86_64, -Dosgi.clean=true, -jar, /home/jenkins/.m2/repository/p2/osgi/bundle/org.eclipse.equinox.launcher/1.5.800.v20200727-1323/org.eclipse.equinox.launcher-1.5.800.v20200727-1323.jar, -data, /home/jenkins/agent/workspace/ease.verify.core.gerrit/tests/org.eclipse.ease.lang.scriptarchive.test/target/work/data, -install, /home/jenkins/agent/workspace/ease.verify.core.gerrit/tests/org.eclipse.ease.lang.scriptarchive.test/target/work, -configuration, /home/jenkins/agent/workspace/ease.verify.core.gerrit/tests/org.eclipse.ease.lang.scriptarchive.test/target/work/configuration, -application, org.eclipse.tycho.surefire.osgibooter.headlesstest, -testproperties, /home/jenkins/agent/workspace/ease.verify.core.gerrit/tests/org.eclipse.ease.lang.scriptarchive.test/target/surefire.properties]
11:35:02 [2020-10-06T15:35:02.887Z] Picked up JAVA_TOOL_OPTIONS: -Dmaven.ext.class.path="/home/jenkins/agent/workspace/ease.verify.core.gerrit@tmp/withMaven06edad13/pipeline-maven-spy.jar" -Dorg.jenkinsci.plugins.pipeline.maven.reportsFolder="/home/jenkins/agent/workspace/ease.verify.core.gerrit@tmp/withMaven06edad13" 
11:35:04 [2020-10-06T15:35:04.846Z] Running org.eclipse.ease.lang.scriptarchive.ArchiveEngineTest
11:35:04 [2020-10-06T15:35:04.846Z] We are running from a zip file!
11:35:05 [2020-10-06T15:35:05.102Z] org.eclipse.ease.ScriptExecutionException: SyntaxError: missing ; before statement (workspace://__EASE_ScriptArchive_1/scripts/Master.js#3)
11:35:05 [2020-10-06T15:35:05.102Z] this is an error
11:35:05 [2020-10-06T15:35:05.102Z]        ^
11:35:05 [2020-10-06T15:35:05.102Z] 	at Master.js,workspace://__EASE_ScriptArchive_1/scripts/Master.js
11:35:05 [2020-10-06T15:35:05.102Z] org.eclipse.ease.ScriptExecutionException: SyntaxError: missing ; before statement (workspace://__EASE_ScriptArchive_1/scripts/Master.js#3)
11:35:05 [2020-10-06T15:35:05.102Z] this is an error
11:35:05 [2020-10-06T15:35:05.102Z]        ^
11:35:05 [2020-10-06T15:35:05.102Z] 	at Master.js,workspace://__EASE_ScriptArchive_1/scripts/Master.js
11:35:05 [2020-10-06T15:35:05.102Z] Tests run: 7, Failures: 0, Errors: 0, Skipped: 0, Time elapsed: 0.42 s - in org.eclipse.ease.lang.scriptarchive.ArchiveEngineTest
11:35:05 [2020-10-06T15:35:05.102Z] executeWithManifest(org.eclipse.ease.lang.scriptarchive.ArchiveEngineTest)  Time elapsed: 0.29 s
11:35:05 [2020-10-06T15:35:05.102Z] zipFileRegistration(org.eclipse.ease.lang.scriptarchive.ArchiveEngineTest)  Time elapsed: 0.006 s
11:35:05 [2020-10-06T15:35:05.102Z] engineIdRegistration(org.eclipse.ease.lang.scriptarchive.ArchiveEngineTest)  Time elapsed: 0 s
11:35:05 [2020-10-06T15:35:05.102Z] jarFileRegistration(org.eclipse.ease.lang.scriptarchive.ArchiveEngineTest)  Time elapsed: 0 s
11:35:05 [2020-10-06T15:35:05.102Z] sarFileRegistration(org.eclipse.ease.lang.scriptarchive.ArchiveEngineTest)  Time elapsed: 0.001 s
11:35:05 [2020-10-06T15:35:05.102Z] executeWithErrors(org.eclipse.ease.lang.scriptarchive.ArchiveEngineTest)  Time elapsed: 0.073 s
11:35:05 [2020-10-06T15:35:05.102Z] executeWithIncludes(org.eclipse.ease.lang.scriptarchive.ArchiveEngineTest)  Time elapsed: 0.032 s
11:35:05 [2020-10-06T15:35:05.102Z] 
11:35:05 [2020-10-06T15:35:05.102Z] Results:
11:35:05 [2020-10-06T15:35:05.102Z] 
11:35:05 [2020-10-06T15:35:05.102Z] Tests run: 7, Failures: 0, Errors: 0, Skipped: 0
11:35:05 [2020-10-06T15:35:05.102Z] 
11:35:05 [2020-10-06T15:35:05.682Z] [INFO] All tests passed!
11:35:05 [2020-10-06T15:35:05.682Z] [INFO] 
11:35:05 [2020-10-06T15:35:05.682Z] [INFO] --------< org.eclipse.ease:org.eclipse.ease.lang.unittest.test >--------
11:35:05 [2020-10-06T15:35:05.682Z] [INFO] Building org.eclipse.ease.lang.unittest.test 0.8.0-SNAPSHOT      [45/48]
11:35:05 [2020-10-06T15:35:05.682Z] [INFO] ------------------------[ eclipse-test-plugin ]-------------------------
11:35:05 [2020-10-06T15:35:05.682Z] [INFO] 
11:35:05 [2020-10-06T15:35:05.682Z] [INFO] --- maven-clean-plugin:2.5:clean (default-clean) @ org.eclipse.ease.lang.unittest.test ---
11:35:05 [2020-10-06T15:35:05.682Z] [INFO] 
11:35:05 [2020-10-06T15:35:05.682Z] [INFO] --- tycho-packaging-plugin:1.5.0:build-qualifier (default-build-qualifier) @ org.eclipse.ease.lang.unittest.test ---
11:35:05 [2020-10-06T15:35:05.682Z] [INFO] The project's OSGi version is 0.8.0.I202009240747
11:35:05 [2020-10-06T15:35:05.682Z] [INFO] 
11:35:05 [2020-10-06T15:35:05.682Z] [INFO] --- tycho-packaging-plugin:1.5.0:validate-id (default-validate-id) @ org.eclipse.ease.lang.unittest.test ---
11:35:05 [2020-10-06T15:35:05.682Z] [INFO] 
11:35:05 [2020-10-06T15:35:05.682Z] [INFO] --- tycho-packaging-plugin:1.5.0:validate-version (default-validate-version) @ org.eclipse.ease.lang.unittest.test ---
11:35:05 [2020-10-06T15:35:05.682Z] [INFO] 
11:35:05 [2020-10-06T15:35:05.682Z] [INFO] >>> maven-javadoc-plugin:2.9.1:javadoc (build-docs) > generate-sources @ org.eclipse.ease.lang.unittest.test >>>
11:35:05 [2020-10-06T15:35:05.682Z] [INFO] 
11:35:05 [2020-10-06T15:35:05.682Z] [INFO] --- tycho-packaging-plugin:1.5.0:build-qualifier (default-build-qualifier) @ org.eclipse.ease.lang.unittest.test ---
11:35:05 [2020-10-06T15:35:05.682Z] [INFO] The project's OSGi version is 0.8.0.I202009240747
11:35:05 [2020-10-06T15:35:05.682Z] [INFO] 
11:35:05 [2020-10-06T15:35:05.682Z] [INFO] --- tycho-packaging-plugin:1.5.0:validate-id (default-validate-id) @ org.eclipse.ease.lang.unittest.test ---
11:35:05 [2020-10-06T15:35:05.682Z] [INFO] 
11:35:05 [2020-10-06T15:35:05.682Z] [INFO] --- tycho-packaging-plugin:1.5.0:validate-version (default-validate-version) @ org.eclipse.ease.lang.unittest.test ---
11:35:05 [2020-10-06T15:35:05.682Z] [INFO] 
11:35:05 [2020-10-06T15:35:05.682Z] [INFO] <<< maven-javadoc-plugin:2.9.1:javadoc (build-docs) < generate-sources @ org.eclipse.ease.lang.unittest.test <<<
11:35:05 [2020-10-06T15:35:05.682Z] [INFO] 
11:35:05 [2020-10-06T15:35:05.682Z] [INFO] 
11:35:05 [2020-10-06T15:35:05.682Z] [INFO] --- maven-javadoc-plugin:2.9.1:javadoc (build-docs) @ org.eclipse.ease.lang.unittest.test ---
11:35:05 [2020-10-06T15:35:05.939Z] [ERROR] Error fetching link: http://help.eclipse.org/oxygen/topic/org.eclipse.platform.doc.isv/reference/api/package-list. Ignored it.
11:35:05 [2020-10-06T15:35:05.939Z] [ERROR] Error fetching link: https://ci.eclipse.org/ease/job/ease.build.core/JavaDoc/package-list. Ignored it.
11:35:06 [2020-10-06T15:35:06.885Z] [INFO] 
11:35:06 [2020-10-06T15:35:06.885Z] Loading source files for package org.eclipse.ease.lang.unittest...
11:35:06 [2020-10-06T15:35:06.885Z] Constructing Javadoc information...
11:35:06 [2020-10-06T15:35:06.885Z] WARNING: Cannot open location "/home/jenkins/agent/workspace/ease.verify.core.gerrit/tests/org.eclipse.ease.lang.unittest.test/target/javadoc-bundle-options/package-list"
11:35:06 [2020-10-06T15:35:06.885Z] No plugin definition found, skipping
11:35:06 [2020-10-06T15:35:06.885Z] No plugin definition found, skipping
11:35:06 [2020-10-06T15:35:06.885Z] [WARNING] Javadoc Warnings
11:35:06 [2020-10-06T15:35:06.885Z] [WARNING] Picked up JAVA_TOOL_OPTIONS: -Dmaven.ext.class.path="/home/jenkins/agent/workspace/ease.verify.core.gerrit@tmp/withMaven06edad13/pipeline-maven-spy.jar" -Dorg.jenkinsci.plugins.pipeline.maven.reportsFolder="/home/jenkins/agent/workspace/ease.verify.core.gerrit@tmp/withMaven06edad13"
11:35:06 [2020-10-06T15:35:06.885Z] [WARNING] javadoc: warning - The old Doclet and Taglet APIs in the packages
11:35:06 [2020-10-06T15:35:06.885Z] [WARNING] com.sun.javadoc, com.sun.tools.doclets and their implementations
11:35:06 [2020-10-06T15:35:06.885Z] [WARNING] are planned to be removed in a future JDK release. These
11:35:06 [2020-10-06T15:35:06.885Z] [WARNING] components have been superseded by the new APIs in jdk.javadoc.doclet.
11:35:06 [2020-10-06T15:35:06.885Z] [WARNING] Users are strongly recommended to migrate to the new APIs.
11:35:06 [2020-10-06T15:35:06.885Z] [INFO] 
11:35:06 [2020-10-06T15:35:06.885Z] [INFO] --- build-helper-maven-plugin:1.9.1:add-resource (add_help) @ org.eclipse.ease.lang.unittest.test ---
11:35:06 [2020-10-06T15:35:06.885Z] [INFO] 
11:35:06 [2020-10-06T15:35:06.885Z] [INFO] --- maven-resources-plugin:2.4.3:resources (default-resources) @ org.eclipse.ease.lang.unittest.test ---
11:35:06 [2020-10-06T15:35:06.885Z] [INFO] Using 'UTF-8' encoding to copy filtered resources.
11:35:06 [2020-10-06T15:35:06.886Z] [INFO] skip non existing resourceDirectory /home/jenkins/agent/workspace/ease.verify.core.gerrit/tests/org.eclipse.ease.lang.unittest.test/src/main/resources
11:35:06 [2020-10-06T15:35:06.886Z] [INFO] skip non existing resourceDirectory /home/jenkins/agent/workspace/ease.verify.core.gerrit/tests/org.eclipse.ease.lang.unittest.test/help
11:35:06 [2020-10-06T15:35:06.886Z] [INFO] 
11:35:06 [2020-10-06T15:35:06.886Z] [INFO] --- tycho-compiler-plugin:1.5.0:compile (default-compile) @ org.eclipse.ease.lang.unittest.test ---
11:35:06 [2020-10-06T15:35:06.886Z] [INFO] Compiling 3 source files to /home/jenkins/agent/workspace/ease.verify.core.gerrit/tests/org.eclipse.ease.lang.unittest.test/target/classes
11:35:07 [2020-10-06T15:35:07.182Z] [INFO] 
11:35:07 [2020-10-06T15:35:07.182Z] [INFO] --- maven-resources-plugin:2.4.3:testResources (default-testResources) @ org.eclipse.ease.lang.unittest.test ---
11:35:07 [2020-10-06T15:35:07.182Z] [INFO] Using 'UTF-8' encoding to copy filtered resources.
11:35:07 [2020-10-06T15:35:07.182Z] [INFO] skip non existing resourceDirectory /home/jenkins/agent/workspace/ease.verify.core.gerrit/tests/org.eclipse.ease.lang.unittest.test/src/test/resources
11:35:07 [2020-10-06T15:35:07.182Z] [INFO] 
11:35:07 [2020-10-06T15:35:07.182Z] [INFO] --- tycho-source-plugin:1.5.0:plugin-source (plugin-source) @ org.eclipse.ease.lang.unittest.test ---
11:35:07 [2020-10-06T15:35:07.182Z] [WARNING] Bundle-Name header not found in /home/jenkins/agent/workspace/ease.verify.core.gerrit/tests/org.eclipse.ease.lang.unittest.test/META-INF/MANIFEST.MF, fallback to Bundle-SymbolicName for source bundle
11:35:07 [2020-10-06T15:35:07.182Z] [WARNING] Bundle-Vendor header not found in /home/jenkins/agent/workspace/ease.verify.core.gerrit/tests/org.eclipse.ease.lang.unittest.test/META-INF/MANIFEST.MF, fallback to 'unknown' for source bundle
11:35:07 [2020-10-06T15:35:07.182Z] [INFO] Building jar: /home/jenkins/agent/workspace/ease.verify.core.gerrit/tests/org.eclipse.ease.lang.unittest.test/target/org.eclipse.ease.lang.unittest.test-0.8.0-SNAPSHOT-sources.jar
11:35:07 [2020-10-06T15:35:07.182Z] [INFO] 
11:35:07 [2020-10-06T15:35:07.182Z] [INFO] --- target-platform-configuration:1.5.0:target-platform (default-target-platform) @ org.eclipse.ease.lang.unittest.test ---
11:35:07 [2020-10-06T15:35:07.182Z] [INFO] 
11:35:07 [2020-10-06T15:35:07.182Z] [INFO] --- tycho-packaging-plugin:1.5.0:package-plugin (default-package-plugin) @ org.eclipse.ease.lang.unittest.test ---
11:35:07 [2020-10-06T15:35:07.182Z] [INFO] Building jar: /home/jenkins/agent/workspace/ease.verify.core.gerrit/tests/org.eclipse.ease.lang.unittest.test/target/org.eclipse.ease.lang.unittest.test-0.8.0-SNAPSHOT.jar
11:35:07 [2020-10-06T15:35:07.182Z] [INFO] 
11:35:07 [2020-10-06T15:35:07.183Z] [INFO] --- tycho-p2-plugin:1.5.0:p2-metadata-default (default-p2-metadata-default) @ org.eclipse.ease.lang.unittest.test ---
11:35:07 [2020-10-06T15:35:07.183Z] [INFO] 
11:35:07 [2020-10-06T15:35:07.183Z] [INFO] --- tycho-source-feature-plugin:1.5.0:source-feature (source-feature) @ org.eclipse.ease.lang.unittest.test ---
11:35:07 [2020-10-06T15:35:07.183Z] [INFO] 
11:35:07 [2020-10-06T15:35:07.183Z] [INFO] --- tycho-p2-plugin:1.5.0:p2-metadata (attached-p2-metadata) @ org.eclipse.ease.lang.unittest.test ---
11:35:07 [2020-10-06T15:35:07.183Z] [INFO] 
11:35:07 [2020-10-06T15:35:07.183Z] [INFO] --- tycho-surefire-plugin:1.5.0:test (default-test) @ org.eclipse.ease.lang.unittest.test ---
11:35:07 [2020-10-06T15:35:07.183Z] [INFO] Expected eclipse log file: /home/jenkins/agent/workspace/ease.verify.core.gerrit/tests/org.eclipse.ease.lang.unittest.test/target/work/data/.metadata/.log
11:35:07 [2020-10-06T15:35:07.183Z] [INFO] Command line:
11:35:07 [2020-10-06T15:35:07.183Z] 	[/opt/tools/java/openjdk/jdk-11/11.0.2+9/bin/java, -Dosgi.noShutdown=false, -Dosgi.os=linux, -Dosgi.ws=gtk, -Dosgi.arch=x86_64, -Dosgi.clean=true, -jar, /home/jenkins/.m2/repository/p2/osgi/bundle/org.eclipse.equinox.launcher/1.5.800.v20200727-1323/org.eclipse.equinox.launcher-1.5.800.v20200727-1323.jar, -data, /home/jenkins/agent/workspace/ease.verify.core.gerrit/tests/org.eclipse.ease.lang.unittest.test/target/work/data, -install, /home/jenkins/agent/workspace/ease.verify.core.gerrit/tests/org.eclipse.ease.lang.unittest.test/target/work, -configuration, /home/jenkins/agent/workspace/ease.verify.core.gerrit/tests/org.eclipse.ease.lang.unittest.test/target/work/configuration, -application, org.eclipse.tycho.surefire.osgibooter.headlesstest, -testproperties, /home/jenkins/agent/workspace/ease.verify.core.gerrit/tests/org.eclipse.ease.lang.unittest.test/target/surefire.properties]
11:35:07 [2020-10-06T15:35:07.183Z] Picked up JAVA_TOOL_OPTIONS: -Dmaven.ext.class.path="/home/jenkins/agent/workspace/ease.verify.core.gerrit@tmp/withMaven06edad13/pipeline-maven-spy.jar" -Dorg.jenkinsci.plugins.pipeline.maven.reportsFolder="/home/jenkins/agent/workspace/ease.verify.core.gerrit@tmp/withMaven06edad13" 
11:35:09 [2020-10-06T15:35:09.113Z] Running org.eclipse.ease.lang.unittest.ModernJavaScriptTest
11:35:11 [2020-10-06T15:35:11.147Z] Tests run: 8, Failures: 0, Errors: 0, Skipped: 0, Time elapsed: 1.743 s - in org.eclipse.ease.lang.unittest.ModernJavaScriptTest
11:35:11 [2020-10-06T15:35:11.147Z] folderStatus(org.eclipse.ease.lang.unittest.ModernJavaScriptTest)  Time elapsed: 0.678 s
11:35:11 [2020-10-06T15:35:11.147Z] verifyOutput(org.eclipse.ease.lang.unittest.ModernJavaScriptTest)  Time elapsed: 0.222 s
11:35:11 [2020-10-06T15:35:11.147Z] suiteStatus(org.eclipse.ease.lang.unittest.ModernJavaScriptTest)  Time elapsed: 0.192 s
11:35:11 [2020-10-06T15:35:11.147Z] ignoreTestStatus(org.eclipse.ease.lang.unittest.ModernJavaScriptTest)  Time elapsed: 0.168 s
11:35:11 [2020-10-06T15:35:11.147Z] ignoreTestClassStatus(org.eclipse.ease.lang.unittest.ModernJavaScriptTest)  Time elapsed: 0.116 s
11:35:11 [2020-10-06T15:35:11.147Z] failureTestClassStatus(org.eclipse.ease.lang.unittest.ModernJavaScriptTest)  Time elapsed: 0.1 s
11:35:11 [2020-10-06T15:35:11.147Z] errorTestClassStatus(org.eclipse.ease.lang.unittest.ModernJavaScriptTest)  Time elapsed: 0.107 s
11:35:11 [2020-10-06T15:35:11.147Z] passTestClassStatus(org.eclipse.ease.lang.unittest.ModernJavaScriptTest)  Time elapsed: 0.092 s
11:35:11 [2020-10-06T15:35:11.147Z] Running org.eclipse.ease.lang.unittest.ClassicJavaScriptTest
11:35:11 [2020-10-06T15:35:11.404Z] Tests run: 7, Failures: 0, Errors: 0, Skipped: 0, Time elapsed: 0.483 s - in org.eclipse.ease.lang.unittest.ClassicJavaScriptTest
11:35:11 [2020-10-06T15:35:11.404Z] folderStatus(org.eclipse.ease.lang.unittest.ClassicJavaScriptTest)  Time elapsed: 0.076 s
11:35:11 [2020-10-06T15:35:11.404Z] errorTestStatus(org.eclipse.ease.lang.unittest.ClassicJavaScriptTest)  Time elapsed: 0.056 s
11:35:11 [2020-10-06T15:35:11.404Z] failureTestStatus(org.eclipse.ease.lang.unittest.ClassicJavaScriptTest)  Time elapsed: 0.08 s
11:35:11 [2020-10-06T15:35:11.404Z] verifyOutput(org.eclipse.ease.lang.unittest.ClassicJavaScriptTest)  Time elapsed: 0.068 s
11:35:11 [2020-10-06T15:35:11.404Z] suiteStatus(org.eclipse.ease.lang.unittest.ClassicJavaScriptTest)  Time elapsed: 0.05 s
11:35:11 [2020-10-06T15:35:11.404Z] ignoreTestStatus(org.eclipse.ease.lang.unittest.ClassicJavaScriptTest)  Time elapsed: 0.077 s
11:35:11 [2020-10-06T15:35:11.404Z] passTestStatus(org.eclipse.ease.lang.unittest.ClassicJavaScriptTest)  Time elapsed: 0.075 s
11:35:11 [2020-10-06T15:35:11.404Z] 
11:35:11 [2020-10-06T15:35:11.404Z] Results:
11:35:11 [2020-10-06T15:35:11.404Z] 
11:35:11 [2020-10-06T15:35:11.404Z] Tests run: 15, Failures: 0, Errors: 0, Skipped: 0
11:35:11 [2020-10-06T15:35:11.404Z] 
11:35:11 [2020-10-06T15:35:11.967Z] [INFO] All tests passed!
11:35:11 [2020-10-06T15:35:11.967Z] [INFO] 
11:35:11 [2020-10-06T15:35:11.967Z] [INFO] ---------< org.eclipse.ease:org.eclipse.ease.ui.scripts.test >----------
11:35:11 [2020-10-06T15:35:11.967Z] [INFO] Building org.eclipse.ease.ui.scripts.test 0.8.0-SNAPSHOT         [46/48]
11:35:11 [2020-10-06T15:35:11.967Z] [INFO] ------------------------[ eclipse-test-plugin ]-------------------------
11:35:11 [2020-10-06T15:35:11.967Z] [INFO] 
11:35:11 [2020-10-06T15:35:11.967Z] [INFO] --- maven-clean-plugin:2.5:clean (default-clean) @ org.eclipse.ease.ui.scripts.test ---
11:35:11 [2020-10-06T15:35:11.967Z] [INFO] 
11:35:11 [2020-10-06T15:35:11.967Z] [INFO] --- tycho-packaging-plugin:1.5.0:build-qualifier (default-build-qualifier) @ org.eclipse.ease.ui.scripts.test ---
11:35:11 [2020-10-06T15:35:11.967Z] [INFO] The project's OSGi version is 0.8.0.I202009240747
11:35:11 [2020-10-06T15:35:11.967Z] [INFO] 
11:35:11 [2020-10-06T15:35:11.967Z] [INFO] --- tycho-packaging-plugin:1.5.0:validate-id (default-validate-id) @ org.eclipse.ease.ui.scripts.test ---
11:35:11 [2020-10-06T15:35:11.967Z] [INFO] 
11:35:11 [2020-10-06T15:35:11.967Z] [INFO] --- tycho-packaging-plugin:1.5.0:validate-version (default-validate-version) @ org.eclipse.ease.ui.scripts.test ---
11:35:11 [2020-10-06T15:35:11.967Z] [INFO] 
11:35:11 [2020-10-06T15:35:11.967Z] [INFO] >>> maven-javadoc-plugin:2.9.1:javadoc (build-docs) > generate-sources @ org.eclipse.ease.ui.scripts.test >>>
11:35:11 [2020-10-06T15:35:11.967Z] [INFO] 
11:35:11 [2020-10-06T15:35:11.967Z] [INFO] --- tycho-packaging-plugin:1.5.0:build-qualifier (default-build-qualifier) @ org.eclipse.ease.ui.scripts.test ---
11:35:11 [2020-10-06T15:35:11.967Z] [INFO] The project's OSGi version is 0.8.0.I202009240747
11:35:11 [2020-10-06T15:35:11.967Z] [INFO] 
11:35:11 [2020-10-06T15:35:11.967Z] [INFO] --- tycho-packaging-plugin:1.5.0:validate-id (default-validate-id) @ org.eclipse.ease.ui.scripts.test ---
11:35:11 [2020-10-06T15:35:11.967Z] [INFO] 
11:35:11 [2020-10-06T15:35:11.967Z] [INFO] --- tycho-packaging-plugin:1.5.0:validate-version (default-validate-version) @ org.eclipse.ease.ui.scripts.test ---
11:35:11 [2020-10-06T15:35:11.967Z] [INFO] 
11:35:11 [2020-10-06T15:35:11.967Z] [INFO] <<< maven-javadoc-plugin:2.9.1:javadoc (build-docs) < generate-sources @ org.eclipse.ease.ui.scripts.test <<<
11:35:11 [2020-10-06T15:35:11.967Z] [INFO] 
11:35:11 [2020-10-06T15:35:11.967Z] [INFO] 
11:35:11 [2020-10-06T15:35:11.967Z] [INFO] --- maven-javadoc-plugin:2.9.1:javadoc (build-docs) @ org.eclipse.ease.ui.scripts.test ---
11:35:12 [2020-10-06T15:35:12.223Z] [ERROR] Error fetching link: http://help.eclipse.org/oxygen/topic/org.eclipse.platform.doc.isv/reference/api/package-list. Ignored it.
11:35:12 [2020-10-06T15:35:12.223Z] [ERROR] Error fetching link: https://ci.eclipse.org/ease/job/ease.build.core/JavaDoc/package-list. Ignored it.
11:35:13 [2020-10-06T15:35:13.189Z] [INFO] 
11:35:13 [2020-10-06T15:35:13.189Z] Loading source files for package org.eclipse.ease.ui.scripts.expressions.definitions...
11:35:13 [2020-10-06T15:35:13.189Z] Constructing Javadoc information...
11:35:13 [2020-10-06T15:35:13.189Z] WARNING: Cannot open location "/home/jenkins/agent/workspace/ease.verify.core.gerrit/tests/org.eclipse.ease.ui.scripts.test/target/javadoc-bundle-options/package-list"
11:35:13 [2020-10-06T15:35:13.189Z] No plugin definition found, skipping
11:35:13 [2020-10-06T15:35:13.189Z] No plugin definition found, skipping
11:35:13 [2020-10-06T15:35:13.189Z] [WARNING] Javadoc Warnings
11:35:13 [2020-10-06T15:35:13.189Z] [WARNING] Picked up JAVA_TOOL_OPTIONS: -Dmaven.ext.class.path="/home/jenkins/agent/workspace/ease.verify.core.gerrit@tmp/withMaven06edad13/pipeline-maven-spy.jar" -Dorg.jenkinsci.plugins.pipeline.maven.reportsFolder="/home/jenkins/agent/workspace/ease.verify.core.gerrit@tmp/withMaven06edad13"
11:35:13 [2020-10-06T15:35:13.189Z] [WARNING] javadoc: warning - The old Doclet and Taglet APIs in the packages
11:35:13 [2020-10-06T15:35:13.189Z] [WARNING] com.sun.javadoc, com.sun.tools.doclets and their implementations
11:35:13 [2020-10-06T15:35:13.189Z] [WARNING] are planned to be removed in a future JDK release. These
11:35:13 [2020-10-06T15:35:13.189Z] [WARNING] components have been superseded by the new APIs in jdk.javadoc.doclet.
11:35:13 [2020-10-06T15:35:13.189Z] [WARNING] Users are strongly recommended to migrate to the new APIs.
11:35:13 [2020-10-06T15:35:13.189Z] [INFO] 
11:35:13 [2020-10-06T15:35:13.189Z] [INFO] --- build-helper-maven-plugin:1.9.1:add-resource (add_help) @ org.eclipse.ease.ui.scripts.test ---
11:35:13 [2020-10-06T15:35:13.189Z] [INFO] 
11:35:13 [2020-10-06T15:35:13.189Z] [INFO] --- maven-resources-plugin:2.4.3:resources (default-resources) @ org.eclipse.ease.ui.scripts.test ---
11:35:13 [2020-10-06T15:35:13.189Z] [INFO] Using 'UTF-8' encoding to copy filtered resources.
11:35:13 [2020-10-06T15:35:13.189Z] [INFO] skip non existing resourceDirectory /home/jenkins/agent/workspace/ease.verify.core.gerrit/tests/org.eclipse.ease.ui.scripts.test/src/main/resources
11:35:13 [2020-10-06T15:35:13.189Z] [INFO] skip non existing resourceDirectory /home/jenkins/agent/workspace/ease.verify.core.gerrit/tests/org.eclipse.ease.ui.scripts.test/help
11:35:13 [2020-10-06T15:35:13.189Z] [INFO] 
11:35:13 [2020-10-06T15:35:13.189Z] [INFO] --- tycho-compiler-plugin:1.5.0:compile (default-compile) @ org.eclipse.ease.ui.scripts.test ---
11:35:13 [2020-10-06T15:35:13.190Z] [INFO] Compiling 1 source file to /home/jenkins/agent/workspace/ease.verify.core.gerrit/tests/org.eclipse.ease.ui.scripts.test/target/classes
11:35:13 [2020-10-06T15:35:13.190Z] [INFO] 
11:35:13 [2020-10-06T15:35:13.190Z] [INFO] --- maven-resources-plugin:2.4.3:testResources (default-testResources) @ org.eclipse.ease.ui.scripts.test ---
11:35:13 [2020-10-06T15:35:13.190Z] [INFO] Using 'UTF-8' encoding to copy filtered resources.
11:35:13 [2020-10-06T15:35:13.190Z] [INFO] skip non existing resourceDirectory /home/jenkins/agent/workspace/ease.verify.core.gerrit/tests/org.eclipse.ease.ui.scripts.test/src/test/resources
11:35:13 [2020-10-06T15:35:13.190Z] [INFO] 
11:35:13 [2020-10-06T15:35:13.190Z] [INFO] --- tycho-source-plugin:1.5.0:plugin-source (plugin-source) @ org.eclipse.ease.ui.scripts.test ---
11:35:13 [2020-10-06T15:35:13.190Z] [INFO] Building jar: /home/jenkins/agent/workspace/ease.verify.core.gerrit/tests/org.eclipse.ease.ui.scripts.test/target/org.eclipse.ease.ui.scripts.test-0.8.0-SNAPSHOT-sources.jar
11:35:13 [2020-10-06T15:35:13.190Z] [INFO] 
11:35:13 [2020-10-06T15:35:13.190Z] [INFO] --- target-platform-configuration:1.5.0:target-platform (default-target-platform) @ org.eclipse.ease.ui.scripts.test ---
11:35:13 [2020-10-06T15:35:13.190Z] [INFO] 
11:35:13 [2020-10-06T15:35:13.190Z] [INFO] --- tycho-packaging-plugin:1.5.0:package-plugin (default-package-plugin) @ org.eclipse.ease.ui.scripts.test ---
11:35:13 [2020-10-06T15:35:13.190Z] [INFO] Building jar: /home/jenkins/agent/workspace/ease.verify.core.gerrit/tests/org.eclipse.ease.ui.scripts.test/target/org.eclipse.ease.ui.scripts.test-0.8.0-SNAPSHOT.jar
11:35:13 [2020-10-06T15:35:13.190Z] [INFO] 
11:35:13 [2020-10-06T15:35:13.190Z] [INFO] --- tycho-p2-plugin:1.5.0:p2-metadata-default (default-p2-metadata-default) @ org.eclipse.ease.ui.scripts.test ---
11:35:13 [2020-10-06T15:35:13.190Z] [INFO] 
11:35:13 [2020-10-06T15:35:13.190Z] [INFO] --- tycho-source-feature-plugin:1.5.0:source-feature (source-feature) @ org.eclipse.ease.ui.scripts.test ---
11:35:13 [2020-10-06T15:35:13.190Z] [INFO] 
11:35:13 [2020-10-06T15:35:13.190Z] [INFO] --- tycho-p2-plugin:1.5.0:p2-metadata (attached-p2-metadata) @ org.eclipse.ease.ui.scripts.test ---
11:35:13 [2020-10-06T15:35:13.190Z] [INFO] 
11:35:13 [2020-10-06T15:35:13.190Z] [INFO] --- tycho-surefire-plugin:1.5.0:test (default-test) @ org.eclipse.ease.ui.scripts.test ---
11:35:13 [2020-10-06T15:35:13.485Z] [INFO] Expected eclipse log file: /home/jenkins/agent/workspace/ease.verify.core.gerrit/tests/org.eclipse.ease.ui.scripts.test/target/work/data/.metadata/.log
11:35:13 [2020-10-06T15:35:13.485Z] [INFO] Command line:
11:35:13 [2020-10-06T15:35:13.485Z] 	[/opt/tools/java/openjdk/jdk-11/11.0.2+9/bin/java, -Dosgi.noShutdown=false, -Dosgi.os=linux, -Dosgi.ws=gtk, -Dosgi.arch=x86_64, -Dosgi.clean=true, -jar, /home/jenkins/.m2/repository/p2/osgi/bundle/org.eclipse.equinox.launcher/1.5.800.v20200727-1323/org.eclipse.equinox.launcher-1.5.800.v20200727-1323.jar, -data, /home/jenkins/agent/workspace/ease.verify.core.gerrit/tests/org.eclipse.ease.ui.scripts.test/target/work/data, -install, /home/jenkins/agent/workspace/ease.verify.core.gerrit/tests/org.eclipse.ease.ui.scripts.test/target/work, -configuration, /home/jenkins/agent/workspace/ease.verify.core.gerrit/tests/org.eclipse.ease.ui.scripts.test/target/work/configuration, -application, org.eclipse.tycho.surefire.osgibooter.headlesstest, -testproperties, /home/jenkins/agent/workspace/ease.verify.core.gerrit/tests/org.eclipse.ease.ui.scripts.test/target/surefire.properties]
11:35:13 [2020-10-06T15:35:13.485Z] Picked up JAVA_TOOL_OPTIONS: -Dmaven.ext.class.path="/home/jenkins/agent/workspace/ease.verify.core.gerrit@tmp/withMaven06edad13/pipeline-maven-spy.jar" -Dorg.jenkinsci.plugins.pipeline.maven.reportsFolder="/home/jenkins/agent/workspace/ease.verify.core.gerrit@tmp/withMaven06edad13" 
11:35:15 [2020-10-06T15:35:15.408Z] Running org.eclipse.ease.ui.scripts.expressions.definitions.ExpressionFactoryTest
11:35:15 [2020-10-06T15:35:15.408Z] Tests run: 14, Failures: 0, Errors: 0, Skipped: 0, Time elapsed: 0.026 s - in org.eclipse.ease.ui.scripts.expressions.definitions.ExpressionFactoryTest
11:35:15 [2020-10-06T15:35:15.408Z] loadClassWithExpression  Time elapsed: 0.01 s
11:35:15 [2020-10-06T15:35:15.408Z] createWithExpression  Time elapsed: 0.001 s
11:35:15 [2020-10-06T15:35:15.408Z] createReferenceExpression  Time elapsed: 0.001 s
11:35:15 [2020-10-06T15:35:15.408Z] loadClassReferenceExpression  Time elapsed: 0 s
11:35:15 [2020-10-06T15:35:15.408Z] loadClassTestExpression  Time elapsed: 0.001 s
11:35:15 [2020-10-06T15:35:15.408Z] createEqualsExpression  Time elapsed: 0.001 s
11:35:15 [2020-10-06T15:35:15.408Z] loadClassCountExpression  Time elapsed: 0.001 s
11:35:15 [2020-10-06T15:35:15.408Z] loadClassOrExpression  Time elapsed: 0 s
11:35:15 [2020-10-06T15:35:15.408Z] createTestExpression  Time elapsed: 0.002 s
11:35:15 [2020-10-06T15:35:15.408Z] createOrExpression  Time elapsed: 0 s
11:35:15 [2020-10-06T15:35:15.408Z] loadClassAndExpression  Time elapsed: 0 s
11:35:15 [2020-10-06T15:35:15.408Z] createAndExpression  Time elapsed: 0.001 s
11:35:15 [2020-10-06T15:35:15.408Z] loadClassEqualsExpression  Time elapsed: 0 s
11:35:15 [2020-10-06T15:35:15.408Z] createCountExpression  Time elapsed: 0.001 s
11:35:15 [2020-10-06T15:35:15.408Z] 
11:35:15 [2020-10-06T15:35:15.408Z] Results:
11:35:15 [2020-10-06T15:35:15.408Z] 
11:35:15 [2020-10-06T15:35:15.408Z] Tests run: 14, Failures: 0, Errors: 0, Skipped: 0
11:35:15 [2020-10-06T15:35:15.408Z] 
11:35:15 [2020-10-06T15:35:15.969Z] [INFO] All tests passed!
11:35:15 [2020-10-06T15:35:15.969Z] [INFO] 
11:35:15 [2020-10-06T15:35:15.969Z] [INFO] -------------< org.eclipse.ease:org.eclipse.ease.ui.test >--------------
11:35:15 [2020-10-06T15:35:15.969Z] [INFO] Building org.eclipse.ease.ui.test 0.8.0-SNAPSHOT                 [47/48]
11:35:15 [2020-10-06T15:35:15.969Z] [INFO] ------------------------[ eclipse-test-plugin ]-------------------------
11:35:15 [2020-10-06T15:35:15.969Z] [INFO] 
11:35:15 [2020-10-06T15:35:15.969Z] [INFO] --- maven-clean-plugin:2.5:clean (default-clean) @ org.eclipse.ease.ui.test ---
11:35:15 [2020-10-06T15:35:15.969Z] [INFO] 
11:35:15 [2020-10-06T15:35:15.969Z] [INFO] --- tycho-packaging-plugin:1.5.0:build-qualifier (default-build-qualifier) @ org.eclipse.ease.ui.test ---
11:35:15 [2020-10-06T15:35:15.969Z] [INFO] The project's OSGi version is 0.8.0.I201910171213
11:35:15 [2020-10-06T15:35:15.969Z] [INFO] 
11:35:15 [2020-10-06T15:35:15.969Z] [INFO] --- tycho-packaging-plugin:1.5.0:validate-id (default-validate-id) @ org.eclipse.ease.ui.test ---
11:35:15 [2020-10-06T15:35:15.969Z] [INFO] 
11:35:15 [2020-10-06T15:35:15.969Z] [INFO] --- tycho-packaging-plugin:1.5.0:validate-version (default-validate-version) @ org.eclipse.ease.ui.test ---
11:35:15 [2020-10-06T15:35:15.969Z] [INFO] 
11:35:15 [2020-10-06T15:35:15.969Z] [INFO] >>> maven-javadoc-plugin:2.9.1:javadoc (build-docs) > generate-sources @ org.eclipse.ease.ui.test >>>
11:35:15 [2020-10-06T15:35:15.969Z] [INFO] 
11:35:15 [2020-10-06T15:35:15.969Z] [INFO] --- tycho-packaging-plugin:1.5.0:build-qualifier (default-build-qualifier) @ org.eclipse.ease.ui.test ---
11:35:15 [2020-10-06T15:35:15.969Z] [INFO] The project's OSGi version is 0.8.0.I201910171213
11:35:15 [2020-10-06T15:35:15.969Z] [INFO] 
11:35:15 [2020-10-06T15:35:15.969Z] [INFO] --- tycho-packaging-plugin:1.5.0:validate-id (default-validate-id) @ org.eclipse.ease.ui.test ---
11:35:15 [2020-10-06T15:35:15.969Z] [INFO] 
11:35:15 [2020-10-06T15:35:15.969Z] [INFO] --- tycho-packaging-plugin:1.5.0:validate-version (default-validate-version) @ org.eclipse.ease.ui.test ---
11:35:15 [2020-10-06T15:35:15.969Z] [INFO] 
11:35:15 [2020-10-06T15:35:15.969Z] [INFO] <<< maven-javadoc-plugin:2.9.1:javadoc (build-docs) < generate-sources @ org.eclipse.ease.ui.test <<<
11:35:15 [2020-10-06T15:35:15.969Z] [INFO] 
11:35:15 [2020-10-06T15:35:15.969Z] [INFO] 
11:35:15 [2020-10-06T15:35:15.969Z] [INFO] --- maven-javadoc-plugin:2.9.1:javadoc (build-docs) @ org.eclipse.ease.ui.test ---
11:35:15 [2020-10-06T15:35:15.969Z] [ERROR] Error fetching link: http://help.eclipse.org/oxygen/topic/org.eclipse.platform.doc.isv/reference/api/package-list. Ignored it.
11:35:16 [2020-10-06T15:35:16.224Z] [ERROR] Error fetching link: https://ci.eclipse.org/ease/job/ease.build.core/JavaDoc/package-list. Ignored it.
11:35:17 [2020-10-06T15:35:17.163Z] [INFO] 
11:35:17 [2020-10-06T15:35:17.164Z] Loading source files for package org.eclipse.ease.ui.completion...
11:35:17 [2020-10-06T15:35:17.164Z] Loading source files for package org.eclipse.ease.ui.completion.provider...
11:35:17 [2020-10-06T15:35:17.164Z] Loading source files for package org.eclipse.ease.ui.completions.java.provider...
11:35:17 [2020-10-06T15:35:17.164Z] Loading source files for package org.eclipse.ease.ui.help.hovers...
11:35:17 [2020-10-06T15:35:17.164Z] Constructing Javadoc information...
11:35:17 [2020-10-06T15:35:17.164Z] WARNING: Cannot open location "/home/jenkins/agent/workspace/ease.verify.core.gerrit/tests/org.eclipse.ease.ui.test/target/javadoc-bundle-options/package-list"
11:35:17 [2020-10-06T15:35:17.164Z] [WARNING] Javadoc Warnings
11:35:17 [2020-10-06T15:35:17.164Z] [WARNING] Picked up JAVA_TOOL_OPTIONS: -Dmaven.ext.class.path="/home/jenkins/agent/workspace/ease.verify.core.gerrit@tmp/withMaven06edad13/pipeline-maven-spy.jar" -Dorg.jenkinsci.plugins.pipeline.maven.reportsFolder="/home/jenkins/agent/workspace/ease.verify.core.gerrit@tmp/withMaven06edad13"
11:35:17 [2020-10-06T15:35:17.164Z] [WARNING] javadoc: warning - The old Doclet and Taglet APIs in the packages
11:35:17 [2020-10-06T15:35:17.164Z] [WARNING] com.sun.javadoc, com.sun.tools.doclets and their implementations
11:35:17 [2020-10-06T15:35:17.164Z] [WARNING] are planned to be removed in a future JDK release. These
11:35:17 [2020-10-06T15:35:17.164Z] [WARNING] components have been superseded by the new APIs in jdk.javadoc.doclet.
11:35:17 [2020-10-06T15:35:17.164Z] [WARNING] Users are strongly recommended to migrate to the new APIs.
11:35:17 [2020-10-06T15:35:17.164Z] [INFO] 
11:35:17 [2020-10-06T15:35:17.164Z] [INFO] --- build-helper-maven-plugin:1.9.1:add-resource (add_help) @ org.eclipse.ease.ui.test ---
11:35:17 [2020-10-06T15:35:17.164Z] [INFO] 
11:35:17 [2020-10-06T15:35:17.164Z] [INFO] --- maven-resources-plugin:2.4.3:resources (default-resources) @ org.eclipse.ease.ui.test ---
11:35:17 [2020-10-06T15:35:17.164Z] [INFO] Using 'UTF-8' encoding to copy filtered resources.
11:35:17 [2020-10-06T15:35:17.164Z] [INFO] skip non existing resourceDirectory /home/jenkins/agent/workspace/ease.verify.core.gerrit/tests/org.eclipse.ease.ui.test/src/main/resources
11:35:17 [2020-10-06T15:35:17.164Z] [INFO] Copying 2 resources to help
11:35:17 [2020-10-06T15:35:17.164Z] [INFO] 
11:35:17 [2020-10-06T15:35:17.164Z] [INFO] --- tycho-compiler-plugin:1.5.0:compile (default-compile) @ org.eclipse.ease.ui.test ---
11:35:17 [2020-10-06T15:35:17.164Z] [INFO] Compiling 6 source files to /home/jenkins/agent/workspace/ease.verify.core.gerrit/tests/org.eclipse.ease.ui.test/target/classes
11:35:17 [2020-10-06T15:35:17.420Z] [INFO] 
11:35:17 [2020-10-06T15:35:17.420Z] [INFO] --- maven-resources-plugin:2.4.3:testResources (default-testResources) @ org.eclipse.ease.ui.test ---
11:35:17 [2020-10-06T15:35:17.420Z] [INFO] Using 'UTF-8' encoding to copy filtered resources.
11:35:17 [2020-10-06T15:35:17.420Z] [INFO] skip non existing resourceDirectory /home/jenkins/agent/workspace/ease.verify.core.gerrit/tests/org.eclipse.ease.ui.test/src/test/resources
11:35:17 [2020-10-06T15:35:17.420Z] [INFO] 
11:35:17 [2020-10-06T15:35:17.420Z] [INFO] --- tycho-source-plugin:1.5.0:plugin-source (plugin-source) @ org.eclipse.ease.ui.test ---
11:35:17 [2020-10-06T15:35:17.420Z] [WARNING] Bundle-Vendor header not found in /home/jenkins/agent/workspace/ease.verify.core.gerrit/tests/org.eclipse.ease.ui.test/META-INF/MANIFEST.MF, fallback to 'unknown' for source bundle
11:35:17 [2020-10-06T15:35:17.420Z] [INFO] Building jar: /home/jenkins/agent/workspace/ease.verify.core.gerrit/tests/org.eclipse.ease.ui.test/target/org.eclipse.ease.ui.test-0.8.0-SNAPSHOT-sources.jar
11:35:17 [2020-10-06T15:35:17.420Z] [INFO] 
11:35:17 [2020-10-06T15:35:17.420Z] [INFO] --- target-platform-configuration:1.5.0:target-platform (default-target-platform) @ org.eclipse.ease.ui.test ---
11:35:17 [2020-10-06T15:35:17.420Z] [INFO] 
11:35:17 [2020-10-06T15:35:17.420Z] [INFO] --- tycho-packaging-plugin:1.5.0:package-plugin (default-package-plugin) @ org.eclipse.ease.ui.test ---
11:35:17 [2020-10-06T15:35:17.420Z] [INFO] Building jar: /home/jenkins/agent/workspace/ease.verify.core.gerrit/tests/org.eclipse.ease.ui.test/target/org.eclipse.ease.ui.test-0.8.0-SNAPSHOT.jar
11:35:17 [2020-10-06T15:35:17.420Z] [INFO] 
11:35:17 [2020-10-06T15:35:17.420Z] [INFO] --- tycho-p2-plugin:1.5.0:p2-metadata-default (default-p2-metadata-default) @ org.eclipse.ease.ui.test ---
11:35:17 [2020-10-06T15:35:17.420Z] [INFO] 
11:35:17 [2020-10-06T15:35:17.420Z] [INFO] --- tycho-source-feature-plugin:1.5.0:source-feature (source-feature) @ org.eclipse.ease.ui.test ---
11:35:17 [2020-10-06T15:35:17.420Z] [INFO] 
11:35:17 [2020-10-06T15:35:17.420Z] [INFO] --- tycho-p2-plugin:1.5.0:p2-metadata (attached-p2-metadata) @ org.eclipse.ease.ui.test ---
11:35:17 [2020-10-06T15:35:17.420Z] [INFO] 
11:35:17 [2020-10-06T15:35:17.420Z] [INFO] --- tycho-surefire-plugin:1.5.0:test (default-test) @ org.eclipse.ease.ui.test ---
11:35:17 [2020-10-06T15:35:17.685Z] [INFO] Expected eclipse log file: /home/jenkins/agent/workspace/ease.verify.core.gerrit/tests/org.eclipse.ease.ui.test/target/work/data/.metadata/.log
11:35:17 [2020-10-06T15:35:17.685Z] [INFO] Command line:
11:35:17 [2020-10-06T15:35:17.685Z] 	[/opt/tools/java/openjdk/jdk-11/11.0.2+9/bin/java, -Dosgi.noShutdown=false, -Dosgi.os=linux, -Dosgi.ws=gtk, -Dosgi.arch=x86_64, -Dosgi.clean=true, -jar, /home/jenkins/.m2/repository/p2/osgi/bundle/org.eclipse.equinox.launcher/1.5.800.v20200727-1323/org.eclipse.equinox.launcher-1.5.800.v20200727-1323.jar, -data, /home/jenkins/agent/workspace/ease.verify.core.gerrit/tests/org.eclipse.ease.ui.test/target/work/data, -install, /home/jenkins/agent/workspace/ease.verify.core.gerrit/tests/org.eclipse.ease.ui.test/target/work, -configuration, /home/jenkins/agent/workspace/ease.verify.core.gerrit/tests/org.eclipse.ease.ui.test/target/work/configuration, -application, org.eclipse.tycho.surefire.osgibooter.headlesstest, -testproperties, /home/jenkins/agent/workspace/ease.verify.core.gerrit/tests/org.eclipse.ease.ui.test/target/surefire.properties]
11:35:17 [2020-10-06T15:35:17.685Z] Picked up JAVA_TOOL_OPTIONS: -Dmaven.ext.class.path="/home/jenkins/agent/workspace/ease.verify.core.gerrit@tmp/withMaven06edad13/pipeline-maven-spy.jar" -Dorg.jenkinsci.plugins.pipeline.maven.reportsFolder="/home/jenkins/agent/workspace/ease.verify.core.gerrit@tmp/withMaven06edad13" 
11:35:19 [2020-10-06T15:35:19.588Z] Running org.eclipse.ease.ui.help.hovers.ModuleHelpTest
11:35:19 [2020-10-06T15:35:19.588Z] Tests run: 4, Failures: 0, Errors: 0, Skipped: 4, Time elapsed: 0.02 s - in org.eclipse.ease.ui.help.hovers.ModuleHelpTest
11:35:19 [2020-10-06T15:35:19.588Z] getModuleHelpLocation(org.eclipse.ease.ui.help.hovers.ModuleHelpTest) skipped
11:35:19 [2020-10-06T15:35:19.588Z] getModuleHelp(org.eclipse.ease.ui.help.hovers.ModuleHelpTest) skipped
11:35:19 [2020-10-06T15:35:19.588Z] getMethodHelp(org.eclipse.ease.ui.help.hovers.ModuleHelpTest) skipped
11:35:19 [2020-10-06T15:35:19.588Z] getConstantHelp(org.eclipse.ease.ui.help.hovers.ModuleHelpTest) skipped
11:35:19 [2020-10-06T15:35:19.588Z] Running org.eclipse.ease.ui.completion.CompletionContextTest
11:35:19 [2020-10-06T15:35:19.588Z] Tests run: 9, Failures: 0, Errors: 0, Skipped: 0, Time elapsed: 0.006 s - in org.eclipse.ease.ui.completion.CompletionContextTest
11:35:19 [2020-10-06T15:35:19.588Z] resolveStaticClass(org.eclipse.ease.ui.completion.CompletionContextTest)  Time elapsed: 0.002 s
11:35:19 [2020-10-06T15:35:19.588Z] resolveClassWithFilter(org.eclipse.ease.ui.completion.CompletionContextTest)  Time elapsed: 0 s
11:35:19 [2020-10-06T15:35:19.588Z] simplifyCalls(org.eclipse.ease.ui.completion.CompletionContextTest)  Time elapsed: 0 s
11:35:19 [2020-10-06T15:35:19.588Z] resolveClass(org.eclipse.ease.ui.completion.CompletionContextTest)  Time elapsed: 0 s
11:35:19 [2020-10-06T15:35:19.588Z] replaceEscapedStringLiterals(org.eclipse.ease.ui.completion.CompletionContextTest)  Time elapsed: 0 s
11:35:19 [2020-10-06T15:35:19.588Z] replaceSimpleStringLiterals(org.eclipse.ease.ui.completion.CompletionContextTest)  Time elapsed: 0 s
11:35:19 [2020-10-06T15:35:19.588Z] resolveStaticClassWithFilter(org.eclipse.ease.ui.completion.CompletionContextTest)  Time elapsed: 0.001 s
11:35:19 [2020-10-06T15:35:19.588Z] resolveClassWithParameters(org.eclipse.ease.ui.completion.CompletionContextTest)  Time elapsed: 0 s
11:35:19 [2020-10-06T15:35:19.588Z] replaceMultipleStringLiterals(org.eclipse.ease.ui.completion.CompletionContextTest)  Time elapsed: 0 s
11:35:19 [2020-10-06T15:35:19.588Z] Running org.eclipse.ease.ui.completion.provider.AbstractFileLocationCompletionProviderTest
11:35:19 [2020-10-06T15:35:19.588Z] Tests run: 8, Failures: 0, Errors: 0, Skipped: 8, Time elapsed: 0.089 s - in org.eclipse.ease.ui.completion.provider.AbstractFileLocationCompletionProviderTest
11:35:19 [2020-10-06T15:35:19.588Z] workspaceProjectProposals(org.eclipse.ease.ui.completion.provider.AbstractFileLocationCompletionProviderTest) skipped
11:35:19 [2020-10-06T15:35:19.588Z] checkOperatingSystem(org.eclipse.ease.ui.completion.provider.AbstractFileLocationCompletionProviderTest) skipped
11:35:19 [2020-10-06T15:35:19.588Z] absoluteRootWorkspaceProposals(org.eclipse.ease.ui.completion.provider.AbstractFileLocationCompletionProviderTest) skipped
11:35:19 [2020-10-06T15:35:19.588Z] workspaceFolderProposals(org.eclipse.ease.ui.completion.provider.AbstractFileLocationCompletionProviderTest) skipped
11:35:19 [2020-10-06T15:35:19.588Z] fileSystemFolderProposals(org.eclipse.ease.ui.completion.provider.AbstractFileLocationCompletionProviderTest) skipped
11:35:19 [2020-10-06T15:35:19.588Z] workspaceProposals(org.eclipse.ease.ui.completion.provider.AbstractFileLocationCompletionProviderTest) skipped
11:35:19 [2020-10-06T15:35:19.588Z] relativeRootWorkspaceProposals(org.eclipse.ease.ui.completion.provider.AbstractFileLocationCompletionProviderTest) skipped
11:35:19 [2020-10-06T15:35:19.588Z] fileSystemRootProposals(org.eclipse.ease.ui.completion.provider.AbstractFileLocationCompletionProviderTest) skipped
11:35:19 [2020-10-06T15:35:19.588Z] Running org.eclipse.ease.ui.completions.java.provider.JavaPackagesCompletionsProviderTest
11:35:19 [2020-10-06T15:35:19.588Z] WARNING: An illegal reflective access operation has occurred
11:35:19 [2020-10-06T15:35:19.588Z] WARNING: Illegal reflective access by org.mockito.cglib.core.ReflectUtils$2 (file:/home/jenkins/.m2/repository/p2/osgi/bundle/org.mockito/1.9.5.v201605172210/org.mockito-1.9.5.v201605172210.jar) to method java.lang.ClassLoader.defineClass(java.lang.String,byte[],int,int,java.security.ProtectionDomain)
11:35:19 [2020-10-06T15:35:19.588Z] WARNING: Please consider reporting this to the maintainers of org.mockito.cglib.core.ReflectUtils$2
11:35:19 [2020-10-06T15:35:19.588Z] WARNING: Use --illegal-access=warn to enable warnings of further illegal reflective access operations
11:35:19 [2020-10-06T15:35:19.588Z] WARNING: All illegal access operations will be denied in a future release
11:35:26 [2020-10-06T15:35:26.125Z] Tests run: 4, Failures: 0, Errors: 0, Skipped: 0, Time elapsed: 5.953 s - in org.eclipse.ease.ui.completions.java.provider.JavaPackagesCompletionsProviderTest
11:35:26 [2020-10-06T15:35:26.125Z] containsJavaLangPackageProposal(org.eclipse.ease.ui.completions.java.provider.JavaPackagesCompletionsProviderTest)  Time elapsed: 0.511 s
11:35:26 [2020-10-06T15:35:26.125Z] containsOrgRootPackageProposal(org.eclipse.ease.ui.completions.java.provider.JavaPackagesCompletionsProviderTest)  Time elapsed: 0.012 s
11:35:26 [2020-10-06T15:35:26.125Z] containsJavaRootPackageProposal(org.eclipse.ease.ui.completions.java.provider.JavaPackagesCompletionsProviderTest)  Time elapsed: 0.007 s
11:35:26 [2020-10-06T15:35:26.125Z] containsOrgEclipsePackageProposal(org.eclipse.ease.ui.completions.java.provider.JavaPackagesCompletionsProviderTest)  Time elapsed: 0.079 s
11:35:26 [2020-10-06T15:35:26.125Z] Running org.eclipse.ease.ui.completions.java.provider.JavaClassCompletionsProviderTest
11:35:31 [2020-10-06T15:35:31.380Z] Tests run: 6, Failures: 0, Errors: 0, Skipped: 0, Time elapsed: 5.154 s - in org.eclipse.ease.ui.completions.java.provider.JavaClassCompletionsProviderTest
11:35:31 [2020-10-06T15:35:31.380Z] containsPackageFileCompletion(org.eclipse.ease.ui.completions.java.provider.JavaClassCompletionsProviderTest)  Time elapsed: 0.008 s
11:35:31 [2020-10-06T15:35:31.380Z] containsGlobalFileCompletion(org.eclipse.ease.ui.completions.java.provider.JavaClassCompletionsProviderTest)  Time elapsed: 0.034 s
11:35:31 [2020-10-06T15:35:31.380Z] containsJavaLangPackageProposal(org.eclipse.ease.ui.completions.java.provider.JavaClassCompletionsProviderTest)  Time elapsed: 0.051 s
11:35:31 [2020-10-06T15:35:31.380Z] containsOrgRootPackageProposal(org.eclipse.ease.ui.completions.java.provider.JavaClassCompletionsProviderTest)  Time elapsed: 0.005 s
11:35:31 [2020-10-06T15:35:31.380Z] containsJavaRootPackageProposal(org.eclipse.ease.ui.completions.java.provider.JavaClassCompletionsProviderTest)  Time elapsed: 0.005 s
11:35:31 [2020-10-06T15:35:31.380Z] containsOrgEclipsePackageProposal(org.eclipse.ease.ui.completions.java.provider.JavaClassCompletionsProviderTest)  Time elapsed: 0.045 s
11:35:31 [2020-10-06T15:35:31.380Z] 
11:35:31 [2020-10-06T15:35:31.380Z] Results:
11:35:31 [2020-10-06T15:35:31.380Z] 
11:35:31 [2020-10-06T15:35:31.380Z] Tests run: 31, Failures: 0, Errors: 0, Skipped: 12
11:35:31 [2020-10-06T15:35:31.380Z] 
11:35:31 [2020-10-06T15:35:31.944Z] [INFO] All tests passed!
11:35:31 [2020-10-06T15:35:31.944Z] [INFO] 
11:35:31 [2020-10-06T15:35:31.944Z] [INFO] ---------------------< org.eclipse.ease:ease.core >---------------------
11:35:31 [2020-10-06T15:35:31.944Z] [INFO] Building EASE (Incubation) 0.4.0-SNAPSHOT                        [48/48]
11:35:31 [2020-10-06T15:35:31.944Z] [INFO] --------------------------------[ pom ]---------------------------------
11:35:31 [2020-10-06T15:35:31.944Z] [INFO] 
11:35:31 [2020-10-06T15:35:31.944Z] [INFO] --- maven-clean-plugin:2.5:clean (default-clean) @ ease.core ---
11:35:31 [2020-10-06T15:35:31.944Z] [INFO] ------------------------------------------------------------------------
11:35:31 [2020-10-06T15:35:31.944Z] [INFO] Reactor Summary:
11:35:31 [2020-10-06T15:35:31.944Z] [INFO] 
11:35:31 [2020-10-06T15:35:31.944Z] [INFO] org.eclipse.ease.releng 0.8.0-SNAPSHOT ............. SUCCESS [  4.274 s]
11:35:31 [2020-10-06T15:35:31.944Z] [INFO] org.eclipse.ease.classloader 0.8.0-SNAPSHOT ........ SUCCESS [  6.960 s]
11:35:31 [2020-10-06T15:35:31.944Z] [INFO] org.eclipse.ease 0.8.0-SNAPSHOT .................... SUCCESS [  2.930 s]
11:35:31 [2020-10-06T15:35:31.944Z] [INFO] org.eclipse.ease.ui 0.8.0-SNAPSHOT ................. SUCCESS [  3.356 s]
11:35:31 [2020-10-06T15:35:31.944Z] [INFO] org.eclipse.ease.ui.completions.java 0.8.0-SNAPSHOT  SUCCESS [  1.940 s]
11:35:31 [2020-10-06T15:35:31.944Z] [INFO] org.eclipse.ease.ui.scripts 0.8.0-SNAPSHOT ......... SUCCESS [  2.363 s]
11:35:31 [2020-10-06T15:35:31.944Z] [INFO] org.eclipse.ease.lang.javascript 0.8.0-SNAPSHOT .... SUCCESS [  1.404 s]
11:35:31 [2020-10-06T15:35:31.944Z] [INFO] org.eclipse.ease.lang.scriptarchive 0.8.0-SNAPSHOT . SUCCESS [  1.399 s]
11:35:31 [2020-10-06T15:35:31.944Z] [INFO] org.eclipse.ease.lang.python 0.8.0-SNAPSHOT ........ SUCCESS [  1.815 s]
11:35:31 [2020-10-06T15:35:31.944Z] [INFO] org.eclipse.ease.lang.python.py4j 0.8.0-SNAPSHOT ... SUCCESS [  1.615 s]
11:35:31 [2020-10-06T15:35:31.944Z] [INFO] org.eclipse.ease.lang.groovy 0.8.0-SNAPSHOT ........ SUCCESS [  1.277 s]
11:35:31 [2020-10-06T15:35:31.944Z] [INFO] org.eclipse.ease.lang.groovy.interpreter 0.8.0-SNAPSHOT SUCCESS [  1.355 s]
11:35:31 [2020-10-06T15:35:31.944Z] [INFO] org.eclipse.ease.lang.unittest 0.8.0-SNAPSHOT ...... SUCCESS [  2.130 s]
11:35:31 [2020-10-06T15:35:31.944Z] [INFO] org.eclipse.ease.lang.unittest.ui 0.8.0-SNAPSHOT ... SUCCESS [  2.121 s]
11:35:31 [2020-10-06T15:35:31.944Z] [INFO] org.eclipse.ease.lang.ruby 0.8.0-SNAPSHOT .......... SUCCESS [  1.370 s]
11:35:31 [2020-10-06T15:35:31.944Z] [INFO] org.eclipse.ease.lang.ruby.jruby 0.8.0-SNAPSHOT .... SUCCESS [  1.623 s]
11:35:31 [2020-10-06T15:35:31.944Z] [INFO] org.eclipse.ease.lang.javascript.nashorn 0.8.0-SNAPSHOT SUCCESS [  1.397 s]
11:35:31 [2020-10-06T15:35:31.944Z] [INFO] org.eclipse.ease.lang.javascript.rhino 0.8.0-SNAPSHOT SUCCESS [  1.806 s]
11:35:31 [2020-10-06T15:35:31.944Z] [INFO] org.eclipse.ease.lang.python.jython 0.8.0-SNAPSHOT . SUCCESS [  1.436 s]
11:35:31 [2020-10-06T15:35:31.944Z] [INFO] org.eclipse.ease.lang.javascript.ui 0.8.0-SNAPSHOT . SUCCESS [  1.677 s]
11:35:31 [2020-10-06T15:35:31.944Z] [INFO] org.eclipse.ease.lang.jvm.compiled 0.8.0-SNAPSHOT .. SUCCESS [  1.409 s]
11:35:31 [2020-10-06T15:35:31.944Z] [INFO] org.eclipse.ease.lang.scriptarchive.ui 0.8.0-SNAPSHOT SUCCESS [  1.591 s]
11:35:31 [2020-10-06T15:35:31.944Z] [INFO] org.eclipse.ease.help 0.8.0-SNAPSHOT ............... SUCCESS [  6.687 s]
11:35:31 [2020-10-06T15:35:31.944Z] [INFO] org.eclipse.ease.feature 0.8.0-SNAPSHOT ............ SUCCESS [  0.189 s]
11:35:31 [2020-10-06T15:35:31.944Z] [INFO] org.eclipse.ease.ui.feature 0.8.0-SNAPSHOT ......... SUCCESS [  0.101 s]
11:35:31 [2020-10-06T15:35:31.944Z] [INFO] org.eclipse.ease.lang.javascript.feature 0.8.0-SNAPSHOT SUCCESS [  0.096 s]
11:35:31 [2020-10-06T15:35:31.944Z] [INFO] org.eclipse.ease.lang.python.feature 0.8.0-SNAPSHOT  SUCCESS [  0.045 s]
11:35:31 [2020-10-06T15:35:31.944Z] [INFO] org.eclipse.ease.python.jython.feature 0.8.0-SNAPSHOT SUCCESS [  0.154 s]
11:35:31 [2020-10-06T15:35:31.944Z] [INFO] org.eclipse.ease.lang.python.py4j.feature 0.8.0-SNAPSHOT SUCCESS [  0.044 s]
11:35:31 [2020-10-06T15:35:31.944Z] [INFO] org.eclipse.ease.lang.jvm.feature 0.8.0-SNAPSHOT ... SUCCESS [  0.092 s]
11:35:31 [2020-10-06T15:35:31.944Z] [INFO] org.eclipse.ease.lang.groovy.feature 0.8.0-SNAPSHOT  SUCCESS [  0.088 s]
11:35:31 [2020-10-06T15:35:31.944Z] [INFO] org.eclipse.ease.lang.ruby.feature 0.8.0-SNAPSHOT .. SUCCESS [  0.087 s]
11:35:31 [2020-10-06T15:35:31.945Z] [INFO] org.eclipse.ease.lang.scriptarchive.feature 0.8.0-SNAPSHOT SUCCESS [  0.112 s]
11:35:31 [2020-10-06T15:35:31.945Z] [INFO] org.eclipse.ease.lang.unittest.feature 0.8.0-SNAPSHOT SUCCESS [  0.095 s]
11:35:31 [2020-10-06T15:35:31.945Z] [INFO] org.eclipse.ease.releng.target 0.8.0-SNAPSHOT ...... SUCCESS [  0.006 s]
11:35:31 [2020-10-06T15:35:31.945Z] [INFO] org.eclipse.ease.releng.p2 0.8.0-SNAPSHOT .......... SUCCESS [  3.422 s]
11:35:31 [2020-10-06T15:35:31.945Z] [INFO] org.eclipse.ease.testhelper 0.8.0-SNAPSHOT ......... SUCCESS [  1.962 s]
11:35:31 [2020-10-06T15:35:31.945Z] [INFO] org.eclipse.ease.test 0.8.0-SNAPSHOT ............... SUCCESS [ 15.412 s]
11:35:31 [2020-10-06T15:35:31.945Z] [INFO] org.eclipse.ease.lang.javascript.nashorn.test 0.8.0-SNAPSHOT SUCCESS [  4.501 s]
11:35:31 [2020-10-06T15:35:31.945Z] [INFO] org.eclipse.ease.lang.javascript.rhino.test 0.8.0-SNAPSHOT SUCCESS [ 15.515 s]
11:35:31 [2020-10-06T15:35:31.945Z] [INFO] org.eclipse.ease.lang.javascript.test 0.8.0-SNAPSHOT SUCCESS [  3.922 s]
11:35:31 [2020-10-06T15:35:31.945Z] [INFO] org.eclipse.ease.lang.python.test 0.8.0-SNAPSHOT ... SUCCESS [  3.624 s]
11:35:31 [2020-10-06T15:35:31.945Z] [INFO] org.eclipse.ease.lang.python.jython.test 0.8.0-SNAPSHOT SUCCESS [ 22.935 s]
11:35:31 [2020-10-06T15:35:31.945Z] [INFO] org.eclipse.ease.lang.scriptarchive.test 0.8.0-SNAPSHOT SUCCESS [  4.955 s]
11:35:31 [2020-10-06T15:35:31.945Z] [INFO] org.eclipse.ease.lang.unittest.test 0.8.0-SNAPSHOT . SUCCESS [  6.280 s]
11:35:31 [2020-10-06T15:35:31.945Z] [INFO] org.eclipse.ease.ui.scripts.test 0.8.0-SNAPSHOT .... SUCCESS [  3.919 s]
11:35:31 [2020-10-06T15:35:31.945Z] [INFO] org.eclipse.ease.ui.test 0.8.0-SNAPSHOT ............ SUCCESS [ 16.014 s]
11:35:31 [2020-10-06T15:35:31.945Z] [INFO] EASE (Incubation) 0.4.0-SNAPSHOT ................... SUCCESS [  0.014 s]
11:35:31 [2020-10-06T15:35:31.945Z] [INFO] ------------------------------------------------------------------------
11:35:31 [2020-10-06T15:35:31.945Z] [INFO] BUILD SUCCESS
11:35:31 [2020-10-06T15:35:31.945Z] [INFO] ------------------------------------------------------------------------
11:35:31 [2020-10-06T15:35:31.945Z] [INFO] Total time:  04:51 min
11:35:31 [2020-10-06T15:35:31.945Z] [INFO] Finished at: 2020-10-06T15:35:31Z
11:35:31 [2020-10-06T15:35:31.945Z] [INFO] ------------------------------------------------------------------------
11:35:31 [2020-10-06T15:35:31.945Z] [INFO] [jenkins-event-spy] Generated /home/jenkins/agent/workspace/ease.verify.core.gerrit@tmp/withMaven06edad13/maven-spy-20201006-153040-2981229062544991679243.log