FailedConsole Output

Skipping 771 KB.. Full Log
CV27OjYAAAAA==[INFO] --- build-helper-maven-plugin:1.9.1:add-resource (add_help) @ org.eclipse.ease.lang.javascript.rhino.test ---
03:19:22 [2020-09-24T07:19:22.911Z] [INFO] 
03:19:22 [2020-09-24T07:19:22.911Z] [INFO] --- maven-resources-plugin:2.4.3:resources (default-resources) @ org.eclipse.ease.lang.javascript.rhino.test ---
03:19:22 [2020-09-24T07:19:22.911Z] [INFO] Using 'UTF-8' encoding to copy filtered resources.
03:19:22 [2020-09-24T07:19:22.911Z] [INFO] skip non existing resourceDirectory /home/jenkins/agent/workspace/ease.verify.core.gerrit/tests/org.eclipse.ease.lang.javascript.rhino.test/src/main/resources
03:19:22 [2020-09-24T07:19:22.911Z] [INFO] skip non existing resourceDirectory /home/jenkins/agent/workspace/ease.verify.core.gerrit/tests/org.eclipse.ease.lang.javascript.rhino.test/help
03:19:22 [2020-09-24T07:19:22.911Z] [INFO] 
03:19:22 [2020-09-24T07:19:22.911Z] [INFO] --- tycho-compiler-plugin:1.5.0:compile (default-compile) @ org.eclipse.ease.lang.javascript.rhino.test ---
03:19:22 [2020-09-24T07:19:22.911Z] [INFO] Compiling 4 source files to /home/jenkins/agent/workspace/ease.verify.core.gerrit/tests/org.eclipse.ease.lang.javascript.rhino.test/target/classes
03:19:22 [2020-09-24T07:19:22.911Z] [INFO] 
03:19:22 [2020-09-24T07:19:22.911Z] [INFO] --- maven-resources-plugin:2.4.3:testResources (default-testResources) @ org.eclipse.ease.lang.javascript.rhino.test ---
03:19:22 [2020-09-24T07:19:22.911Z] [INFO] Using 'UTF-8' encoding to copy filtered resources.
03:19:22 [2020-09-24T07:19:22.911Z] [INFO] skip non existing resourceDirectory /home/jenkins/agent/workspace/ease.verify.core.gerrit/tests/org.eclipse.ease.lang.javascript.rhino.test/src/test/resources
03:19:22 [2020-09-24T07:19:22.911Z] [INFO] 
03:19:22 [2020-09-24T07:19:22.911Z] [INFO] --- tycho-source-plugin:1.5.0:plugin-source (plugin-source) @ org.eclipse.ease.lang.javascript.rhino.test ---
03:19:22 [2020-09-24T07:19:22.911Z] [WARNING] Bundle-Vendor header not found in /home/jenkins/agent/workspace/ease.verify.core.gerrit/tests/org.eclipse.ease.lang.javascript.rhino.test/META-INF/MANIFEST.MF, fallback to 'unknown' for source bundle
03:19:22 [2020-09-24T07:19:22.911Z] [INFO] Building jar: /home/jenkins/agent/workspace/ease.verify.core.gerrit/tests/org.eclipse.ease.lang.javascript.rhino.test/target/org.eclipse.ease.lang.javascript.rhino.test-0.8.0-SNAPSHOT-sources.jar
03:19:22 [2020-09-24T07:19:22.911Z] [INFO] 
03:19:22 [2020-09-24T07:19:22.911Z] [INFO] --- target-platform-configuration:1.5.0:target-platform (default-target-platform) @ org.eclipse.ease.lang.javascript.rhino.test ---
03:19:22 [2020-09-24T07:19:22.911Z] [INFO] 
03:19:22 [2020-09-24T07:19:22.911Z] [INFO] --- tycho-packaging-plugin:1.5.0:package-plugin (default-package-plugin) @ org.eclipse.ease.lang.javascript.rhino.test ---
03:19:22 [2020-09-24T07:19:22.911Z] [INFO] Building jar: /home/jenkins/agent/workspace/ease.verify.core.gerrit/tests/org.eclipse.ease.lang.javascript.rhino.test/target/org.eclipse.ease.lang.javascript.rhino.test-0.8.0-SNAPSHOT.jar
03:19:22 [2020-09-24T07:19:22.911Z] [INFO] 
03:19:22 [2020-09-24T07:19:22.911Z] [INFO] --- tycho-p2-plugin:1.5.0:p2-metadata-default (default-p2-metadata-default) @ org.eclipse.ease.lang.javascript.rhino.test ---
03:19:22 [2020-09-24T07:19:22.911Z] [INFO] 
03:19:22 [2020-09-24T07:19:22.911Z] [INFO] --- tycho-source-feature-plugin:1.5.0:source-feature (source-feature) @ org.eclipse.ease.lang.javascript.rhino.test ---
03:19:22 [2020-09-24T07:19:22.911Z] [INFO] 
03:19:22 [2020-09-24T07:19:22.911Z] [INFO] --- tycho-p2-plugin:1.5.0:p2-metadata (attached-p2-metadata) @ org.eclipse.ease.lang.javascript.rhino.test ---
03:19:22 [2020-09-24T07:19:22.911Z] [INFO] 
03:19:22 [2020-09-24T07:19:22.911Z] [INFO] --- tycho-surefire-plugin:1.5.0:test (default-test) @ org.eclipse.ease.lang.javascript.rhino.test ---
03:19:22 [2020-09-24T07:19:22.911Z] [INFO] Expected eclipse log file: /home/jenkins/agent/workspace/ease.verify.core.gerrit/tests/org.eclipse.ease.lang.javascript.rhino.test/target/work/data/.metadata/.log
03:19:22 [2020-09-24T07:19:22.911Z] [INFO] Command line:
03:19:22 [2020-09-24T07:19:22.911Z] 	[/opt/tools/java/openjdk/jdk-11/11.0.2+9/bin/java, -Dosgi.noShutdown=false, -Dosgi.os=linux, -Dosgi.ws=gtk, -Dosgi.arch=x86_64, -Dosgi.clean=true, -jar, /home/jenkins/.m2/repository/p2/osgi/bundle/org.eclipse.equinox.launcher/1.5.800.v20200727-1323/org.eclipse.equinox.launcher-1.5.800.v20200727-1323.jar, -data, /home/jenkins/agent/workspace/ease.verify.core.gerrit/tests/org.eclipse.ease.lang.javascript.rhino.test/target/work/data, -install, /home/jenkins/agent/workspace/ease.verify.core.gerrit/tests/org.eclipse.ease.lang.javascript.rhino.test/target/work, -configuration, /home/jenkins/agent/workspace/ease.verify.core.gerrit/tests/org.eclipse.ease.lang.javascript.rhino.test/target/work/configuration, -application, org.eclipse.tycho.surefire.osgibooter.headlesstest, -testproperties, /home/jenkins/agent/workspace/ease.verify.core.gerrit/tests/org.eclipse.ease.lang.javascript.rhino.test/target/surefire.properties]
03:19:22 [2020-09-24T07:19:22.911Z] Picked up JAVA_TOOL_OPTIONS: -Dmaven.ext.class.path="/home/jenkins/agent/workspace/ease.verify.core.gerrit@tmp/withMaven2474cf29/pipeline-maven-spy.jar" -Dorg.jenkinsci.plugins.pipeline.maven.reportsFolder="/home/jenkins/agent/workspace/ease.verify.core.gerrit@tmp/withMaven2474cf29" 
03:19:24 [2020-09-24T07:19:24.874Z] Running org.eclipse.ease.lang.javascript.rhino.RhinoDebugTest
03:19:24 [2020-09-24T07:19:24.874Z] WARNING: An illegal reflective access operation has occurred
03:19:24 [2020-09-24T07:19:24.874Z] WARNING: Illegal reflective access by org.mockito.cglib.core.ReflectUtils$2 (file:/home/jenkins/.m2/repository/p2/osgi/bundle/org.mockito/1.9.5.v201605172210/org.mockito-1.9.5.v201605172210.jar) to method java.lang.ClassLoader.defineClass(java.lang.String,byte[],int,int,java.security.ProtectionDomain)
03:19:24 [2020-09-24T07:19:24.874Z] WARNING: Please consider reporting this to the maintainers of org.mockito.cglib.core.ReflectUtils$2
03:19:24 [2020-09-24T07:19:24.874Z] WARNING: Use --illegal-access=warn to enable warnings of further illegal reflective access operations
03:19:24 [2020-09-24T07:19:24.874Z] WARNING: All illegal access operations will be denied in a future release
03:19:25 [2020-09-24T07:19:25.130Z] Start of script
03:19:25 [2020-09-24T07:19:25.130Z] include file start
03:19:25 [2020-09-24T07:19:25.130Z] Include file processed
03:19:25 [2020-09-24T07:19:25.130Z] line after include file
03:19:25 [2020-09-24T07:19:25.130Z] Result of testMethod = 5
03:19:25 [2020-09-24T07:19:25.130Z] End of script
03:19:25 [2020-09-24T07:19:25.386Z] Start of script
03:19:25 [2020-09-24T07:19:25.386Z] include file start
03:19:25 [2020-09-24T07:19:25.386Z] Include file processed
03:19:25 [2020-09-24T07:19:25.386Z] line after include file
03:19:25 [2020-09-24T07:19:25.386Z] Result of testMethod = 5
03:19:25 [2020-09-24T07:19:25.386Z] End of script
03:19:25 [2020-09-24T07:19:25.386Z] Start of script
03:19:25 [2020-09-24T07:19:25.386Z] include file start
03:19:25 [2020-09-24T07:19:25.386Z] Include file processed
03:19:25 [2020-09-24T07:19:25.386Z] line after include file
03:19:25 [2020-09-24T07:19:25.386Z] Result of testMethod = 5
03:19:25 [2020-09-24T07:19:25.948Z] Start of script
03:19:25 [2020-09-24T07:19:25.948Z] include file start
03:19:25 [2020-09-24T07:19:25.948Z] Include file processed
03:19:25 [2020-09-24T07:19:25.948Z] line after include file
03:19:25 [2020-09-24T07:19:25.948Z] Result of testMethod = 5
03:19:25 [2020-09-24T07:19:25.948Z] End of script
03:19:26 [2020-09-24T07:19:26.204Z] Start of script
03:19:26 [2020-09-24T07:19:26.204Z] include file start
03:19:26 [2020-09-24T07:19:26.204Z] Include file processed
03:19:26 [2020-09-24T07:19:26.204Z] line after include file
03:19:26 [2020-09-24T07:19:26.204Z] Result of testMethod = 5
03:19:26 [2020-09-24T07:19:26.204Z] End of script
03:19:26 [2020-09-24T07:19:26.460Z] Start of script
03:19:26 [2020-09-24T07:19:26.460Z] include file start
03:19:26 [2020-09-24T07:19:26.460Z] Include file processed
03:19:26 [2020-09-24T07:19:26.460Z] line after include file
03:19:26 [2020-09-24T07:19:26.716Z] Result of testMethod = 5
03:19:26 [2020-09-24T07:19:26.716Z] End of script
03:19:26 [2020-09-24T07:19:26.716Z] Start of script
03:19:26 [2020-09-24T07:19:26.716Z] include file start
03:19:26 [2020-09-24T07:19:26.716Z] Include file processed
03:19:26 [2020-09-24T07:19:26.716Z] line after include file
03:19:26 [2020-09-24T07:19:26.716Z] Result of testMethod = 5
03:19:26 [2020-09-24T07:19:26.971Z] Start of script
03:19:26 [2020-09-24T07:19:26.971Z] include file start
03:19:26 [2020-09-24T07:19:26.971Z] Include file processed
03:19:26 [2020-09-24T07:19:26.971Z] line after include file
03:19:27 [2020-09-24T07:19:27.226Z] Result of testMethod = 5
03:19:27 [2020-09-24T07:19:27.226Z] End of script
03:19:27 [2020-09-24T07:19:27.226Z] Start of script
03:19:27 [2020-09-24T07:19:27.226Z] include file start
03:19:27 [2020-09-24T07:19:27.226Z] Include file processed
03:19:27 [2020-09-24T07:19:27.226Z] line after include file
03:19:27 [2020-09-24T07:19:27.226Z] Result of testMethod = 5
03:19:27 [2020-09-24T07:19:27.483Z] End of script
03:19:27 [2020-09-24T07:19:27.484Z] Start of script
03:19:27 [2020-09-24T07:19:27.484Z] include file start
03:19:27 [2020-09-24T07:19:27.484Z] Include file processed
03:19:27 [2020-09-24T07:19:27.484Z] line after include file
03:19:28 [2020-09-24T07:19:28.046Z] Start of script
03:19:28 [2020-09-24T07:19:28.046Z] include file start
03:19:28 [2020-09-24T07:19:28.046Z] Include file processed
03:19:28 [2020-09-24T07:19:28.046Z] line after include file
03:19:28 [2020-09-24T07:19:28.046Z] Result of testMethod = 5
03:19:28 [2020-09-24T07:19:28.046Z] End of script
03:19:28 [2020-09-24T07:19:28.046Z] Start of script
03:19:28 [2020-09-24T07:19:28.046Z] include file start
03:19:28 [2020-09-24T07:19:28.046Z] Include file processed
03:19:28 [2020-09-24T07:19:28.046Z] line after include file
03:19:28 [2020-09-24T07:19:28.302Z] Result of testMethod = 5
03:19:28 [2020-09-24T07:19:28.302Z] End of script
03:19:28 [2020-09-24T07:19:28.559Z] Start of script
03:19:28 [2020-09-24T07:19:28.815Z] include file start
03:19:28 [2020-09-24T07:19:28.815Z] Include file processed
03:19:28 [2020-09-24T07:19:28.815Z] line after include file
03:19:28 [2020-09-24T07:19:28.815Z] Result of testMethod = 5
03:19:28 [2020-09-24T07:19:28.815Z] End of script
03:19:28 [2020-09-24T07:19:28.815Z] Start of script
03:19:28 [2020-09-24T07:19:28.815Z] include file start
03:19:28 [2020-09-24T07:19:28.815Z] Include file processed
03:19:28 [2020-09-24T07:19:28.815Z] line after include file
03:19:29 [2020-09-24T07:19:29.072Z] Result of testMethod = 5
03:19:29 [2020-09-24T07:19:29.072Z] End of script
03:19:29 [2020-09-24T07:19:29.328Z] Start of script
03:19:29 [2020-09-24T07:19:29.328Z] include file start
03:19:29 [2020-09-24T07:19:29.328Z] Include file processed
03:19:29 [2020-09-24T07:19:29.328Z] line after include file
03:19:29 [2020-09-24T07:19:29.328Z] Result of testMethod = 5
03:19:29 [2020-09-24T07:19:29.584Z] Start of script
03:19:29 [2020-09-24T07:19:29.584Z] include file start
03:19:29 [2020-09-24T07:19:29.584Z] Include file processed
03:19:29 [2020-09-24T07:19:29.584Z] line after include file
03:19:29 [2020-09-24T07:19:29.840Z] Result of testMethod = 5
03:19:29 [2020-09-24T07:19:29.840Z] End of script
03:19:30 [2020-09-24T07:19:30.096Z] Start of script
03:19:30 [2020-09-24T07:19:30.096Z] include file start
03:19:30 [2020-09-24T07:19:30.096Z] Include file processed
03:19:30 [2020-09-24T07:19:30.096Z] line after include file
03:19:30 [2020-09-24T07:19:30.096Z] Result of testMethod = 5
03:19:30 [2020-09-24T07:19:30.096Z] End of script
03:19:30 [2020-09-24T07:19:30.352Z] Start of script
03:19:30 [2020-09-24T07:19:30.352Z] include file start
03:19:30 [2020-09-24T07:19:30.353Z] Include file processed
03:19:30 [2020-09-24T07:19:30.353Z] line after include file
03:19:30 [2020-09-24T07:19:30.353Z] Result of testMethod = 5
03:19:30 [2020-09-24T07:19:30.353Z] End of script
03:19:30 [2020-09-24T07:19:30.915Z] Start of script
03:19:30 [2020-09-24T07:19:30.915Z] include file start
03:19:30 [2020-09-24T07:19:30.915Z] Include file processed
03:19:30 [2020-09-24T07:19:30.915Z] line after include file
03:19:30 [2020-09-24T07:19:30.915Z] Result of testMethod = 5
03:19:30 [2020-09-24T07:19:30.915Z] End of script
03:19:31 [2020-09-24T07:19:31.170Z] Start of script
03:19:31 [2020-09-24T07:19:31.170Z] include file start
03:19:31 [2020-09-24T07:19:31.170Z] Include file processed
03:19:31 [2020-09-24T07:19:31.170Z] line after include file
03:19:31 [2020-09-24T07:19:31.170Z] Result of testMethod = 5
03:19:31 [2020-09-24T07:19:31.427Z] Start of script
03:19:31 [2020-09-24T07:19:31.427Z] include file start
03:19:31 [2020-09-24T07:19:31.427Z] Include file processed
03:19:31 [2020-09-24T07:19:31.427Z] line after include file
03:19:31 [2020-09-24T07:19:31.427Z] Result of testMethod = 5
03:19:31 [2020-09-24T07:19:31.427Z] End of script
03:19:31 [2020-09-24T07:19:31.683Z] Start of script
03:19:31 [2020-09-24T07:19:31.683Z] include file start
03:19:31 [2020-09-24T07:19:31.683Z] Include file processed
03:19:31 [2020-09-24T07:19:31.683Z] line after include file
03:19:31 [2020-09-24T07:19:31.683Z] Result of testMethod = 5
03:19:31 [2020-09-24T07:19:31.683Z] End of script
03:19:31 [2020-09-24T07:19:31.939Z] Start of script
03:19:31 [2020-09-24T07:19:31.939Z] include file start
03:19:31 [2020-09-24T07:19:31.939Z] Include file processed
03:19:31 [2020-09-24T07:19:31.939Z] line after include file
03:19:31 [2020-09-24T07:19:31.939Z] Result of testMethod = 5
03:19:31 [2020-09-24T07:19:31.939Z] End of script
03:19:31 [2020-09-24T07:19:31.939Z] Start of script
03:19:32 [2020-09-24T07:19:32.195Z] include file start
03:19:32 [2020-09-24T07:19:32.195Z] Include file processed
03:19:32 [2020-09-24T07:19:32.195Z] line after include file
03:19:32 [2020-09-24T07:19:32.195Z] Result of testMethod = 5
03:19:32 [2020-09-24T07:19:32.195Z] End of script
03:19:32 [2020-09-24T07:19:32.195Z] Start of script
03:19:32 [2020-09-24T07:19:32.195Z] include file start
03:19:32 [2020-09-24T07:19:32.195Z] Include file processed
03:19:32 [2020-09-24T07:19:32.195Z] line after include file
03:19:32 [2020-09-24T07:19:32.757Z] Start of script
03:19:32 [2020-09-24T07:19:32.757Z] include file start
03:19:32 [2020-09-24T07:19:32.757Z] Include file processed
03:19:32 [2020-09-24T07:19:32.757Z] line after include file
03:19:32 [2020-09-24T07:19:32.757Z] Result of testMethod = 5
03:19:32 [2020-09-24T07:19:32.757Z] End of script
03:19:33 [2020-09-24T07:19:33.014Z] Start of script
03:19:33 [2020-09-24T07:19:33.014Z] include file start
03:19:33 [2020-09-24T07:19:33.014Z] Include file processed
03:19:33 [2020-09-24T07:19:33.014Z] line after include file
03:19:33 [2020-09-24T07:19:33.014Z] Result of testMethod = 5
03:19:33 [2020-09-24T07:19:33.270Z] Start of script
03:19:33 [2020-09-24T07:19:33.270Z] include file start
03:19:33 [2020-09-24T07:19:33.270Z] Include file processed
03:19:33 [2020-09-24T07:19:33.270Z] line after include file
03:19:33 [2020-09-24T07:19:33.270Z] Result of testMethod = 5
03:19:33 [2020-09-24T07:19:33.270Z] End of script
03:19:33 [2020-09-24T07:19:33.525Z] Start of script
03:19:33 [2020-09-24T07:19:33.525Z] include file start
03:19:33 [2020-09-24T07:19:33.525Z] Include file processed
03:19:33 [2020-09-24T07:19:33.525Z] line after include file
03:19:33 [2020-09-24T07:19:33.525Z] Result of testMethod = 5
03:19:33 [2020-09-24T07:19:33.525Z] End of script
03:19:33 [2020-09-24T07:19:33.781Z] Start of script
03:19:33 [2020-09-24T07:19:33.781Z] include file start
03:19:33 [2020-09-24T07:19:33.781Z] Include file processed
03:19:33 [2020-09-24T07:19:33.781Z] line after include file
03:19:34 [2020-09-24T07:19:34.036Z] Result of testMethod = 5
03:19:34 [2020-09-24T07:19:34.036Z] End of script
03:19:34 [2020-09-24T07:19:34.036Z] Start of script
03:19:34 [2020-09-24T07:19:34.036Z] include file start
03:19:34 [2020-09-24T07:19:34.036Z] Include file processed
03:19:34 [2020-09-24T07:19:34.036Z] line after include file
03:19:34 [2020-09-24T07:19:34.036Z] Result of testMethod = 5
03:19:34 [2020-09-24T07:19:34.036Z] End of script
03:19:34 [2020-09-24T07:19:34.291Z] Start of script
03:19:34 [2020-09-24T07:19:34.291Z] include file start
03:19:34 [2020-09-24T07:19:34.291Z] Include file processed
03:19:34 [2020-09-24T07:19:34.291Z] line after include file
03:19:34 [2020-09-24T07:19:34.291Z] Result of testMethod = 5
03:19:34 [2020-09-24T07:19:34.547Z] Start of script
03:19:34 [2020-09-24T07:19:34.547Z] include file start
03:19:34 [2020-09-24T07:19:34.547Z] Include file processed
03:19:34 [2020-09-24T07:19:34.547Z] line after include file
03:19:34 [2020-09-24T07:19:34.547Z] Result of testMethod = 5
03:19:34 [2020-09-24T07:19:34.547Z] End of script
03:19:34 [2020-09-24T07:19:34.803Z] Start of script
03:19:34 [2020-09-24T07:19:34.803Z] include file start
03:19:34 [2020-09-24T07:19:34.803Z] Include file processed
03:19:34 [2020-09-24T07:19:34.803Z] line after include file
03:19:34 [2020-09-24T07:19:34.803Z] Result of testMethod = 5
03:19:35 [2020-09-24T07:19:35.364Z] Start of script
03:19:35 [2020-09-24T07:19:35.364Z] include file start
03:19:35 [2020-09-24T07:19:35.364Z] Include file processed
03:19:35 [2020-09-24T07:19:35.364Z] line after include file
03:19:35 [2020-09-24T07:19:35.364Z] Result of testMethod = 5
03:19:35 [2020-09-24T07:19:35.364Z] End of script
03:19:35 [2020-09-24T07:19:35.364Z] Start of script
03:19:35 [2020-09-24T07:19:35.364Z] include file start
03:19:35 [2020-09-24T07:19:35.364Z] Include file processed
03:19:35 [2020-09-24T07:19:35.364Z] line after include file
03:19:35 [2020-09-24T07:19:35.620Z] Result of testMethod = 5
03:19:35 [2020-09-24T07:19:35.620Z] End of script
03:19:35 [2020-09-24T07:19:35.876Z] Start of script
03:19:35 [2020-09-24T07:19:35.876Z] include file start
03:19:35 [2020-09-24T07:19:35.876Z] Include file processed
03:19:35 [2020-09-24T07:19:35.876Z] line after include file
03:19:35 [2020-09-24T07:19:35.876Z] Result of testMethod = 5
03:19:35 [2020-09-24T07:19:35.876Z] End of script
03:19:35 [2020-09-24T07:19:35.876Z] Tests run: 42, Failures: 0, Errors: 0, Skipped: 0, Time elapsed: 11.098 s - in org.eclipse.ease.lang.javascript.rhino.RhinoDebugTest
03:19:35 [2020-09-24T07:19:35.876Z] disconnectProcessInSuspendedState(org.eclipse.ease.lang.javascript.rhino.RhinoDebugTest)  Time elapsed: 0.377 s
03:19:35 [2020-09-24T07:19:35.876Z] stepReturnIncludeCommand(org.eclipse.ease.lang.javascript.rhino.RhinoDebugTest)  Time elapsed: 0.21 s
03:19:35 [2020-09-24T07:19:35.876Z] arrayVariableSorting(org.eclipse.ease.lang.javascript.rhino.RhinoDebugTest)  Time elapsed: 0.309 s
03:19:35 [2020-09-24T07:19:35.876Z] stepOverOnDebugTarget(org.eclipse.ease.lang.javascript.rhino.RhinoDebugTest)  Time elapsed: 0.31 s
03:19:35 [2020-09-24T07:19:35.876Z] hasDebugTarget(org.eclipse.ease.lang.javascript.rhino.RhinoDebugTest)  Time elapsed: 0.105 s
03:19:35 [2020-09-24T07:19:35.876Z] disconnectThreadInSuspendedState(org.eclipse.ease.lang.javascript.rhino.RhinoDebugTest)  Time elapsed: 0.208 s
03:19:35 [2020-09-24T07:19:35.876Z] stepReturnOnDebugTarget(org.eclipse.ease.lang.javascript.rhino.RhinoDebugTest)  Time elapsed: 0.308 s
03:19:35 [2020-09-24T07:19:35.876Z] nullVariable(org.eclipse.ease.lang.javascript.rhino.RhinoDebugTest)  Time elapsed: 0.308 s
03:19:35 [2020-09-24T07:19:35.876Z] stepOverOnStackFrame(org.eclipse.ease.lang.javascript.rhino.RhinoDebugTest)  Time elapsed: 0.308 s
03:19:35 [2020-09-24T07:19:35.876Z] resumeOnDebugTarget(org.eclipse.ease.lang.javascript.rhino.RhinoDebugTest)  Time elapsed: 0.207 s
03:19:35 [2020-09-24T07:19:35.876Z] modifyVariableKeepingType(org.eclipse.ease.lang.javascript.rhino.RhinoDebugTest)  Time elapsed: 0.407 s
03:19:35 [2020-09-24T07:19:35.876Z] resumeOnLastIncludeLine(org.eclipse.ease.lang.javascript.rhino.RhinoDebugTest)  Time elapsed: 0.207 s
03:19:35 [2020-09-24T07:19:35.876Z] stepReturnOnStackFrame(org.eclipse.ease.lang.javascript.rhino.RhinoDebugTest)  Time elapsed: 0.308 s
03:19:35 [2020-09-24T07:19:35.876Z] terminateStackFrameInSuspendedState(org.eclipse.ease.lang.javascript.rhino.RhinoDebugTest)  Time elapsed: 0.208 s
03:19:35 [2020-09-24T07:19:35.876Z] breakpointLocation(org.eclipse.ease.lang.javascript.rhino.RhinoDebugTest)  Time elapsed: 0.209 s
03:19:35 [2020-09-24T07:19:35.876Z] stepReturnOnThread(org.eclipse.ease.lang.javascript.rhino.RhinoDebugTest)  Time elapsed: 0.321 s
03:19:35 [2020-09-24T07:19:35.876Z] javaClassVariable(org.eclipse.ease.lang.javascript.rhino.RhinoDebugTest)  Time elapsed: 0.308 s
03:19:35 [2020-09-24T07:19:35.876Z] stepIntoOnThread(org.eclipse.ease.lang.javascript.rhino.RhinoDebugTest)  Time elapsed: 0.308 s
03:19:35 [2020-09-24T07:19:35.876Z] terminateThreadInSuspendedState(org.eclipse.ease.lang.javascript.rhino.RhinoDebugTest)  Time elapsed: 0.207 s
03:19:35 [2020-09-24T07:19:35.876Z] resumeOnThread(org.eclipse.ease.lang.javascript.rhino.RhinoDebugTest)  Time elapsed: 0.207 s
03:19:35 [2020-09-24T07:19:35.876Z] stepIntoOnStackFrame(org.eclipse.ease.lang.javascript.rhino.RhinoDebugTest)  Time elapsed: 0.307 s
03:19:35 [2020-09-24T07:19:35.876Z] terminateProcessInSuspendedState(org.eclipse.ease.lang.javascript.rhino.RhinoDebugTest)  Time elapsed: 0.205 s
03:19:35 [2020-09-24T07:19:35.876Z] stepOverOnProcess(org.eclipse.ease.lang.javascript.rhino.RhinoDebugTest)  Time elapsed: 0.307 s
03:19:35 [2020-09-24T07:19:35.876Z] nativeArrayVariable(org.eclipse.ease.lang.javascript.rhino.RhinoDebugTest)  Time elapsed: 0.307 s
03:19:35 [2020-09-24T07:19:35.876Z] disconnectDebugTargetInSuspendedState(org.eclipse.ease.lang.javascript.rhino.RhinoDebugTest)  Time elapsed: 0.206 s
03:19:35 [2020-09-24T07:19:35.876Z] stepIntoOnProcess(org.eclipse.ease.lang.javascript.rhino.RhinoDebugTest)  Time elapsed: 0.307 s
03:19:35 [2020-09-24T07:19:35.876Z] terminatedState(org.eclipse.ease.lang.javascript.rhino.RhinoDebugTest)  Time elapsed: 0.104 s
03:19:35 [2020-09-24T07:19:35.876Z] stepOverIncludeCommand(org.eclipse.ease.lang.javascript.rhino.RhinoDebugTest)  Time elapsed: 0.305 s
03:19:35 [2020-09-24T07:19:35.876Z] innerScopeVariableBeforeOuterScopeVariable(org.eclipse.ease.lang.javascript.rhino.RhinoDebugTest)  Time elapsed: 0.306 s
03:19:35 [2020-09-24T07:19:35.876Z] stepIntoIncludeCommand(org.eclipse.ease.lang.javascript.rhino.RhinoDebugTest)  Time elapsed: 0.305 s
03:19:35 [2020-09-24T07:19:35.876Z] primitiveStringVariable(org.eclipse.ease.lang.javascript.rhino.RhinoDebugTest)  Time elapsed: 0.305 s
03:19:35 [2020-09-24T07:19:35.876Z] resumeOnProcess(org.eclipse.ease.lang.javascript.rhino.RhinoDebugTest)  Time elapsed: 0.206 s
03:19:35 [2020-09-24T07:19:35.876Z] stepIntoOnDebugTarget(org.eclipse.ease.lang.javascript.rhino.RhinoDebugTest)  Time elapsed: 0.307 s
03:19:35 [2020-09-24T07:19:35.876Z] stepOverOnThread(org.eclipse.ease.lang.javascript.rhino.RhinoDebugTest)  Time elapsed: 0.306 s
03:19:35 [2020-09-24T07:19:35.876Z] suspendedState(org.eclipse.ease.lang.javascript.rhino.RhinoDebugTest)  Time elapsed: 0.205 s
03:19:35 [2020-09-24T07:19:35.876Z] primitiveDoubleVariable(org.eclipse.ease.lang.javascript.rhino.RhinoDebugTest)  Time elapsed: 0.306 s
03:19:35 [2020-09-24T07:19:35.876Z] resumeOnStackFrame(org.eclipse.ease.lang.javascript.rhino.RhinoDebugTest)  Time elapsed: 0.206 s
03:19:35 [2020-09-24T07:19:35.876Z] nativeObjectVariable(org.eclipse.ease.lang.javascript.rhino.RhinoDebugTest)  Time elapsed: 0.307 s
03:19:35 [2020-09-24T07:19:35.876Z] terminateDebugTargetInSuspendedState(org.eclipse.ease.lang.javascript.rhino.RhinoDebugTest)  Time elapsed: 0.206 s
03:19:35 [2020-09-24T07:19:35.876Z] disconnectStackFrameInSuspendedState(org.eclipse.ease.lang.javascript.rhino.RhinoDebugTest)  Time elapsed: 0.207 s
03:19:35 [2020-09-24T07:19:35.876Z] stepReturnOnProcess(org.eclipse.ease.lang.javascript.rhino.RhinoDebugTest)  Time elapsed: 0.306 s
03:19:35 [2020-09-24T07:19:35.876Z] evaluateWatchExpression(org.eclipse.ease.lang.javascript.rhino.RhinoDebugTest)  Time elapsed: 0.208 s
03:19:35 [2020-09-24T07:19:35.876Z] Running org.eclipse.ease.lang.javascript.rhino.RhinoDebuggerEngineTest
03:19:36 [2020-09-24T07:19:36.132Z] org.eclipse.ease.ScriptExecutionException: JavaError: NotThere cannot be found by org.mozilla.javascript_1.7.10.v20190430-1943
03:19:36 [2020-09-24T07:19:36.132Z] 
03:19:36 [2020-09-24T07:19:36.132Z] Java Stacktrace:
03:19:36 [2020-09-24T07:19:36.132Z] java.lang.ClassNotFoundException: NotThere cannot be found by org.mozilla.javascript_1.7.10.v20190430-1943
03:19:36 [2020-09-24T07:19:36.132Z] 	at org.eclipse.osgi.internal.loader.BundleLoader.findClass(BundleLoader.java:516)
03:19:36 [2020-09-24T07:19:36.132Z] 	at org.eclipse.osgi.internal.loader.ModuleClassLoader.loadClass(ModuleClassLoader.java:171)
03:19:36 [2020-09-24T07:19:36.132Z] 	at java.base/java.lang.ClassLoader.loadClass(ClassLoader.java:521)
03:19:36 [2020-09-24T07:19:36.132Z] 	at java.base/java.lang.Class.forName0(Native Method)
03:19:36 [2020-09-24T07:19:36.132Z] 	at java.base/java.lang.Class.forName(Class.java:315)
03:19:36 [2020-09-24T07:19:36.132Z] 	at java.base/jdk.internal.reflect.NativeMethodAccessorImpl.invoke0(Native Method)
03:19:36 [2020-09-24T07:19:36.132Z] 	at java.base/jdk.internal.reflect.NativeMethodAccessorImpl.invoke(NativeMethodAccessorImpl.java:62)
03:19:36 [2020-09-24T07:19:36.132Z] 	at java.base/jdk.internal.reflect.DelegatingMethodAccessorImpl.invoke(DelegatingMethodAccessorImpl.java:43)
03:19:36 [2020-09-24T07:19:36.132Z] 	at java.base/java.lang.reflect.Method.invoke(Method.java:566)
03:19:36 [2020-09-24T07:19:36.132Z] 	at org.mozilla.javascript.MemberBox.invoke(MemberBox.java:126)
03:19:36 [2020-09-24T07:19:36.132Z] 	at org.mozilla.javascript.NativeJavaMethod.call(NativeJavaMethod.java:225)
03:19:36 [2020-09-24T07:19:36.132Z] 	at org.mozilla.javascript.Interpreter.interpretLoop(Interpreter.java:1573)
03:19:36 [2020-09-24T07:19:36.132Z] 	at org.mozilla.javascript.Interpreter.interpret(Interpreter.java:911)
03:19:36 [2020-09-24T07:19:36.132Z] 	at org.mozilla.javascript.InterpretedFunction.call(InterpretedFunction.java:109)
03:19:36 [2020-09-24T07:19:36.132Z] 	at org.mozilla.javascript.ContextFactory.doTopCall(ContextFactory.java:405)
03:19:36 [2020-09-24T07:19:36.132Z] 	at org.mozilla.javascript.ScriptRuntime.doTopCall(ScriptRuntime.java:3508)
03:19:36 [2020-09-24T07:19:36.132Z] 	at org.mozilla.javascript.InterpretedFunction.exec(InterpretedFunction.java:120)
03:19:36 [2020-09-24T07:19:36.132Z] 	at org.mozilla.javascript.Context.evaluateReader(Context.java:1293)
03:19:36 [2020-09-24T07:19:36.132Z] 	at org.eclipse.ease.lang.javascript.rhino.RhinoScriptEngine.internalExecute(RhinoScriptEngine.java:222)
03:19:36 [2020-09-24T07:19:36.132Z] 	at org.eclipse.ease.lang.javascript.rhino.RhinoScriptEngine.execute(RhinoScriptEngine.java:201)
03:19:36 [2020-09-24T07:19:36.132Z] 	at org.eclipse.ease.AbstractScriptEngine.inject(AbstractScriptEngine.java:222)
03:19:36 [2020-09-24T07:19:36.132Z] 	at org.eclipse.ease.AbstractScriptEngine.run(AbstractScriptEngine.java:272)
03:19:36 [2020-09-24T07:19:36.132Z] 	at org.eclipse.core.internal.jobs.Worker.run(Worker.java:63)
03:19:36 [2020-09-24T07:19:36.132Z] org.eclipse.ease.ScriptExecutionException: TypeError: Cannot call method "foobar" of undefined
03:19:36 [2020-09-24T07:19:36.132Z] org.eclipse.ease.ScriptExecutionException: ScriptException: test
03:19:36 [2020-09-24T07:19:36.132Z] org.eclipse.ease.ScriptExecutionException: JavaError: java.lang.Exception
03:19:36 [2020-09-24T07:19:36.132Z] 
03:19:36 [2020-09-24T07:19:36.132Z] Java Stacktrace:
03:19:36 [2020-09-24T07:19:36.132Z] java.lang.Exception
03:19:36 [2020-09-24T07:19:36.132Z] 	at java.base/jdk.internal.reflect.NativeConstructorAccessorImpl.newInstance0(Native Method)
03:19:36 [2020-09-24T07:19:36.132Z] 	at java.base/jdk.internal.reflect.NativeConstructorAccessorImpl.newInstance(NativeConstructorAccessorImpl.java:62)
03:19:36 [2020-09-24T07:19:36.132Z] 	at java.base/jdk.internal.reflect.DelegatingConstructorAccessorImpl.newInstance(DelegatingConstructorAccessorImpl.java:45)
03:19:36 [2020-09-24T07:19:36.132Z] 	at java.base/java.lang.reflect.Constructor.newInstance(Constructor.java:490)
03:19:36 [2020-09-24T07:19:36.132Z] 	at org.mozilla.javascript.MemberBox.newInstance(MemberBox.java:159)
03:19:36 [2020-09-24T07:19:36.132Z] 	at org.mozilla.javascript.NativeJavaClass.constructInternal(NativeJavaClass.java:266)
03:19:36 [2020-09-24T07:19:36.132Z] 	at org.mozilla.javascript.NativeJavaClass.constructSpecific(NativeJavaClass.java:205)
03:19:36 [2020-09-24T07:19:36.132Z] 	at org.mozilla.javascript.NativeJavaClass.construct(NativeJavaClass.java:166)
03:19:36 [2020-09-24T07:19:36.132Z] 	at org.mozilla.javascript.Interpreter.interpretLoop(Interpreter.java:1617)
03:19:36 [2020-09-24T07:19:36.132Z] 	at org.mozilla.javascript.Interpreter.interpret(Interpreter.java:911)
03:19:36 [2020-09-24T07:19:36.132Z] 	at org.mozilla.javascript.InterpretedFunction.call(InterpretedFunction.java:109)
03:19:36 [2020-09-24T07:19:36.132Z] 	at org.mozilla.javascript.ContextFactory.doTopCall(ContextFactory.java:405)
03:19:36 [2020-09-24T07:19:36.132Z] 	at org.mozilla.javascript.ScriptRuntime.doTopCall(ScriptRuntime.java:3508)
03:19:36 [2020-09-24T07:19:36.133Z] 	at org.mozilla.javascript.InterpretedFunction.exec(InterpretedFunction.java:120)
03:19:36 [2020-09-24T07:19:36.133Z] 	at org.mozilla.javascript.Context.evaluateReader(Context.java:1293)
03:19:36 [2020-09-24T07:19:36.133Z] 	at org.eclipse.ease.lang.javascript.rhino.RhinoScriptEngine.internalExecute(RhinoScriptEngine.java:222)
03:19:36 [2020-09-24T07:19:36.133Z] 	at org.eclipse.ease.lang.javascript.rhino.RhinoScriptEngine.execute(RhinoScriptEngine.java:201)
03:19:36 [2020-09-24T07:19:36.133Z] 	at org.eclipse.ease.AbstractScriptEngine.inject(AbstractScriptEngine.java:222)
03:19:36 [2020-09-24T07:19:36.133Z] 	at org.eclipse.ease.AbstractScriptEngine.run(AbstractScriptEngine.java:272)
03:19:36 [2020-09-24T07:19:36.133Z] 	at org.eclipse.core.internal.jobs.Worker.run(Worker.java:63)
03:19:36 [2020-09-24T07:19:36.133Z] org.eclipse.ease.ScriptExecutionException: ScriptException: JavaScript
03:19:36 [2020-09-24T07:19:36.133Z] org.eclipse.ease.ScriptExecutionException: SyntaxError: unterminated string literal (#1)
03:19:36 [2020-09-24T07:19:36.133Z] 'asdf
03:19:36 [2020-09-24T07:19:36.133Z]     ^
03:19:36 [2020-09-24T07:19:36.133Z] 	at <unknown source>:1
03:19:36 [2020-09-24T07:19:36.133Z] Tests run: 12, Failures: 0, Errors: 0, Skipped: 0, Time elapsed: 0.167 s - in org.eclipse.ease.lang.javascript.rhino.RhinoDebuggerEngineTest
03:19:36 [2020-09-24T07:19:36.133Z] getExceptionStackTrace(org.eclipse.ease.lang.javascript.rhino.RhinoDebuggerEngineTest)  Time elapsed: 0.026 s
03:19:36 [2020-09-24T07:19:36.133Z] causeWrappedException(org.eclipse.ease.lang.javascript.rhino.RhinoDebuggerEngineTest)  Time elapsed: 0.012 s
03:19:36 [2020-09-24T07:19:36.133Z] optionalModuleParameters(org.eclipse.ease.lang.javascript.rhino.RhinoDebuggerEngineTest)  Time elapsed: 0.01 s
03:19:36 [2020-09-24T07:19:36.133Z] simpleScriptCode(org.eclipse.ease.lang.javascript.rhino.RhinoDebuggerEngineTest)  Time elapsed: 0.013 s
03:19:36 [2020-09-24T07:19:36.133Z] causeRuntimeErrorException(org.eclipse.ease.lang.javascript.rhino.RhinoDebuggerEngineTest)  Time elapsed: 0.011 s
03:19:36 [2020-09-24T07:19:36.133Z] callModuleCode(org.eclipse.ease.lang.javascript.rhino.RhinoDebuggerEngineTest)  Time elapsed: 0.008 s
03:19:36 [2020-09-24T07:19:36.133Z] throwJavaClass(org.eclipse.ease.lang.javascript.rhino.RhinoDebuggerEngineTest)  Time elapsed: 0.009 s
03:19:36 [2020-09-24T07:19:36.133Z] throwJavaException(org.eclipse.ease.lang.javascript.rhino.RhinoDebuggerEngineTest)  Time elapsed: 0.009 s
03:19:36 [2020-09-24T07:19:36.133Z] accessJavaClasses(org.eclipse.ease.lang.javascript.rhino.RhinoDebuggerEngineTest)  Time elapsed: 0.008 s
03:19:36 [2020-09-24T07:19:36.133Z] accessEclipseClasses(org.eclipse.ease.lang.javascript.rhino.RhinoDebuggerEngineTest)  Time elapsed: 0.009 s
03:19:36 [2020-09-24T07:19:36.133Z] throwJavaScriptException(org.eclipse.ease.lang.javascript.rhino.RhinoDebuggerEngineTest)  Time elapsed: 0.042 s
03:19:36 [2020-09-24T07:19:36.133Z] causeSyntaxErrorException(org.eclipse.ease.lang.javascript.rhino.RhinoDebuggerEngineTest)  Time elapsed: 0.009 s
03:19:36 [2020-09-24T07:19:36.133Z] Running org.eclipse.ease.lang.javascript.rhino.RhinoEnvironmentTest
03:19:36 [2020-09-24T07:19:36.389Z] Tests run: 5, Failures: 0, Errors: 0, Skipped: 0, Time elapsed: 0.142 s - in org.eclipse.ease.lang.javascript.rhino.RhinoEnvironmentTest
03:19:36 [2020-09-24T07:19:36.389Z] reloadEnvironment(org.eclipse.ease.lang.javascript.rhino.RhinoEnvironmentTest)  Time elapsed: 0.044 s
03:19:36 [2020-09-24T07:19:36.389Z] bootstrappedEnvironment(org.eclipse.ease.lang.javascript.rhino.RhinoEnvironmentTest)  Time elapsed: 0.049 s
03:19:36 [2020-09-24T07:19:36.389Z] postMethodCallback(org.eclipse.ease.lang.javascript.rhino.RhinoEnvironmentTest)  Time elapsed: 0.016 s
03:19:36 [2020-09-24T07:19:36.389Z] preMethodCallback(org.eclipse.ease.lang.javascript.rhino.RhinoEnvironmentTest)  Time elapsed: 0.013 s
03:19:36 [2020-09-24T07:19:36.389Z] reloadFunctionDefinitions(org.eclipse.ease.lang.javascript.rhino.RhinoEnvironmentTest)  Time elapsed: 0.019 s
03:19:36 [2020-09-24T07:19:36.389Z] Running org.eclipse.ease.lang.javascript.rhino.RhinoScriptEngineTest
03:19:36 [2020-09-24T07:19:36.389Z] org.eclipse.ease.ScriptExecutionException: JavaError: NotThere cannot be found by org.mozilla.javascript_1.7.10.v20190430-1943
03:19:36 [2020-09-24T07:19:36.389Z] 	at <unknown source>
03:19:36 [2020-09-24T07:19:36.389Z] 
03:19:36 [2020-09-24T07:19:36.389Z] Java Stacktrace:
03:19:36 [2020-09-24T07:19:36.389Z] java.lang.ClassNotFoundException: NotThere cannot be found by org.mozilla.javascript_1.7.10.v20190430-1943
03:19:36 [2020-09-24T07:19:36.389Z] 	at org.eclipse.osgi.internal.loader.BundleLoader.findClass(BundleLoader.java:516)
03:19:36 [2020-09-24T07:19:36.389Z] 	at org.eclipse.osgi.internal.loader.ModuleClassLoader.loadClass(ModuleClassLoader.java:171)
03:19:36 [2020-09-24T07:19:36.389Z] 	at java.base/java.lang.ClassLoader.loadClass(ClassLoader.java:521)
03:19:36 [2020-09-24T07:19:36.389Z] 	at java.base/java.lang.Class.forName0(Native Method)
03:19:36 [2020-09-24T07:19:36.389Z] 	at java.base/java.lang.Class.forName(Class.java:315)
03:19:36 [2020-09-24T07:19:36.389Z] 	at java.base/jdk.internal.reflect.NativeMethodAccessorImpl.invoke0(Native Method)
03:19:36 [2020-09-24T07:19:36.389Z] 	at java.base/jdk.internal.reflect.NativeMethodAccessorImpl.invoke(NativeMethodAccessorImpl.java:62)
03:19:36 [2020-09-24T07:19:36.389Z] 	at java.base/jdk.internal.reflect.DelegatingMethodAccessorImpl.invoke(DelegatingMethodAccessorImpl.java:43)
03:19:36 [2020-09-24T07:19:36.389Z] 	at java.base/java.lang.reflect.Method.invoke(Method.java:566)
03:19:36 [2020-09-24T07:19:36.389Z] 	at org.mozilla.javascript.MemberBox.invoke(MemberBox.java:126)
03:19:36 [2020-09-24T07:19:36.389Z] 	at org.mozilla.javascript.NativeJavaMethod.call(NativeJavaMethod.java:225)
03:19:36 [2020-09-24T07:19:36.389Z] 	at org.mozilla.javascript.optimizer.OptRuntime.call1(OptRuntime.java:32)
03:19:36 [2020-09-24T07:19:36.389Z] 	at org.mozilla.javascript.gen.c_27._c_script_0(Unknown Source)
03:19:36 [2020-09-24T07:19:36.389Z] 	at org.mozilla.javascript.gen.c_27.call(Unknown Source)
03:19:36 [2020-09-24T07:19:36.389Z] 	at org.mozilla.javascript.ContextFactory.doTopCall(ContextFactory.java:405)
03:19:36 [2020-09-24T07:19:36.389Z] 	at org.mozilla.javascript.ScriptRuntime.doTopCall(ScriptRuntime.java:3508)
03:19:36 [2020-09-24T07:19:36.389Z] 	at org.mozilla.javascript.gen.c_27.call(Unknown Source)
03:19:36 [2020-09-24T07:19:36.389Z] 	at org.mozilla.javascript.gen.c_27.exec(Unknown Source)
03:19:36 [2020-09-24T07:19:36.389Z] 	at org.mozilla.javascript.Context.evaluateReader(Context.java:1293)
03:19:36 [2020-09-24T07:19:36.389Z] 	at org.eclipse.ease.lang.javascript.rhino.RhinoScriptEngine.internalExecute(RhinoScriptEngine.java:222)
03:19:36 [2020-09-24T07:19:36.389Z] 	at org.eclipse.ease.lang.javascript.rhino.RhinoScriptEngine.execute(RhinoScriptEngine.java:201)
03:19:36 [2020-09-24T07:19:36.389Z] 	at org.eclipse.ease.AbstractScriptEngine.inject(AbstractScriptEngine.java:222)
03:19:36 [2020-09-24T07:19:36.389Z] 	at org.eclipse.ease.AbstractScriptEngine.run(AbstractScriptEngine.java:272)
03:19:36 [2020-09-24T07:19:36.389Z] 	at org.eclipse.core.internal.jobs.Worker.run(Worker.java:63)
03:19:36 [2020-09-24T07:19:36.389Z] org.eclipse.ease.ScriptExecutionException: TypeError: Cannot call method "foobar" of undefined
03:19:36 [2020-09-24T07:19:36.389Z] 	at <unknown source>
03:19:36 [2020-09-24T07:19:36.389Z] org.eclipse.ease.ScriptExecutionException: ScriptException: test
03:19:36 [2020-09-24T07:19:36.389Z] 	at <unknown source>
03:19:36 [2020-09-24T07:19:36.389Z] org.eclipse.ease.ScriptExecutionException: JavaError: java.lang.Exception
03:19:36 [2020-09-24T07:19:36.389Z] 	at <unknown source>
03:19:36 [2020-09-24T07:19:36.389Z] 
03:19:36 [2020-09-24T07:19:36.389Z] Java Stacktrace:
03:19:36 [2020-09-24T07:19:36.389Z] java.lang.Exception
03:19:36 [2020-09-24T07:19:36.389Z] 	at java.base/jdk.internal.reflect.NativeConstructorAccessorImpl.newInstance0(Native Method)
03:19:36 [2020-09-24T07:19:36.389Z] 	at java.base/jdk.internal.reflect.NativeConstructorAccessorImpl.newInstance(NativeConstructorAccessorImpl.java:62)
03:19:36 [2020-09-24T07:19:36.389Z] 	at java.base/jdk.internal.reflect.DelegatingConstructorAccessorImpl.newInstance(DelegatingConstructorAccessorImpl.java:45)
03:19:36 [2020-09-24T07:19:36.389Z] 	at java.base/java.lang.reflect.Constructor.newInstance(Constructor.java:490)
03:19:36 [2020-09-24T07:19:36.389Z] 	at org.mozilla.javascript.MemberBox.newInstance(MemberBox.java:159)
03:19:36 [2020-09-24T07:19:36.389Z] 	at org.mozilla.javascript.NativeJavaClass.constructInternal(NativeJavaClass.java:266)
03:19:36 [2020-09-24T07:19:36.389Z] 	at org.mozilla.javascript.NativeJavaClass.constructSpecific(NativeJavaClass.java:205)
03:19:36 [2020-09-24T07:19:36.389Z] 	at org.mozilla.javascript.NativeJavaClass.construct(NativeJavaClass.java:166)
03:19:36 [2020-09-24T07:19:36.389Z] 	at org.mozilla.javascript.ScriptRuntime.newObject(ScriptRuntime.java:2655)
03:19:36 [2020-09-24T07:19:36.389Z] 	at org.mozilla.javascript.gen.c_45._c_script_0(Unknown Source)
03:19:36 [2020-09-24T07:19:36.389Z] 	at org.mozilla.javascript.gen.c_45.call(Unknown Source)
03:19:36 [2020-09-24T07:19:36.389Z] 	at org.mozilla.javascript.ContextFactory.doTopCall(ContextFactory.java:405)
03:19:36 [2020-09-24T07:19:36.389Z] 	at org.mozilla.javascript.ScriptRuntime.doTopCall(ScriptRuntime.java:3508)
03:19:36 [2020-09-24T07:19:36.389Z] 	at org.mozilla.javascript.gen.c_45.call(Unknown Source)
03:19:36 [2020-09-24T07:19:36.389Z] 	at org.mozilla.javascript.gen.c_45.exec(Unknown Source)
03:19:36 [2020-09-24T07:19:36.389Z] 	at org.mozilla.javascript.Context.evaluateReader(Context.java:1293)
03:19:36 [2020-09-24T07:19:36.389Z] 	at org.eclipse.ease.lang.javascript.rhino.RhinoScriptEngine.internalExecute(RhinoScriptEngine.java:222)
03:19:36 [2020-09-24T07:19:36.389Z] 	at org.eclipse.ease.lang.javascript.rhino.RhinoScriptEngine.execute(RhinoScriptEngine.java:201)
03:19:36 [2020-09-24T07:19:36.389Z] 	at org.eclipse.ease.AbstractScriptEngine.inject(AbstractScriptEngine.java:222)
03:19:36 [2020-09-24T07:19:36.389Z] 	at org.eclipse.ease.AbstractScriptEngine.run(AbstractScriptEngine.java:272)
03:19:36 [2020-09-24T07:19:36.389Z] 	at org.eclipse.core.internal.jobs.Worker.run(Worker.java:63)
03:19:36 [2020-09-24T07:19:36.389Z] org.eclipse.ease.ScriptExecutionException: ScriptException: JavaScript
03:19:36 [2020-09-24T07:19:36.389Z] 	at <unknown source>
03:19:36 [2020-09-24T07:19:36.389Z] org.eclipse.ease.ScriptExecutionException: SyntaxError: unterminated string literal (#1)
03:19:36 [2020-09-24T07:19:36.389Z] 'asdf
03:19:36 [2020-09-24T07:19:36.390Z]     ^
03:19:36 [2020-09-24T07:19:36.390Z] 	at <unknown source>
03:19:36 [2020-09-24T07:19:36.390Z] Tests run: 11, Failures: 0, Errors: 0, Skipped: 0, Time elapsed: 0.17 s - in org.eclipse.ease.lang.javascript.rhino.RhinoScriptEngineTest
03:19:36 [2020-09-24T07:19:36.390Z] causeWrappedException(org.eclipse.ease.lang.javascript.rhino.RhinoScriptEngineTest)  Time elapsed: 0.05 s
03:19:36 [2020-09-24T07:19:36.390Z] optionalModuleParameters(org.eclipse.ease.lang.javascript.rhino.RhinoScriptEngineTest)  Time elapsed: 0.009 s
03:19:36 [2020-09-24T07:19:36.390Z] simpleScriptCode(org.eclipse.ease.lang.javascript.rhino.RhinoScriptEngineTest)  Time elapsed: 0.008 s
03:19:36 [2020-09-24T07:19:36.390Z] causeRuntimeErrorException(org.eclipse.ease.lang.javascript.rhino.RhinoScriptEngineTest)  Time elapsed: 0.008 s
03:19:36 [2020-09-24T07:19:36.390Z] callModuleCode(org.eclipse.ease.lang.javascript.rhino.RhinoScriptEngineTest)  Time elapsed: 0.011 s
03:19:36 [2020-09-24T07:19:36.390Z] throwJavaClass(org.eclipse.ease.lang.javascript.rhino.RhinoScriptEngineTest)  Time elapsed: 0.008 s
03:19:36 [2020-09-24T07:19:36.390Z] throwJavaException(org.eclipse.ease.lang.javascript.rhino.RhinoScriptEngineTest)  Time elapsed: 0.009 s
03:19:36 [2020-09-24T07:19:36.390Z] accessJavaClasses(org.eclipse.ease.lang.javascript.rhino.RhinoScriptEngineTest)  Time elapsed: 0.042 s
03:19:36 [2020-09-24T07:19:36.390Z] accessEclipseClasses(org.eclipse.ease.lang.javascript.rhino.RhinoScriptEngineTest)  Time elapsed: 0.008 s
03:19:36 [2020-09-24T07:19:36.390Z] throwJavaScriptException(org.eclipse.ease.lang.javascript.rhino.RhinoScriptEngineTest)  Time elapsed: 0.008 s
03:19:36 [2020-09-24T07:19:36.390Z] causeSyntaxErrorException(org.eclipse.ease.lang.javascript.rhino.RhinoScriptEngineTest)  Time elapsed: 0.007 s
03:19:36 [2020-09-24T07:19:36.390Z] 
03:19:36 [2020-09-24T07:19:36.390Z] Results:
03:19:36 [2020-09-24T07:19:36.390Z] 
03:19:36 [2020-09-24T07:19:36.390Z] Tests run: 70, Failures: 0, Errors: 0, Skipped: 0
03:19:36 [2020-09-24T07:19:36.390Z] 
03:19:37 [2020-09-24T07:19:37.317Z] [INFO] All tests passed!
03:19:37 [2020-09-24T07:19:37.317Z] [INFO] 
03:19:37 [2020-09-24T07:19:37.317Z] [INFO] -------< org.eclipse.ease:org.eclipse.ease.lang.javascript.test >-------
03:19:37 [2020-09-24T07:19:37.317Z] [INFO] Building org.eclipse.ease.lang.javascript.test 0.8.0-SNAPSHOT    [41/48]
03:19:37 [2020-09-24T07:19:37.317Z] [INFO] ------------------------[ eclipse-test-plugin ]-------------------------
03:19:37 [2020-09-24T07:19:37.317Z] [INFO] 
03:19:37 [2020-09-24T07:19:37.317Z] [INFO] --- maven-clean-plugin:2.5:clean (default-clean) @ org.eclipse.ease.lang.javascript.test ---
03:19:37 [2020-09-24T07:19:37.317Z] [INFO] 
03:19:37 [2020-09-24T07:19:37.317Z] [INFO] --- tycho-packaging-plugin:1.5.0:build-qualifier (default-build-qualifier) @ org.eclipse.ease.lang.javascript.test ---
03:19:37 [2020-09-24T07:19:37.317Z] [INFO] The project's OSGi version is 0.8.0.I201910171213
03:19:37 [2020-09-24T07:19:37.317Z] [INFO] 
03:19:37 [2020-09-24T07:19:37.317Z] [INFO] --- tycho-packaging-plugin:1.5.0:validate-id (default-validate-id) @ org.eclipse.ease.lang.javascript.test ---
03:19:37 [2020-09-24T07:19:37.317Z] [INFO] 
03:19:37 [2020-09-24T07:19:37.317Z] [INFO] --- tycho-packaging-plugin:1.5.0:validate-version (default-validate-version) @ org.eclipse.ease.lang.javascript.test ---
03:19:37 [2020-09-24T07:19:37.317Z] [INFO] 
03:19:37 [2020-09-24T07:19:37.317Z] [INFO] >>> maven-javadoc-plugin:2.9.1:javadoc (build-docs) > generate-sources @ org.eclipse.ease.lang.javascript.test >>>
03:19:37 [2020-09-24T07:19:37.317Z] [INFO] 
03:19:37 [2020-09-24T07:19:37.317Z] [INFO] --- tycho-packaging-plugin:1.5.0:build-qualifier (default-build-qualifier) @ org.eclipse.ease.lang.javascript.test ---
03:19:37 [2020-09-24T07:19:37.317Z] [INFO] The project's OSGi version is 0.8.0.I201910171213
03:19:37 [2020-09-24T07:19:37.317Z] [INFO] 
03:19:37 [2020-09-24T07:19:37.317Z] [INFO] --- tycho-packaging-plugin:1.5.0:validate-id (default-validate-id) @ org.eclipse.ease.lang.javascript.test ---
03:19:37 [2020-09-24T07:19:37.317Z] [INFO] 
03:19:37 [2020-09-24T07:19:37.317Z] [INFO] --- tycho-packaging-plugin:1.5.0:validate-version (default-validate-version) @ org.eclipse.ease.lang.javascript.test ---
03:19:37 [2020-09-24T07:19:37.317Z] [INFO] 
03:19:37 [2020-09-24T07:19:37.317Z] [INFO] <<< maven-javadoc-plugin:2.9.1:javadoc (build-docs) < generate-sources @ org.eclipse.ease.lang.javascript.test <<<
03:19:37 [2020-09-24T07:19:37.317Z] [INFO] 
03:19:37 [2020-09-24T07:19:37.317Z] [INFO] 
03:19:37 [2020-09-24T07:19:37.317Z] [INFO] --- maven-javadoc-plugin:2.9.1:javadoc (build-docs) @ org.eclipse.ease.lang.javascript.test ---
03:19:37 [2020-09-24T07:19:37.317Z] [ERROR] Error fetching link: http://help.eclipse.org/oxygen/topic/org.eclipse.platform.doc.isv/reference/api/package-list. Ignored it.
03:19:38 [2020-09-24T07:19:38.713Z] [INFO] 
03:19:38 [2020-09-24T07:19:38.713Z] Loading source files for package org.eclipse.ease.lang.javascript...
03:19:38 [2020-09-24T07:19:38.713Z] Constructing Javadoc information...
03:19:38 [2020-09-24T07:19:38.713Z] WARNING: Cannot open location "/home/jenkins/agent/workspace/ease.verify.core.gerrit/tests/org.eclipse.ease.lang.javascript.test/target/javadoc-bundle-options/package-list"
03:19:38 [2020-09-24T07:19:38.713Z] No plugin definition found, skipping
03:19:38 [2020-09-24T07:19:38.713Z] No plugin definition found, skipping
03:19:38 [2020-09-24T07:19:38.713Z] [WARNING] Javadoc Warnings
03:19:38 [2020-09-24T07:19:38.713Z] [WARNING] Picked up JAVA_TOOL_OPTIONS: -Dmaven.ext.class.path="/home/jenkins/agent/workspace/ease.verify.core.gerrit@tmp/withMaven2474cf29/pipeline-maven-spy.jar" -Dorg.jenkinsci.plugins.pipeline.maven.reportsFolder="/home/jenkins/agent/workspace/ease.verify.core.gerrit@tmp/withMaven2474cf29"
03:19:38 [2020-09-24T07:19:38.713Z] [WARNING] javadoc: warning - The old Doclet and Taglet APIs in the packages
03:19:38 [2020-09-24T07:19:38.713Z] [WARNING] com.sun.javadoc, com.sun.tools.doclets and their implementations
03:19:38 [2020-09-24T07:19:38.713Z] [WARNING] are planned to be removed in a future JDK release. These
03:19:38 [2020-09-24T07:19:38.713Z] [WARNING] components have been superseded by the new APIs in jdk.javadoc.doclet.
03:19:38 [2020-09-24T07:19:38.713Z] [WARNING] Users are strongly recommended to migrate to the new APIs.
03:19:38 [2020-09-24T07:19:38.713Z] [INFO] 
03:19:38 [2020-09-24T07:19:38.713Z] [INFO] --- build-helper-maven-plugin:1.9.1:add-resource (add_help) @ org.eclipse.ease.lang.javascript.test ---
03:19:38 [2020-09-24T07:19:38.713Z] [INFO] 
03:19:38 [2020-09-24T07:19:38.713Z] [INFO] --- maven-resources-plugin:2.4.3:resources (default-resources) @ org.eclipse.ease.lang.javascript.test ---
03:19:38 [2020-09-24T07:19:38.713Z] [INFO] Using 'UTF-8' encoding to copy filtered resources.
03:19:38 [2020-09-24T07:19:38.713Z] [INFO] skip non existing resourceDirectory /home/jenkins/agent/workspace/ease.verify.core.gerrit/tests/org.eclipse.ease.lang.javascript.test/src/main/resources
03:19:38 [2020-09-24T07:19:38.713Z] [INFO] skip non existing resourceDirectory /home/jenkins/agent/workspace/ease.verify.core.gerrit/tests/org.eclipse.ease.lang.javascript.test/help
03:19:38 [2020-09-24T07:19:38.713Z] [INFO] 
03:19:38 [2020-09-24T07:19:38.713Z] [INFO] --- tycho-compiler-plugin:1.5.0:compile (default-compile) @ org.eclipse.ease.lang.javascript.test ---
03:19:38 [2020-09-24T07:19:38.713Z] [INFO] Compiling 2 source files to /home/jenkins/agent/workspace/ease.verify.core.gerrit/tests/org.eclipse.ease.lang.javascript.test/target/classes
03:19:38 [2020-09-24T07:19:38.713Z] [INFO] 
03:19:38 [2020-09-24T07:19:38.713Z] [INFO] --- maven-resources-plugin:2.4.3:testResources (default-testResources) @ org.eclipse.ease.lang.javascript.test ---
03:19:38 [2020-09-24T07:19:38.713Z] [INFO] Using 'UTF-8' encoding to copy filtered resources.
03:19:38 [2020-09-24T07:19:38.713Z] [INFO] skip non existing resourceDirectory /home/jenkins/agent/workspace/ease.verify.core.gerrit/tests/org.eclipse.ease.lang.javascript.test/src/test/resources
03:19:38 [2020-09-24T07:19:38.713Z] [INFO] 
03:19:38 [2020-09-24T07:19:38.713Z] [INFO] --- tycho-source-plugin:1.5.0:plugin-source (plugin-source) @ org.eclipse.ease.lang.javascript.test ---
03:19:38 [2020-09-24T07:19:38.713Z] [WARNING] Bundle-Vendor header not found in /home/jenkins/agent/workspace/ease.verify.core.gerrit/tests/org.eclipse.ease.lang.javascript.test/META-INF/MANIFEST.MF, fallback to 'unknown' for source bundle
03:19:38 [2020-09-24T07:19:38.713Z] [INFO] Building jar: /home/jenkins/agent/workspace/ease.verify.core.gerrit/tests/org.eclipse.ease.lang.javascript.test/target/org.eclipse.ease.lang.javascript.test-0.8.0-SNAPSHOT-sources.jar
03:19:38 [2020-09-24T07:19:38.713Z] [INFO] 
03:19:38 [2020-09-24T07:19:38.713Z] [INFO] --- target-platform-configuration:1.5.0:target-platform (default-target-platform) @ org.eclipse.ease.lang.javascript.test ---
03:19:38 [2020-09-24T07:19:38.713Z] [INFO] 
03:19:38 [2020-09-24T07:19:38.713Z] [INFO] --- tycho-packaging-plugin:1.5.0:package-plugin (default-package-plugin) @ org.eclipse.ease.lang.javascript.test ---
03:19:38 [2020-09-24T07:19:38.713Z] [INFO] Building jar: /home/jenkins/agent/workspace/ease.verify.core.gerrit/tests/org.eclipse.ease.lang.javascript.test/target/org.eclipse.ease.lang.javascript.test-0.8.0-SNAPSHOT.jar
03:19:38 [2020-09-24T07:19:38.714Z] [INFO] 
03:19:38 [2020-09-24T07:19:38.714Z] [INFO] --- tycho-p2-plugin:1.5.0:p2-metadata-default (default-p2-metadata-default) @ org.eclipse.ease.lang.javascript.test ---
03:19:39 [2020-09-24T07:19:39.011Z] [INFO] 
03:19:39 [2020-09-24T07:19:39.011Z] [INFO] --- tycho-source-feature-plugin:1.5.0:source-feature (source-feature) @ org.eclipse.ease.lang.javascript.test ---
03:19:39 [2020-09-24T07:19:39.011Z] [INFO] 
03:19:39 [2020-09-24T07:19:39.011Z] [INFO] --- tycho-p2-plugin:1.5.0:p2-metadata (attached-p2-metadata) @ org.eclipse.ease.lang.javascript.test ---
03:19:39 [2020-09-24T07:19:39.011Z] [INFO] 
03:19:39 [2020-09-24T07:19:39.011Z] [INFO] --- tycho-surefire-plugin:1.5.0:test (default-test) @ org.eclipse.ease.lang.javascript.test ---
03:19:39 [2020-09-24T07:19:39.011Z] [INFO] Expected eclipse log file: /home/jenkins/agent/workspace/ease.verify.core.gerrit/tests/org.eclipse.ease.lang.javascript.test/target/work/data/.metadata/.log
03:19:39 [2020-09-24T07:19:39.011Z] [INFO] Command line:
03:19:39 [2020-09-24T07:19:39.011Z] 	[/opt/tools/java/openjdk/jdk-11/11.0.2+9/bin/java, -Dosgi.noShutdown=false, -Dosgi.os=linux, -Dosgi.ws=gtk, -Dosgi.arch=x86_64, -Dosgi.clean=true, -jar, /home/jenkins/.m2/repository/p2/osgi/bundle/org.eclipse.equinox.launcher/1.5.800.v20200727-1323/org.eclipse.equinox.launcher-1.5.800.v20200727-1323.jar, -data, /home/jenkins/agent/workspace/ease.verify.core.gerrit/tests/org.eclipse.ease.lang.javascript.test/target/work/data, -install, /home/jenkins/agent/workspace/ease.verify.core.gerrit/tests/org.eclipse.ease.lang.javascript.test/target/work, -configuration, /home/jenkins/agent/workspace/ease.verify.core.gerrit/tests/org.eclipse.ease.lang.javascript.test/target/work/configuration, -application, org.eclipse.tycho.surefire.osgibooter.headlesstest, -testproperties, /home/jenkins/agent/workspace/ease.verify.core.gerrit/tests/org.eclipse.ease.lang.javascript.test/target/surefire.properties]
03:19:39 [2020-09-24T07:19:39.011Z] Picked up JAVA_TOOL_OPTIONS: -Dmaven.ext.class.path="/home/jenkins/agent/workspace/ease.verify.core.gerrit@tmp/withMaven2474cf29/pipeline-maven-spy.jar" -Dorg.jenkinsci.plugins.pipeline.maven.reportsFolder="/home/jenkins/agent/workspace/ease.verify.core.gerrit@tmp/withMaven2474cf29" 
03:19:40 [2020-09-24T07:19:40.931Z] Running org.eclipse.ease.lang.javascript.JavaScriptCompletionContextTest
03:19:40 [2020-09-24T07:19:40.932Z] Tests run: 8, Failures: 0, Errors: 0, Skipped: 0, Time elapsed: 0.257 s - in org.eclipse.ease.lang.javascript.JavaScriptCompletionContextTest
03:19:40 [2020-09-24T07:19:40.932Z] verifyStaticClassTypes(org.eclipse.ease.lang.javascript.JavaScriptCompletionContextTest)  Time elapsed: 0.005 s
03:19:40 [2020-09-24T07:19:40.932Z] verifyClassInstanceTypes(org.eclipse.ease.lang.javascript.JavaScriptCompletionContextTest)  Time elapsed: 0.005 s
03:19:40 [2020-09-24T07:19:40.932Z] verifyTypesForScriptEngine(org.eclipse.ease.lang.javascript.JavaScriptCompletionContextTest)  Time elapsed: 0.097 s
03:19:40 [2020-09-24T07:19:40.932Z] verifyPackageTypes(org.eclipse.ease.lang.javascript.JavaScriptCompletionContextTest)  Time elapsed: 0.001 s
03:19:40 [2020-09-24T07:19:40.932Z] definedVariableTypes(org.eclipse.ease.lang.javascript.JavaScriptCompletionContextTest)  Time elapsed: 0.001 s
03:19:40 [2020-09-24T07:19:40.932Z] verifyStringLiteralTypes(org.eclipse.ease.lang.javascript.JavaScriptCompletionContextTest)  Time elapsed: 0 s
03:19:40 [2020-09-24T07:19:40.932Z] verifyUnknownTypes(org.eclipse.ease.lang.javascript.JavaScriptCompletionContextTest)  Time elapsed: 0 s
03:19:40 [2020-09-24T07:19:40.932Z] verifyNoneTypes(org.eclipse.ease.lang.javascript.JavaScriptCompletionContextTest)  Time elapsed: 0 s
03:19:40 [2020-09-24T07:19:40.932Z] Running org.eclipse.ease.lang.javascript.JavaScriptCodeFactoryTest
03:19:40 [2020-09-24T07:19:40.932Z] Tests run: 1, Failures: 0, Errors: 0, Skipped: 0, Time elapsed: 0.002 s - in org.eclipse.ease.lang.javascript.JavaScriptCodeFactoryTest
03:19:40 [2020-09-24T07:19:40.932Z] testCommentCreator(org.eclipse.ease.lang.javascript.JavaScriptCodeFactoryTest)  Time elapsed: 0.001 s
03:19:40 [2020-09-24T07:19:40.932Z] 
03:19:40 [2020-09-24T07:19:40.932Z] Results:
03:19:40 [2020-09-24T07:19:40.932Z] 
03:19:40 [2020-09-24T07:19:40.932Z] Tests run: 9, Failures: 0, Errors: 0, Skipped: 0
03:19:40 [2020-09-24T07:19:40.932Z] 
03:19:41 [2020-09-24T07:19:41.493Z] [INFO] All tests passed!
03:19:41 [2020-09-24T07:19:41.493Z] [INFO] 
03:19:41 [2020-09-24T07:19:41.493Z] [INFO] ---------< org.eclipse.ease:org.eclipse.ease.lang.python.test >---------
03:19:41 [2020-09-24T07:19:41.493Z] [INFO] Building org.eclipse.ease.lang.python.test 0.8.0-SNAPSHOT        [42/48]
03:19:41 [2020-09-24T07:19:41.493Z] [INFO] ------------------------[ eclipse-test-plugin ]-------------------------
03:19:41 [2020-09-24T07:19:41.493Z] [INFO] 
03:19:41 [2020-09-24T07:19:41.493Z] [INFO] --- maven-clean-plugin:2.5:clean (default-clean) @ org.eclipse.ease.lang.python.test ---
03:19:41 [2020-09-24T07:19:41.493Z] [INFO] 
03:19:41 [2020-09-24T07:19:41.493Z] [INFO] --- tycho-packaging-plugin:1.5.0:build-qualifier (default-build-qualifier) @ org.eclipse.ease.lang.python.test ---
03:19:41 [2020-09-24T07:19:41.493Z] [INFO] The project's OSGi version is 0.8.0.I201910171213
03:19:41 [2020-09-24T07:19:41.493Z] [INFO] 
03:19:41 [2020-09-24T07:19:41.493Z] [INFO] --- tycho-packaging-plugin:1.5.0:validate-id (default-validate-id) @ org.eclipse.ease.lang.python.test ---
03:19:41 [2020-09-24T07:19:41.493Z] [INFO] 
03:19:41 [2020-09-24T07:19:41.493Z] [INFO] --- tycho-packaging-plugin:1.5.0:validate-version (default-validate-version) @ org.eclipse.ease.lang.python.test ---
03:19:41 [2020-09-24T07:19:41.493Z] [INFO] 
03:19:41 [2020-09-24T07:19:41.493Z] [INFO] >>> maven-javadoc-plugin:2.9.1:javadoc (build-docs) > generate-sources @ org.eclipse.ease.lang.python.test >>>
03:19:41 [2020-09-24T07:19:41.493Z] [INFO] 
03:19:41 [2020-09-24T07:19:41.493Z] [INFO] --- tycho-packaging-plugin:1.5.0:build-qualifier (default-build-qualifier) @ org.eclipse.ease.lang.python.test ---
03:19:41 [2020-09-24T07:19:41.493Z] [INFO] The project's OSGi version is 0.8.0.I201910171213
03:19:41 [2020-09-24T07:19:41.493Z] [INFO] 
03:19:41 [2020-09-24T07:19:41.493Z] [INFO] --- tycho-packaging-plugin:1.5.0:validate-id (default-validate-id) @ org.eclipse.ease.lang.python.test ---
03:19:41 [2020-09-24T07:19:41.493Z] [INFO] 
03:19:41 [2020-09-24T07:19:41.493Z] [INFO] --- tycho-packaging-plugin:1.5.0:validate-version (default-validate-version) @ org.eclipse.ease.lang.python.test ---
03:19:41 [2020-09-24T07:19:41.493Z] [INFO] 
03:19:41 [2020-09-24T07:19:41.493Z] [INFO] <<< maven-javadoc-plugin:2.9.1:javadoc (build-docs) < generate-sources @ org.eclipse.ease.lang.python.test <<<
03:19:41 [2020-09-24T07:19:41.493Z] [INFO] 
03:19:41 [2020-09-24T07:19:41.493Z] [INFO] 
03:19:41 [2020-09-24T07:19:41.493Z] [INFO] --- maven-javadoc-plugin:2.9.1:javadoc (build-docs) @ org.eclipse.ease.lang.python.test ---
03:19:41 [2020-09-24T07:19:41.493Z] [ERROR] Error fetching link: http://help.eclipse.org/oxygen/topic/org.eclipse.platform.doc.isv/reference/api/package-list. Ignored it.
03:19:42 [2020-09-24T07:19:42.857Z] [INFO] 
03:19:42 [2020-09-24T07:19:42.857Z] Loading source files for package org.eclipse.ease.lang.python...
03:19:42 [2020-09-24T07:19:42.857Z] Constructing Javadoc information...
03:19:42 [2020-09-24T07:19:42.857Z] WARNING: Cannot open location "/home/jenkins/agent/workspace/ease.verify.core.gerrit/tests/org.eclipse.ease.lang.python.test/target/javadoc-bundle-options/package-list"
03:19:42 [2020-09-24T07:19:42.857Z] No plugin definition found, skipping
03:19:42 [2020-09-24T07:19:42.857Z] No plugin definition found, skipping
03:19:42 [2020-09-24T07:19:42.857Z] [WARNING] Javadoc Warnings
03:19:42 [2020-09-24T07:19:42.857Z] [WARNING] Picked up JAVA_TOOL_OPTIONS: -Dmaven.ext.class.path="/home/jenkins/agent/workspace/ease.verify.core.gerrit@tmp/withMaven2474cf29/pipeline-maven-spy.jar" -Dorg.jenkinsci.plugins.pipeline.maven.reportsFolder="/home/jenkins/agent/workspace/ease.verify.core.gerrit@tmp/withMaven2474cf29"
03:19:42 [2020-09-24T07:19:42.857Z] [WARNING] javadoc: warning - The old Doclet and Taglet APIs in the packages
03:19:42 [2020-09-24T07:19:42.857Z] [WARNING] com.sun.javadoc, com.sun.tools.doclets and their implementations
03:19:42 [2020-09-24T07:19:42.857Z] [WARNING] are planned to be removed in a future JDK release. These
03:19:42 [2020-09-24T07:19:42.857Z] [WARNING] components have been superseded by the new APIs in jdk.javadoc.doclet.
03:19:42 [2020-09-24T07:19:42.857Z] [WARNING] Users are strongly recommended to migrate to the new APIs.
03:19:42 [2020-09-24T07:19:42.857Z] [INFO] 
03:19:42 [2020-09-24T07:19:42.857Z] [INFO] --- build-helper-maven-plugin:1.9.1:add-resource (add_help) @ org.eclipse.ease.lang.python.test ---
03:19:42 [2020-09-24T07:19:42.857Z] [INFO] 
03:19:42 [2020-09-24T07:19:42.857Z] [INFO] --- maven-resources-plugin:2.4.3:resources (default-resources) @ org.eclipse.ease.lang.python.test ---
03:19:42 [2020-09-24T07:19:42.857Z] [INFO] Using 'UTF-8' encoding to copy filtered resources.
03:19:42 [2020-09-24T07:19:42.857Z] [INFO] skip non existing resourceDirectory /home/jenkins/agent/workspace/ease.verify.core.gerrit/tests/org.eclipse.ease.lang.python.test/src/main/resources
03:19:42 [2020-09-24T07:19:42.857Z] [INFO] skip non existing resourceDirectory /home/jenkins/agent/workspace/ease.verify.core.gerrit/tests/org.eclipse.ease.lang.python.test/help
03:19:42 [2020-09-24T07:19:42.857Z] [INFO] 
03:19:42 [2020-09-24T07:19:42.857Z] [INFO] --- tycho-compiler-plugin:1.5.0:compile (default-compile) @ org.eclipse.ease.lang.python.test ---
03:19:42 [2020-09-24T07:19:42.858Z] [INFO] Compiling 1 source file to /home/jenkins/agent/workspace/ease.verify.core.gerrit/tests/org.eclipse.ease.lang.python.test/target/classes
03:19:42 [2020-09-24T07:19:42.858Z] [INFO] 
03:19:42 [2020-09-24T07:19:42.858Z] [INFO] --- maven-resources-plugin:2.4.3:testResources (default-testResources) @ org.eclipse.ease.lang.python.test ---
03:19:42 [2020-09-24T07:19:42.858Z] [INFO] Using 'UTF-8' encoding to copy filtered resources.
03:19:42 [2020-09-24T07:19:42.858Z] [INFO] skip non existing resourceDirectory /home/jenkins/agent/workspace/ease.verify.core.gerrit/tests/org.eclipse.ease.lang.python.test/src/test/resources
03:19:42 [2020-09-24T07:19:42.858Z] [INFO] 
03:19:42 [2020-09-24T07:19:42.858Z] [INFO] --- tycho-source-plugin:1.5.0:plugin-source (plugin-source) @ org.eclipse.ease.lang.python.test ---
03:19:42 [2020-09-24T07:19:42.858Z] [WARNING] Bundle-Vendor header not found in /home/jenkins/agent/workspace/ease.verify.core.gerrit/tests/org.eclipse.ease.lang.python.test/META-INF/MANIFEST.MF, fallback to 'unknown' for source bundle
03:19:42 [2020-09-24T07:19:42.858Z] [INFO] Building jar: /home/jenkins/agent/workspace/ease.verify.core.gerrit/tests/org.eclipse.ease.lang.python.test/target/org.eclipse.ease.lang.python.test-0.8.0-SNAPSHOT-sources.jar
03:19:42 [2020-09-24T07:19:42.858Z] [INFO] 
03:19:42 [2020-09-24T07:19:42.858Z] [INFO] --- target-platform-configuration:1.5.0:target-platform (default-target-platform) @ org.eclipse.ease.lang.python.test ---
03:19:42 [2020-09-24T07:19:42.858Z] [INFO] 
03:19:42 [2020-09-24T07:19:42.858Z] [INFO] --- tycho-packaging-plugin:1.5.0:package-plugin (default-package-plugin) @ org.eclipse.ease.lang.python.test ---
03:19:42 [2020-09-24T07:19:42.858Z] [INFO] Building jar: /home/jenkins/agent/workspace/ease.verify.core.gerrit/tests/org.eclipse.ease.lang.python.test/target/org.eclipse.ease.lang.python.test-0.8.0-SNAPSHOT.jar
03:19:42 [2020-09-24T07:19:42.858Z] [INFO] 
03:19:42 [2020-09-24T07:19:42.858Z] [INFO] --- tycho-p2-plugin:1.5.0:p2-metadata-default (default-p2-metadata-default) @ org.eclipse.ease.lang.python.test ---
03:19:42 [2020-09-24T07:19:42.858Z] [INFO] 
03:19:42 [2020-09-24T07:19:42.858Z] [INFO] --- tycho-source-feature-plugin:1.5.0:source-feature (source-feature) @ org.eclipse.ease.lang.python.test ---
03:19:42 [2020-09-24T07:19:42.858Z] [INFO] 
03:19:42 [2020-09-24T07:19:42.858Z] [INFO] --- tycho-p2-plugin:1.5.0:p2-metadata (attached-p2-metadata) @ org.eclipse.ease.lang.python.test ---
03:19:42 [2020-09-24T07:19:42.858Z] [INFO] 
03:19:42 [2020-09-24T07:19:42.858Z] [INFO] --- tycho-surefire-plugin:1.5.0:test (default-test) @ org.eclipse.ease.lang.python.test ---
03:19:43 [2020-09-24T07:19:43.113Z] [INFO] Expected eclipse log file: /home/jenkins/agent/workspace/ease.verify.core.gerrit/tests/org.eclipse.ease.lang.python.test/target/work/data/.metadata/.log
03:19:43 [2020-09-24T07:19:43.113Z] [INFO] Command line:
03:19:43 [2020-09-24T07:19:43.113Z] 	[/opt/tools/java/openjdk/jdk-11/11.0.2+9/bin/java, -Dosgi.noShutdown=false, -Dosgi.os=linux, -Dosgi.ws=gtk, -Dosgi.arch=x86_64, -Dosgi.clean=true, -jar, /home/jenkins/.m2/repository/p2/osgi/bundle/org.eclipse.equinox.launcher/1.5.800.v20200727-1323/org.eclipse.equinox.launcher-1.5.800.v20200727-1323.jar, -data, /home/jenkins/agent/workspace/ease.verify.core.gerrit/tests/org.eclipse.ease.lang.python.test/target/work/data, -install, /home/jenkins/agent/workspace/ease.verify.core.gerrit/tests/org.eclipse.ease.lang.python.test/target/work, -configuration, /home/jenkins/agent/workspace/ease.verify.core.gerrit/tests/org.eclipse.ease.lang.python.test/target/work/configuration, -application, org.eclipse.tycho.surefire.osgibooter.headlesstest, -testproperties, /home/jenkins/agent/workspace/ease.verify.core.gerrit/tests/org.eclipse.ease.lang.python.test/target/surefire.properties]
03:19:43 [2020-09-24T07:19:43.113Z] Picked up JAVA_TOOL_OPTIONS: -Dmaven.ext.class.path="/home/jenkins/agent/workspace/ease.verify.core.gerrit@tmp/withMaven2474cf29/pipeline-maven-spy.jar" -Dorg.jenkinsci.plugins.pipeline.maven.reportsFolder="/home/jenkins/agent/workspace/ease.verify.core.gerrit@tmp/withMaven2474cf29" 
03:19:44 [2020-09-24T07:19:44.512Z] Running org.eclipse.ease.lang.python.PythonCodeFactoryTest
03:19:44 [2020-09-24T07:19:44.768Z] Tests run: 1, Failures: 0, Errors: 0, Skipped: 0, Time elapsed: 0.078 s - in org.eclipse.ease.lang.python.PythonCodeFactoryTest
03:19:44 [2020-09-24T07:19:44.768Z] testCommentCreator(org.eclipse.ease.lang.python.PythonCodeFactoryTest)  Time elapsed: 0.003 s
03:19:44 [2020-09-24T07:19:44.768Z] 
03:19:44 [2020-09-24T07:19:44.768Z] Results:
03:19:44 [2020-09-24T07:19:44.768Z] 
03:19:44 [2020-09-24T07:19:44.768Z] Tests run: 1, Failures: 0, Errors: 0, Skipped: 0
03:19:44 [2020-09-24T07:19:44.768Z] 
03:19:45 [2020-09-24T07:19:45.329Z] [INFO] All tests passed!
03:19:45 [2020-09-24T07:19:45.329Z] [INFO] 
03:19:45 [2020-09-24T07:19:45.329Z] [INFO] -----< org.eclipse.ease:org.eclipse.ease.lang.python.jython.test >------
03:19:45 [2020-09-24T07:19:45.329Z] [INFO] Building org.eclipse.ease.lang.python.jython.test 0.8.0-SNAPSHOT [43/48]
03:19:45 [2020-09-24T07:19:45.329Z] [INFO] ------------------------[ eclipse-test-plugin ]-------------------------
03:19:45 [2020-09-24T07:19:45.329Z] [INFO] 
03:19:45 [2020-09-24T07:19:45.329Z] [INFO] --- maven-clean-plugin:2.5:clean (default-clean) @ org.eclipse.ease.lang.python.jython.test ---
03:19:45 [2020-09-24T07:19:45.329Z] [INFO] 
03:19:45 [2020-09-24T07:19:45.329Z] [INFO] --- tycho-packaging-plugin:1.5.0:build-qualifier (default-build-qualifier) @ org.eclipse.ease.lang.python.jython.test ---
03:19:45 [2020-09-24T07:19:45.329Z] [INFO] The project's OSGi version is 0.8.0.I201911291239
03:19:45 [2020-09-24T07:19:45.329Z] [INFO] 
03:19:45 [2020-09-24T07:19:45.329Z] [INFO] --- tycho-packaging-plugin:1.5.0:validate-id (default-validate-id) @ org.eclipse.ease.lang.python.jython.test ---
03:19:45 [2020-09-24T07:19:45.329Z] [INFO] 
03:19:45 [2020-09-24T07:19:45.329Z] [INFO] --- tycho-packaging-plugin:1.5.0:validate-version (default-validate-version) @ org.eclipse.ease.lang.python.jython.test ---
03:19:45 [2020-09-24T07:19:45.329Z] [INFO] 
03:19:45 [2020-09-24T07:19:45.329Z] [INFO] >>> maven-javadoc-plugin:2.9.1:javadoc (build-docs) > generate-sources @ org.eclipse.ease.lang.python.jython.test >>>
03:19:45 [2020-09-24T07:19:45.329Z] [INFO] 
03:19:45 [2020-09-24T07:19:45.329Z] [INFO] --- tycho-packaging-plugin:1.5.0:build-qualifier (default-build-qualifier) @ org.eclipse.ease.lang.python.jython.test ---
03:19:45 [2020-09-24T07:19:45.329Z] [INFO] The project's OSGi version is 0.8.0.I201911291239
03:19:45 [2020-09-24T07:19:45.329Z] [INFO] 
03:19:45 [2020-09-24T07:19:45.329Z] [INFO] --- tycho-packaging-plugin:1.5.0:validate-id (default-validate-id) @ org.eclipse.ease.lang.python.jython.test ---
03:19:45 [2020-09-24T07:19:45.329Z] [INFO] 
03:19:45 [2020-09-24T07:19:45.329Z] [INFO] --- tycho-packaging-plugin:1.5.0:validate-version (default-validate-version) @ org.eclipse.ease.lang.python.jython.test ---
03:19:45 [2020-09-24T07:19:45.329Z] [INFO] 
03:19:45 [2020-09-24T07:19:45.329Z] [INFO] <<< maven-javadoc-plugin:2.9.1:javadoc (build-docs) < generate-sources @ org.eclipse.ease.lang.python.jython.test <<<
03:19:45 [2020-09-24T07:19:45.329Z] [INFO] 
03:19:45 [2020-09-24T07:19:45.329Z] [INFO] 
03:19:45 [2020-09-24T07:19:45.329Z] [INFO] --- maven-javadoc-plugin:2.9.1:javadoc (build-docs) @ org.eclipse.ease.lang.python.jython.test ---
03:19:45 [2020-09-24T07:19:45.585Z] [ERROR] Error fetching link: http://help.eclipse.org/oxygen/topic/org.eclipse.platform.doc.isv/reference/api/package-list. Ignored it.
03:19:46 [2020-09-24T07:19:46.949Z] [INFO] 
03:19:46 [2020-09-24T07:19:46.949Z] Loading source files for package org.eclipse.ease.lang.python.jython.debugger...
03:19:46 [2020-09-24T07:19:46.949Z] Constructing Javadoc information...
03:19:46 [2020-09-24T07:19:46.949Z] WARNING: Cannot open location "/home/jenkins/agent/workspace/ease.verify.core.gerrit/tests/org.eclipse.ease.lang.python.jython.test/target/javadoc-bundle-options/package-list"
03:19:46 [2020-09-24T07:19:46.949Z] No plugin definition found, skipping
03:19:46 [2020-09-24T07:19:46.949Z] No plugin definition found, skipping
03:19:46 [2020-09-24T07:19:46.949Z] [WARNING] Javadoc Warnings
03:19:46 [2020-09-24T07:19:46.949Z] [WARNING] Picked up JAVA_TOOL_OPTIONS: -Dmaven.ext.class.path="/home/jenkins/agent/workspace/ease.verify.core.gerrit@tmp/withMaven2474cf29/pipeline-maven-spy.jar" -Dorg.jenkinsci.plugins.pipeline.maven.reportsFolder="/home/jenkins/agent/workspace/ease.verify.core.gerrit@tmp/withMaven2474cf29"
03:19:46 [2020-09-24T07:19:46.949Z] [WARNING] javadoc: warning - The old Doclet and Taglet APIs in the packages
03:19:46 [2020-09-24T07:19:46.950Z] [WARNING] com.sun.javadoc, com.sun.tools.doclets and their implementations
03:19:46 [2020-09-24T07:19:46.950Z] [WARNING] are planned to be removed in a future JDK release. These
03:19:46 [2020-09-24T07:19:46.950Z] [WARNING] components have been superseded by the new APIs in jdk.javadoc.doclet.
03:19:46 [2020-09-24T07:19:46.950Z] [WARNING] Users are strongly recommended to migrate to the new APIs.
03:19:46 [2020-09-24T07:19:46.950Z] [INFO] 
03:19:46 [2020-09-24T07:19:46.950Z] [INFO] --- build-helper-maven-plugin:1.9.1:add-resource (add_help) @ org.eclipse.ease.lang.python.jython.test ---
03:19:46 [2020-09-24T07:19:46.950Z] [INFO] 
03:19:46 [2020-09-24T07:19:46.950Z] [INFO] --- maven-resources-plugin:2.4.3:resources (default-resources) @ org.eclipse.ease.lang.python.jython.test ---
03:19:46 [2020-09-24T07:19:46.950Z] [INFO] Using 'UTF-8' encoding to copy filtered resources.
03:19:46 [2020-09-24T07:19:46.950Z] [INFO] skip non existing resourceDirectory /home/jenkins/agent/workspace/ease.verify.core.gerrit/tests/org.eclipse.ease.lang.python.jython.test/src/main/resources
03:19:46 [2020-09-24T07:19:46.950Z] [INFO] skip non existing resourceDirectory /home/jenkins/agent/workspace/ease.verify.core.gerrit/tests/org.eclipse.ease.lang.python.jython.test/help
03:19:46 [2020-09-24T07:19:46.950Z] [INFO] 
03:19:46 [2020-09-24T07:19:46.950Z] [INFO] --- tycho-compiler-plugin:1.5.0:compile (default-compile) @ org.eclipse.ease.lang.python.jython.test ---
03:19:46 [2020-09-24T07:19:46.950Z] [INFO] Compiling 1 source file to /home/jenkins/agent/workspace/ease.verify.core.gerrit/tests/org.eclipse.ease.lang.python.jython.test/target/classes
03:19:46 [2020-09-24T07:19:46.950Z] [INFO] 
03:19:46 [2020-09-24T07:19:46.950Z] [INFO] --- maven-resources-plugin:2.4.3:testResources (default-testResources) @ org.eclipse.ease.lang.python.jython.test ---
03:19:46 [2020-09-24T07:19:46.950Z] [INFO] Using 'UTF-8' encoding to copy filtered resources.
03:19:46 [2020-09-24T07:19:46.950Z] [INFO] skip non existing resourceDirectory /home/jenkins/agent/workspace/ease.verify.core.gerrit/tests/org.eclipse.ease.lang.python.jython.test/src/test/resources
03:19:46 [2020-09-24T07:19:46.950Z] [INFO] 
03:19:46 [2020-09-24T07:19:46.950Z] [INFO] --- tycho-source-plugin:1.5.0:plugin-source (plugin-source) @ org.eclipse.ease.lang.python.jython.test ---
03:19:46 [2020-09-24T07:19:46.950Z] [WARNING] Bundle-Vendor header not found in /home/jenkins/agent/workspace/ease.verify.core.gerrit/tests/org.eclipse.ease.lang.python.jython.test/META-INF/MANIFEST.MF, fallback to 'unknown' for source bundle
03:19:46 [2020-09-24T07:19:46.950Z] [INFO] Building jar: /home/jenkins/agent/workspace/ease.verify.core.gerrit/tests/org.eclipse.ease.lang.python.jython.test/target/org.eclipse.ease.lang.python.jython.test-0.8.0-SNAPSHOT-sources.jar
03:19:46 [2020-09-24T07:19:46.950Z] [INFO] 
03:19:46 [2020-09-24T07:19:46.950Z] [INFO] --- target-platform-configuration:1.5.0:target-platform (default-target-platform) @ org.eclipse.ease.lang.python.jython.test ---
03:19:46 [2020-09-24T07:19:46.950Z] [INFO] 
03:19:46 [2020-09-24T07:19:46.950Z] [INFO] --- tycho-packaging-plugin:1.5.0:package-plugin (default-package-plugin) @ org.eclipse.ease.lang.python.jython.test ---
03:19:46 [2020-09-24T07:19:46.950Z] [INFO] Building jar: /home/jenkins/agent/workspace/ease.verify.core.gerrit/tests/org.eclipse.ease.lang.python.jython.test/target/org.eclipse.ease.lang.python.jython.test-0.8.0-SNAPSHOT.jar
03:19:46 [2020-09-24T07:19:46.950Z] [INFO] 
03:19:46 [2020-09-24T07:19:46.950Z] [INFO] --- tycho-p2-plugin:1.5.0:p2-metadata-default (default-p2-metadata-default) @ org.eclipse.ease.lang.python.jython.test ---
03:19:46 [2020-09-24T07:19:46.950Z] [INFO] 
03:19:46 [2020-09-24T07:19:46.950Z] [INFO] --- tycho-source-feature-plugin:1.5.0:source-feature (source-feature) @ org.eclipse.ease.lang.python.jython.test ---
03:19:46 [2020-09-24T07:19:46.950Z] [INFO] 
03:19:46 [2020-09-24T07:19:46.950Z] [INFO] --- tycho-p2-plugin:1.5.0:p2-metadata (attached-p2-metadata) @ org.eclipse.ease.lang.python.jython.test ---
03:19:46 [2020-09-24T07:19:46.950Z] [INFO] 
03:19:46 [2020-09-24T07:19:46.950Z] [INFO] --- tycho-surefire-plugin:1.5.0:test (default-test) @ org.eclipse.ease.lang.python.jython.test ---
03:19:47 [2020-09-24T07:19:47.512Z] [INFO] Expected eclipse log file: /home/jenkins/agent/workspace/ease.verify.core.gerrit/tests/org.eclipse.ease.lang.python.jython.test/target/work/data/.metadata/.log
03:19:47 [2020-09-24T07:19:47.512Z] [INFO] Command line:
03:19:47 [2020-09-24T07:19:47.512Z] 	[/opt/tools/java/openjdk/jdk-11/11.0.2+9/bin/java, -Dosgi.noShutdown=false, -Dosgi.os=linux, -Dosgi.ws=gtk, -Dosgi.arch=x86_64, -Dosgi.clean=true, -jar, /home/jenkins/.m2/repository/p2/osgi/bundle/org.eclipse.equinox.launcher/1.5.800.v20200727-1323/org.eclipse.equinox.launcher-1.5.800.v20200727-1323.jar, -data, /home/jenkins/agent/workspace/ease.verify.core.gerrit/tests/org.eclipse.ease.lang.python.jython.test/target/work/data, -install, /home/jenkins/agent/workspace/ease.verify.core.gerrit/tests/org.eclipse.ease.lang.python.jython.test/target/work, -configuration, /home/jenkins/agent/workspace/ease.verify.core.gerrit/tests/org.eclipse.ease.lang.python.jython.test/target/work/configuration, -application, org.eclipse.tycho.surefire.osgibooter.headlesstest, -testproperties, /home/jenkins/agent/workspace/ease.verify.core.gerrit/tests/org.eclipse.ease.lang.python.jython.test/target/surefire.properties]
03:19:47 [2020-09-24T07:19:47.512Z] Picked up JAVA_TOOL_OPTIONS: -Dmaven.ext.class.path="/home/jenkins/agent/workspace/ease.verify.core.gerrit@tmp/withMaven2474cf29/pipeline-maven-spy.jar" -Dorg.jenkinsci.plugins.pipeline.maven.reportsFolder="/home/jenkins/agent/workspace/ease.verify.core.gerrit@tmp/withMaven2474cf29" 
03:19:48 [2020-09-24T07:19:48.947Z] WARNING: An illegal reflective access operation has occurred
03:19:48 [2020-09-24T07:19:48.947Z] WARNING: Illegal reflective access by org.python.core.PySystemState (file:/home/jenkins/agent/workspace/ease.verify.core.gerrit/tests/org.eclipse.ease.lang.python.jython.test/target/work/plugins/org.jython_2.7.0.I201609090924/jython.jar) to method java.io.Console.encoding()
03:19:48 [2020-09-24T07:19:48.947Z] WARNING: Please consider reporting this to the maintainers of org.python.core.PySystemState
03:19:48 [2020-09-24T07:19:48.947Z] WARNING: Use --illegal-access=warn to enable warnings of further illegal reflective access operations
03:19:48 [2020-09-24T07:19:48.947Z] WARNING: All illegal access operations will be denied in a future release
03:19:49 [2020-09-24T07:19:49.210Z] Running org.eclipse.ease.lang.python.jython.debugger.JythonDebugTest
03:19:51 [2020-09-24T07:19:51.099Z] Start of script
03:19:51 [2020-09-24T07:19:51.099Z] include file start
03:19:51 [2020-09-24T07:19:51.099Z] include file processed
03:19:51 [2020-09-24T07:19:51.099Z] Result of testMethod = 5
03:19:51 [2020-09-24T07:19:51.099Z] End of script
03:19:51 [2020-09-24T07:19:51.099Z] Start of script
03:19:51 [2020-09-24T07:19:51.099Z] include file start
03:19:51 [2020-09-24T07:19:51.099Z] include file processed
03:19:51 [2020-09-24T07:19:51.099Z] Result of testMethod = 5
03:19:51 [2020-09-24T07:19:51.099Z] End of script
03:19:51 [2020-09-24T07:19:51.099Z] Start of script
03:19:51 [2020-09-24T07:19:51.099Z] include file start
03:19:51 [2020-09-24T07:19:51.099Z] include file processed
03:19:51 [2020-09-24T07:19:51.099Z] Result of testMethod = 5
03:19:51 [2020-09-24T07:19:51.354Z] Traceback (most recent call last):
03:19:51 [2020-09-24T07:19:51.354Z]   File "(none)", line 184, in run
03:19:51 [2020-09-24T07:19:51.354Z]   File "__ref_L/Debug Test/Main.py_hdigxphmdy", line 23, in <module>
03:19:51 [2020-09-24T07:19:51.354Z]   File "(none)", line 161, in trace_dispatch
03:19:51 [2020-09-24T07:19:51.354Z] org.eclipse.ease.ExitException: 
03:19:51 [2020-09-24T07:19:51.354Z] 
03:19:51 [2020-09-24T07:19:51.354Z] org.eclipse.ease.ExitException: org.eclipse.ease.ExitException: 
03:19:51 [2020-09-24T07:19:51.354Z] Start of script
03:19:51 [2020-09-24T07:19:51.354Z] include file start
03:19:51 [2020-09-24T07:19:51.354Z] include file processed
03:19:51 [2020-09-24T07:19:51.610Z] Result of testMethod = 5
03:19:51 [2020-09-24T07:19:51.610Z] End of script
03:19:51 [2020-09-24T07:19:51.865Z] Start of script
03:19:51 [2020-09-24T07:19:51.865Z] include file start
03:19:51 [2020-09-24T07:19:51.865Z] include file processed
03:19:51 [2020-09-24T07:19:51.865Z] Result of testMethod = 5
03:19:51 [2020-09-24T07:19:51.865Z] End of script
03:19:52 [2020-09-24T07:19:52.120Z] Start of script
03:19:52 [2020-09-24T07:19:52.120Z] include file start
03:19:52 [2020-09-24T07:19:52.120Z] include file processed
03:19:52 [2020-09-24T07:19:52.120Z] Result of testMethod = 5
03:19:52 [2020-09-24T07:19:52.120Z] End of script
03:19:52 [2020-09-24T07:19:52.376Z] Start of script
03:19:52 [2020-09-24T07:19:52.376Z] include file start
03:19:52 [2020-09-24T07:19:52.376Z] include file processed
03:19:52 [2020-09-24T07:19:52.376Z] Result of testMethod = 5
03:19:52 [2020-09-24T07:19:52.631Z] Traceback (most recent call last):
03:19:52 [2020-09-24T07:19:52.631Z]   File "(none)", line 184, in run
03:19:52 [2020-09-24T07:19:52.631Z]   File "__ref_L/Debug Test/Main.py_tlmgvigzbk", line 23, in <module>
03:19:52 [2020-09-24T07:19:52.631Z]   File "(none)", line 161, in trace_dispatch
03:19:52 [2020-09-24T07:19:52.631Z] org.eclipse.ease.ExitException: 
03:19:52 [2020-09-24T07:19:52.631Z] 
03:19:52 [2020-09-24T07:19:52.631Z] org.eclipse.ease.ExitException: org.eclipse.ease.ExitException: 
03:19:52 [2020-09-24T07:19:52.631Z] Start of script
03:19:52 [2020-09-24T07:19:52.631Z] include file start
03:19:52 [2020-09-24T07:19:52.631Z] include file processed
03:19:52 [2020-09-24T07:19:52.887Z] Result of testMethod = 5
03:19:52 [2020-09-24T07:19:52.887Z] End of script
03:19:52 [2020-09-24T07:19:52.887Z] Start of script
03:19:52 [2020-09-24T07:19:52.887Z] include file start
03:19:52 [2020-09-24T07:19:52.887Z] include file processed
03:19:52 [2020-09-24T07:19:52.887Z] Result of testMethod = 5
03:19:53 [2020-09-24T07:19:53.142Z] End of script
03:19:53 [2020-09-24T07:19:53.142Z] Start of script
03:19:53 [2020-09-24T07:19:53.142Z] include file start
03:19:53 [2020-09-24T07:19:53.142Z] include file processed
03:19:53 [2020-09-24T07:19:53.705Z] Traceback (most recent call last):
03:19:53 [2020-09-24T07:19:53.705Z]   File "(none)", line 184, in run
03:19:53 [2020-09-24T07:19:53.705Z]   File "__ref_L/Debug Test/Main.py_xqxzuzkoom", line 22, in <module>
03:19:53 [2020-09-24T07:19:53.705Z]   File "(none)", line 161, in trace_dispatch
03:19:53 [2020-09-24T07:19:53.705Z] org.eclipse.ease.ExitException: 
03:19:53 [2020-09-24T07:19:53.705Z] 
03:19:53 [2020-09-24T07:19:53.705Z] org.eclipse.ease.ExitException: org.eclipse.ease.ExitException: 
03:19:53 [2020-09-24T07:19:53.705Z] Start of script
03:19:53 [2020-09-24T07:19:53.705Z] include file start
03:19:53 [2020-09-24T07:19:53.705Z] include file processed
03:19:53 [2020-09-24T07:19:53.705Z] Result of testMethod = 5
03:19:53 [2020-09-24T07:19:53.705Z] End of script
03:19:53 [2020-09-24T07:19:53.960Z] Start of script
03:19:53 [2020-09-24T07:19:53.960Z] include file start
03:19:53 [2020-09-24T07:19:53.960Z] include file processed
03:19:53 [2020-09-24T07:19:53.960Z] Result of testMethod = 5
03:19:53 [2020-09-24T07:19:53.960Z] End of script
03:19:54 [2020-09-24T07:19:54.216Z] Traceback (most recent call last):
03:19:54 [2020-09-24T07:19:54.216Z]   File "(none)", line 184, in run
03:19:54 [2020-09-24T07:19:54.216Z]   File "__ref_L/Debug Test/Main.py_iugtaozoiw", line 1, in <module>
03:19:54 [2020-09-24T07:19:54.216Z]   File "(none)", line 161, in trace_dispatch
03:19:54 [2020-09-24T07:19:54.216Z] org.eclipse.ease.ExitException: 
03:19:54 [2020-09-24T07:19:54.216Z] 
03:19:54 [2020-09-24T07:19:54.216Z] org.eclipse.ease.ExitException: org.eclipse.ease.ExitException: 
03:19:54 [2020-09-24T07:19:54.473Z] Start of script
03:19:54 [2020-09-24T07:19:54.473Z] include file start
03:19:54 [2020-09-24T07:19:54.473Z] include file processed
03:19:54 [2020-09-24T07:19:54.473Z] Result of testMethod = 5
03:19:54 [2020-09-24T07:19:54.473Z] End of script
03:19:54 [2020-09-24T07:19:54.728Z] Start of script
03:19:54 [2020-09-24T07:19:54.729Z] include file start
03:19:54 [2020-09-24T07:19:54.729Z] include file processed
03:19:54 [2020-09-24T07:19:54.729Z] Result of testMethod = 5
03:19:54 [2020-09-24T07:19:54.729Z] End of script
03:19:54 [2020-09-24T07:19:54.984Z] Start of script
03:19:54 [2020-09-24T07:19:54.984Z] include file start
03:19:54 [2020-09-24T07:19:54.984Z] include file processed
03:19:54 [2020-09-24T07:19:54.984Z] Result of testMethod = 5
03:19:55 [2020-09-24T07:19:55.241Z] Traceback (most recent call last):
03:19:55 [2020-09-24T07:19:55.241Z]   File "(none)", line 184, in run
03:19:55 [2020-09-24T07:19:55.241Z]   File "__ref_L/Debug Test/Main.py_dhpebkzgvp", line 23, in <module>
03:19:55 [2020-09-24T07:19:55.241Z]   File "(none)", line 161, in trace_dispatch
03:19:55 [2020-09-24T07:19:55.241Z] org.eclipse.ease.ExitException: 
03:19:55 [2020-09-24T07:19:55.241Z] 
03:19:55 [2020-09-24T07:19:55.241Z] org.eclipse.ease.ExitException: org.eclipse.ease.ExitException: 
03:19:55 [2020-09-24T07:19:55.241Z] Start of script
03:19:55 [2020-09-24T07:19:55.241Z] include file start
03:19:55 [2020-09-24T07:19:55.241Z] include file processed
03:19:55 [2020-09-24T07:19:55.496Z] Result of testMethod = 5
03:19:55 [2020-09-24T07:19:55.496Z] End of script
03:19:55 [2020-09-24T07:19:55.752Z] Traceback (most recent call last):
03:19:55 [2020-09-24T07:19:55.752Z]   File "(none)", line 184, in run
03:19:55 [2020-09-24T07:19:55.752Z]   File "__ref_L/Debug Test/Main.py_rmcerzuktx", line 1, in <module>
03:19:55 [2020-09-24T07:19:55.752Z]   File "(none)", line 161, in trace_dispatch
03:19:55 [2020-09-24T07:19:55.752Z] org.eclipse.ease.ExitException: 
03:19:55 [2020-09-24T07:19:55.752Z] 
03:19:55 [2020-09-24T07:19:55.752Z] org.eclipse.ease.ExitException: org.eclipse.ease.ExitException: 
03:19:55 [2020-09-24T07:19:55.752Z] Start of script
03:19:55 [2020-09-24T07:19:55.752Z] include file start
03:19:55 [2020-09-24T07:19:55.752Z] include file processed
03:19:55 [2020-09-24T07:19:55.752Z] Result of testMethod = 5
03:19:55 [2020-09-24T07:19:55.752Z] End of script
03:19:56 [2020-09-24T07:19:56.009Z] Start of script
03:19:56 [2020-09-24T07:19:56.009Z] include file start
03:19:56 [2020-09-24T07:19:56.009Z] include file processed
03:19:56 [2020-09-24T07:19:56.264Z] Result of testMethod = 5
03:19:56 [2020-09-24T07:19:56.264Z] End of script
03:19:56 [2020-09-24T07:19:56.264Z] Traceback (most recent call last):
03:19:56 [2020-09-24T07:19:56.264Z]   File "(none)", line 184, in run
03:19:56 [2020-09-24T07:19:56.264Z]   File "__ref_L/Debug Test/Main.py_myhxphgxod", line 1, in <module>
03:19:56 [2020-09-24T07:19:56.264Z]   File "(none)", line 161, in trace_dispatch
03:19:56 [2020-09-24T07:19:56.265Z] org.eclipse.ease.ExitException: 
03:19:56 [2020-09-24T07:19:56.265Z] 
03:19:56 [2020-09-24T07:19:56.265Z] org.eclipse.ease.ExitException: org.eclipse.ease.ExitException: 
03:19:56 [2020-09-24T07:19:56.520Z] Start of script
03:19:56 [2020-09-24T07:19:56.520Z] include file start
03:19:56 [2020-09-24T07:19:56.521Z] include file processed
03:19:56 [2020-09-24T07:19:56.776Z] Result of testMethod = 5
03:19:56 [2020-09-24T07:19:56.776Z] End of script
03:19:56 [2020-09-24T07:19:56.776Z] Start of script
03:19:56 [2020-09-24T07:19:56.776Z] include file start
03:19:56 [2020-09-24T07:19:56.777Z] include file processed
03:19:56 [2020-09-24T07:19:56.777Z] Result of testMethod = 5
03:19:57 [2020-09-24T07:19:57.032Z] Traceback (most recent call last):
03:19:57 [2020-09-24T07:19:57.032Z]   File "(none)", line 184, in run
03:19:57 [2020-09-24T07:19:57.032Z]   File "__ref_L/Debug Test/Main.py_tzfkgsibtt", line 23, in <module>
03:19:57 [2020-09-24T07:19:57.032Z]   File "(none)", line 161, in trace_dispatch
03:19:57 [2020-09-24T07:19:57.032Z] org.eclipse.ease.ExitException: 
03:19:57 [2020-09-24T07:19:57.032Z] 
03:19:57 [2020-09-24T07:19:57.032Z] org.eclipse.ease.ExitException: org.eclipse.ease.ExitException: 
03:19:57 [2020-09-24T07:19:57.289Z] Start of script
03:19:57 [2020-09-24T07:19:57.289Z] include file start
03:19:57 [2020-09-24T07:19:57.289Z] include file processed
03:19:57 [2020-09-24T07:19:57.289Z] Result of testMethod = 5
03:19:57 [2020-09-24T07:19:57.289Z] End of script
03:19:57 [2020-09-24T07:19:57.289Z] Start of script
03:19:57 [2020-09-24T07:19:57.289Z] include file start
03:19:57 [2020-09-24T07:19:57.289Z] include file processed
03:19:57 [2020-09-24T07:19:57.545Z] Result of testMethod = 5
03:19:57 [2020-09-24T07:19:57.545Z] End of script
03:19:57 [2020-09-24T07:19:57.545Z] Start of script
03:19:57 [2020-09-24T07:19:57.545Z] include file start
03:19:57 [2020-09-24T07:19:57.545Z] include file processed
03:19:57 [2020-09-24T07:19:57.545Z] Result of testMethod = 5
03:19:57 [2020-09-24T07:19:57.545Z] End of script
03:19:57 [2020-09-24T07:19:57.800Z] Start of script
03:19:57 [2020-09-24T07:19:57.800Z] include file start
03:19:57 [2020-09-24T07:19:57.800Z] include file processed
03:19:57 [2020-09-24T07:19:57.800Z] Result of testMethod = 5
03:19:57 [2020-09-24T07:19:57.800Z] End of script
03:19:58 [2020-09-24T07:19:58.056Z] Start of script
03:19:58 [2020-09-24T07:19:58.056Z] include file start
03:19:58 [2020-09-24T07:19:58.056Z] include file processed
03:19:58 [2020-09-24T07:19:58.313Z] Traceback (most recent call last):
03:19:58 [2020-09-24T07:19:58.313Z]   File "(none)", line 184, in run
03:19:58 [2020-09-24T07:19:58.313Z]   File "__ref_L/Debug Test/Main.py_yohjvyjkub", line 21, in <module>
03:19:58 [2020-09-24T07:19:58.313Z]   File "__ref_L/Debug Test/Main.py_yohjvyjkub", line 18, in testMethod
03:19:58 [2020-09-24T07:19:58.313Z]   File "(none)", line 161, in trace_dispatch
03:19:58 [2020-09-24T07:19:58.313Z] org.eclipse.ease.ExitException: 
03:19:58 [2020-09-24T07:19:58.313Z] 
03:19:58 [2020-09-24T07:19:58.313Z] org.eclipse.ease.ExitException: org.eclipse.ease.ExitException: 
03:19:58 [2020-09-24T07:19:58.313Z] Start of script
03:19:58 [2020-09-24T07:19:58.569Z] include file start
03:19:58 [2020-09-24T07:19:58.569Z] include file processed
03:19:58 [2020-09-24T07:19:58.569Z] Result of testMethod = 5
03:19:58 [2020-09-24T07:19:58.569Z] End of script
03:19:58 [2020-09-24T07:19:58.569Z] Start of script
03:19:58 [2020-09-24T07:19:58.569Z] include file start
03:19:58 [2020-09-24T07:19:58.569Z] include file processed
03:19:58 [2020-09-24T07:19:58.569Z] Result of testMethod = 5
03:19:58 [2020-09-24T07:19:58.824Z] Traceback (most recent call last):
03:19:58 [2020-09-24T07:19:58.824Z]   File "(none)", line 184, in run
03:19:58 [2020-09-24T07:19:58.824Z]   File "__ref_L/Debug Test/Main.py_jyqhqlenxf", line 23, in <module>
03:19:58 [2020-09-24T07:19:58.824Z]   File "(none)", line 161, in trace_dispatch
03:19:58 [2020-09-24T07:19:58.824Z] org.eclipse.ease.ExitException: 
03:19:58 [2020-09-24T07:19:58.824Z] 
03:19:58 [2020-09-24T07:19:58.824Z] org.eclipse.ease.ExitException: org.eclipse.ease.ExitException: 
03:19:58 [2020-09-24T07:19:58.824Z] Start of script
03:19:58 [2020-09-24T07:19:58.824Z] include file start
03:19:58 [2020-09-24T07:19:58.824Z] include file processed
03:19:58 [2020-09-24T07:19:58.824Z] Result of testMethod = 5
03:19:59 [2020-09-24T07:19:59.081Z] End of script
03:19:59 [2020-09-24T07:19:59.081Z] Start of script
03:19:59 [2020-09-24T07:19:59.081Z] include file start
03:19:59 [2020-09-24T07:19:59.081Z] include file processed
03:19:59 [2020-09-24T07:19:59.336Z] Result of testMethod = 5
03:19:59 [2020-09-24T07:19:59.336Z] End of script
03:19:59 [2020-09-24T07:19:59.336Z] Start of script
03:19:59 [2020-09-24T07:19:59.336Z] include file start
03:19:59 [2020-09-24T07:19:59.336Z] include file processed
03:19:59 [2020-09-24T07:19:59.592Z] Result of testMethod = 5
03:19:59 [2020-09-24T07:19:59.592Z] End of script
03:19:59 [2020-09-24T07:19:59.847Z] Start of script
03:19:59 [2020-09-24T07:19:59.847Z] include file start
03:19:59 [2020-09-24T07:19:59.847Z] include file processed
03:19:59 [2020-09-24T07:19:59.847Z] Result of testMethod = 5
03:19:59 [2020-09-24T07:19:59.847Z] End of script
03:19:59 [2020-09-24T07:19:59.847Z] Start of script
03:19:59 [2020-09-24T07:19:59.847Z] include file start
03:19:59 [2020-09-24T07:19:59.847Z] include file processed
03:19:59 [2020-09-24T07:19:59.847Z] Result of testMethod = 5
03:20:00 [2020-09-24T07:20:00.103Z] Traceback (most recent call last):
03:20:00 [2020-09-24T07:20:00.103Z]   File "(none)", line 184, in run
03:20:00 [2020-09-24T07:20:00.103Z]   File "__ref_L/Debug Test/Main.py_kxahqbjbkk", line 23, in <module>
03:20:00 [2020-09-24T07:20:00.103Z]   File "(none)", line 161, in trace_dispatch
03:20:00 [2020-09-24T07:20:00.103Z] org.eclipse.ease.ExitException: 
03:20:00 [2020-09-24T07:20:00.103Z] 
03:20:00 [2020-09-24T07:20:00.103Z] org.eclipse.ease.ExitException: org.eclipse.ease.ExitException: 
03:20:00 [2020-09-24T07:20:00.358Z] Start of script
03:20:00 [2020-09-24T07:20:00.358Z] include file start
03:20:00 [2020-09-24T07:20:00.358Z] include file processed
03:20:00 [2020-09-24T07:20:00.358Z] Result of testMethod = 5
03:20:00 [2020-09-24T07:20:00.358Z] End of script
03:20:00 [2020-09-24T07:20:00.358Z] Start of script
03:20:00 [2020-09-24T07:20:00.359Z] include file start
03:20:00 [2020-09-24T07:20:00.359Z] include file processed
03:20:00 [2020-09-24T07:20:00.359Z] Result of testMethod = 5
03:20:00 [2020-09-24T07:20:00.614Z] Traceback (most recent call last):
03:20:00 [2020-09-24T07:20:00.614Z]   File "(none)", line 184, in run
03:20:00 [2020-09-24T07:20:00.614Z]   File "__ref_L/Debug Test/Main.py_riiqkzxgwv", line 23, in <module>
03:20:00 [2020-09-24T07:20:00.614Z]   File "(none)", line 161, in trace_dispatch
03:20:00 [2020-09-24T07:20:00.614Z] org.eclipse.ease.ExitException: 
03:20:00 [2020-09-24T07:20:00.614Z] 
03:20:00 [2020-09-24T07:20:00.614Z] org.eclipse.ease.ExitException: org.eclipse.ease.ExitException: 
03:20:00 [2020-09-24T07:20:00.870Z] Traceback (most recent call last):
03:20:00 [2020-09-24T07:20:00.870Z]   File "(none)", line 184, in run
03:20:00 [2020-09-24T07:20:00.870Z]   File "__ref_L/Debug Test/Main.py_scmvqyfjzw", line 1, in <module>
03:20:00 [2020-09-24T07:20:00.870Z]   File "(none)", line 161, in trace_dispatch
03:20:00 [2020-09-24T07:20:00.870Z] org.eclipse.ease.ExitException: 
03:20:00 [2020-09-24T07:20:00.870Z] 
03:20:00 [2020-09-24T07:20:00.870Z] org.eclipse.ease.ExitException: org.eclipse.ease.ExitException: 
03:20:01 [2020-09-24T07:20:01.126Z] Start of script
03:20:01 [2020-09-24T07:20:01.126Z] include file start
03:20:01 [2020-09-24T07:20:01.126Z] include file processed
03:20:01 [2020-09-24T07:20:01.126Z] Result of testMethod = 5
03:20:01 [2020-09-24T07:20:01.126Z] End of script
03:20:01 [2020-09-24T07:20:01.126Z] Start of script
03:20:01 [2020-09-24T07:20:01.126Z] include file start
03:20:01 [2020-09-24T07:20:01.126Z] include file processed
03:20:01 [2020-09-24T07:20:01.382Z] Result of testMethod = 5
03:20:01 [2020-09-24T07:20:01.382Z] End of script
03:20:01 [2020-09-24T07:20:01.382Z] Start of script
03:20:01 [2020-09-24T07:20:01.382Z] include file start
03:20:01 [2020-09-24T07:20:01.382Z] include file processed
03:20:01 [2020-09-24T07:20:01.382Z] Result of testMethod = 5
03:20:01 [2020-09-24T07:20:01.639Z] End of script
03:20:01 [2020-09-24T07:20:01.639Z] Tests run: 42, Failures: 0, Errors: 0, Skipped: 0, Time elapsed: 12.51 s - in org.eclipse.ease.lang.python.jython.debugger.JythonDebugTest
03:20:01 [2020-09-24T07:20:01.639Z] disconnectProcessInSuspendedState(org.eclipse.ease.lang.python.jython.debugger.JythonDebugTest)  Time elapsed: 1.687 s
03:20:01 [2020-09-24T07:20:01.639Z] stepReturnIncludeCommand(org.eclipse.ease.lang.python.jython.debugger.JythonDebugTest)  Time elapsed: 0.213 s
03:20:01 [2020-09-24T07:20:01.639Z] arrayVariableSorting(org.eclipse.ease.lang.python.jython.debugger.JythonDebugTest)  Time elapsed: 0.309 s
03:20:01 [2020-09-24T07:20:01.639Z] stepOverOnDebugTarget(org.eclipse.ease.lang.python.jython.debugger.JythonDebugTest)  Time elapsed: 0.312 s
03:20:01 [2020-09-24T07:20:01.639Z] hasDebugTarget(org.eclipse.ease.lang.python.jython.debugger.JythonDebugTest)  Time elapsed: 0.107 s
03:20:01 [2020-09-24T07:20:01.639Z] disconnectThreadInSuspendedState(org.eclipse.ease.lang.python.jython.debugger.JythonDebugTest)  Time elapsed: 0.209 s
03:20:01 [2020-09-24T07:20:01.639Z] stepReturnOnDebugTarget(org.eclipse.ease.lang.python.jython.debugger.JythonDebugTest)  Time elapsed: 0.309 s
03:20:01 [2020-09-24T07:20:01.639Z] nullVariable(org.eclipse.ease.lang.python.jython.debugger.JythonDebugTest)  Time elapsed: 0.308 s
03:20:01 [2020-09-24T07:20:01.639Z] stepOverOnStackFrame(org.eclipse.ease.lang.python.jython.debugger.JythonDebugTest)  Time elapsed: 0.313 s
03:20:01 [2020-09-24T07:20:01.639Z] resumeOnDebugTarget(org.eclipse.ease.lang.python.jython.debugger.JythonDebugTest)  Time elapsed: 0.207 s
03:20:01 [2020-09-24T07:20:01.639Z] modifyVariableKeepingType(org.eclipse.ease.lang.python.jython.debugger.JythonDebugTest)  Time elapsed: 0.507 s
03:20:01 [2020-09-24T07:20:01.639Z] resumeOnLastIncludeLine(org.eclipse.ease.lang.python.jython.debugger.JythonDebugTest)  Time elapsed: 0.209 s
03:20:01 [2020-09-24T07:20:01.639Z] stepReturnOnStackFrame(org.eclipse.ease.lang.python.jython.debugger.JythonDebugTest)  Time elapsed: 0.307 s
03:20:01 [2020-09-24T07:20:01.639Z] terminateStackFrameInSuspendedState(org.eclipse.ease.lang.python.jython.debugger.JythonDebugTest)  Time elapsed: 0.214 s
03:20:01 [2020-09-24T07:20:01.639Z] breakpointLocation(org.eclipse.ease.lang.python.jython.debugger.JythonDebugTest)  Time elapsed: 0.206 s
03:20:01 [2020-09-24T07:20:01.639Z] stepReturnOnThread(org.eclipse.ease.lang.python.jython.debugger.JythonDebugTest)  Time elapsed: 0.308 s
03:20:01 [2020-09-24T07:20:01.639Z] javaClassVariable(org.eclipse.ease.lang.python.jython.debugger.JythonDebugTest)  Time elapsed: 0.308 s
03:20:01 [2020-09-24T07:20:01.639Z] stepIntoOnThread(org.eclipse.ease.lang.python.jython.debugger.JythonDebugTest)  Time elapsed: 0.307 s
03:20:01 [2020-09-24T07:20:01.639Z] terminateThreadInSuspendedState(org.eclipse.ease.lang.python.jython.debugger.JythonDebugTest)  Time elapsed: 0.206 s
03:20:01 [2020-09-24T07:20:01.639Z] resumeOnThread(org.eclipse.ease.lang.python.jython.debugger.JythonDebugTest)  Time elapsed: 0.206 s
03:20:01 [2020-09-24T07:20:01.639Z] stepIntoOnStackFrame(org.eclipse.ease.lang.python.jython.debugger.JythonDebugTest)  Time elapsed: 0.307 s
03:20:01 [2020-09-24T07:20:01.639Z] terminateProcessInSuspendedState(org.eclipse.ease.lang.python.jython.debugger.JythonDebugTest)  Time elapsed: 0.208 s
03:20:01 [2020-09-24T07:20:01.639Z] stepOverOnProcess(org.eclipse.ease.lang.python.jython.debugger.JythonDebugTest)  Time elapsed: 0.308 s
03:20:01 [2020-09-24T07:20:01.639Z] nativeArrayVariable(org.eclipse.ease.lang.python.jython.debugger.JythonDebugTest)  Time elapsed: 0.306 s
03:20:01 [2020-09-24T07:20:01.639Z] disconnectDebugTargetInSuspendedState(org.eclipse.ease.lang.python.jython.debugger.JythonDebugTest)  Time elapsed: 0.206 s
03:20:01 [2020-09-24T07:20:01.639Z] stepIntoOnProcess(org.eclipse.ease.lang.python.jython.debugger.JythonDebugTest)  Time elapsed: 0.307 s
03:20:01 [2020-09-24T07:20:01.639Z] terminatedState(org.eclipse.ease.lang.python.jython.debugger.JythonDebugTest)  Time elapsed: 0.104 s
03:20:01 [2020-09-24T07:20:01.639Z] stepOverIncludeCommand(org.eclipse.ease.lang.python.jython.debugger.JythonDebugTest)  Time elapsed: 0.305 s
03:20:01 [2020-09-24T07:20:01.639Z] innerScopeVariableBeforeOuterScopeVariable(org.eclipse.ease.lang.python.jython.debugger.JythonDebugTest)  Time elapsed: 0.305 s
03:20:01 [2020-09-24T07:20:01.639Z] stepIntoIncludeCommand(org.eclipse.ease.lang.python.jython.debugger.JythonDebugTest)  Time elapsed: 0.305 s
03:20:01 [2020-09-24T07:20:01.639Z] primitiveStringVariable(org.eclipse.ease.lang.python.jython.debugger.JythonDebugTest)  Time elapsed: 0.306 s
03:20:01 [2020-09-24T07:20:01.639Z] resumeOnProcess(org.eclipse.ease.lang.python.jython.debugger.JythonDebugTest)  Time elapsed: 0.205 s
03:20:01 [2020-09-24T07:20:01.639Z] stepIntoOnDebugTarget(org.eclipse.ease.lang.python.jython.debugger.JythonDebugTest)  Time elapsed: 0.306 s
03:20:01 [2020-09-24T07:20:01.639Z] stepOverOnThread(org.eclipse.ease.lang.python.jython.debugger.JythonDebugTest)  Time elapsed: 0.311 s
03:20:01 [2020-09-24T07:20:01.639Z] suspendedState(org.eclipse.ease.lang.python.jython.debugger.JythonDebugTest)  Time elapsed: 0.205 s
03:20:01 [2020-09-24T07:20:01.639Z] primitiveDoubleVariable(org.eclipse.ease.lang.python.jython.debugger.JythonDebugTest)  Time elapsed: 0.306 s
03:20:01 [2020-09-24T07:20:01.639Z] resumeOnStackFrame(org.eclipse.ease.lang.python.jython.debugger.JythonDebugTest)  Time elapsed: 0.205 s
03:20:01 [2020-09-24T07:20:01.639Z] nativeObjectVariable(org.eclipse.ease.lang.python.jython.debugger.JythonDebugTest)  Time elapsed: 0.305 s
03:20:01 [2020-09-24T07:20:01.639Z] terminateDebugTargetInSuspendedState(org.eclipse.ease.lang.python.jython.debugger.JythonDebugTest)  Time elapsed: 0.206 s
03:20:01 [2020-09-24T07:20:01.639Z] disconnectStackFrameInSuspendedState(org.eclipse.ease.lang.python.jython.debugger.JythonDebugTest)  Time elapsed: 0.206 s
03:20:01 [2020-09-24T07:20:01.639Z] stepReturnOnProcess(org.eclipse.ease.lang.python.jython.debugger.JythonDebugTest)  Time elapsed: 0.306 s
03:20:01 [2020-09-24T07:20:01.639Z] evaluateWatchExpression(org.eclipse.ease.lang.python.jython.debugger.JythonDebugTest)  Time elapsed: 0.207 s
03:20:01 [2020-09-24T07:20:01.639Z] 
03:20:01 [2020-09-24T07:20:01.639Z] Results:
03:20:01 [2020-09-24T07:20:01.639Z] 
03:20:01 [2020-09-24T07:20:01.639Z] Tests run: 42, Failures: 0, Errors: 0, Skipped: 0
03:20:01 [2020-09-24T07:20:01.639Z] 
03:20:03 [2020-09-24T07:20:03.006Z] [INFO] All tests passed!
03:20:03 [2020-09-24T07:20:03.006Z] [INFO] 
03:20:03 [2020-09-24T07:20:03.006Z] [INFO] -----< org.eclipse.ease:org.eclipse.ease.lang.scriptarchive.test >------
03:20:03 [2020-09-24T07:20:03.006Z] [INFO] Building org.eclipse.ease.lang.scriptarchive.test 0.8.0-SNAPSHOT [44/48]
03:20:03 [2020-09-24T07:20:03.006Z] [INFO] ------------------------[ eclipse-test-plugin ]-------------------------
03:20:03 [2020-09-24T07:20:03.006Z] [INFO] 
03:20:03 [2020-09-24T07:20:03.006Z] [INFO] --- maven-clean-plugin:2.5:clean (default-clean) @ org.eclipse.ease.lang.scriptarchive.test ---
03:20:03 [2020-09-24T07:20:03.006Z] [INFO] 
03:20:03 [2020-09-24T07:20:03.006Z] [INFO] --- tycho-packaging-plugin:1.5.0:build-qualifier (default-build-qualifier) @ org.eclipse.ease.lang.scriptarchive.test ---
03:20:03 [2020-09-24T07:20:03.007Z] [INFO] The project's OSGi version is 0.8.0.I201910171213
03:20:03 [2020-09-24T07:20:03.007Z] [INFO] 
03:20:03 [2020-09-24T07:20:03.007Z] [INFO] --- tycho-packaging-plugin:1.5.0:validate-id (default-validate-id) @ org.eclipse.ease.lang.scriptarchive.test ---
03:20:03 [2020-09-24T07:20:03.007Z] [INFO] 
03:20:03 [2020-09-24T07:20:03.007Z] [INFO] --- tycho-packaging-plugin:1.5.0:validate-version (default-validate-version) @ org.eclipse.ease.lang.scriptarchive.test ---
03:20:03 [2020-09-24T07:20:03.007Z] [INFO] 
03:20:03 [2020-09-24T07:20:03.007Z] [INFO] >>> maven-javadoc-plugin:2.9.1:javadoc (build-docs) > generate-sources @ org.eclipse.ease.lang.scriptarchive.test >>>
03:20:03 [2020-09-24T07:20:03.007Z] [INFO] 
03:20:03 [2020-09-24T07:20:03.007Z] [INFO] --- tycho-packaging-plugin:1.5.0:build-qualifier (default-build-qualifier) @ org.eclipse.ease.lang.scriptarchive.test ---
03:20:03 [2020-09-24T07:20:03.007Z] [INFO] The project's OSGi version is 0.8.0.I201910171213
03:20:03 [2020-09-24T07:20:03.007Z] [INFO] 
03:20:03 [2020-09-24T07:20:03.007Z] [INFO] --- tycho-packaging-plugin:1.5.0:validate-id (default-validate-id) @ org.eclipse.ease.lang.scriptarchive.test ---
03:20:03 [2020-09-24T07:20:03.007Z] [INFO] 
03:20:03 [2020-09-24T07:20:03.007Z] [INFO] --- tycho-packaging-plugin:1.5.0:validate-version (default-validate-version) @ org.eclipse.ease.lang.scriptarchive.test ---
03:20:03 [2020-09-24T07:20:03.007Z] [INFO] 
03:20:03 [2020-09-24T07:20:03.007Z] [INFO] <<< maven-javadoc-plugin:2.9.1:javadoc (build-docs) < generate-sources @ org.eclipse.ease.lang.scriptarchive.test <<<
03:20:03 [2020-09-24T07:20:03.007Z] [INFO] 
03:20:03 [2020-09-24T07:20:03.007Z] [INFO] 
03:20:03 [2020-09-24T07:20:03.007Z] [INFO] --- maven-javadoc-plugin:2.9.1:javadoc (build-docs) @ org.eclipse.ease.lang.scriptarchive.test ---
03:20:03 [2020-09-24T07:20:03.007Z] [ERROR] Error fetching link: http://help.eclipse.org/oxygen/topic/org.eclipse.platform.doc.isv/reference/api/package-list. Ignored it.
03:20:04 [2020-09-24T07:20:04.409Z] [INFO] 
03:20:04 [2020-09-24T07:20:04.409Z] Loading source files for package org.eclipse.ease.lang.scriptarchive...
03:20:04 [2020-09-24T07:20:04.409Z] Constructing Javadoc information...
03:20:04 [2020-09-24T07:20:04.409Z] WARNING: Cannot open location "/home/jenkins/agent/workspace/ease.verify.core.gerrit/tests/org.eclipse.ease.lang.scriptarchive.test/target/javadoc-bundle-options/package-list"
03:20:04 [2020-09-24T07:20:04.409Z] No plugin definition found, skipping
03:20:04 [2020-09-24T07:20:04.409Z] No plugin definition found, skipping
03:20:04 [2020-09-24T07:20:04.409Z] [WARNING] Javadoc Warnings
03:20:04 [2020-09-24T07:20:04.409Z] [WARNING] Picked up JAVA_TOOL_OPTIONS: -Dmaven.ext.class.path="/home/jenkins/agent/workspace/ease.verify.core.gerrit@tmp/withMaven2474cf29/pipeline-maven-spy.jar" -Dorg.jenkinsci.plugins.pipeline.maven.reportsFolder="/home/jenkins/agent/workspace/ease.verify.core.gerrit@tmp/withMaven2474cf29"
03:20:04 [2020-09-24T07:20:04.409Z] [WARNING] javadoc: warning - The old Doclet and Taglet APIs in the packages
03:20:04 [2020-09-24T07:20:04.409Z] [WARNING] com.sun.javadoc, com.sun.tools.doclets and their implementations
03:20:04 [2020-09-24T07:20:04.409Z] [WARNING] are planned to be removed in a future JDK release. These
03:20:04 [2020-09-24T07:20:04.409Z] [WARNING] components have been superseded by the new APIs in jdk.javadoc.doclet.
03:20:04 [2020-09-24T07:20:04.409Z] [WARNING] Users are strongly recommended to migrate to the new APIs.
03:20:04 [2020-09-24T07:20:04.409Z] [INFO] 
03:20:04 [2020-09-24T07:20:04.409Z] [INFO] --- build-helper-maven-plugin:1.9.1:add-resource (add_help) @ org.eclipse.ease.lang.scriptarchive.test ---
03:20:04 [2020-09-24T07:20:04.409Z] [INFO] 
03:20:04 [2020-09-24T07:20:04.409Z] [INFO] --- maven-resources-plugin:2.4.3:resources (default-resources) @ org.eclipse.ease.lang.scriptarchive.test ---
03:20:04 [2020-09-24T07:20:04.409Z] [INFO] Using 'UTF-8' encoding to copy filtered resources.
03:20:04 [2020-09-24T07:20:04.409Z] [INFO] skip non existing resourceDirectory /home/jenkins/agent/workspace/ease.verify.core.gerrit/tests/org.eclipse.ease.lang.scriptarchive.test/src/main/resources
03:20:04 [2020-09-24T07:20:04.409Z] [INFO] skip non existing resourceDirectory /home/jenkins/agent/workspace/ease.verify.core.gerrit/tests/org.eclipse.ease.lang.scriptarchive.test/help
03:20:04 [2020-09-24T07:20:04.409Z] [INFO] 
03:20:04 [2020-09-24T07:20:04.409Z] [INFO] --- tycho-compiler-plugin:1.5.0:compile (default-compile) @ org.eclipse.ease.lang.scriptarchive.test ---
03:20:04 [2020-09-24T07:20:04.409Z] [INFO] Compiling 1 source file to /home/jenkins/agent/workspace/ease.verify.core.gerrit/tests/org.eclipse.ease.lang.scriptarchive.test/target/classes
03:20:04 [2020-09-24T07:20:04.409Z] [INFO] 
03:20:04 [2020-09-24T07:20:04.409Z] [INFO] --- maven-resources-plugin:2.4.3:testResources (default-testResources) @ org.eclipse.ease.lang.scriptarchive.test ---
03:20:04 [2020-09-24T07:20:04.409Z] [INFO] Using 'UTF-8' encoding to copy filtered resources.
03:20:04 [2020-09-24T07:20:04.410Z] [INFO] skip non existing resourceDirectory /home/jenkins/agent/workspace/ease.verify.core.gerrit/tests/org.eclipse.ease.lang.scriptarchive.test/src/test/resources
03:20:04 [2020-09-24T07:20:04.410Z] [INFO] 
03:20:04 [2020-09-24T07:20:04.410Z] [INFO] --- tycho-source-plugin:1.5.0:plugin-source (plugin-source) @ org.eclipse.ease.lang.scriptarchive.test ---
03:20:04 [2020-09-24T07:20:04.410Z] [INFO] Building jar: /home/jenkins/agent/workspace/ease.verify.core.gerrit/tests/org.eclipse.ease.lang.scriptarchive.test/target/org.eclipse.ease.lang.scriptarchive.test-0.8.0-SNAPSHOT-sources.jar
03:20:04 [2020-09-24T07:20:04.410Z] [INFO] 
03:20:04 [2020-09-24T07:20:04.410Z] [INFO] --- target-platform-configuration:1.5.0:target-platform (default-target-platform) @ org.eclipse.ease.lang.scriptarchive.test ---
03:20:04 [2020-09-24T07:20:04.410Z] [INFO] 
03:20:04 [2020-09-24T07:20:04.410Z] [INFO] --- tycho-packaging-plugin:1.5.0:package-plugin (default-package-plugin) @ org.eclipse.ease.lang.scriptarchive.test ---
03:20:04 [2020-09-24T07:20:04.410Z] [INFO] Building jar: /home/jenkins/agent/workspace/ease.verify.core.gerrit/tests/org.eclipse.ease.lang.scriptarchive.test/target/org.eclipse.ease.lang.scriptarchive.test-0.8.0-SNAPSHOT.jar
03:20:04 [2020-09-24T07:20:04.410Z] [INFO] 
03:20:04 [2020-09-24T07:20:04.410Z] [INFO] --- tycho-p2-plugin:1.5.0:p2-metadata-default (default-p2-metadata-default) @ org.eclipse.ease.lang.scriptarchive.test ---
03:20:04 [2020-09-24T07:20:04.410Z] [INFO] 
03:20:04 [2020-09-24T07:20:04.410Z] [INFO] --- tycho-source-feature-plugin:1.5.0:source-feature (source-feature) @ org.eclipse.ease.lang.scriptarchive.test ---
03:20:04 [2020-09-24T07:20:04.410Z] [INFO] 
03:20:04 [2020-09-24T07:20:04.410Z] [INFO] --- tycho-p2-plugin:1.5.0:p2-metadata (attached-p2-metadata) @ org.eclipse.ease.lang.scriptarchive.test ---
03:20:04 [2020-09-24T07:20:04.410Z] [INFO] 
03:20:04 [2020-09-24T07:20:04.410Z] [INFO] --- tycho-surefire-plugin:1.5.0:test (default-test) @ org.eclipse.ease.lang.scriptarchive.test ---
03:20:04 [2020-09-24T07:20:04.710Z] [INFO] Expected eclipse log file: /home/jenkins/agent/workspace/ease.verify.core.gerrit/tests/org.eclipse.ease.lang.scriptarchive.test/target/work/data/.metadata/.log
03:20:04 [2020-09-24T07:20:04.710Z] [INFO] Command line:
03:20:04 [2020-09-24T07:20:04.710Z] 	[/opt/tools/java/openjdk/jdk-11/11.0.2+9/bin/java, -Dosgi.noShutdown=false, -Dosgi.os=linux, -Dosgi.ws=gtk, -Dosgi.arch=x86_64, -Dosgi.clean=true, -jar, /home/jenkins/.m2/repository/p2/osgi/bundle/org.eclipse.equinox.launcher/1.5.800.v20200727-1323/org.eclipse.equinox.launcher-1.5.800.v20200727-1323.jar, -data, /home/jenkins/agent/workspace/ease.verify.core.gerrit/tests/org.eclipse.ease.lang.scriptarchive.test/target/work/data, -install, /home/jenkins/agent/workspace/ease.verify.core.gerrit/tests/org.eclipse.ease.lang.scriptarchive.test/target/work, -configuration, /home/jenkins/agent/workspace/ease.verify.core.gerrit/tests/org.eclipse.ease.lang.scriptarchive.test/target/work/configuration, -application, org.eclipse.tycho.surefire.osgibooter.headlesstest, -testproperties, /home/jenkins/agent/workspace/ease.verify.core.gerrit/tests/org.eclipse.ease.lang.scriptarchive.test/target/surefire.properties]
03:20:04 [2020-09-24T07:20:04.710Z] Picked up JAVA_TOOL_OPTIONS: -Dmaven.ext.class.path="/home/jenkins/agent/workspace/ease.verify.core.gerrit@tmp/withMaven2474cf29/pipeline-maven-spy.jar" -Dorg.jenkinsci.plugins.pipeline.maven.reportsFolder="/home/jenkins/agent/workspace/ease.verify.core.gerrit@tmp/withMaven2474cf29" 
03:20:06 [2020-09-24T07:20:06.074Z] Running org.eclipse.ease.lang.scriptarchive.ArchiveEngineTest
03:20:06 [2020-09-24T07:20:06.636Z] We are running from a zip file!
03:20:06 [2020-09-24T07:20:06.636Z] org.eclipse.ease.ScriptExecutionException: SyntaxError: missing ; before statement (workspace://__EASE_ScriptArchive_1/scripts/Master.js#3)
03:20:06 [2020-09-24T07:20:06.636Z] this is an error
03:20:06 [2020-09-24T07:20:06.636Z]        ^
03:20:06 [2020-09-24T07:20:06.636Z] 	at Master.js,workspace://__EASE_ScriptArchive_1/scripts/Master.js
03:20:06 [2020-09-24T07:20:06.636Z] org.eclipse.ease.ScriptExecutionException: SyntaxError: missing ; before statement (workspace://__EASE_ScriptArchive_1/scripts/Master.js#3)
03:20:06 [2020-09-24T07:20:06.636Z] this is an error
03:20:06 [2020-09-24T07:20:06.636Z]        ^
03:20:06 [2020-09-24T07:20:06.636Z] 	at Master.js,workspace://__EASE_ScriptArchive_1/scripts/Master.js
03:20:06 [2020-09-24T07:20:06.636Z] Tests run: 7, Failures: 0, Errors: 0, Skipped: 0, Time elapsed: 0.423 s - in org.eclipse.ease.lang.scriptarchive.ArchiveEngineTest
03:20:06 [2020-09-24T07:20:06.636Z] executeWithManifest(org.eclipse.ease.lang.scriptarchive.ArchiveEngineTest)  Time elapsed: 0.286 s
03:20:06 [2020-09-24T07:20:06.636Z] zipFileRegistration(org.eclipse.ease.lang.scriptarchive.ArchiveEngineTest)  Time elapsed: 0.005 s
03:20:06 [2020-09-24T07:20:06.636Z] engineIdRegistration(org.eclipse.ease.lang.scriptarchive.ArchiveEngineTest)  Time elapsed: 0 s
03:20:06 [2020-09-24T07:20:06.636Z] jarFileRegistration(org.eclipse.ease.lang.scriptarchive.ArchiveEngineTest)  Time elapsed: 0 s
03:20:06 [2020-09-24T07:20:06.636Z] sarFileRegistration(org.eclipse.ease.lang.scriptarchive.ArchiveEngineTest)  Time elapsed: 0 s
03:20:06 [2020-09-24T07:20:06.636Z] executeWithErrors(org.eclipse.ease.lang.scriptarchive.ArchiveEngineTest)  Time elapsed: 0.08 s
03:20:06 [2020-09-24T07:20:06.636Z] executeWithIncludes(org.eclipse.ease.lang.scriptarchive.ArchiveEngineTest)  Time elapsed: 0.032 s
03:20:06 [2020-09-24T07:20:06.636Z] 
03:20:06 [2020-09-24T07:20:06.636Z] Results:
03:20:06 [2020-09-24T07:20:06.636Z] 
03:20:06 [2020-09-24T07:20:06.636Z] Tests run: 7, Failures: 0, Errors: 0, Skipped: 0
03:20:06 [2020-09-24T07:20:06.636Z] 
03:20:07 [2020-09-24T07:20:07.199Z] [INFO] All tests passed!
03:20:07 [2020-09-24T07:20:07.199Z] [INFO] 
03:20:07 [2020-09-24T07:20:07.199Z] [INFO] --------< org.eclipse.ease:org.eclipse.ease.lang.unittest.test >--------
03:20:07 [2020-09-24T07:20:07.199Z] [INFO] Building org.eclipse.ease.lang.unittest.test 0.8.0-SNAPSHOT      [45/48]
03:20:07 [2020-09-24T07:20:07.199Z] [INFO] ------------------------[ eclipse-test-plugin ]-------------------------
03:20:07 [2020-09-24T07:20:07.199Z] [INFO] 
03:20:07 [2020-09-24T07:20:07.199Z] [INFO] --- maven-clean-plugin:2.5:clean (default-clean) @ org.eclipse.ease.lang.unittest.test ---
03:20:07 [2020-09-24T07:20:07.199Z] [INFO] 
03:20:07 [2020-09-24T07:20:07.199Z] [INFO] --- tycho-packaging-plugin:1.5.0:build-qualifier (default-build-qualifier) @ org.eclipse.ease.lang.unittest.test ---
03:20:07 [2020-09-24T07:20:07.455Z] [INFO] The project's OSGi version is 0.8.0.I201908141044
03:20:07 [2020-09-24T07:20:07.455Z] [INFO] 
03:20:07 [2020-09-24T07:20:07.455Z] [INFO] --- tycho-packaging-plugin:1.5.0:validate-id (default-validate-id) @ org.eclipse.ease.lang.unittest.test ---
03:20:07 [2020-09-24T07:20:07.455Z] [INFO] 
03:20:07 [2020-09-24T07:20:07.455Z] [INFO] --- tycho-packaging-plugin:1.5.0:validate-version (default-validate-version) @ org.eclipse.ease.lang.unittest.test ---
03:20:07 [2020-09-24T07:20:07.455Z] [INFO] 
03:20:07 [2020-09-24T07:20:07.455Z] [INFO] >>> maven-javadoc-plugin:2.9.1:javadoc (build-docs) > generate-sources @ org.eclipse.ease.lang.unittest.test >>>
03:20:07 [2020-09-24T07:20:07.455Z] [INFO] 
03:20:07 [2020-09-24T07:20:07.455Z] [INFO] --- tycho-packaging-plugin:1.5.0:build-qualifier (default-build-qualifier) @ org.eclipse.ease.lang.unittest.test ---
03:20:07 [2020-09-24T07:20:07.455Z] [INFO] The project's OSGi version is 0.8.0.I201908141044
03:20:07 [2020-09-24T07:20:07.455Z] [INFO] 
03:20:07 [2020-09-24T07:20:07.455Z] [INFO] --- tycho-packaging-plugin:1.5.0:validate-id (default-validate-id) @ org.eclipse.ease.lang.unittest.test ---
03:20:07 [2020-09-24T07:20:07.455Z] [INFO] 
03:20:07 [2020-09-24T07:20:07.455Z] [INFO] --- tycho-packaging-plugin:1.5.0:validate-version (default-validate-version) @ org.eclipse.ease.lang.unittest.test ---
03:20:07 [2020-09-24T07:20:07.455Z] [INFO] 
03:20:07 [2020-09-24T07:20:07.455Z] [INFO] <<< maven-javadoc-plugin:2.9.1:javadoc (build-docs) < generate-sources @ org.eclipse.ease.lang.unittest.test <<<
03:20:07 [2020-09-24T07:20:07.455Z] [INFO] 
03:20:07 [2020-09-24T07:20:07.455Z] [INFO] 
03:20:07 [2020-09-24T07:20:07.455Z] [INFO] --- maven-javadoc-plugin:2.9.1:javadoc (build-docs) @ org.eclipse.ease.lang.unittest.test ---
03:20:07 [2020-09-24T07:20:07.455Z] [ERROR] Error fetching link: http://help.eclipse.org/oxygen/topic/org.eclipse.platform.doc.isv/reference/api/package-list. Ignored it.
03:20:08 [2020-09-24T07:20:08.847Z] [INFO] 
03:20:08 [2020-09-24T07:20:08.847Z] Loading source files for package org.eclipse.ease.lang.unittest...
03:20:08 [2020-09-24T07:20:08.847Z] Constructing Javadoc information...
03:20:08 [2020-09-24T07:20:08.847Z] WARNING: Cannot open location "/home/jenkins/agent/workspace/ease.verify.core.gerrit/tests/org.eclipse.ease.lang.unittest.test/target/javadoc-bundle-options/package-list"
03:20:08 [2020-09-24T07:20:08.847Z] No plugin definition found, skipping
03:20:08 [2020-09-24T07:20:08.847Z] No plugin definition found, skipping
03:20:08 [2020-09-24T07:20:08.847Z] [WARNING] Javadoc Warnings
03:20:08 [2020-09-24T07:20:08.847Z] [WARNING] Picked up JAVA_TOOL_OPTIONS: -Dmaven.ext.class.path="/home/jenkins/agent/workspace/ease.verify.core.gerrit@tmp/withMaven2474cf29/pipeline-maven-spy.jar" -Dorg.jenkinsci.plugins.pipeline.maven.reportsFolder="/home/jenkins/agent/workspace/ease.verify.core.gerrit@tmp/withMaven2474cf29"
03:20:08 [2020-09-24T07:20:08.847Z] [WARNING] javadoc: warning - The old Doclet and Taglet APIs in the packages
03:20:08 [2020-09-24T07:20:08.847Z] [WARNING] com.sun.javadoc, com.sun.tools.doclets and their implementations
03:20:08 [2020-09-24T07:20:08.847Z] [WARNING] are planned to be removed in a future JDK release. These
03:20:08 [2020-09-24T07:20:08.847Z] [WARNING] components have been superseded by the new APIs in jdk.javadoc.doclet.
03:20:08 [2020-09-24T07:20:08.847Z] [WARNING] Users are strongly recommended to migrate to the new APIs.
03:20:08 [2020-09-24T07:20:08.847Z] [INFO] 
03:20:08 [2020-09-24T07:20:08.847Z] [INFO] --- build-helper-maven-plugin:1.9.1:add-resource (add_help) @ org.eclipse.ease.lang.unittest.test ---
03:20:08 [2020-09-24T07:20:08.847Z] [INFO] 
03:20:08 [2020-09-24T07:20:08.847Z] [INFO] --- maven-resources-plugin:2.4.3:resources (default-resources) @ org.eclipse.ease.lang.unittest.test ---
03:20:08 [2020-09-24T07:20:08.847Z] [INFO] Using 'UTF-8' encoding to copy filtered resources.
03:20:08 [2020-09-24T07:20:08.847Z] [INFO] skip non existing resourceDirectory /home/jenkins/agent/workspace/ease.verify.core.gerrit/tests/org.eclipse.ease.lang.unittest.test/src/main/resources
03:20:08 [2020-09-24T07:20:08.847Z] [INFO] skip non existing resourceDirectory /home/jenkins/agent/workspace/ease.verify.core.gerrit/tests/org.eclipse.ease.lang.unittest.test/help
03:20:08 [2020-09-24T07:20:08.847Z] [INFO] 
03:20:08 [2020-09-24T07:20:08.847Z] [INFO] --- tycho-compiler-plugin:1.5.0:compile (default-compile) @ org.eclipse.ease.lang.unittest.test ---
03:20:08 [2020-09-24T07:20:08.847Z] [INFO] Compiling 3 source files to /home/jenkins/agent/workspace/ease.verify.core.gerrit/tests/org.eclipse.ease.lang.unittest.test/target/classes
03:20:08 [2020-09-24T07:20:08.847Z] [INFO] 
03:20:08 [2020-09-24T07:20:08.847Z] [INFO] --- maven-resources-plugin:2.4.3:testResources (default-testResources) @ org.eclipse.ease.lang.unittest.test ---
03:20:08 [2020-09-24T07:20:08.847Z] [INFO] Using 'UTF-8' encoding to copy filtered resources.
03:20:08 [2020-09-24T07:20:08.848Z] [INFO] skip non existing resourceDirectory /home/jenkins/agent/workspace/ease.verify.core.gerrit/tests/org.eclipse.ease.lang.unittest.test/src/test/resources
03:20:08 [2020-09-24T07:20:08.848Z] [INFO] 
03:20:08 [2020-09-24T07:20:08.848Z] [INFO] --- tycho-source-plugin:1.5.0:plugin-source (plugin-source) @ org.eclipse.ease.lang.unittest.test ---
03:20:08 [2020-09-24T07:20:08.848Z] [WARNING] Bundle-Name header not found in /home/jenkins/agent/workspace/ease.verify.core.gerrit/tests/org.eclipse.ease.lang.unittest.test/META-INF/MANIFEST.MF, fallback to Bundle-SymbolicName for source bundle
03:20:08 [2020-09-24T07:20:08.848Z] [WARNING] Bundle-Vendor header not found in /home/jenkins/agent/workspace/ease.verify.core.gerrit/tests/org.eclipse.ease.lang.unittest.test/META-INF/MANIFEST.MF, fallback to 'unknown' for source bundle
03:20:08 [2020-09-24T07:20:08.848Z] [INFO] Building jar: /home/jenkins/agent/workspace/ease.verify.core.gerrit/tests/org.eclipse.ease.lang.unittest.test/target/org.eclipse.ease.lang.unittest.test-0.8.0-SNAPSHOT-sources.jar
03:20:08 [2020-09-24T07:20:08.848Z] [INFO] 
03:20:08 [2020-09-24T07:20:08.848Z] [INFO] --- target-platform-configuration:1.5.0:target-platform (default-target-platform) @ org.eclipse.ease.lang.unittest.test ---
03:20:08 [2020-09-24T07:20:08.848Z] [INFO] 
03:20:08 [2020-09-24T07:20:08.848Z] [INFO] --- tycho-packaging-plugin:1.5.0:package-plugin (default-package-plugin) @ org.eclipse.ease.lang.unittest.test ---
03:20:08 [2020-09-24T07:20:08.848Z] [INFO] Building jar: /home/jenkins/agent/workspace/ease.verify.core.gerrit/tests/org.eclipse.ease.lang.unittest.test/target/org.eclipse.ease.lang.unittest.test-0.8.0-SNAPSHOT.jar
03:20:08 [2020-09-24T07:20:08.848Z] [INFO] 
03:20:08 [2020-09-24T07:20:08.848Z] [INFO] --- tycho-p2-plugin:1.5.0:p2-metadata-default (default-p2-metadata-default) @ org.eclipse.ease.lang.unittest.test ---
03:20:08 [2020-09-24T07:20:08.848Z] [INFO] 
03:20:08 [2020-09-24T07:20:08.848Z] [INFO] --- tycho-source-feature-plugin:1.5.0:source-feature (source-feature) @ org.eclipse.ease.lang.unittest.test ---
03:20:08 [2020-09-24T07:20:08.848Z] [INFO] 
03:20:08 [2020-09-24T07:20:08.848Z] [INFO] --- tycho-p2-plugin:1.5.0:p2-metadata (attached-p2-metadata) @ org.eclipse.ease.lang.unittest.test ---
03:20:08 [2020-09-24T07:20:08.848Z] [INFO] 
03:20:08 [2020-09-24T07:20:08.848Z] [INFO] --- tycho-surefire-plugin:1.5.0:test (default-test) @ org.eclipse.ease.lang.unittest.test ---
03:20:09 [2020-09-24T07:20:09.112Z] [INFO] Expected eclipse log file: /home/jenkins/agent/workspace/ease.verify.core.gerrit/tests/org.eclipse.ease.lang.unittest.test/target/work/data/.metadata/.log
03:20:09 [2020-09-24T07:20:09.112Z] [INFO] Command line:
03:20:09 [2020-09-24T07:20:09.112Z] 	[/opt/tools/java/openjdk/jdk-11/11.0.2+9/bin/java, -Dosgi.noShutdown=false, -Dosgi.os=linux, -Dosgi.ws=gtk, -Dosgi.arch=x86_64, -Dosgi.clean=true, -jar, /home/jenkins/.m2/repository/p2/osgi/bundle/org.eclipse.equinox.launcher/1.5.800.v20200727-1323/org.eclipse.equinox.launcher-1.5.800.v20200727-1323.jar, -data, /home/jenkins/agent/workspace/ease.verify.core.gerrit/tests/org.eclipse.ease.lang.unittest.test/target/work/data, -install, /home/jenkins/agent/workspace/ease.verify.core.gerrit/tests/org.eclipse.ease.lang.unittest.test/target/work, -configuration, /home/jenkins/agent/workspace/ease.verify.core.gerrit/tests/org.eclipse.ease.lang.unittest.test/target/work/configuration, -application, org.eclipse.tycho.surefire.osgibooter.headlesstest, -testproperties, /home/jenkins/agent/workspace/ease.verify.core.gerrit/tests/org.eclipse.ease.lang.unittest.test/target/surefire.properties]
03:20:09 [2020-09-24T07:20:09.112Z] Picked up JAVA_TOOL_OPTIONS: -Dmaven.ext.class.path="/home/jenkins/agent/workspace/ease.verify.core.gerrit@tmp/withMaven2474cf29/pipeline-maven-spy.jar" -Dorg.jenkinsci.plugins.pipeline.maven.reportsFolder="/home/jenkins/agent/workspace/ease.verify.core.gerrit@tmp/withMaven2474cf29" 
03:20:11 [2020-09-24T07:20:11.036Z] 
03:20:11 [2020-09-24T07:20:11.036Z] Results:
03:20:11 [2020-09-24T07:20:11.036Z] 
03:20:11 [2020-09-24T07:20:11.036Z] Tests run: 0, Failures: 0, Errors: 0, Skipped: 0
03:20:11 [2020-09-24T07:20:11.036Z] 
03:20:11 [2020-09-24T07:20:11.297Z] An error has occurred. See the log file
03:20:11 [2020-09-24T07:20:11.297Z] /home/jenkins/agent/workspace/ease.verify.core.gerrit/tests/org.eclipse.ease.lang.unittest.test/target/work/data/.metadata/.log.
03:20:11 [2020-09-24T07:20:11.297Z] [INFO] ------------------------------------------------------------------------
03:20:11 [2020-09-24T07:20:11.297Z] [INFO] Reactor Summary:
03:20:11 [2020-09-24T07:20:11.297Z] [INFO] 
03:20:11 [2020-09-24T07:20:11.297Z] [INFO] org.eclipse.ease.releng 0.8.0-SNAPSHOT ............. SUCCESS [  8.681 s]
03:20:11 [2020-09-24T07:20:11.298Z] [INFO] org.eclipse.ease.classloader 0.8.0-SNAPSHOT ........ SUCCESS [  6.838 s]
03:20:11 [2020-09-24T07:20:11.298Z] [INFO] org.eclipse.ease 0.8.0-SNAPSHOT .................... SUCCESS [  3.084 s]
03:20:11 [2020-09-24T07:20:11.298Z] [INFO] org.eclipse.ease.ui 0.8.0-SNAPSHOT ................. SUCCESS [  3.104 s]
03:20:11 [2020-09-24T07:20:11.298Z] [INFO] org.eclipse.ease.ui.completions.java 0.8.0-SNAPSHOT  SUCCESS [  2.290 s]
03:20:11 [2020-09-24T07:20:11.298Z] [INFO] org.eclipse.ease.ui.scripts 0.8.0-SNAPSHOT ......... SUCCESS [  2.611 s]
03:20:11 [2020-09-24T07:20:11.298Z] [INFO] org.eclipse.ease.lang.javascript 0.8.0-SNAPSHOT .... SUCCESS [  1.989 s]
03:20:11 [2020-09-24T07:20:11.298Z] [INFO] org.eclipse.ease.lang.scriptarchive 0.8.0-SNAPSHOT . SUCCESS [  1.893 s]
03:20:11 [2020-09-24T07:20:11.298Z] [INFO] org.eclipse.ease.lang.python 0.8.0-SNAPSHOT ........ SUCCESS [  1.902 s]
03:20:11 [2020-09-24T07:20:11.298Z] [INFO] org.eclipse.ease.lang.python.py4j 0.8.0-SNAPSHOT ... SUCCESS [  1.910 s]
03:20:11 [2020-09-24T07:20:11.298Z] [INFO] org.eclipse.ease.lang.groovy 0.8.0-SNAPSHOT ........ SUCCESS [  1.828 s]
03:20:11 [2020-09-24T07:20:11.298Z] [INFO] org.eclipse.ease.lang.groovy.interpreter 0.8.0-SNAPSHOT SUCCESS [  1.650 s]
03:20:11 [2020-09-24T07:20:11.298Z] [INFO] org.eclipse.ease.lang.unittest 0.8.0-SNAPSHOT ...... SUCCESS [  2.260 s]
03:20:11 [2020-09-24T07:20:11.298Z] [INFO] org.eclipse.ease.lang.unittest.ui 0.8.0-SNAPSHOT ... SUCCESS [  2.255 s]
03:20:11 [2020-09-24T07:20:11.298Z] [INFO] org.eclipse.ease.lang.ruby 0.8.0-SNAPSHOT .......... SUCCESS [  1.515 s]
03:20:11 [2020-09-24T07:20:11.298Z] [INFO] org.eclipse.ease.lang.ruby.jruby 0.8.0-SNAPSHOT .... SUCCESS [  1.601 s]
03:20:11 [2020-09-24T07:20:11.298Z] [INFO] org.eclipse.ease.lang.javascript.nashorn 0.8.0-SNAPSHOT SUCCESS [  1.601 s]
03:20:11 [2020-09-24T07:20:11.298Z] [INFO] org.eclipse.ease.lang.javascript.rhino 0.8.0-SNAPSHOT SUCCESS [  1.994 s]
03:20:11 [2020-09-24T07:20:11.298Z] [INFO] org.eclipse.ease.lang.python.jython 0.8.0-SNAPSHOT . SUCCESS [  1.815 s]
03:20:11 [2020-09-24T07:20:11.298Z] [INFO] org.eclipse.ease.lang.javascript.ui 0.8.0-SNAPSHOT . SUCCESS [  1.798 s]
03:20:11 [2020-09-24T07:20:11.298Z] [INFO] org.eclipse.ease.lang.jvm.compiled 0.8.0-SNAPSHOT .. SUCCESS [  1.627 s]
03:20:11 [2020-09-24T07:20:11.298Z] [INFO] org.eclipse.ease.lang.scriptarchive.ui 0.8.0-SNAPSHOT SUCCESS [  1.853 s]
03:20:11 [2020-09-24T07:20:11.298Z] [INFO] org.eclipse.ease.help 0.8.0-SNAPSHOT ............... SUCCESS [  6.540 s]
03:20:11 [2020-09-24T07:20:11.298Z] [INFO] org.eclipse.ease.feature 0.8.0-SNAPSHOT ............ SUCCESS [  0.175 s]
03:20:11 [2020-09-24T07:20:11.298Z] [INFO] org.eclipse.ease.ui.feature 0.8.0-SNAPSHOT ......... SUCCESS [  0.101 s]
03:20:11 [2020-09-24T07:20:11.298Z] [INFO] org.eclipse.ease.lang.javascript.feature 0.8.0-SNAPSHOT SUCCESS [  0.115 s]
03:20:11 [2020-09-24T07:20:11.298Z] [INFO] org.eclipse.ease.lang.python.feature 0.8.0-SNAPSHOT  SUCCESS [  0.090 s]
03:20:11 [2020-09-24T07:20:11.298Z] [INFO] org.eclipse.ease.python.jython.feature 0.8.0-SNAPSHOT SUCCESS [  0.082 s]
03:20:11 [2020-09-24T07:20:11.298Z] [INFO] org.eclipse.ease.lang.python.py4j.feature 0.8.0-SNAPSHOT SUCCESS [  0.090 s]
03:20:11 [2020-09-24T07:20:11.298Z] [INFO] org.eclipse.ease.lang.jvm.feature 0.8.0-SNAPSHOT ... SUCCESS [  0.043 s]
03:20:11 [2020-09-24T07:20:11.298Z] [INFO] org.eclipse.ease.lang.groovy.feature 0.8.0-SNAPSHOT  SUCCESS [  0.090 s]
03:20:11 [2020-09-24T07:20:11.298Z] [INFO] org.eclipse.ease.lang.ruby.feature 0.8.0-SNAPSHOT .. SUCCESS [  0.160 s]
03:20:11 [2020-09-24T07:20:11.298Z] [INFO] org.eclipse.ease.lang.scriptarchive.feature 0.8.0-SNAPSHOT SUCCESS [  0.045 s]
03:20:11 [2020-09-24T07:20:11.298Z] [INFO] org.eclipse.ease.lang.unittest.feature 0.8.0-SNAPSHOT SUCCESS [  0.090 s]
03:20:11 [2020-09-24T07:20:11.298Z] [INFO] org.eclipse.ease.releng.target 0.8.0-SNAPSHOT ...... SUCCESS [  0.007 s]
03:20:11 [2020-09-24T07:20:11.298Z] [INFO] org.eclipse.ease.releng.p2 0.8.0-SNAPSHOT .......... SUCCESS [  3.279 s]
03:20:11 [2020-09-24T07:20:11.298Z] [INFO] org.eclipse.ease.testhelper 0.8.0-SNAPSHOT ......... SUCCESS [  1.642 s]
03:20:11 [2020-09-24T07:20:11.298Z] [INFO] org.eclipse.ease.test 0.8.0-SNAPSHOT ............... SUCCESS [ 12.223 s]
03:20:11 [2020-09-24T07:20:11.298Z] [INFO] org.eclipse.ease.lang.javascript.nashorn.test 0.8.0-SNAPSHOT SUCCESS [  4.951 s]
03:20:11 [2020-09-24T07:20:11.298Z] [INFO] org.eclipse.ease.lang.javascript.rhino.test 0.8.0-SNAPSHOT SUCCESS [ 15.931 s]
03:20:11 [2020-09-24T07:20:11.298Z] [INFO] org.eclipse.ease.lang.javascript.test 0.8.0-SNAPSHOT SUCCESS [  4.260 s]
03:20:11 [2020-09-24T07:20:11.298Z] [INFO] org.eclipse.ease.lang.python.test 0.8.0-SNAPSHOT ... SUCCESS [  3.853 s]
03:20:11 [2020-09-24T07:20:11.298Z] [INFO] org.eclipse.ease.lang.python.jython.test 0.8.0-SNAPSHOT SUCCESS [ 17.514 s]
03:20:11 [2020-09-24T07:20:11.298Z] [INFO] org.eclipse.ease.lang.scriptarchive.test 0.8.0-SNAPSHOT SUCCESS [  4.481 s]
03:20:11 [2020-09-24T07:20:11.298Z] [INFO] org.eclipse.ease.lang.unittest.test 0.8.0-SNAPSHOT . FAILURE [  4.059 s]
03:20:11 [2020-09-24T07:20:11.298Z] [INFO] org.eclipse.ease.ui.scripts.test 0.8.0-SNAPSHOT .... SKIPPED
03:20:11 [2020-09-24T07:20:11.298Z] [INFO] org.eclipse.ease.ui.test 0.8.0-SNAPSHOT ............ SKIPPED
03:20:11 [2020-09-24T07:20:11.298Z] [INFO] EASE (Incubation) 0.4.0-SNAPSHOT ................... SKIPPED
03:20:11 [2020-09-24T07:20:11.298Z] [INFO] ------------------------------------------------------------------------
03:20:11 [2020-09-24T07:20:11.298Z] [INFO] BUILD FAILURE
03:20:11 [2020-09-24T07:20:11.298Z] [INFO] ------------------------------------------------------------------------
03:20:11 [2020-09-24T07:20:11.298Z] [INFO] Total time:  04:49 min
03:20:11 [2020-09-24T07:20:11.298Z] [INFO] Finished at: 2020-09-24T07:20:11Z
03:20:11 [2020-09-24T07:20:11.298Z] [INFO] ------------------------------------------------------------------------
03:20:11 [2020-09-24T07:20:11.298Z] [INFO] [jenkins-event-spy] Generated /home/jenkins/agent/workspace/ease.verify.core.gerrit@tmp/withMaven2474cf29/maven-spy-20200924-071521-22013169019492979174789.log
03:20:11 [2020-09-24T07:20:11.298Z] [ERROR] Failed to execute goal org.eclipse.tycho:tycho-surefire-plugin:1.5.0:test (default-test) on project org.eclipse.ease.lang.unittest.test: An unexpected error occured while launching the test runtime (return code 13). See log /home/jenkins/agent/workspace/ease.verify.core.gerrit/tests/org.eclipse.ease.lang.unittest.test/target/work/data/.metadata/.log for details. -> [Help 1]
03:20:11 [2020-09-24T07:20:11.298Z] [ERROR] 
03:20:11 [2020-09-24T07:20:11.298Z] [ERROR] To see the full stack trace of the errors, re-run Maven with the -e switch.
03:20:11 [2020-09-24T07:20:11.298Z] [ERROR] Re-run Maven using the -X switch to enable full debug logging.
03:20:11 [2020-09-24T07:20:11.298Z] [ERROR] 
03:20:11 [2020-09-24T07:20:11.298Z] [ERROR] For more information about the errors and possible solutions, please read the following articles:
03:20:11 [2020-09-24T07:20:11.298Z] [ERROR] [Help 1] http://cwiki.apache.org/confluence/display/MAVEN/MojoFailureException
03:20:11 [2020-09-24T07:20:11.298Z] [ERROR] 
03:20:11 [2020-09-24T07:20:11.298Z] [ERROR] After correcting the problems, you can resume the build with the command
03:20:11 [2020-09-24T07:20:11.298Z] [ERROR]   mvn <args> -rf :org.eclipse.ease.lang.unittest.test
[Pipeline] }
03:20:13 [2020-09-24T07:20:13.911Z] [withMaven] Publishers: Pipeline Graph Publisher: 28 ms, Invoker Publisher: 1 ms, Junit Publisher: 1 ms, Dependencies Fingerprint Publisher: 1004 ms, Findbugs Publisher: 1 ms
[Pipeline] // withMaven
[Pipeline] }
[Pipeline] // stage
[Pipeline] }
03:20:14 [2020-09-24T07:20:14.176Z] Failed in branch EASE Core
[Pipeline] // parallel
[Pipeline] }
[Pipeline] // stage
[Pipeline] stage
[Pipeline] { (Declarative: Post Actions)
[Pipeline] archiveArtifacts
03:20:14 [2020-09-24T07:20:14.281Z] Archiving artifacts
[Pipeline] emailext
03:20:43 [2020-09-24T07:20:43.803Z] Sending email to: christian.pontesegger@web.de
[Pipeline] }
[Pipeline] // stage
[Pipeline] }
[Pipeline] // timeout
[Pipeline] }
[Pipeline] // timestamps
[Pipeline] }
[Pipeline] // node
[Pipeline] End of Pipeline
ERROR: script returned exit code 1
Finished: FAILURE