FailedConsole Output

Skipping 771 KB.. Full Log
BjCCFBQCV27OjYAAAAA==[INFO] --- build-helper-maven-plugin:1.9.1:add-resource (add_help) @ org.eclipse.ease.lang.javascript.rhino.test ---
03:09:54 [2020-09-24T07:09:54.842Z] [INFO] 
03:09:54 [2020-09-24T07:09:54.842Z] [INFO] --- maven-resources-plugin:2.4.3:resources (default-resources) @ org.eclipse.ease.lang.javascript.rhino.test ---
03:09:54 [2020-09-24T07:09:54.843Z] [INFO] Using 'UTF-8' encoding to copy filtered resources.
03:09:54 [2020-09-24T07:09:54.843Z] [INFO] skip non existing resourceDirectory /home/jenkins/agent/workspace/ease.verify.core.gerrit/tests/org.eclipse.ease.lang.javascript.rhino.test/src/main/resources
03:09:54 [2020-09-24T07:09:54.843Z] [INFO] skip non existing resourceDirectory /home/jenkins/agent/workspace/ease.verify.core.gerrit/tests/org.eclipse.ease.lang.javascript.rhino.test/help
03:09:54 [2020-09-24T07:09:54.843Z] [INFO] 
03:09:54 [2020-09-24T07:09:54.843Z] [INFO] --- tycho-compiler-plugin:1.5.0:compile (default-compile) @ org.eclipse.ease.lang.javascript.rhino.test ---
03:09:54 [2020-09-24T07:09:54.843Z] [INFO] Compiling 4 source files to /home/jenkins/agent/workspace/ease.verify.core.gerrit/tests/org.eclipse.ease.lang.javascript.rhino.test/target/classes
03:09:55 [2020-09-24T07:09:55.102Z] [INFO] 
03:09:55 [2020-09-24T07:09:55.102Z] [INFO] --- maven-resources-plugin:2.4.3:testResources (default-testResources) @ org.eclipse.ease.lang.javascript.rhino.test ---
03:09:55 [2020-09-24T07:09:55.102Z] [INFO] Using 'UTF-8' encoding to copy filtered resources.
03:09:55 [2020-09-24T07:09:55.102Z] [INFO] skip non existing resourceDirectory /home/jenkins/agent/workspace/ease.verify.core.gerrit/tests/org.eclipse.ease.lang.javascript.rhino.test/src/test/resources
03:09:55 [2020-09-24T07:09:55.102Z] [INFO] 
03:09:55 [2020-09-24T07:09:55.102Z] [INFO] --- tycho-source-plugin:1.5.0:plugin-source (plugin-source) @ org.eclipse.ease.lang.javascript.rhino.test ---
03:09:55 [2020-09-24T07:09:55.102Z] [WARNING] Bundle-Vendor header not found in /home/jenkins/agent/workspace/ease.verify.core.gerrit/tests/org.eclipse.ease.lang.javascript.rhino.test/META-INF/MANIFEST.MF, fallback to 'unknown' for source bundle
03:09:55 [2020-09-24T07:09:55.102Z] [INFO] Building jar: /home/jenkins/agent/workspace/ease.verify.core.gerrit/tests/org.eclipse.ease.lang.javascript.rhino.test/target/org.eclipse.ease.lang.javascript.rhino.test-0.8.0-SNAPSHOT-sources.jar
03:09:55 [2020-09-24T07:09:55.102Z] [INFO] 
03:09:55 [2020-09-24T07:09:55.102Z] [INFO] --- target-platform-configuration:1.5.0:target-platform (default-target-platform) @ org.eclipse.ease.lang.javascript.rhino.test ---
03:09:55 [2020-09-24T07:09:55.102Z] [INFO] 
03:09:55 [2020-09-24T07:09:55.102Z] [INFO] --- tycho-packaging-plugin:1.5.0:package-plugin (default-package-plugin) @ org.eclipse.ease.lang.javascript.rhino.test ---
03:09:55 [2020-09-24T07:09:55.102Z] [INFO] Building jar: /home/jenkins/agent/workspace/ease.verify.core.gerrit/tests/org.eclipse.ease.lang.javascript.rhino.test/target/org.eclipse.ease.lang.javascript.rhino.test-0.8.0-SNAPSHOT.jar
03:09:55 [2020-09-24T07:09:55.102Z] [INFO] 
03:09:55 [2020-09-24T07:09:55.102Z] [INFO] --- tycho-p2-plugin:1.5.0:p2-metadata-default (default-p2-metadata-default) @ org.eclipse.ease.lang.javascript.rhino.test ---
03:09:55 [2020-09-24T07:09:55.102Z] [INFO] 
03:09:55 [2020-09-24T07:09:55.102Z] [INFO] --- tycho-source-feature-plugin:1.5.0:source-feature (source-feature) @ org.eclipse.ease.lang.javascript.rhino.test ---
03:09:55 [2020-09-24T07:09:55.102Z] [INFO] 
03:09:55 [2020-09-24T07:09:55.102Z] [INFO] --- tycho-p2-plugin:1.5.0:p2-metadata (attached-p2-metadata) @ org.eclipse.ease.lang.javascript.rhino.test ---
03:09:55 [2020-09-24T07:09:55.102Z] [INFO] 
03:09:55 [2020-09-24T07:09:55.102Z] [INFO] --- tycho-surefire-plugin:1.5.0:test (default-test) @ org.eclipse.ease.lang.javascript.rhino.test ---
03:09:55 [2020-09-24T07:09:55.358Z] [INFO] Expected eclipse log file: /home/jenkins/agent/workspace/ease.verify.core.gerrit/tests/org.eclipse.ease.lang.javascript.rhino.test/target/work/data/.metadata/.log
03:09:55 [2020-09-24T07:09:55.358Z] [INFO] Command line:
03:09:55 [2020-09-24T07:09:55.358Z] 	[/opt/tools/java/openjdk/jdk-11/11.0.2+9/bin/java, -Dosgi.noShutdown=false, -Dosgi.os=linux, -Dosgi.ws=gtk, -Dosgi.arch=x86_64, -Dosgi.clean=true, -jar, /home/jenkins/.m2/repository/p2/osgi/bundle/org.eclipse.equinox.launcher/1.5.800.v20200727-1323/org.eclipse.equinox.launcher-1.5.800.v20200727-1323.jar, -data, /home/jenkins/agent/workspace/ease.verify.core.gerrit/tests/org.eclipse.ease.lang.javascript.rhino.test/target/work/data, -install, /home/jenkins/agent/workspace/ease.verify.core.gerrit/tests/org.eclipse.ease.lang.javascript.rhino.test/target/work, -configuration, /home/jenkins/agent/workspace/ease.verify.core.gerrit/tests/org.eclipse.ease.lang.javascript.rhino.test/target/work/configuration, -application, org.eclipse.tycho.surefire.osgibooter.headlesstest, -testproperties, /home/jenkins/agent/workspace/ease.verify.core.gerrit/tests/org.eclipse.ease.lang.javascript.rhino.test/target/surefire.properties]
03:09:55 [2020-09-24T07:09:55.358Z] Picked up JAVA_TOOL_OPTIONS: -Dmaven.ext.class.path="/home/jenkins/agent/workspace/ease.verify.core.gerrit@tmp/withMaven67bfed35/pipeline-maven-spy.jar" -Dorg.jenkinsci.plugins.pipeline.maven.reportsFolder="/home/jenkins/agent/workspace/ease.verify.core.gerrit@tmp/withMaven67bfed35" 
03:09:57 [2020-09-24T07:09:57.263Z] Running org.eclipse.ease.lang.javascript.rhino.RhinoDebugTest
03:09:57 [2020-09-24T07:09:57.263Z] WARNING: An illegal reflective access operation has occurred
03:09:57 [2020-09-24T07:09:57.263Z] WARNING: Illegal reflective access by org.mockito.cglib.core.ReflectUtils$2 (file:/home/jenkins/.m2/repository/p2/osgi/bundle/org.mockito/1.9.5.v201605172210/org.mockito-1.9.5.v201605172210.jar) to method java.lang.ClassLoader.defineClass(java.lang.String,byte[],int,int,java.security.ProtectionDomain)
03:09:57 [2020-09-24T07:09:57.263Z] WARNING: Please consider reporting this to the maintainers of org.mockito.cglib.core.ReflectUtils$2
03:09:57 [2020-09-24T07:09:57.263Z] WARNING: Use --illegal-access=warn to enable warnings of further illegal reflective access operations
03:09:57 [2020-09-24T07:09:57.263Z] WARNING: All illegal access operations will be denied in a future release
03:09:57 [2020-09-24T07:09:57.263Z] Start of script
03:09:57 [2020-09-24T07:09:57.263Z] include file start
03:09:57 [2020-09-24T07:09:57.263Z] Include file processed
03:09:57 [2020-09-24T07:09:57.263Z] line after include file
03:09:57 [2020-09-24T07:09:57.263Z] Result of testMethod = 5
03:09:57 [2020-09-24T07:09:57.263Z] End of script
03:09:57 [2020-09-24T07:09:57.518Z] Start of script
03:09:57 [2020-09-24T07:09:57.518Z] include file start
03:09:57 [2020-09-24T07:09:57.518Z] Include file processed
03:09:57 [2020-09-24T07:09:57.518Z] line after include file
03:09:57 [2020-09-24T07:09:57.518Z] Result of testMethod = 5
03:09:57 [2020-09-24T07:09:57.518Z] End of script
03:09:57 [2020-09-24T07:09:57.775Z] Start of script
03:09:57 [2020-09-24T07:09:57.775Z] include file start
03:09:57 [2020-09-24T07:09:57.775Z] Include file processed
03:09:57 [2020-09-24T07:09:57.775Z] line after include file
03:09:57 [2020-09-24T07:09:57.775Z] Result of testMethod = 5
03:09:58 [2020-09-24T07:09:58.031Z] Start of script
03:09:58 [2020-09-24T07:09:58.031Z] include file start
03:09:58 [2020-09-24T07:09:58.031Z] Include file processed
03:09:58 [2020-09-24T07:09:58.031Z] line after include file
03:09:58 [2020-09-24T07:09:58.289Z] Result of testMethod = 5
03:09:58 [2020-09-24T07:09:58.289Z] End of script
03:09:58 [2020-09-24T07:09:58.545Z] Start of script
03:09:58 [2020-09-24T07:09:58.545Z] include file start
03:09:58 [2020-09-24T07:09:58.545Z] Include file processed
03:09:58 [2020-09-24T07:09:58.545Z] line after include file
03:09:58 [2020-09-24T07:09:58.545Z] Result of testMethod = 5
03:09:58 [2020-09-24T07:09:58.545Z] End of script
03:09:58 [2020-09-24T07:09:58.545Z] Start of script
03:09:58 [2020-09-24T07:09:58.545Z] include file start
03:09:58 [2020-09-24T07:09:58.545Z] Include file processed
03:09:58 [2020-09-24T07:09:58.545Z] line after include file
03:09:58 [2020-09-24T07:09:58.801Z] Result of testMethod = 5
03:09:58 [2020-09-24T07:09:58.801Z] End of script
03:09:58 [2020-09-24T07:09:58.801Z] Start of script
03:09:58 [2020-09-24T07:09:58.801Z] include file start
03:09:58 [2020-09-24T07:09:58.801Z] Include file processed
03:09:58 [2020-09-24T07:09:58.801Z] line after include file
03:09:58 [2020-09-24T07:09:58.801Z] Result of testMethod = 5
03:09:59 [2020-09-24T07:09:59.362Z] Start of script
03:09:59 [2020-09-24T07:09:59.362Z] include file start
03:09:59 [2020-09-24T07:09:59.362Z] Include file processed
03:09:59 [2020-09-24T07:09:59.362Z] line after include file
03:09:59 [2020-09-24T07:09:59.362Z] Result of testMethod = 5
03:09:59 [2020-09-24T07:09:59.362Z] End of script
03:09:59 [2020-09-24T07:09:59.618Z] Start of script
03:09:59 [2020-09-24T07:09:59.618Z] include file start
03:09:59 [2020-09-24T07:09:59.618Z] Include file processed
03:09:59 [2020-09-24T07:09:59.618Z] line after include file
03:09:59 [2020-09-24T07:09:59.618Z] Result of testMethod = 5
03:09:59 [2020-09-24T07:09:59.618Z] End of script
03:09:59 [2020-09-24T07:09:59.618Z] Start of script
03:09:59 [2020-09-24T07:09:59.618Z] include file start
03:09:59 [2020-09-24T07:09:59.618Z] Include file processed
03:09:59 [2020-09-24T07:09:59.618Z] line after include file
03:10:00 [2020-09-24T07:10:00.179Z] Start of script
03:10:00 [2020-09-24T07:10:00.179Z] include file start
03:10:00 [2020-09-24T07:10:00.179Z] Include file processed
03:10:00 [2020-09-24T07:10:00.179Z] line after include file
03:10:00 [2020-09-24T07:10:00.179Z] Result of testMethod = 5
03:10:00 [2020-09-24T07:10:00.180Z] End of script
03:10:00 [2020-09-24T07:10:00.436Z] Start of script
03:10:00 [2020-09-24T07:10:00.436Z] include file start
03:10:00 [2020-09-24T07:10:00.436Z] Include file processed
03:10:00 [2020-09-24T07:10:00.436Z] line after include file
03:10:00 [2020-09-24T07:10:00.436Z] Result of testMethod = 5
03:10:00 [2020-09-24T07:10:00.436Z] End of script
03:10:00 [2020-09-24T07:10:00.997Z] Start of script
03:10:00 [2020-09-24T07:10:00.997Z] include file start
03:10:00 [2020-09-24T07:10:00.997Z] Include file processed
03:10:00 [2020-09-24T07:10:00.997Z] line after include file
03:10:00 [2020-09-24T07:10:00.997Z] Result of testMethod = 5
03:10:00 [2020-09-24T07:10:00.997Z] End of script
03:10:00 [2020-09-24T07:10:00.997Z] Start of script
03:10:00 [2020-09-24T07:10:00.997Z] include file start
03:10:00 [2020-09-24T07:10:00.997Z] Include file processed
03:10:00 [2020-09-24T07:10:00.997Z] line after include file
03:10:01 [2020-09-24T07:10:01.252Z] Result of testMethod = 5
03:10:01 [2020-09-24T07:10:01.252Z] End of script
03:10:01 [2020-09-24T07:10:01.252Z] Start of script
03:10:01 [2020-09-24T07:10:01.252Z] include file start
03:10:01 [2020-09-24T07:10:01.252Z] Include file processed
03:10:01 [2020-09-24T07:10:01.252Z] line after include file
03:10:01 [2020-09-24T07:10:01.252Z] Result of testMethod = 5
03:10:01 [2020-09-24T07:10:01.814Z] Start of script
03:10:01 [2020-09-24T07:10:01.814Z] include file start
03:10:01 [2020-09-24T07:10:01.814Z] Include file processed
03:10:01 [2020-09-24T07:10:01.814Z] line after include file
03:10:01 [2020-09-24T07:10:01.814Z] Result of testMethod = 5
03:10:01 [2020-09-24T07:10:01.814Z] End of script
03:10:02 [2020-09-24T07:10:02.070Z] Start of script
03:10:02 [2020-09-24T07:10:02.326Z] include file start
03:10:02 [2020-09-24T07:10:02.326Z] Include file processed
03:10:02 [2020-09-24T07:10:02.326Z] line after include file
03:10:02 [2020-09-24T07:10:02.326Z] Result of testMethod = 5
03:10:02 [2020-09-24T07:10:02.326Z] End of script
03:10:02 [2020-09-24T07:10:02.326Z] Start of script
03:10:02 [2020-09-24T07:10:02.326Z] include file start
03:10:02 [2020-09-24T07:10:02.326Z] Include file processed
03:10:02 [2020-09-24T07:10:02.326Z] line after include file
03:10:02 [2020-09-24T07:10:02.581Z] Result of testMethod = 5
03:10:02 [2020-09-24T07:10:02.581Z] End of script
03:10:02 [2020-09-24T07:10:02.837Z] Start of script
03:10:02 [2020-09-24T07:10:02.837Z] include file start
03:10:02 [2020-09-24T07:10:02.837Z] Include file processed
03:10:02 [2020-09-24T07:10:02.837Z] line after include file
03:10:03 [2020-09-24T07:10:03.093Z] Result of testMethod = 5
03:10:03 [2020-09-24T07:10:03.093Z] End of script
03:10:03 [2020-09-24T07:10:03.349Z] Start of script
03:10:03 [2020-09-24T07:10:03.349Z] include file start
03:10:03 [2020-09-24T07:10:03.349Z] Include file processed
03:10:03 [2020-09-24T07:10:03.349Z] line after include file
03:10:03 [2020-09-24T07:10:03.349Z] Result of testMethod = 5
03:10:03 [2020-09-24T07:10:03.607Z] Start of script
03:10:03 [2020-09-24T07:10:03.607Z] include file start
03:10:03 [2020-09-24T07:10:03.607Z] Include file processed
03:10:03 [2020-09-24T07:10:03.607Z] line after include file
03:10:03 [2020-09-24T07:10:03.607Z] Result of testMethod = 5
03:10:03 [2020-09-24T07:10:03.607Z] End of script
03:10:03 [2020-09-24T07:10:03.863Z] Start of script
03:10:03 [2020-09-24T07:10:03.863Z] include file start
03:10:03 [2020-09-24T07:10:03.863Z] Include file processed
03:10:03 [2020-09-24T07:10:03.863Z] line after include file
03:10:03 [2020-09-24T07:10:03.863Z] Result of testMethod = 5
03:10:03 [2020-09-24T07:10:03.863Z] End of script
03:10:04 [2020-09-24T07:10:04.119Z] Start of script
03:10:04 [2020-09-24T07:10:04.119Z] include file start
03:10:04 [2020-09-24T07:10:04.119Z] Include file processed
03:10:04 [2020-09-24T07:10:04.119Z] line after include file
03:10:04 [2020-09-24T07:10:04.119Z] Result of testMethod = 5
03:10:04 [2020-09-24T07:10:04.119Z] End of script
03:10:04 [2020-09-24T07:10:04.119Z] Start of script
03:10:04 [2020-09-24T07:10:04.376Z] include file start
03:10:04 [2020-09-24T07:10:04.376Z] Include file processed
03:10:04 [2020-09-24T07:10:04.376Z] line after include file
03:10:04 [2020-09-24T07:10:04.376Z] Result of testMethod = 5
03:10:04 [2020-09-24T07:10:04.376Z] End of script
03:10:04 [2020-09-24T07:10:04.376Z] Start of script
03:10:04 [2020-09-24T07:10:04.376Z] include file start
03:10:04 [2020-09-24T07:10:04.376Z] Include file processed
03:10:04 [2020-09-24T07:10:04.376Z] line after include file
03:10:04 [2020-09-24T07:10:04.937Z] Start of script
03:10:04 [2020-09-24T07:10:04.937Z] include file start
03:10:04 [2020-09-24T07:10:04.937Z] Include file processed
03:10:04 [2020-09-24T07:10:04.937Z] line after include file
03:10:04 [2020-09-24T07:10:04.937Z] Result of testMethod = 5
03:10:04 [2020-09-24T07:10:04.937Z] End of script
03:10:05 [2020-09-24T07:10:05.193Z] Start of script
03:10:05 [2020-09-24T07:10:05.193Z] include file start
03:10:05 [2020-09-24T07:10:05.193Z] Include file processed
03:10:05 [2020-09-24T07:10:05.193Z] line after include file
03:10:05 [2020-09-24T07:10:05.193Z] Result of testMethod = 5
03:10:05 [2020-09-24T07:10:05.449Z] Start of script
03:10:05 [2020-09-24T07:10:05.449Z] include file start
03:10:05 [2020-09-24T07:10:05.449Z] Include file processed
03:10:05 [2020-09-24T07:10:05.449Z] line after include file
03:10:05 [2020-09-24T07:10:05.449Z] Result of testMethod = 5
03:10:05 [2020-09-24T07:10:05.449Z] End of script
03:10:05 [2020-09-24T07:10:05.706Z] Start of script
03:10:05 [2020-09-24T07:10:05.706Z] include file start
03:10:05 [2020-09-24T07:10:05.706Z] Include file processed
03:10:05 [2020-09-24T07:10:05.706Z] line after include file
03:10:05 [2020-09-24T07:10:05.706Z] Result of testMethod = 5
03:10:05 [2020-09-24T07:10:05.706Z] End of script
03:10:05 [2020-09-24T07:10:05.961Z] Start of script
03:10:05 [2020-09-24T07:10:05.961Z] include file start
03:10:05 [2020-09-24T07:10:05.961Z] Include file processed
03:10:05 [2020-09-24T07:10:05.961Z] line after include file
03:10:05 [2020-09-24T07:10:05.961Z] Result of testMethod = 5
03:10:05 [2020-09-24T07:10:05.961Z] End of script
03:10:06 [2020-09-24T07:10:06.217Z] Start of script
03:10:06 [2020-09-24T07:10:06.217Z] include file start
03:10:06 [2020-09-24T07:10:06.217Z] Include file processed
03:10:06 [2020-09-24T07:10:06.217Z] line after include file
03:10:06 [2020-09-24T07:10:06.217Z] Result of testMethod = 5
03:10:06 [2020-09-24T07:10:06.217Z] End of script
03:10:06 [2020-09-24T07:10:06.473Z] Start of script
03:10:06 [2020-09-24T07:10:06.473Z] include file start
03:10:06 [2020-09-24T07:10:06.473Z] Include file processed
03:10:06 [2020-09-24T07:10:06.473Z] line after include file
03:10:06 [2020-09-24T07:10:06.473Z] Result of testMethod = 5
03:10:06 [2020-09-24T07:10:06.729Z] Start of script
03:10:06 [2020-09-24T07:10:06.729Z] include file start
03:10:06 [2020-09-24T07:10:06.729Z] Include file processed
03:10:06 [2020-09-24T07:10:06.729Z] line after include file
03:10:06 [2020-09-24T07:10:06.729Z] Result of testMethod = 5
03:10:06 [2020-09-24T07:10:06.729Z] End of script
03:10:06 [2020-09-24T07:10:06.984Z] Start of script
03:10:06 [2020-09-24T07:10:06.984Z] include file start
03:10:06 [2020-09-24T07:10:06.984Z] Include file processed
03:10:06 [2020-09-24T07:10:06.984Z] line after include file
03:10:06 [2020-09-24T07:10:06.984Z] Result of testMethod = 5
03:10:07 [2020-09-24T07:10:07.545Z] Start of script
03:10:07 [2020-09-24T07:10:07.545Z] include file start
03:10:07 [2020-09-24T07:10:07.545Z] Include file processed
03:10:07 [2020-09-24T07:10:07.545Z] line after include file
03:10:07 [2020-09-24T07:10:07.545Z] Result of testMethod = 5
03:10:07 [2020-09-24T07:10:07.545Z] End of script
03:10:07 [2020-09-24T07:10:07.545Z] Start of script
03:10:07 [2020-09-24T07:10:07.545Z] include file start
03:10:07 [2020-09-24T07:10:07.545Z] Include file processed
03:10:07 [2020-09-24T07:10:07.545Z] line after include file
03:10:07 [2020-09-24T07:10:07.801Z] Result of testMethod = 5
03:10:07 [2020-09-24T07:10:07.801Z] End of script
03:10:08 [2020-09-24T07:10:08.056Z] Start of script
03:10:08 [2020-09-24T07:10:08.056Z] include file start
03:10:08 [2020-09-24T07:10:08.056Z] Include file processed
03:10:08 [2020-09-24T07:10:08.056Z] line after include file
03:10:08 [2020-09-24T07:10:08.056Z] Result of testMethod = 5
03:10:08 [2020-09-24T07:10:08.056Z] End of script
03:10:08 [2020-09-24T07:10:08.056Z] Tests run: 42, Failures: 0, Errors: 0, Skipped: 0, Time elapsed: 11.245 s - in org.eclipse.ease.lang.javascript.rhino.RhinoDebugTest
03:10:08 [2020-09-24T07:10:08.056Z] disconnectProcessInSuspendedState(org.eclipse.ease.lang.javascript.rhino.RhinoDebugTest)  Time elapsed: 0.496 s
03:10:08 [2020-09-24T07:10:08.056Z] stepReturnIncludeCommand(org.eclipse.ease.lang.javascript.rhino.RhinoDebugTest)  Time elapsed: 0.21 s
03:10:08 [2020-09-24T07:10:08.057Z] arrayVariableSorting(org.eclipse.ease.lang.javascript.rhino.RhinoDebugTest)  Time elapsed: 0.31 s
03:10:08 [2020-09-24T07:10:08.057Z] stepOverOnDebugTarget(org.eclipse.ease.lang.javascript.rhino.RhinoDebugTest)  Time elapsed: 0.31 s
03:10:08 [2020-09-24T07:10:08.057Z] hasDebugTarget(org.eclipse.ease.lang.javascript.rhino.RhinoDebugTest)  Time elapsed: 0.106 s
03:10:08 [2020-09-24T07:10:08.057Z] disconnectThreadInSuspendedState(org.eclipse.ease.lang.javascript.rhino.RhinoDebugTest)  Time elapsed: 0.208 s
03:10:08 [2020-09-24T07:10:08.057Z] stepReturnOnDebugTarget(org.eclipse.ease.lang.javascript.rhino.RhinoDebugTest)  Time elapsed: 0.309 s
03:10:08 [2020-09-24T07:10:08.057Z] nullVariable(org.eclipse.ease.lang.javascript.rhino.RhinoDebugTest)  Time elapsed: 0.308 s
03:10:08 [2020-09-24T07:10:08.057Z] stepOverOnStackFrame(org.eclipse.ease.lang.javascript.rhino.RhinoDebugTest)  Time elapsed: 0.308 s
03:10:08 [2020-09-24T07:10:08.057Z] resumeOnDebugTarget(org.eclipse.ease.lang.javascript.rhino.RhinoDebugTest)  Time elapsed: 0.207 s
03:10:08 [2020-09-24T07:10:08.057Z] modifyVariableKeepingType(org.eclipse.ease.lang.javascript.rhino.RhinoDebugTest)  Time elapsed: 0.407 s
03:10:08 [2020-09-24T07:10:08.057Z] resumeOnLastIncludeLine(org.eclipse.ease.lang.javascript.rhino.RhinoDebugTest)  Time elapsed: 0.207 s
03:10:08 [2020-09-24T07:10:08.057Z] stepReturnOnStackFrame(org.eclipse.ease.lang.javascript.rhino.RhinoDebugTest)  Time elapsed: 0.308 s
03:10:08 [2020-09-24T07:10:08.057Z] terminateStackFrameInSuspendedState(org.eclipse.ease.lang.javascript.rhino.RhinoDebugTest)  Time elapsed: 0.208 s
03:10:08 [2020-09-24T07:10:08.057Z] breakpointLocation(org.eclipse.ease.lang.javascript.rhino.RhinoDebugTest)  Time elapsed: 0.207 s
03:10:08 [2020-09-24T07:10:08.057Z] stepReturnOnThread(org.eclipse.ease.lang.javascript.rhino.RhinoDebugTest)  Time elapsed: 0.309 s
03:10:08 [2020-09-24T07:10:08.057Z] javaClassVariable(org.eclipse.ease.lang.javascript.rhino.RhinoDebugTest)  Time elapsed: 0.308 s
03:10:08 [2020-09-24T07:10:08.057Z] stepIntoOnThread(org.eclipse.ease.lang.javascript.rhino.RhinoDebugTest)  Time elapsed: 0.309 s
03:10:08 [2020-09-24T07:10:08.057Z] terminateThreadInSuspendedState(org.eclipse.ease.lang.javascript.rhino.RhinoDebugTest)  Time elapsed: 0.208 s
03:10:08 [2020-09-24T07:10:08.057Z] resumeOnThread(org.eclipse.ease.lang.javascript.rhino.RhinoDebugTest)  Time elapsed: 0.208 s
03:10:08 [2020-09-24T07:10:08.057Z] stepIntoOnStackFrame(org.eclipse.ease.lang.javascript.rhino.RhinoDebugTest)  Time elapsed: 0.308 s
03:10:08 [2020-09-24T07:10:08.057Z] terminateProcessInSuspendedState(org.eclipse.ease.lang.javascript.rhino.RhinoDebugTest)  Time elapsed: 0.208 s
03:10:08 [2020-09-24T07:10:08.057Z] stepOverOnProcess(org.eclipse.ease.lang.javascript.rhino.RhinoDebugTest)  Time elapsed: 0.306 s
03:10:08 [2020-09-24T07:10:08.057Z] nativeArrayVariable(org.eclipse.ease.lang.javascript.rhino.RhinoDebugTest)  Time elapsed: 0.308 s
03:10:08 [2020-09-24T07:10:08.057Z] disconnectDebugTargetInSuspendedState(org.eclipse.ease.lang.javascript.rhino.RhinoDebugTest)  Time elapsed: 0.207 s
03:10:08 [2020-09-24T07:10:08.057Z] stepIntoOnProcess(org.eclipse.ease.lang.javascript.rhino.RhinoDebugTest)  Time elapsed: 0.307 s
03:10:08 [2020-09-24T07:10:08.057Z] terminatedState(org.eclipse.ease.lang.javascript.rhino.RhinoDebugTest)  Time elapsed: 0.105 s
03:10:08 [2020-09-24T07:10:08.057Z] stepOverIncludeCommand(org.eclipse.ease.lang.javascript.rhino.RhinoDebugTest)  Time elapsed: 0.305 s
03:10:08 [2020-09-24T07:10:08.057Z] innerScopeVariableBeforeOuterScopeVariable(org.eclipse.ease.lang.javascript.rhino.RhinoDebugTest)  Time elapsed: 0.307 s
03:10:08 [2020-09-24T07:10:08.057Z] stepIntoIncludeCommand(org.eclipse.ease.lang.javascript.rhino.RhinoDebugTest)  Time elapsed: 0.305 s
03:10:08 [2020-09-24T07:10:08.057Z] primitiveStringVariable(org.eclipse.ease.lang.javascript.rhino.RhinoDebugTest)  Time elapsed: 0.306 s
03:10:08 [2020-09-24T07:10:08.057Z] resumeOnProcess(org.eclipse.ease.lang.javascript.rhino.RhinoDebugTest)  Time elapsed: 0.206 s
03:10:08 [2020-09-24T07:10:08.057Z] stepIntoOnDebugTarget(org.eclipse.ease.lang.javascript.rhino.RhinoDebugTest)  Time elapsed: 0.306 s
03:10:08 [2020-09-24T07:10:08.057Z] stepOverOnThread(org.eclipse.ease.lang.javascript.rhino.RhinoDebugTest)  Time elapsed: 0.306 s
03:10:08 [2020-09-24T07:10:08.058Z] suspendedState(org.eclipse.ease.lang.javascript.rhino.RhinoDebugTest)  Time elapsed: 0.205 s
03:10:08 [2020-09-24T07:10:08.058Z] primitiveDoubleVariable(org.eclipse.ease.lang.javascript.rhino.RhinoDebugTest)  Time elapsed: 0.307 s
03:10:08 [2020-09-24T07:10:08.058Z] resumeOnStackFrame(org.eclipse.ease.lang.javascript.rhino.RhinoDebugTest)  Time elapsed: 0.205 s
03:10:08 [2020-09-24T07:10:08.058Z] nativeObjectVariable(org.eclipse.ease.lang.javascript.rhino.RhinoDebugTest)  Time elapsed: 0.306 s
03:10:08 [2020-09-24T07:10:08.058Z] terminateDebugTargetInSuspendedState(org.eclipse.ease.lang.javascript.rhino.RhinoDebugTest)  Time elapsed: 0.206 s
03:10:08 [2020-09-24T07:10:08.058Z] disconnectStackFrameInSuspendedState(org.eclipse.ease.lang.javascript.rhino.RhinoDebugTest)  Time elapsed: 0.206 s
03:10:08 [2020-09-24T07:10:08.058Z] stepReturnOnProcess(org.eclipse.ease.lang.javascript.rhino.RhinoDebugTest)  Time elapsed: 0.306 s
03:10:08 [2020-09-24T07:10:08.058Z] evaluateWatchExpression(org.eclipse.ease.lang.javascript.rhino.RhinoDebugTest)  Time elapsed: 0.208 s
03:10:08 [2020-09-24T07:10:08.058Z] Running org.eclipse.ease.lang.javascript.rhino.RhinoDebuggerEngineTest
03:10:08 [2020-09-24T07:10:08.314Z] org.eclipse.ease.ScriptExecutionException: JavaError: NotThere cannot be found by org.mozilla.javascript_1.7.10.v20190430-1943
03:10:08 [2020-09-24T07:10:08.314Z] 
03:10:08 [2020-09-24T07:10:08.314Z] Java Stacktrace:
03:10:08 [2020-09-24T07:10:08.314Z] java.lang.ClassNotFoundException: NotThere cannot be found by org.mozilla.javascript_1.7.10.v20190430-1943
03:10:08 [2020-09-24T07:10:08.314Z] 	at org.eclipse.osgi.internal.loader.BundleLoader.findClass(BundleLoader.java:516)
03:10:08 [2020-09-24T07:10:08.314Z] 	at org.eclipse.osgi.internal.loader.ModuleClassLoader.loadClass(ModuleClassLoader.java:171)
03:10:08 [2020-09-24T07:10:08.314Z] 	at java.base/java.lang.ClassLoader.loadClass(ClassLoader.java:521)
03:10:08 [2020-09-24T07:10:08.314Z] 	at java.base/java.lang.Class.forName0(Native Method)
03:10:08 [2020-09-24T07:10:08.314Z] 	at java.base/java.lang.Class.forName(Class.java:315)
03:10:08 [2020-09-24T07:10:08.314Z] 	at java.base/jdk.internal.reflect.NativeMethodAccessorImpl.invoke0(Native Method)
03:10:08 [2020-09-24T07:10:08.314Z] 	at java.base/jdk.internal.reflect.NativeMethodAccessorImpl.invoke(NativeMethodAccessorImpl.java:62)
03:10:08 [2020-09-24T07:10:08.314Z] 	at java.base/jdk.internal.reflect.DelegatingMethodAccessorImpl.invoke(DelegatingMethodAccessorImpl.java:43)
03:10:08 [2020-09-24T07:10:08.314Z] 	at java.base/java.lang.reflect.Method.invoke(Method.java:566)
03:10:08 [2020-09-24T07:10:08.315Z] 	at org.mozilla.javascript.MemberBox.invoke(MemberBox.java:126)
03:10:08 [2020-09-24T07:10:08.315Z] 	at org.mozilla.javascript.NativeJavaMethod.call(NativeJavaMethod.java:225)
03:10:08 [2020-09-24T07:10:08.315Z] 	at org.mozilla.javascript.Interpreter.interpretLoop(Interpreter.java:1573)
03:10:08 [2020-09-24T07:10:08.315Z] 	at org.mozilla.javascript.Interpreter.interpret(Interpreter.java:911)
03:10:08 [2020-09-24T07:10:08.315Z] 	at org.mozilla.javascript.InterpretedFunction.call(InterpretedFunction.java:109)
03:10:08 [2020-09-24T07:10:08.315Z] 	at org.mozilla.javascript.ContextFactory.doTopCall(ContextFactory.java:405)
03:10:08 [2020-09-24T07:10:08.315Z] 	at org.mozilla.javascript.ScriptRuntime.doTopCall(ScriptRuntime.java:3508)
03:10:08 [2020-09-24T07:10:08.315Z] 	at org.mozilla.javascript.InterpretedFunction.exec(InterpretedFunction.java:120)
03:10:08 [2020-09-24T07:10:08.315Z] 	at org.mozilla.javascript.Context.evaluateReader(Context.java:1293)
03:10:08 [2020-09-24T07:10:08.315Z] 	at org.eclipse.ease.lang.javascript.rhino.RhinoScriptEngine.internalExecute(RhinoScriptEngine.java:222)
03:10:08 [2020-09-24T07:10:08.315Z] 	at org.eclipse.ease.lang.javascript.rhino.RhinoScriptEngine.execute(RhinoScriptEngine.java:201)
03:10:08 [2020-09-24T07:10:08.315Z] 	at org.eclipse.ease.AbstractScriptEngine.inject(AbstractScriptEngine.java:222)
03:10:08 [2020-09-24T07:10:08.315Z] 	at org.eclipse.ease.AbstractScriptEngine.run(AbstractScriptEngine.java:272)
03:10:08 [2020-09-24T07:10:08.315Z] 	at org.eclipse.core.internal.jobs.Worker.run(Worker.java:63)
03:10:08 [2020-09-24T07:10:08.315Z] org.eclipse.ease.ScriptExecutionException: TypeError: Cannot call method "foobar" of undefined
03:10:08 [2020-09-24T07:10:08.315Z] org.eclipse.ease.ScriptExecutionException: ScriptException: test
03:10:08 [2020-09-24T07:10:08.315Z] org.eclipse.ease.ScriptExecutionException: JavaError: java.lang.Exception
03:10:08 [2020-09-24T07:10:08.315Z] 
03:10:08 [2020-09-24T07:10:08.315Z] Java Stacktrace:
03:10:08 [2020-09-24T07:10:08.315Z] java.lang.Exception
03:10:08 [2020-09-24T07:10:08.315Z] 	at java.base/jdk.internal.reflect.NativeConstructorAccessorImpl.newInstance0(Native Method)
03:10:08 [2020-09-24T07:10:08.315Z] 	at java.base/jdk.internal.reflect.NativeConstructorAccessorImpl.newInstance(NativeConstructorAccessorImpl.java:62)
03:10:08 [2020-09-24T07:10:08.315Z] 	at java.base/jdk.internal.reflect.DelegatingConstructorAccessorImpl.newInstance(DelegatingConstructorAccessorImpl.java:45)
03:10:08 [2020-09-24T07:10:08.315Z] 	at java.base/java.lang.reflect.Constructor.newInstance(Constructor.java:490)
03:10:08 [2020-09-24T07:10:08.315Z] 	at org.mozilla.javascript.MemberBox.newInstance(MemberBox.java:159)
03:10:08 [2020-09-24T07:10:08.315Z] 	at org.mozilla.javascript.NativeJavaClass.constructInternal(NativeJavaClass.java:266)
03:10:08 [2020-09-24T07:10:08.315Z] 	at org.mozilla.javascript.NativeJavaClass.constructSpecific(NativeJavaClass.java:205)
03:10:08 [2020-09-24T07:10:08.315Z] 	at org.mozilla.javascript.NativeJavaClass.construct(NativeJavaClass.java:166)
03:10:08 [2020-09-24T07:10:08.315Z] 	at org.mozilla.javascript.Interpreter.interpretLoop(Interpreter.java:1617)
03:10:08 [2020-09-24T07:10:08.315Z] 	at org.mozilla.javascript.Interpreter.interpret(Interpreter.java:911)
03:10:08 [2020-09-24T07:10:08.315Z] 	at org.mozilla.javascript.InterpretedFunction.call(InterpretedFunction.java:109)
03:10:08 [2020-09-24T07:10:08.315Z] 	at org.mozilla.javascript.ContextFactory.doTopCall(ContextFactory.java:405)
03:10:08 [2020-09-24T07:10:08.315Z] 	at org.mozilla.javascript.ScriptRuntime.doTopCall(ScriptRuntime.java:3508)
03:10:08 [2020-09-24T07:10:08.315Z] 	at org.mozilla.javascript.InterpretedFunction.exec(InterpretedFunction.java:120)
03:10:08 [2020-09-24T07:10:08.315Z] 	at org.mozilla.javascript.Context.evaluateReader(Context.java:1293)
03:10:08 [2020-09-24T07:10:08.315Z] 	at org.eclipse.ease.lang.javascript.rhino.RhinoScriptEngine.internalExecute(RhinoScriptEngine.java:222)
03:10:08 [2020-09-24T07:10:08.315Z] 	at org.eclipse.ease.lang.javascript.rhino.RhinoScriptEngine.execute(RhinoScriptEngine.java:201)
03:10:08 [2020-09-24T07:10:08.315Z] 	at org.eclipse.ease.AbstractScriptEngine.inject(AbstractScriptEngine.java:222)
03:10:08 [2020-09-24T07:10:08.315Z] 	at org.eclipse.ease.AbstractScriptEngine.run(AbstractScriptEngine.java:272)
03:10:08 [2020-09-24T07:10:08.315Z] 	at org.eclipse.core.internal.jobs.Worker.run(Worker.java:63)
03:10:08 [2020-09-24T07:10:08.315Z] org.eclipse.ease.ScriptExecutionException: ScriptException: JavaScript
03:10:08 [2020-09-24T07:10:08.315Z] org.eclipse.ease.ScriptExecutionException: SyntaxError: unterminated string literal (#1)
03:10:08 [2020-09-24T07:10:08.315Z] 'asdf
03:10:08 [2020-09-24T07:10:08.315Z]     ^
03:10:08 [2020-09-24T07:10:08.315Z] 	at <unknown source>:1
03:10:08 [2020-09-24T07:10:08.315Z] Tests run: 12, Failures: 0, Errors: 0, Skipped: 0, Time elapsed: 0.196 s - in org.eclipse.ease.lang.javascript.rhino.RhinoDebuggerEngineTest
03:10:08 [2020-09-24T07:10:08.315Z] getExceptionStackTrace(org.eclipse.ease.lang.javascript.rhino.RhinoDebuggerEngineTest)  Time elapsed: 0.022 s
03:10:08 [2020-09-24T07:10:08.315Z] causeWrappedException(org.eclipse.ease.lang.javascript.rhino.RhinoDebuggerEngineTest)  Time elapsed: 0.014 s
03:10:08 [2020-09-24T07:10:08.315Z] optionalModuleParameters(org.eclipse.ease.lang.javascript.rhino.RhinoDebuggerEngineTest)  Time elapsed: 0.01 s
03:10:08 [2020-09-24T07:10:08.315Z] simpleScriptCode(org.eclipse.ease.lang.javascript.rhino.RhinoDebuggerEngineTest)  Time elapsed: 0.036 s
03:10:08 [2020-09-24T07:10:08.315Z] causeRuntimeErrorException(org.eclipse.ease.lang.javascript.rhino.RhinoDebuggerEngineTest)  Time elapsed: 0.015 s
03:10:08 [2020-09-24T07:10:08.315Z] callModuleCode(org.eclipse.ease.lang.javascript.rhino.RhinoDebuggerEngineTest)  Time elapsed: 0.01 s
03:10:08 [2020-09-24T07:10:08.315Z] throwJavaClass(org.eclipse.ease.lang.javascript.rhino.RhinoDebuggerEngineTest)  Time elapsed: 0.01 s
03:10:08 [2020-09-24T07:10:08.315Z] throwJavaException(org.eclipse.ease.lang.javascript.rhino.RhinoDebuggerEngineTest)  Time elapsed: 0.009 s
03:10:08 [2020-09-24T07:10:08.315Z] accessJavaClasses(org.eclipse.ease.lang.javascript.rhino.RhinoDebuggerEngineTest)  Time elapsed: 0.009 s
03:10:08 [2020-09-24T07:10:08.315Z] accessEclipseClasses(org.eclipse.ease.lang.javascript.rhino.RhinoDebuggerEngineTest)  Time elapsed: 0.011 s
03:10:08 [2020-09-24T07:10:08.315Z] throwJavaScriptException(org.eclipse.ease.lang.javascript.rhino.RhinoDebuggerEngineTest)  Time elapsed: 0.009 s
03:10:08 [2020-09-24T07:10:08.315Z] causeSyntaxErrorException(org.eclipse.ease.lang.javascript.rhino.RhinoDebuggerEngineTest)  Time elapsed: 0.01 s
03:10:08 [2020-09-24T07:10:08.315Z] Running org.eclipse.ease.lang.javascript.rhino.RhinoEnvironmentTest
03:10:08 [2020-09-24T07:10:08.571Z] Tests run: 5, Failures: 0, Errors: 0, Skipped: 0, Time elapsed: 0.219 s - in org.eclipse.ease.lang.javascript.rhino.RhinoEnvironmentTest
03:10:08 [2020-09-24T07:10:08.571Z] reloadEnvironment(org.eclipse.ease.lang.javascript.rhino.RhinoEnvironmentTest)  Time elapsed: 0.106 s
03:10:08 [2020-09-24T07:10:08.571Z] bootstrappedEnvironment(org.eclipse.ease.lang.javascript.rhino.RhinoEnvironmentTest)  Time elapsed: 0.014 s
03:10:08 [2020-09-24T07:10:08.571Z] postMethodCallback(org.eclipse.ease.lang.javascript.rhino.RhinoEnvironmentTest)  Time elapsed: 0.057 s
03:10:08 [2020-09-24T07:10:08.571Z] preMethodCallback(org.eclipse.ease.lang.javascript.rhino.RhinoEnvironmentTest)  Time elapsed: 0.02 s
03:10:08 [2020-09-24T07:10:08.571Z] reloadFunctionDefinitions(org.eclipse.ease.lang.javascript.rhino.RhinoEnvironmentTest)  Time elapsed: 0.021 s
03:10:08 [2020-09-24T07:10:08.571Z] Running org.eclipse.ease.lang.javascript.rhino.RhinoScriptEngineTest
03:10:08 [2020-09-24T07:10:08.571Z] org.eclipse.ease.ScriptExecutionException: JavaError: NotThere cannot be found by org.mozilla.javascript_1.7.10.v20190430-1943
03:10:08 [2020-09-24T07:10:08.571Z] 	at <unknown source>
03:10:08 [2020-09-24T07:10:08.571Z] 
03:10:08 [2020-09-24T07:10:08.571Z] Java Stacktrace:
03:10:08 [2020-09-24T07:10:08.571Z] java.lang.ClassNotFoundException: NotThere cannot be found by org.mozilla.javascript_1.7.10.v20190430-1943
03:10:08 [2020-09-24T07:10:08.571Z] 	at org.eclipse.osgi.internal.loader.BundleLoader.findClass(BundleLoader.java:516)
03:10:08 [2020-09-24T07:10:08.571Z] 	at org.eclipse.osgi.internal.loader.ModuleClassLoader.loadClass(ModuleClassLoader.java:171)
03:10:08 [2020-09-24T07:10:08.571Z] 	at java.base/java.lang.ClassLoader.loadClass(ClassLoader.java:521)
03:10:08 [2020-09-24T07:10:08.571Z] 	at java.base/java.lang.Class.forName0(Native Method)
03:10:08 [2020-09-24T07:10:08.571Z] 	at java.base/java.lang.Class.forName(Class.java:315)
03:10:08 [2020-09-24T07:10:08.571Z] 	at java.base/jdk.internal.reflect.NativeMethodAccessorImpl.invoke0(Native Method)
03:10:08 [2020-09-24T07:10:08.572Z] 	at java.base/jdk.internal.reflect.NativeMethodAccessorImpl.invoke(NativeMethodAccessorImpl.java:62)
03:10:08 [2020-09-24T07:10:08.572Z] 	at java.base/jdk.internal.reflect.DelegatingMethodAccessorImpl.invoke(DelegatingMethodAccessorImpl.java:43)
03:10:08 [2020-09-24T07:10:08.572Z] 	at java.base/java.lang.reflect.Method.invoke(Method.java:566)
03:10:08 [2020-09-24T07:10:08.572Z] 	at org.mozilla.javascript.MemberBox.invoke(MemberBox.java:126)
03:10:08 [2020-09-24T07:10:08.572Z] 	at org.mozilla.javascript.NativeJavaMethod.call(NativeJavaMethod.java:225)
03:10:08 [2020-09-24T07:10:08.572Z] 	at org.mozilla.javascript.optimizer.OptRuntime.call1(OptRuntime.java:32)
03:10:08 [2020-09-24T07:10:08.572Z] 	at org.mozilla.javascript.gen.c_27._c_script_0(Unknown Source)
03:10:08 [2020-09-24T07:10:08.572Z] 	at org.mozilla.javascript.gen.c_27.call(Unknown Source)
03:10:08 [2020-09-24T07:10:08.572Z] 	at org.mozilla.javascript.ContextFactory.doTopCall(ContextFactory.java:405)
03:10:08 [2020-09-24T07:10:08.572Z] 	at org.mozilla.javascript.ScriptRuntime.doTopCall(ScriptRuntime.java:3508)
03:10:08 [2020-09-24T07:10:08.572Z] 	at org.mozilla.javascript.gen.c_27.call(Unknown Source)
03:10:08 [2020-09-24T07:10:08.572Z] 	at org.mozilla.javascript.gen.c_27.exec(Unknown Source)
03:10:08 [2020-09-24T07:10:08.572Z] 	at org.mozilla.javascript.Context.evaluateReader(Context.java:1293)
03:10:08 [2020-09-24T07:10:08.572Z] 	at org.eclipse.ease.lang.javascript.rhino.RhinoScriptEngine.internalExecute(RhinoScriptEngine.java:222)
03:10:08 [2020-09-24T07:10:08.572Z] 	at org.eclipse.ease.lang.javascript.rhino.RhinoScriptEngine.execute(RhinoScriptEngine.java:201)
03:10:08 [2020-09-24T07:10:08.572Z] 	at org.eclipse.ease.AbstractScriptEngine.inject(AbstractScriptEngine.java:222)
03:10:08 [2020-09-24T07:10:08.572Z] 	at org.eclipse.ease.AbstractScriptEngine.run(AbstractScriptEngine.java:272)
03:10:08 [2020-09-24T07:10:08.572Z] 	at org.eclipse.core.internal.jobs.Worker.run(Worker.java:63)
03:10:08 [2020-09-24T07:10:08.572Z] org.eclipse.ease.ScriptExecutionException: TypeError: Cannot call method "foobar" of undefined
03:10:08 [2020-09-24T07:10:08.572Z] 	at <unknown source>
03:10:08 [2020-09-24T07:10:08.572Z] org.eclipse.ease.ScriptExecutionException: ScriptException: test
03:10:08 [2020-09-24T07:10:08.572Z] 	at <unknown source>
03:10:08 [2020-09-24T07:10:08.572Z] org.eclipse.ease.ScriptExecutionException: JavaError: java.lang.Exception
03:10:08 [2020-09-24T07:10:08.572Z] 	at <unknown source>
03:10:08 [2020-09-24T07:10:08.572Z] 
03:10:08 [2020-09-24T07:10:08.572Z] Java Stacktrace:
03:10:08 [2020-09-24T07:10:08.572Z] java.lang.Exception
03:10:08 [2020-09-24T07:10:08.572Z] 	at java.base/jdk.internal.reflect.NativeConstructorAccessorImpl.newInstance0(Native Method)
03:10:08 [2020-09-24T07:10:08.572Z] 	at java.base/jdk.internal.reflect.NativeConstructorAccessorImpl.newInstance(NativeConstructorAccessorImpl.java:62)
03:10:08 [2020-09-24T07:10:08.572Z] 	at java.base/jdk.internal.reflect.DelegatingConstructorAccessorImpl.newInstance(DelegatingConstructorAccessorImpl.java:45)
03:10:08 [2020-09-24T07:10:08.572Z] 	at java.base/java.lang.reflect.Constructor.newInstance(Constructor.java:490)
03:10:08 [2020-09-24T07:10:08.572Z] 	at org.mozilla.javascript.MemberBox.newInstance(MemberBox.java:159)
03:10:08 [2020-09-24T07:10:08.572Z] 	at org.mozilla.javascript.NativeJavaClass.constructInternal(NativeJavaClass.java:266)
03:10:08 [2020-09-24T07:10:08.572Z] 	at org.mozilla.javascript.NativeJavaClass.constructSpecific(NativeJavaClass.java:205)
03:10:08 [2020-09-24T07:10:08.572Z] 	at org.mozilla.javascript.NativeJavaClass.construct(NativeJavaClass.java:166)
03:10:08 [2020-09-24T07:10:08.572Z] 	at org.mozilla.javascript.ScriptRuntime.newObject(ScriptRuntime.java:2655)
03:10:08 [2020-09-24T07:10:08.572Z] 	at org.mozilla.javascript.gen.c_45._c_script_0(Unknown Source)
03:10:08 [2020-09-24T07:10:08.572Z] 	at org.mozilla.javascript.gen.c_45.call(Unknown Source)
03:10:08 [2020-09-24T07:10:08.572Z] 	at org.mozilla.javascript.ContextFactory.doTopCall(ContextFactory.java:405)
03:10:08 [2020-09-24T07:10:08.572Z] 	at org.mozilla.javascript.ScriptRuntime.doTopCall(ScriptRuntime.java:3508)
03:10:08 [2020-09-24T07:10:08.572Z] 	at org.mozilla.javascript.gen.c_45.call(Unknown Source)
03:10:08 [2020-09-24T07:10:08.572Z] 	at org.mozilla.javascript.gen.c_45.exec(Unknown Source)
03:10:08 [2020-09-24T07:10:08.572Z] 	at org.mozilla.javascript.Context.evaluateReader(Context.java:1293)
03:10:08 [2020-09-24T07:10:08.572Z] 	at org.eclipse.ease.lang.javascript.rhino.RhinoScriptEngine.internalExecute(RhinoScriptEngine.java:222)
03:10:08 [2020-09-24T07:10:08.572Z] 	at org.eclipse.ease.lang.javascript.rhino.RhinoScriptEngine.execute(RhinoScriptEngine.java:201)
03:10:08 [2020-09-24T07:10:08.572Z] 	at org.eclipse.ease.AbstractScriptEngine.inject(AbstractScriptEngine.java:222)
03:10:08 [2020-09-24T07:10:08.572Z] 	at org.eclipse.ease.AbstractScriptEngine.run(AbstractScriptEngine.java:272)
03:10:08 [2020-09-24T07:10:08.572Z] 	at org.eclipse.core.internal.jobs.Worker.run(Worker.java:63)
03:10:08 [2020-09-24T07:10:08.829Z] org.eclipse.ease.ScriptExecutionException: ScriptException: JavaScript
03:10:08 [2020-09-24T07:10:08.829Z] 	at <unknown source>
03:10:08 [2020-09-24T07:10:08.829Z] org.eclipse.ease.ScriptExecutionException: SyntaxError: unterminated string literal (#1)
03:10:08 [2020-09-24T07:10:08.829Z] 'asdf
03:10:08 [2020-09-24T07:10:08.829Z]     ^
03:10:08 [2020-09-24T07:10:08.829Z] 	at <unknown source>
03:10:08 [2020-09-24T07:10:08.829Z] Tests run: 11, Failures: 0, Errors: 0, Skipped: 0, Time elapsed: 0.161 s - in org.eclipse.ease.lang.javascript.rhino.RhinoScriptEngineTest
03:10:08 [2020-09-24T07:10:08.829Z] causeWrappedException(org.eclipse.ease.lang.javascript.rhino.RhinoScriptEngineTest)  Time elapsed: 0.01 s
03:10:08 [2020-09-24T07:10:08.829Z] optionalModuleParameters(org.eclipse.ease.lang.javascript.rhino.RhinoScriptEngineTest)  Time elapsed: 0.012 s
03:10:08 [2020-09-24T07:10:08.829Z] simpleScriptCode(org.eclipse.ease.lang.javascript.rhino.RhinoScriptEngineTest)  Time elapsed: 0.041 s
03:10:08 [2020-09-24T07:10:08.829Z] causeRuntimeErrorException(org.eclipse.ease.lang.javascript.rhino.RhinoScriptEngineTest)  Time elapsed: 0.008 s
03:10:08 [2020-09-24T07:10:08.829Z] callModuleCode(org.eclipse.ease.lang.javascript.rhino.RhinoScriptEngineTest)  Time elapsed: 0.013 s
03:10:08 [2020-09-24T07:10:08.829Z] throwJavaClass(org.eclipse.ease.lang.javascript.rhino.RhinoScriptEngineTest)  Time elapsed: 0.008 s
03:10:08 [2020-09-24T07:10:08.829Z] throwJavaException(org.eclipse.ease.lang.javascript.rhino.RhinoScriptEngineTest)  Time elapsed: 0.009 s
03:10:08 [2020-09-24T07:10:08.829Z] accessJavaClasses(org.eclipse.ease.lang.javascript.rhino.RhinoScriptEngineTest)  Time elapsed: 0.014 s
03:10:08 [2020-09-24T07:10:08.829Z] accessEclipseClasses(org.eclipse.ease.lang.javascript.rhino.RhinoScriptEngineTest)  Time elapsed: 0.008 s
03:10:08 [2020-09-24T07:10:08.829Z] throwJavaScriptException(org.eclipse.ease.lang.javascript.rhino.RhinoScriptEngineTest)  Time elapsed: 0.009 s
03:10:08 [2020-09-24T07:10:08.829Z] causeSyntaxErrorException(org.eclipse.ease.lang.javascript.rhino.RhinoScriptEngineTest)  Time elapsed: 0.029 s
03:10:08 [2020-09-24T07:10:08.829Z] 
03:10:08 [2020-09-24T07:10:08.829Z] Results:
03:10:08 [2020-09-24T07:10:08.829Z] 
03:10:08 [2020-09-24T07:10:08.829Z] Tests run: 70, Failures: 0, Errors: 0, Skipped: 0
03:10:08 [2020-09-24T07:10:08.829Z] 
03:10:09 [2020-09-24T07:10:09.390Z] [INFO] All tests passed!
03:10:09 [2020-09-24T07:10:09.390Z] [INFO] 
03:10:09 [2020-09-24T07:10:09.390Z] [INFO] -------< org.eclipse.ease:org.eclipse.ease.lang.javascript.test >-------
03:10:09 [2020-09-24T07:10:09.390Z] [INFO] Building org.eclipse.ease.lang.javascript.test 0.8.0-SNAPSHOT    [41/48]
03:10:09 [2020-09-24T07:10:09.390Z] [INFO] ------------------------[ eclipse-test-plugin ]-------------------------
03:10:09 [2020-09-24T07:10:09.390Z] [INFO] 
03:10:09 [2020-09-24T07:10:09.390Z] [INFO] --- maven-clean-plugin:2.5:clean (default-clean) @ org.eclipse.ease.lang.javascript.test ---
03:10:09 [2020-09-24T07:10:09.390Z] [INFO] 
03:10:09 [2020-09-24T07:10:09.390Z] [INFO] --- tycho-packaging-plugin:1.5.0:build-qualifier (default-build-qualifier) @ org.eclipse.ease.lang.javascript.test ---
03:10:09 [2020-09-24T07:10:09.390Z] [INFO] The project's OSGi version is 0.8.0.I201910171213
03:10:09 [2020-09-24T07:10:09.390Z] [INFO] 
03:10:09 [2020-09-24T07:10:09.390Z] [INFO] --- tycho-packaging-plugin:1.5.0:validate-id (default-validate-id) @ org.eclipse.ease.lang.javascript.test ---
03:10:09 [2020-09-24T07:10:09.390Z] [INFO] 
03:10:09 [2020-09-24T07:10:09.390Z] [INFO] --- tycho-packaging-plugin:1.5.0:validate-version (default-validate-version) @ org.eclipse.ease.lang.javascript.test ---
03:10:09 [2020-09-24T07:10:09.390Z] [INFO] 
03:10:09 [2020-09-24T07:10:09.390Z] [INFO] >>> maven-javadoc-plugin:2.9.1:javadoc (build-docs) > generate-sources @ org.eclipse.ease.lang.javascript.test >>>
03:10:09 [2020-09-24T07:10:09.390Z] [INFO] 
03:10:09 [2020-09-24T07:10:09.391Z] [INFO] --- tycho-packaging-plugin:1.5.0:build-qualifier (default-build-qualifier) @ org.eclipse.ease.lang.javascript.test ---
03:10:09 [2020-09-24T07:10:09.391Z] [INFO] The project's OSGi version is 0.8.0.I201910171213
03:10:09 [2020-09-24T07:10:09.391Z] [INFO] 
03:10:09 [2020-09-24T07:10:09.391Z] [INFO] --- tycho-packaging-plugin:1.5.0:validate-id (default-validate-id) @ org.eclipse.ease.lang.javascript.test ---
03:10:09 [2020-09-24T07:10:09.391Z] [INFO] 
03:10:09 [2020-09-24T07:10:09.391Z] [INFO] --- tycho-packaging-plugin:1.5.0:validate-version (default-validate-version) @ org.eclipse.ease.lang.javascript.test ---
03:10:09 [2020-09-24T07:10:09.391Z] [INFO] 
03:10:09 [2020-09-24T07:10:09.391Z] [INFO] <<< maven-javadoc-plugin:2.9.1:javadoc (build-docs) < generate-sources @ org.eclipse.ease.lang.javascript.test <<<
03:10:09 [2020-09-24T07:10:09.391Z] [INFO] 
03:10:09 [2020-09-24T07:10:09.391Z] [INFO] 
03:10:09 [2020-09-24T07:10:09.391Z] [INFO] --- maven-javadoc-plugin:2.9.1:javadoc (build-docs) @ org.eclipse.ease.lang.javascript.test ---
03:10:09 [2020-09-24T07:10:09.646Z] [ERROR] Error fetching link: http://help.eclipse.org/oxygen/topic/org.eclipse.platform.doc.isv/reference/api/package-list. Ignored it.
03:10:11 [2020-09-24T07:10:11.011Z] [INFO] 
03:10:11 [2020-09-24T07:10:11.011Z] Loading source files for package org.eclipse.ease.lang.javascript...
03:10:11 [2020-09-24T07:10:11.011Z] Constructing Javadoc information...
03:10:11 [2020-09-24T07:10:11.011Z] WARNING: Cannot open location "/home/jenkins/agent/workspace/ease.verify.core.gerrit/tests/org.eclipse.ease.lang.javascript.test/target/javadoc-bundle-options/package-list"
03:10:11 [2020-09-24T07:10:11.011Z] No plugin definition found, skipping
03:10:11 [2020-09-24T07:10:11.011Z] No plugin definition found, skipping
03:10:11 [2020-09-24T07:10:11.011Z] [WARNING] Javadoc Warnings
03:10:11 [2020-09-24T07:10:11.011Z] [WARNING] Picked up JAVA_TOOL_OPTIONS: -Dmaven.ext.class.path="/home/jenkins/agent/workspace/ease.verify.core.gerrit@tmp/withMaven67bfed35/pipeline-maven-spy.jar" -Dorg.jenkinsci.plugins.pipeline.maven.reportsFolder="/home/jenkins/agent/workspace/ease.verify.core.gerrit@tmp/withMaven67bfed35"
03:10:11 [2020-09-24T07:10:11.011Z] [WARNING] javadoc: warning - The old Doclet and Taglet APIs in the packages
03:10:11 [2020-09-24T07:10:11.011Z] [WARNING] com.sun.javadoc, com.sun.tools.doclets and their implementations
03:10:11 [2020-09-24T07:10:11.011Z] [WARNING] are planned to be removed in a future JDK release. These
03:10:11 [2020-09-24T07:10:11.011Z] [WARNING] components have been superseded by the new APIs in jdk.javadoc.doclet.
03:10:11 [2020-09-24T07:10:11.011Z] [WARNING] Users are strongly recommended to migrate to the new APIs.
03:10:11 [2020-09-24T07:10:11.011Z] [INFO] 
03:10:11 [2020-09-24T07:10:11.011Z] [INFO] --- build-helper-maven-plugin:1.9.1:add-resource (add_help) @ org.eclipse.ease.lang.javascript.test ---
03:10:11 [2020-09-24T07:10:11.012Z] [INFO] 
03:10:11 [2020-09-24T07:10:11.012Z] [INFO] --- maven-resources-plugin:2.4.3:resources (default-resources) @ org.eclipse.ease.lang.javascript.test ---
03:10:11 [2020-09-24T07:10:11.012Z] [INFO] Using 'UTF-8' encoding to copy filtered resources.
03:10:11 [2020-09-24T07:10:11.012Z] [INFO] skip non existing resourceDirectory /home/jenkins/agent/workspace/ease.verify.core.gerrit/tests/org.eclipse.ease.lang.javascript.test/src/main/resources
03:10:11 [2020-09-24T07:10:11.012Z] [INFO] skip non existing resourceDirectory /home/jenkins/agent/workspace/ease.verify.core.gerrit/tests/org.eclipse.ease.lang.javascript.test/help
03:10:11 [2020-09-24T07:10:11.012Z] [INFO] 
03:10:11 [2020-09-24T07:10:11.012Z] [INFO] --- tycho-compiler-plugin:1.5.0:compile (default-compile) @ org.eclipse.ease.lang.javascript.test ---
03:10:11 [2020-09-24T07:10:11.012Z] [INFO] Compiling 2 source files to /home/jenkins/agent/workspace/ease.verify.core.gerrit/tests/org.eclipse.ease.lang.javascript.test/target/classes
03:10:11 [2020-09-24T07:10:11.012Z] [INFO] 
03:10:11 [2020-09-24T07:10:11.012Z] [INFO] --- maven-resources-plugin:2.4.3:testResources (default-testResources) @ org.eclipse.ease.lang.javascript.test ---
03:10:11 [2020-09-24T07:10:11.012Z] [INFO] Using 'UTF-8' encoding to copy filtered resources.
03:10:11 [2020-09-24T07:10:11.012Z] [INFO] skip non existing resourceDirectory /home/jenkins/agent/workspace/ease.verify.core.gerrit/tests/org.eclipse.ease.lang.javascript.test/src/test/resources
03:10:11 [2020-09-24T07:10:11.012Z] [INFO] 
03:10:11 [2020-09-24T07:10:11.012Z] [INFO] --- tycho-source-plugin:1.5.0:plugin-source (plugin-source) @ org.eclipse.ease.lang.javascript.test ---
03:10:11 [2020-09-24T07:10:11.012Z] [WARNING] Bundle-Vendor header not found in /home/jenkins/agent/workspace/ease.verify.core.gerrit/tests/org.eclipse.ease.lang.javascript.test/META-INF/MANIFEST.MF, fallback to 'unknown' for source bundle
03:10:11 [2020-09-24T07:10:11.012Z] [INFO] Building jar: /home/jenkins/agent/workspace/ease.verify.core.gerrit/tests/org.eclipse.ease.lang.javascript.test/target/org.eclipse.ease.lang.javascript.test-0.8.0-SNAPSHOT-sources.jar
03:10:11 [2020-09-24T07:10:11.012Z] [INFO] 
03:10:11 [2020-09-24T07:10:11.012Z] [INFO] --- target-platform-configuration:1.5.0:target-platform (default-target-platform) @ org.eclipse.ease.lang.javascript.test ---
03:10:11 [2020-09-24T07:10:11.012Z] [INFO] 
03:10:11 [2020-09-24T07:10:11.012Z] [INFO] --- tycho-packaging-plugin:1.5.0:package-plugin (default-package-plugin) @ org.eclipse.ease.lang.javascript.test ---
03:10:11 [2020-09-24T07:10:11.012Z] [INFO] Building jar: /home/jenkins/agent/workspace/ease.verify.core.gerrit/tests/org.eclipse.ease.lang.javascript.test/target/org.eclipse.ease.lang.javascript.test-0.8.0-SNAPSHOT.jar
03:10:11 [2020-09-24T07:10:11.012Z] [INFO] 
03:10:11 [2020-09-24T07:10:11.012Z] [INFO] --- tycho-p2-plugin:1.5.0:p2-metadata-default (default-p2-metadata-default) @ org.eclipse.ease.lang.javascript.test ---
03:10:11 [2020-09-24T07:10:11.012Z] [INFO] 
03:10:11 [2020-09-24T07:10:11.012Z] [INFO] --- tycho-source-feature-plugin:1.5.0:source-feature (source-feature) @ org.eclipse.ease.lang.javascript.test ---
03:10:11 [2020-09-24T07:10:11.012Z] [INFO] 
03:10:11 [2020-09-24T07:10:11.012Z] [INFO] --- tycho-p2-plugin:1.5.0:p2-metadata (attached-p2-metadata) @ org.eclipse.ease.lang.javascript.test ---
03:10:11 [2020-09-24T07:10:11.012Z] [INFO] 
03:10:11 [2020-09-24T07:10:11.012Z] [INFO] --- tycho-surefire-plugin:1.5.0:test (default-test) @ org.eclipse.ease.lang.javascript.test ---
03:10:11 [2020-09-24T07:10:11.012Z] [INFO] Expected eclipse log file: /home/jenkins/agent/workspace/ease.verify.core.gerrit/tests/org.eclipse.ease.lang.javascript.test/target/work/data/.metadata/.log
03:10:11 [2020-09-24T07:10:11.012Z] [INFO] Command line:
03:10:11 [2020-09-24T07:10:11.012Z] 	[/opt/tools/java/openjdk/jdk-11/11.0.2+9/bin/java, -Dosgi.noShutdown=false, -Dosgi.os=linux, -Dosgi.ws=gtk, -Dosgi.arch=x86_64, -Dosgi.clean=true, -jar, /home/jenkins/.m2/repository/p2/osgi/bundle/org.eclipse.equinox.launcher/1.5.800.v20200727-1323/org.eclipse.equinox.launcher-1.5.800.v20200727-1323.jar, -data, /home/jenkins/agent/workspace/ease.verify.core.gerrit/tests/org.eclipse.ease.lang.javascript.test/target/work/data, -install, /home/jenkins/agent/workspace/ease.verify.core.gerrit/tests/org.eclipse.ease.lang.javascript.test/target/work, -configuration, /home/jenkins/agent/workspace/ease.verify.core.gerrit/tests/org.eclipse.ease.lang.javascript.test/target/work/configuration, -application, org.eclipse.tycho.surefire.osgibooter.headlesstest, -testproperties, /home/jenkins/agent/workspace/ease.verify.core.gerrit/tests/org.eclipse.ease.lang.javascript.test/target/surefire.properties]
03:10:11 [2020-09-24T07:10:11.012Z] Picked up JAVA_TOOL_OPTIONS: -Dmaven.ext.class.path="/home/jenkins/agent/workspace/ease.verify.core.gerrit@tmp/withMaven67bfed35/pipeline-maven-spy.jar" -Dorg.jenkinsci.plugins.pipeline.maven.reportsFolder="/home/jenkins/agent/workspace/ease.verify.core.gerrit@tmp/withMaven67bfed35" 
03:10:13 [2020-09-24T07:10:13.001Z] Running org.eclipse.ease.lang.javascript.JavaScriptCompletionContextTest
03:10:13 [2020-09-24T07:10:13.257Z] Tests run: 8, Failures: 0, Errors: 0, Skipped: 0, Time elapsed: 0.247 s - in org.eclipse.ease.lang.javascript.JavaScriptCompletionContextTest
03:10:13 [2020-09-24T07:10:13.257Z] verifyStaticClassTypes(org.eclipse.ease.lang.javascript.JavaScriptCompletionContextTest)  Time elapsed: 0.005 s
03:10:13 [2020-09-24T07:10:13.257Z] verifyClassInstanceTypes(org.eclipse.ease.lang.javascript.JavaScriptCompletionContextTest)  Time elapsed: 0.044 s
03:10:13 [2020-09-24T07:10:13.257Z] verifyTypesForScriptEngine(org.eclipse.ease.lang.javascript.JavaScriptCompletionContextTest)  Time elapsed: 0.089 s
03:10:13 [2020-09-24T07:10:13.257Z] verifyPackageTypes(org.eclipse.ease.lang.javascript.JavaScriptCompletionContextTest)  Time elapsed: 0 s
03:10:13 [2020-09-24T07:10:13.257Z] definedVariableTypes(org.eclipse.ease.lang.javascript.JavaScriptCompletionContextTest)  Time elapsed: 0.001 s
03:10:13 [2020-09-24T07:10:13.257Z] verifyStringLiteralTypes(org.eclipse.ease.lang.javascript.JavaScriptCompletionContextTest)  Time elapsed: 0 s
03:10:13 [2020-09-24T07:10:13.257Z] verifyUnknownTypes(org.eclipse.ease.lang.javascript.JavaScriptCompletionContextTest)  Time elapsed: 0 s
03:10:13 [2020-09-24T07:10:13.257Z] verifyNoneTypes(org.eclipse.ease.lang.javascript.JavaScriptCompletionContextTest)  Time elapsed: 0 s
03:10:13 [2020-09-24T07:10:13.257Z] Running org.eclipse.ease.lang.javascript.JavaScriptCodeFactoryTest
03:10:13 [2020-09-24T07:10:13.257Z] Tests run: 1, Failures: 0, Errors: 0, Skipped: 0, Time elapsed: 0.002 s - in org.eclipse.ease.lang.javascript.JavaScriptCodeFactoryTest
03:10:13 [2020-09-24T07:10:13.257Z] testCommentCreator(org.eclipse.ease.lang.javascript.JavaScriptCodeFactoryTest)  Time elapsed: 0.002 s
03:10:13 [2020-09-24T07:10:13.257Z] 
03:10:13 [2020-09-24T07:10:13.257Z] Results:
03:10:13 [2020-09-24T07:10:13.257Z] 
03:10:13 [2020-09-24T07:10:13.257Z] Tests run: 9, Failures: 0, Errors: 0, Skipped: 0
03:10:13 [2020-09-24T07:10:13.257Z] 
03:10:14 [2020-09-24T07:10:14.623Z] [INFO] All tests passed!
03:10:14 [2020-09-24T07:10:14.623Z] [INFO] 
03:10:14 [2020-09-24T07:10:14.623Z] [INFO] ---------< org.eclipse.ease:org.eclipse.ease.lang.python.test >---------
03:10:14 [2020-09-24T07:10:14.623Z] [INFO] Building org.eclipse.ease.lang.python.test 0.8.0-SNAPSHOT        [42/48]
03:10:14 [2020-09-24T07:10:14.623Z] [INFO] ------------------------[ eclipse-test-plugin ]-------------------------
03:10:14 [2020-09-24T07:10:14.623Z] [INFO] 
03:10:14 [2020-09-24T07:10:14.623Z] [INFO] --- maven-clean-plugin:2.5:clean (default-clean) @ org.eclipse.ease.lang.python.test ---
03:10:14 [2020-09-24T07:10:14.623Z] [INFO] 
03:10:14 [2020-09-24T07:10:14.623Z] [INFO] --- tycho-packaging-plugin:1.5.0:build-qualifier (default-build-qualifier) @ org.eclipse.ease.lang.python.test ---
03:10:14 [2020-09-24T07:10:14.623Z] [INFO] The project's OSGi version is 0.8.0.I201910171213
03:10:14 [2020-09-24T07:10:14.623Z] [INFO] 
03:10:14 [2020-09-24T07:10:14.623Z] [INFO] --- tycho-packaging-plugin:1.5.0:validate-id (default-validate-id) @ org.eclipse.ease.lang.python.test ---
03:10:14 [2020-09-24T07:10:14.623Z] [INFO] 
03:10:14 [2020-09-24T07:10:14.623Z] [INFO] --- tycho-packaging-plugin:1.5.0:validate-version (default-validate-version) @ org.eclipse.ease.lang.python.test ---
03:10:14 [2020-09-24T07:10:14.623Z] [INFO] 
03:10:14 [2020-09-24T07:10:14.623Z] [INFO] >>> maven-javadoc-plugin:2.9.1:javadoc (build-docs) > generate-sources @ org.eclipse.ease.lang.python.test >>>
03:10:14 [2020-09-24T07:10:14.623Z] [INFO] 
03:10:14 [2020-09-24T07:10:14.623Z] [INFO] --- tycho-packaging-plugin:1.5.0:build-qualifier (default-build-qualifier) @ org.eclipse.ease.lang.python.test ---
03:10:14 [2020-09-24T07:10:14.623Z] [INFO] The project's OSGi version is 0.8.0.I201910171213
03:10:14 [2020-09-24T07:10:14.623Z] [INFO] 
03:10:14 [2020-09-24T07:10:14.623Z] [INFO] --- tycho-packaging-plugin:1.5.0:validate-id (default-validate-id) @ org.eclipse.ease.lang.python.test ---
03:10:14 [2020-09-24T07:10:14.623Z] [INFO] 
03:10:14 [2020-09-24T07:10:14.623Z] [INFO] --- tycho-packaging-plugin:1.5.0:validate-version (default-validate-version) @ org.eclipse.ease.lang.python.test ---
03:10:14 [2020-09-24T07:10:14.623Z] [INFO] 
03:10:14 [2020-09-24T07:10:14.623Z] [INFO] <<< maven-javadoc-plugin:2.9.1:javadoc (build-docs) < generate-sources @ org.eclipse.ease.lang.python.test <<<
03:10:14 [2020-09-24T07:10:14.623Z] [INFO] 
03:10:14 [2020-09-24T07:10:14.623Z] [INFO] 
03:10:14 [2020-09-24T07:10:14.623Z] [INFO] --- maven-javadoc-plugin:2.9.1:javadoc (build-docs) @ org.eclipse.ease.lang.python.test ---
03:10:14 [2020-09-24T07:10:14.623Z] [ERROR] Error fetching link: http://help.eclipse.org/oxygen/topic/org.eclipse.platform.doc.isv/reference/api/package-list. Ignored it.
03:10:16 [2020-09-24T07:10:16.007Z] [INFO] 
03:10:16 [2020-09-24T07:10:16.007Z] Loading source files for package org.eclipse.ease.lang.python...
03:10:16 [2020-09-24T07:10:16.007Z] Constructing Javadoc information...
03:10:16 [2020-09-24T07:10:16.007Z] WARNING: Cannot open location "/home/jenkins/agent/workspace/ease.verify.core.gerrit/tests/org.eclipse.ease.lang.python.test/target/javadoc-bundle-options/package-list"
03:10:16 [2020-09-24T07:10:16.007Z] No plugin definition found, skipping
03:10:16 [2020-09-24T07:10:16.007Z] No plugin definition found, skipping
03:10:16 [2020-09-24T07:10:16.007Z] [WARNING] Javadoc Warnings
03:10:16 [2020-09-24T07:10:16.008Z] [WARNING] Picked up JAVA_TOOL_OPTIONS: -Dmaven.ext.class.path="/home/jenkins/agent/workspace/ease.verify.core.gerrit@tmp/withMaven67bfed35/pipeline-maven-spy.jar" -Dorg.jenkinsci.plugins.pipeline.maven.reportsFolder="/home/jenkins/agent/workspace/ease.verify.core.gerrit@tmp/withMaven67bfed35"
03:10:16 [2020-09-24T07:10:16.008Z] [WARNING] javadoc: warning - The old Doclet and Taglet APIs in the packages
03:10:16 [2020-09-24T07:10:16.008Z] [WARNING] com.sun.javadoc, com.sun.tools.doclets and their implementations
03:10:16 [2020-09-24T07:10:16.008Z] [WARNING] are planned to be removed in a future JDK release. These
03:10:16 [2020-09-24T07:10:16.008Z] [WARNING] components have been superseded by the new APIs in jdk.javadoc.doclet.
03:10:16 [2020-09-24T07:10:16.008Z] [WARNING] Users are strongly recommended to migrate to the new APIs.
03:10:16 [2020-09-24T07:10:16.008Z] [INFO] 
03:10:16 [2020-09-24T07:10:16.008Z] [INFO] --- build-helper-maven-plugin:1.9.1:add-resource (add_help) @ org.eclipse.ease.lang.python.test ---
03:10:16 [2020-09-24T07:10:16.008Z] [INFO] 
03:10:16 [2020-09-24T07:10:16.008Z] [INFO] --- maven-resources-plugin:2.4.3:resources (default-resources) @ org.eclipse.ease.lang.python.test ---
03:10:16 [2020-09-24T07:10:16.008Z] [INFO] Using 'UTF-8' encoding to copy filtered resources.
03:10:16 [2020-09-24T07:10:16.008Z] [INFO] skip non existing resourceDirectory /home/jenkins/agent/workspace/ease.verify.core.gerrit/tests/org.eclipse.ease.lang.python.test/src/main/resources
03:10:16 [2020-09-24T07:10:16.008Z] [INFO] skip non existing resourceDirectory /home/jenkins/agent/workspace/ease.verify.core.gerrit/tests/org.eclipse.ease.lang.python.test/help
03:10:16 [2020-09-24T07:10:16.008Z] [INFO] 
03:10:16 [2020-09-24T07:10:16.008Z] [INFO] --- tycho-compiler-plugin:1.5.0:compile (default-compile) @ org.eclipse.ease.lang.python.test ---
03:10:16 [2020-09-24T07:10:16.008Z] [INFO] Compiling 1 source file to /home/jenkins/agent/workspace/ease.verify.core.gerrit/tests/org.eclipse.ease.lang.python.test/target/classes
03:10:16 [2020-09-24T07:10:16.008Z] [INFO] 
03:10:16 [2020-09-24T07:10:16.008Z] [INFO] --- maven-resources-plugin:2.4.3:testResources (default-testResources) @ org.eclipse.ease.lang.python.test ---
03:10:16 [2020-09-24T07:10:16.008Z] [INFO] Using 'UTF-8' encoding to copy filtered resources.
03:10:16 [2020-09-24T07:10:16.008Z] [INFO] skip non existing resourceDirectory /home/jenkins/agent/workspace/ease.verify.core.gerrit/tests/org.eclipse.ease.lang.python.test/src/test/resources
03:10:16 [2020-09-24T07:10:16.008Z] [INFO] 
03:10:16 [2020-09-24T07:10:16.008Z] [INFO] --- tycho-source-plugin:1.5.0:plugin-source (plugin-source) @ org.eclipse.ease.lang.python.test ---
03:10:16 [2020-09-24T07:10:16.008Z] [WARNING] Bundle-Vendor header not found in /home/jenkins/agent/workspace/ease.verify.core.gerrit/tests/org.eclipse.ease.lang.python.test/META-INF/MANIFEST.MF, fallback to 'unknown' for source bundle
03:10:16 [2020-09-24T07:10:16.008Z] [INFO] Building jar: /home/jenkins/agent/workspace/ease.verify.core.gerrit/tests/org.eclipse.ease.lang.python.test/target/org.eclipse.ease.lang.python.test-0.8.0-SNAPSHOT-sources.jar
03:10:16 [2020-09-24T07:10:16.008Z] [INFO] 
03:10:16 [2020-09-24T07:10:16.008Z] [INFO] --- target-platform-configuration:1.5.0:target-platform (default-target-platform) @ org.eclipse.ease.lang.python.test ---
03:10:16 [2020-09-24T07:10:16.008Z] [INFO] 
03:10:16 [2020-09-24T07:10:16.008Z] [INFO] --- tycho-packaging-plugin:1.5.0:package-plugin (default-package-plugin) @ org.eclipse.ease.lang.python.test ---
03:10:16 [2020-09-24T07:10:16.008Z] [INFO] Building jar: /home/jenkins/agent/workspace/ease.verify.core.gerrit/tests/org.eclipse.ease.lang.python.test/target/org.eclipse.ease.lang.python.test-0.8.0-SNAPSHOT.jar
03:10:16 [2020-09-24T07:10:16.008Z] [INFO] 
03:10:16 [2020-09-24T07:10:16.008Z] [INFO] --- tycho-p2-plugin:1.5.0:p2-metadata-default (default-p2-metadata-default) @ org.eclipse.ease.lang.python.test ---
03:10:16 [2020-09-24T07:10:16.008Z] [INFO] 
03:10:16 [2020-09-24T07:10:16.008Z] [INFO] --- tycho-source-feature-plugin:1.5.0:source-feature (source-feature) @ org.eclipse.ease.lang.python.test ---
03:10:16 [2020-09-24T07:10:16.008Z] [INFO] 
03:10:16 [2020-09-24T07:10:16.008Z] [INFO] --- tycho-p2-plugin:1.5.0:p2-metadata (attached-p2-metadata) @ org.eclipse.ease.lang.python.test ---
03:10:16 [2020-09-24T07:10:16.008Z] [INFO] 
03:10:16 [2020-09-24T07:10:16.008Z] [INFO] --- tycho-surefire-plugin:1.5.0:test (default-test) @ org.eclipse.ease.lang.python.test ---
03:10:16 [2020-09-24T07:10:16.008Z] [INFO] Expected eclipse log file: /home/jenkins/agent/workspace/ease.verify.core.gerrit/tests/org.eclipse.ease.lang.python.test/target/work/data/.metadata/.log
03:10:16 [2020-09-24T07:10:16.008Z] [INFO] Command line:
03:10:16 [2020-09-24T07:10:16.008Z] 	[/opt/tools/java/openjdk/jdk-11/11.0.2+9/bin/java, -Dosgi.noShutdown=false, -Dosgi.os=linux, -Dosgi.ws=gtk, -Dosgi.arch=x86_64, -Dosgi.clean=true, -jar, /home/jenkins/.m2/repository/p2/osgi/bundle/org.eclipse.equinox.launcher/1.5.800.v20200727-1323/org.eclipse.equinox.launcher-1.5.800.v20200727-1323.jar, -data, /home/jenkins/agent/workspace/ease.verify.core.gerrit/tests/org.eclipse.ease.lang.python.test/target/work/data, -install, /home/jenkins/agent/workspace/ease.verify.core.gerrit/tests/org.eclipse.ease.lang.python.test/target/work, -configuration, /home/jenkins/agent/workspace/ease.verify.core.gerrit/tests/org.eclipse.ease.lang.python.test/target/work/configuration, -application, org.eclipse.tycho.surefire.osgibooter.headlesstest, -testproperties, /home/jenkins/agent/workspace/ease.verify.core.gerrit/tests/org.eclipse.ease.lang.python.test/target/surefire.properties]
03:10:16 [2020-09-24T07:10:16.008Z] Picked up JAVA_TOOL_OPTIONS: -Dmaven.ext.class.path="/home/jenkins/agent/workspace/ease.verify.core.gerrit@tmp/withMaven67bfed35/pipeline-maven-spy.jar" -Dorg.jenkinsci.plugins.pipeline.maven.reportsFolder="/home/jenkins/agent/workspace/ease.verify.core.gerrit@tmp/withMaven67bfed35" 
03:10:17 [2020-09-24T07:10:17.930Z] Running org.eclipse.ease.lang.python.PythonCodeFactoryTest
03:10:17 [2020-09-24T07:10:17.930Z] Tests run: 1, Failures: 0, Errors: 0, Skipped: 0, Time elapsed: 0.032 s - in org.eclipse.ease.lang.python.PythonCodeFactoryTest
03:10:17 [2020-09-24T07:10:17.930Z] testCommentCreator(org.eclipse.ease.lang.python.PythonCodeFactoryTest)  Time elapsed: 0.003 s
03:10:17 [2020-09-24T07:10:17.930Z] 
03:10:17 [2020-09-24T07:10:17.930Z] Results:
03:10:17 [2020-09-24T07:10:17.930Z] 
03:10:17 [2020-09-24T07:10:17.930Z] Tests run: 1, Failures: 0, Errors: 0, Skipped: 0
03:10:17 [2020-09-24T07:10:17.930Z] 
03:10:18 [2020-09-24T07:10:18.490Z] [INFO] All tests passed!
03:10:18 [2020-09-24T07:10:18.490Z] [INFO] 
03:10:18 [2020-09-24T07:10:18.490Z] [INFO] -----< org.eclipse.ease:org.eclipse.ease.lang.python.jython.test >------
03:10:18 [2020-09-24T07:10:18.490Z] [INFO] Building org.eclipse.ease.lang.python.jython.test 0.8.0-SNAPSHOT [43/48]
03:10:18 [2020-09-24T07:10:18.490Z] [INFO] ------------------------[ eclipse-test-plugin ]-------------------------
03:10:18 [2020-09-24T07:10:18.490Z] [INFO] 
03:10:18 [2020-09-24T07:10:18.490Z] [INFO] --- maven-clean-plugin:2.5:clean (default-clean) @ org.eclipse.ease.lang.python.jython.test ---
03:10:18 [2020-09-24T07:10:18.490Z] [INFO] 
03:10:18 [2020-09-24T07:10:18.490Z] [INFO] --- tycho-packaging-plugin:1.5.0:build-qualifier (default-build-qualifier) @ org.eclipse.ease.lang.python.jython.test ---
03:10:18 [2020-09-24T07:10:18.490Z] [INFO] The project's OSGi version is 0.8.0.I201911291239
03:10:18 [2020-09-24T07:10:18.490Z] [INFO] 
03:10:18 [2020-09-24T07:10:18.490Z] [INFO] --- tycho-packaging-plugin:1.5.0:validate-id (default-validate-id) @ org.eclipse.ease.lang.python.jython.test ---
03:10:18 [2020-09-24T07:10:18.490Z] [INFO] 
03:10:18 [2020-09-24T07:10:18.491Z] [INFO] --- tycho-packaging-plugin:1.5.0:validate-version (default-validate-version) @ org.eclipse.ease.lang.python.jython.test ---
03:10:18 [2020-09-24T07:10:18.491Z] [INFO] 
03:10:18 [2020-09-24T07:10:18.491Z] [INFO] >>> maven-javadoc-plugin:2.9.1:javadoc (build-docs) > generate-sources @ org.eclipse.ease.lang.python.jython.test >>>
03:10:18 [2020-09-24T07:10:18.491Z] [INFO] 
03:10:18 [2020-09-24T07:10:18.491Z] [INFO] --- tycho-packaging-plugin:1.5.0:build-qualifier (default-build-qualifier) @ org.eclipse.ease.lang.python.jython.test ---
03:10:18 [2020-09-24T07:10:18.491Z] [INFO] The project's OSGi version is 0.8.0.I201911291239
03:10:18 [2020-09-24T07:10:18.491Z] [INFO] 
03:10:18 [2020-09-24T07:10:18.491Z] [INFO] --- tycho-packaging-plugin:1.5.0:validate-id (default-validate-id) @ org.eclipse.ease.lang.python.jython.test ---
03:10:18 [2020-09-24T07:10:18.491Z] [INFO] 
03:10:18 [2020-09-24T07:10:18.491Z] [INFO] --- tycho-packaging-plugin:1.5.0:validate-version (default-validate-version) @ org.eclipse.ease.lang.python.jython.test ---
03:10:18 [2020-09-24T07:10:18.491Z] [INFO] 
03:10:18 [2020-09-24T07:10:18.491Z] [INFO] <<< maven-javadoc-plugin:2.9.1:javadoc (build-docs) < generate-sources @ org.eclipse.ease.lang.python.jython.test <<<
03:10:18 [2020-09-24T07:10:18.491Z] [INFO] 
03:10:18 [2020-09-24T07:10:18.491Z] [INFO] 
03:10:18 [2020-09-24T07:10:18.491Z] [INFO] --- maven-javadoc-plugin:2.9.1:javadoc (build-docs) @ org.eclipse.ease.lang.python.jython.test ---
03:10:18 [2020-09-24T07:10:18.491Z] [ERROR] Error fetching link: http://help.eclipse.org/oxygen/topic/org.eclipse.platform.doc.isv/reference/api/package-list. Ignored it.
03:10:19 [2020-09-24T07:10:19.855Z] [INFO] 
03:10:19 [2020-09-24T07:10:19.855Z] Loading source files for package org.eclipse.ease.lang.python.jython.debugger...
03:10:19 [2020-09-24T07:10:19.855Z] Constructing Javadoc information...
03:10:19 [2020-09-24T07:10:19.855Z] WARNING: Cannot open location "/home/jenkins/agent/workspace/ease.verify.core.gerrit/tests/org.eclipse.ease.lang.python.jython.test/target/javadoc-bundle-options/package-list"
03:10:19 [2020-09-24T07:10:19.855Z] No plugin definition found, skipping
03:10:19 [2020-09-24T07:10:19.855Z] No plugin definition found, skipping
03:10:19 [2020-09-24T07:10:19.855Z] [WARNING] Javadoc Warnings
03:10:19 [2020-09-24T07:10:19.855Z] [WARNING] Picked up JAVA_TOOL_OPTIONS: -Dmaven.ext.class.path="/home/jenkins/agent/workspace/ease.verify.core.gerrit@tmp/withMaven67bfed35/pipeline-maven-spy.jar" -Dorg.jenkinsci.plugins.pipeline.maven.reportsFolder="/home/jenkins/agent/workspace/ease.verify.core.gerrit@tmp/withMaven67bfed35"
03:10:19 [2020-09-24T07:10:19.855Z] [WARNING] javadoc: warning - The old Doclet and Taglet APIs in the packages
03:10:19 [2020-09-24T07:10:19.855Z] [WARNING] com.sun.javadoc, com.sun.tools.doclets and their implementations
03:10:19 [2020-09-24T07:10:19.855Z] [WARNING] are planned to be removed in a future JDK release. These
03:10:19 [2020-09-24T07:10:19.855Z] [WARNING] components have been superseded by the new APIs in jdk.javadoc.doclet.
03:10:19 [2020-09-24T07:10:19.855Z] [WARNING] Users are strongly recommended to migrate to the new APIs.
03:10:19 [2020-09-24T07:10:19.855Z] [INFO] 
03:10:19 [2020-09-24T07:10:19.855Z] [INFO] --- build-helper-maven-plugin:1.9.1:add-resource (add_help) @ org.eclipse.ease.lang.python.jython.test ---
03:10:19 [2020-09-24T07:10:19.855Z] [INFO] 
03:10:19 [2020-09-24T07:10:19.855Z] [INFO] --- maven-resources-plugin:2.4.3:resources (default-resources) @ org.eclipse.ease.lang.python.jython.test ---
03:10:19 [2020-09-24T07:10:19.855Z] [INFO] Using 'UTF-8' encoding to copy filtered resources.
03:10:19 [2020-09-24T07:10:19.855Z] [INFO] skip non existing resourceDirectory /home/jenkins/agent/workspace/ease.verify.core.gerrit/tests/org.eclipse.ease.lang.python.jython.test/src/main/resources
03:10:19 [2020-09-24T07:10:19.855Z] [INFO] skip non existing resourceDirectory /home/jenkins/agent/workspace/ease.verify.core.gerrit/tests/org.eclipse.ease.lang.python.jython.test/help
03:10:19 [2020-09-24T07:10:19.855Z] [INFO] 
03:10:19 [2020-09-24T07:10:19.855Z] [INFO] --- tycho-compiler-plugin:1.5.0:compile (default-compile) @ org.eclipse.ease.lang.python.jython.test ---
03:10:19 [2020-09-24T07:10:19.855Z] [INFO] Compiling 1 source file to /home/jenkins/agent/workspace/ease.verify.core.gerrit/tests/org.eclipse.ease.lang.python.jython.test/target/classes
03:10:19 [2020-09-24T07:10:19.855Z] [INFO] 
03:10:19 [2020-09-24T07:10:19.855Z] [INFO] --- maven-resources-plugin:2.4.3:testResources (default-testResources) @ org.eclipse.ease.lang.python.jython.test ---
03:10:19 [2020-09-24T07:10:19.855Z] [INFO] Using 'UTF-8' encoding to copy filtered resources.
03:10:19 [2020-09-24T07:10:19.855Z] [INFO] skip non existing resourceDirectory /home/jenkins/agent/workspace/ease.verify.core.gerrit/tests/org.eclipse.ease.lang.python.jython.test/src/test/resources
03:10:19 [2020-09-24T07:10:19.855Z] [INFO] 
03:10:19 [2020-09-24T07:10:19.855Z] [INFO] --- tycho-source-plugin:1.5.0:plugin-source (plugin-source) @ org.eclipse.ease.lang.python.jython.test ---
03:10:19 [2020-09-24T07:10:19.855Z] [WARNING] Bundle-Vendor header not found in /home/jenkins/agent/workspace/ease.verify.core.gerrit/tests/org.eclipse.ease.lang.python.jython.test/META-INF/MANIFEST.MF, fallback to 'unknown' for source bundle
03:10:19 [2020-09-24T07:10:19.855Z] [INFO] Building jar: /home/jenkins/agent/workspace/ease.verify.core.gerrit/tests/org.eclipse.ease.lang.python.jython.test/target/org.eclipse.ease.lang.python.jython.test-0.8.0-SNAPSHOT-sources.jar
03:10:19 [2020-09-24T07:10:19.855Z] [INFO] 
03:10:19 [2020-09-24T07:10:19.855Z] [INFO] --- target-platform-configuration:1.5.0:target-platform (default-target-platform) @ org.eclipse.ease.lang.python.jython.test ---
03:10:19 [2020-09-24T07:10:19.855Z] [INFO] 
03:10:19 [2020-09-24T07:10:19.855Z] [INFO] --- tycho-packaging-plugin:1.5.0:package-plugin (default-package-plugin) @ org.eclipse.ease.lang.python.jython.test ---
03:10:19 [2020-09-24T07:10:19.855Z] [INFO] Building jar: /home/jenkins/agent/workspace/ease.verify.core.gerrit/tests/org.eclipse.ease.lang.python.jython.test/target/org.eclipse.ease.lang.python.jython.test-0.8.0-SNAPSHOT.jar
03:10:19 [2020-09-24T07:10:19.855Z] [INFO] 
03:10:19 [2020-09-24T07:10:19.855Z] [INFO] --- tycho-p2-plugin:1.5.0:p2-metadata-default (default-p2-metadata-default) @ org.eclipse.ease.lang.python.jython.test ---
03:10:19 [2020-09-24T07:10:19.855Z] [INFO] 
03:10:19 [2020-09-24T07:10:19.855Z] [INFO] --- tycho-source-feature-plugin:1.5.0:source-feature (source-feature) @ org.eclipse.ease.lang.python.jython.test ---
03:10:19 [2020-09-24T07:10:19.855Z] [INFO] 
03:10:19 [2020-09-24T07:10:19.856Z] [INFO] --- tycho-p2-plugin:1.5.0:p2-metadata (attached-p2-metadata) @ org.eclipse.ease.lang.python.jython.test ---
03:10:19 [2020-09-24T07:10:19.856Z] [INFO] 
03:10:19 [2020-09-24T07:10:19.856Z] [INFO] --- tycho-surefire-plugin:1.5.0:test (default-test) @ org.eclipse.ease.lang.python.jython.test ---
03:10:20 [2020-09-24T07:10:20.802Z] [INFO] Expected eclipse log file: /home/jenkins/agent/workspace/ease.verify.core.gerrit/tests/org.eclipse.ease.lang.python.jython.test/target/work/data/.metadata/.log
03:10:20 [2020-09-24T07:10:20.802Z] [INFO] Command line:
03:10:20 [2020-09-24T07:10:20.802Z] 	[/opt/tools/java/openjdk/jdk-11/11.0.2+9/bin/java, -Dosgi.noShutdown=false, -Dosgi.os=linux, -Dosgi.ws=gtk, -Dosgi.arch=x86_64, -Dosgi.clean=true, -jar, /home/jenkins/.m2/repository/p2/osgi/bundle/org.eclipse.equinox.launcher/1.5.800.v20200727-1323/org.eclipse.equinox.launcher-1.5.800.v20200727-1323.jar, -data, /home/jenkins/agent/workspace/ease.verify.core.gerrit/tests/org.eclipse.ease.lang.python.jython.test/target/work/data, -install, /home/jenkins/agent/workspace/ease.verify.core.gerrit/tests/org.eclipse.ease.lang.python.jython.test/target/work, -configuration, /home/jenkins/agent/workspace/ease.verify.core.gerrit/tests/org.eclipse.ease.lang.python.jython.test/target/work/configuration, -application, org.eclipse.tycho.surefire.osgibooter.headlesstest, -testproperties, /home/jenkins/agent/workspace/ease.verify.core.gerrit/tests/org.eclipse.ease.lang.python.jython.test/target/surefire.properties]
03:10:20 [2020-09-24T07:10:20.802Z] Picked up JAVA_TOOL_OPTIONS: -Dmaven.ext.class.path="/home/jenkins/agent/workspace/ease.verify.core.gerrit@tmp/withMaven67bfed35/pipeline-maven-spy.jar" -Dorg.jenkinsci.plugins.pipeline.maven.reportsFolder="/home/jenkins/agent/workspace/ease.verify.core.gerrit@tmp/withMaven67bfed35" 
03:10:22 [2020-09-24T07:10:22.203Z] WARNING: An illegal reflective access operation has occurred
03:10:22 [2020-09-24T07:10:22.204Z] WARNING: Illegal reflective access by org.python.core.PySystemState (file:/home/jenkins/agent/workspace/ease.verify.core.gerrit/tests/org.eclipse.ease.lang.python.jython.test/target/work/plugins/org.jython_2.7.0.I201609090924/jython.jar) to method java.io.Console.encoding()
03:10:22 [2020-09-24T07:10:22.204Z] WARNING: Please consider reporting this to the maintainers of org.python.core.PySystemState
03:10:22 [2020-09-24T07:10:22.204Z] WARNING: Use --illegal-access=warn to enable warnings of further illegal reflective access operations
03:10:22 [2020-09-24T07:10:22.204Z] WARNING: All illegal access operations will be denied in a future release
03:10:22 [2020-09-24T07:10:22.459Z] Running org.eclipse.ease.lang.python.jython.debugger.JythonDebugTest
03:10:23 [2020-09-24T07:10:23.842Z] Start of script
03:10:23 [2020-09-24T07:10:23.842Z] include file start
03:10:23 [2020-09-24T07:10:23.842Z] include file processed
03:10:23 [2020-09-24T07:10:23.842Z] Result of testMethod = 5
03:10:23 [2020-09-24T07:10:23.842Z] End of script
03:10:24 [2020-09-24T07:10:24.098Z] Start of script
03:10:24 [2020-09-24T07:10:24.098Z] include file start
03:10:24 [2020-09-24T07:10:24.098Z] include file processed
03:10:24 [2020-09-24T07:10:24.098Z] Result of testMethod = 5
03:10:24 [2020-09-24T07:10:24.098Z] End of script
03:10:24 [2020-09-24T07:10:24.355Z] Start of script
03:10:24 [2020-09-24T07:10:24.355Z] include file start
03:10:24 [2020-09-24T07:10:24.355Z] include file processed
03:10:24 [2020-09-24T07:10:24.355Z] Result of testMethod = 5
03:10:24 [2020-09-24T07:10:24.355Z] Traceback (most recent call last):
03:10:24 [2020-09-24T07:10:24.355Z]   File "(none)", line 184, in run
03:10:24 [2020-09-24T07:10:24.355Z]   File "__ref_L/Debug Test/Main.py_lacqijpzkn", line 23, in <module>
03:10:24 [2020-09-24T07:10:24.355Z]   File "(none)", line 161, in trace_dispatch
03:10:24 [2020-09-24T07:10:24.355Z] org.eclipse.ease.ExitException: 
03:10:24 [2020-09-24T07:10:24.355Z] 
03:10:24 [2020-09-24T07:10:24.355Z] org.eclipse.ease.ExitException: org.eclipse.ease.ExitException: 
03:10:24 [2020-09-24T07:10:24.611Z] Start of script
03:10:24 [2020-09-24T07:10:24.611Z] include file start
03:10:24 [2020-09-24T07:10:24.611Z] include file processed
03:10:24 [2020-09-24T07:10:24.611Z] Result of testMethod = 5
03:10:24 [2020-09-24T07:10:24.611Z] End of script
03:10:25 [2020-09-24T07:10:25.173Z] Start of script
03:10:25 [2020-09-24T07:10:25.173Z] include file start
03:10:25 [2020-09-24T07:10:25.173Z] include file processed
03:10:25 [2020-09-24T07:10:25.173Z] Result of testMethod = 5
03:10:25 [2020-09-24T07:10:25.173Z] End of script
03:10:25 [2020-09-24T07:10:25.173Z] Start of script
03:10:25 [2020-09-24T07:10:25.173Z] include file start
03:10:25 [2020-09-24T07:10:25.173Z] include file processed
03:10:25 [2020-09-24T07:10:25.429Z] Result of testMethod = 5
03:10:25 [2020-09-24T07:10:25.429Z] End of script
03:10:25 [2020-09-24T07:10:25.429Z] Start of script
03:10:25 [2020-09-24T07:10:25.429Z] include file start
03:10:25 [2020-09-24T07:10:25.429Z] include file processed
03:10:25 [2020-09-24T07:10:25.429Z] Result of testMethod = 5
03:10:25 [2020-09-24T07:10:25.684Z] Traceback (most recent call last):
03:10:25 [2020-09-24T07:10:25.684Z]   File "(none)", line 184, in run
03:10:25 [2020-09-24T07:10:25.684Z]   File "__ref_L/Debug Test/Main.py_srhkxflkpm", line 23, in <module>
03:10:25 [2020-09-24T07:10:25.684Z]   File "(none)", line 161, in trace_dispatch
03:10:25 [2020-09-24T07:10:25.684Z] org.eclipse.ease.ExitException: 
03:10:25 [2020-09-24T07:10:25.684Z] 
03:10:25 [2020-09-24T07:10:25.684Z] org.eclipse.ease.ExitException: org.eclipse.ease.ExitException: 
03:10:25 [2020-09-24T07:10:25.684Z] Start of script
03:10:25 [2020-09-24T07:10:25.684Z] include file start
03:10:25 [2020-09-24T07:10:25.684Z] include file processed
03:10:25 [2020-09-24T07:10:25.939Z] Result of testMethod = 5
03:10:25 [2020-09-24T07:10:25.939Z] End of script
03:10:26 [2020-09-24T07:10:26.194Z] Start of script
03:10:26 [2020-09-24T07:10:26.194Z] include file start
03:10:26 [2020-09-24T07:10:26.194Z] include file processed
03:10:26 [2020-09-24T07:10:26.194Z] Result of testMethod = 5
03:10:26 [2020-09-24T07:10:26.194Z] End of script
03:10:26 [2020-09-24T07:10:26.194Z] Start of script
03:10:26 [2020-09-24T07:10:26.194Z] include file start
03:10:26 [2020-09-24T07:10:26.194Z] include file processed
03:10:26 [2020-09-24T07:10:26.756Z] Traceback (most recent call last):
03:10:26 [2020-09-24T07:10:26.756Z]   File "(none)", line 184, in run
03:10:26 [2020-09-24T07:10:26.756Z]   File "__ref_L/Debug Test/Main.py_dnykbecxln", line 22, in <module>
03:10:26 [2020-09-24T07:10:26.756Z]   File "(none)", line 161, in trace_dispatch
03:10:26 [2020-09-24T07:10:26.756Z] org.eclipse.ease.ExitException: 
03:10:26 [2020-09-24T07:10:26.756Z] 
03:10:26 [2020-09-24T07:10:26.756Z] org.eclipse.ease.ExitException: org.eclipse.ease.ExitException: 
03:10:26 [2020-09-24T07:10:26.756Z] Start of script
03:10:26 [2020-09-24T07:10:26.756Z] include file start
03:10:26 [2020-09-24T07:10:26.756Z] include file processed
03:10:26 [2020-09-24T07:10:26.756Z] Result of testMethod = 5
03:10:26 [2020-09-24T07:10:26.756Z] End of script
03:10:27 [2020-09-24T07:10:27.011Z] Start of script
03:10:27 [2020-09-24T07:10:27.011Z] include file start
03:10:27 [2020-09-24T07:10:27.011Z] include file processed
03:10:27 [2020-09-24T07:10:27.268Z] Result of testMethod = 5
03:10:27 [2020-09-24T07:10:27.268Z] End of script
03:10:27 [2020-09-24T07:10:27.268Z] Traceback (most recent call last):
03:10:27 [2020-09-24T07:10:27.268Z]   File "(none)", line 184, in run
03:10:27 [2020-09-24T07:10:27.268Z]   File "__ref_L/Debug Test/Main.py_gvxprercde", line 1, in <module>
03:10:27 [2020-09-24T07:10:27.268Z]   File "(none)", line 161, in trace_dispatch
03:10:27 [2020-09-24T07:10:27.268Z] org.eclipse.ease.ExitException: 
03:10:27 [2020-09-24T07:10:27.268Z] 
03:10:27 [2020-09-24T07:10:27.268Z] org.eclipse.ease.ExitException: org.eclipse.ease.ExitException: 
03:10:27 [2020-09-24T07:10:27.525Z] Start of script
03:10:27 [2020-09-24T07:10:27.525Z] include file start
03:10:27 [2020-09-24T07:10:27.525Z] include file processed
03:10:27 [2020-09-24T07:10:27.525Z] Result of testMethod = 5
03:10:27 [2020-09-24T07:10:27.525Z] End of script
03:10:27 [2020-09-24T07:10:27.780Z] Start of script
03:10:27 [2020-09-24T07:10:27.780Z] include file start
03:10:27 [2020-09-24T07:10:27.780Z] include file processed
03:10:27 [2020-09-24T07:10:27.780Z] Result of testMethod = 5
03:10:27 [2020-09-24T07:10:27.780Z] End of script
03:10:28 [2020-09-24T07:10:28.036Z] Start of script
03:10:28 [2020-09-24T07:10:28.036Z] include file start
03:10:28 [2020-09-24T07:10:28.036Z] include file processed
03:10:28 [2020-09-24T07:10:28.036Z] Result of testMethod = 5
03:10:28 [2020-09-24T07:10:28.293Z] Traceback (most recent call last):
03:10:28 [2020-09-24T07:10:28.293Z]   File "(none)", line 184, in run
03:10:28 [2020-09-24T07:10:28.293Z]   File "__ref_L/Debug Test/Main.py_nvuhhyhpeq", line 23, in <module>
03:10:28 [2020-09-24T07:10:28.293Z]   File "(none)", line 161, in trace_dispatch
03:10:28 [2020-09-24T07:10:28.293Z] org.eclipse.ease.ExitException: 
03:10:28 [2020-09-24T07:10:28.293Z] 
03:10:28 [2020-09-24T07:10:28.293Z] org.eclipse.ease.ExitException: org.eclipse.ease.ExitException: 
03:10:28 [2020-09-24T07:10:28.293Z] Start of script
03:10:28 [2020-09-24T07:10:28.293Z] include file start
03:10:28 [2020-09-24T07:10:28.293Z] include file processed
03:10:28 [2020-09-24T07:10:28.548Z] Result of testMethod = 5
03:10:28 [2020-09-24T07:10:28.548Z] End of script
03:10:28 [2020-09-24T07:10:28.803Z] Traceback (most recent call last):
03:10:28 [2020-09-24T07:10:28.803Z]   File "(none)", line 184, in run
03:10:28 [2020-09-24T07:10:28.803Z]   File "__ref_L/Debug Test/Main.py_naqtexptse", line 1, in <module>
03:10:28 [2020-09-24T07:10:28.803Z]   File "(none)", line 161, in trace_dispatch
03:10:28 [2020-09-24T07:10:28.803Z] org.eclipse.ease.ExitException: 
03:10:28 [2020-09-24T07:10:28.803Z] 
03:10:28 [2020-09-24T07:10:28.803Z] org.eclipse.ease.ExitException: org.eclipse.ease.ExitException: 
03:10:28 [2020-09-24T07:10:28.803Z] Start of script
03:10:28 [2020-09-24T07:10:28.803Z] include file start
03:10:28 [2020-09-24T07:10:28.803Z] include file processed
03:10:28 [2020-09-24T07:10:28.803Z] Result of testMethod = 5
03:10:29 [2020-09-24T07:10:29.059Z] End of script
03:10:29 [2020-09-24T07:10:29.059Z] Start of script
03:10:29 [2020-09-24T07:10:29.059Z] include file start
03:10:29 [2020-09-24T07:10:29.059Z] include file processed
03:10:29 [2020-09-24T07:10:29.315Z] Result of testMethod = 5
03:10:29 [2020-09-24T07:10:29.315Z] End of script
03:10:29 [2020-09-24T07:10:29.571Z] Traceback (most recent call last):
03:10:29 [2020-09-24T07:10:29.571Z]   File "(none)", line 184, in run
03:10:29 [2020-09-24T07:10:29.571Z]   File "__ref_L/Debug Test/Main.py_dztjyluync", line 1, in <module>
03:10:29 [2020-09-24T07:10:29.571Z]   File "(none)", line 161, in trace_dispatch
03:10:29 [2020-09-24T07:10:29.571Z] org.eclipse.ease.ExitException: 
03:10:29 [2020-09-24T07:10:29.571Z] 
03:10:29 [2020-09-24T07:10:29.571Z] org.eclipse.ease.ExitException: org.eclipse.ease.ExitException: 
03:10:29 [2020-09-24T07:10:29.571Z] Start of script
03:10:29 [2020-09-24T07:10:29.571Z] include file start
03:10:29 [2020-09-24T07:10:29.571Z] include file processed
03:10:29 [2020-09-24T07:10:29.827Z] Result of testMethod = 5
03:10:29 [2020-09-24T07:10:29.827Z] End of script
03:10:29 [2020-09-24T07:10:29.827Z] Start of script
03:10:29 [2020-09-24T07:10:29.827Z] include file start
03:10:29 [2020-09-24T07:10:29.827Z] include file processed
03:10:29 [2020-09-24T07:10:29.827Z] Result of testMethod = 5
03:10:30 [2020-09-24T07:10:30.083Z] Traceback (most recent call last):
03:10:30 [2020-09-24T07:10:30.083Z]   File "(none)", line 184, in run
03:10:30 [2020-09-24T07:10:30.083Z]   File "__ref_L/Debug Test/Main.py_puiuqdlmtp", line 23, in <module>
03:10:30 [2020-09-24T07:10:30.083Z]   File "(none)", line 161, in trace_dispatch
03:10:30 [2020-09-24T07:10:30.083Z] org.eclipse.ease.ExitException: 
03:10:30 [2020-09-24T07:10:30.083Z] 
03:10:30 [2020-09-24T07:10:30.083Z] org.eclipse.ease.ExitException: org.eclipse.ease.ExitException: 
03:10:30 [2020-09-24T07:10:30.339Z] Start of script
03:10:30 [2020-09-24T07:10:30.339Z] include file start
03:10:30 [2020-09-24T07:10:30.339Z] include file processed
03:10:30 [2020-09-24T07:10:30.339Z] Result of testMethod = 5
03:10:30 [2020-09-24T07:10:30.339Z] End of script
03:10:30 [2020-09-24T07:10:30.339Z] Start of script
03:10:30 [2020-09-24T07:10:30.339Z] include file start
03:10:30 [2020-09-24T07:10:30.339Z] include file processed
03:10:30 [2020-09-24T07:10:30.595Z] Result of testMethod = 5
03:10:30 [2020-09-24T07:10:30.595Z] End of script
03:10:30 [2020-09-24T07:10:30.595Z] Start of script
03:10:30 [2020-09-24T07:10:30.595Z] include file start
03:10:30 [2020-09-24T07:10:30.595Z] include file processed
03:10:30 [2020-09-24T07:10:30.595Z] Result of testMethod = 5
03:10:30 [2020-09-24T07:10:30.595Z] End of script
03:10:30 [2020-09-24T07:10:30.851Z] Start of script
03:10:30 [2020-09-24T07:10:30.851Z] include file start
03:10:30 [2020-09-24T07:10:30.851Z] include file processed
03:10:31 [2020-09-24T07:10:31.107Z] Result of testMethod = 5
03:10:31 [2020-09-24T07:10:31.107Z] End of script
03:10:31 [2020-09-24T07:10:31.107Z] Start of script
03:10:31 [2020-09-24T07:10:31.107Z] include file start
03:10:31 [2020-09-24T07:10:31.107Z] include file processed
03:10:31 [2020-09-24T07:10:31.364Z] Traceback (most recent call last):
03:10:31 [2020-09-24T07:10:31.364Z]   File "(none)", line 184, in run
03:10:31 [2020-09-24T07:10:31.364Z]   File "__ref_L/Debug Test/Main.py_ldmlpkzzuz", line 21, in <module>
03:10:31 [2020-09-24T07:10:31.364Z]   File "__ref_L/Debug Test/Main.py_ldmlpkzzuz", line 18, in testMethod
03:10:31 [2020-09-24T07:10:31.364Z]   File "(none)", line 161, in trace_dispatch
03:10:31 [2020-09-24T07:10:31.364Z] org.eclipse.ease.ExitException: 
03:10:31 [2020-09-24T07:10:31.364Z] 
03:10:31 [2020-09-24T07:10:31.364Z] org.eclipse.ease.ExitException: org.eclipse.ease.ExitException: 
03:10:31 [2020-09-24T07:10:31.364Z] Start of script
03:10:31 [2020-09-24T07:10:31.619Z] include file start
03:10:31 [2020-09-24T07:10:31.619Z] include file processed
03:10:31 [2020-09-24T07:10:31.619Z] Result of testMethod = 5
03:10:31 [2020-09-24T07:10:31.619Z] End of script
03:10:31 [2020-09-24T07:10:31.619Z] Start of script
03:10:31 [2020-09-24T07:10:31.619Z] include file start
03:10:31 [2020-09-24T07:10:31.619Z] include file processed
03:10:31 [2020-09-24T07:10:31.619Z] Result of testMethod = 5
03:10:31 [2020-09-24T07:10:31.876Z] Traceback (most recent call last):
03:10:31 [2020-09-24T07:10:31.876Z]   File "(none)", line 184, in run
03:10:31 [2020-09-24T07:10:31.876Z]   File "__ref_L/Debug Test/Main.py_mvrqglqtov", line 23, in <module>
03:10:31 [2020-09-24T07:10:31.876Z]   File "(none)", line 161, in trace_dispatch
03:10:31 [2020-09-24T07:10:31.876Z] org.eclipse.ease.ExitException: 
03:10:31 [2020-09-24T07:10:31.876Z] 
03:10:31 [2020-09-24T07:10:31.876Z] org.eclipse.ease.ExitException: org.eclipse.ease.ExitException: 
03:10:32 [2020-09-24T07:10:32.132Z] Start of script
03:10:32 [2020-09-24T07:10:32.132Z] include file start
03:10:32 [2020-09-24T07:10:32.132Z] include file processed
03:10:32 [2020-09-24T07:10:32.132Z] Result of testMethod = 5
03:10:32 [2020-09-24T07:10:32.132Z] End of script
03:10:32 [2020-09-24T07:10:32.132Z] Start of script
03:10:32 [2020-09-24T07:10:32.132Z] include file start
03:10:32 [2020-09-24T07:10:32.132Z] include file processed
03:10:32 [2020-09-24T07:10:32.388Z] Result of testMethod = 5
03:10:32 [2020-09-24T07:10:32.388Z] End of script
03:10:32 [2020-09-24T07:10:32.644Z] Start of script
03:10:32 [2020-09-24T07:10:32.644Z] include file start
03:10:32 [2020-09-24T07:10:32.644Z] include file processed
03:10:32 [2020-09-24T07:10:32.644Z] Result of testMethod = 5
03:10:32 [2020-09-24T07:10:32.644Z] End of script
03:10:32 [2020-09-24T07:10:32.900Z] Start of script
03:10:32 [2020-09-24T07:10:32.900Z] include file start
03:10:32 [2020-09-24T07:10:32.900Z] include file processed
03:10:32 [2020-09-24T07:10:32.900Z] Result of testMethod = 5
03:10:32 [2020-09-24T07:10:32.900Z] End of script
03:10:33 [2020-09-24T07:10:33.156Z] Start of script
03:10:33 [2020-09-24T07:10:33.156Z] include file start
03:10:33 [2020-09-24T07:10:33.156Z] include file processed
03:10:33 [2020-09-24T07:10:33.156Z] Result of testMethod = 5
03:10:33 [2020-09-24T07:10:33.156Z] Traceback (most recent call last):
03:10:33 [2020-09-24T07:10:33.156Z]   File "(none)", line 184, in run
03:10:33 [2020-09-24T07:10:33.156Z]   File "__ref_L/Debug Test/Main.py_walibzfohs", line 23, in <module>
03:10:33 [2020-09-24T07:10:33.156Z]   File "(none)", line 161, in trace_dispatch
03:10:33 [2020-09-24T07:10:33.156Z] org.eclipse.ease.ExitException: 
03:10:33 [2020-09-24T07:10:33.156Z] 
03:10:33 [2020-09-24T07:10:33.156Z] org.eclipse.ease.ExitException: org.eclipse.ease.ExitException: 
03:10:33 [2020-09-24T07:10:33.411Z] Start of script
03:10:33 [2020-09-24T07:10:33.411Z] include file start
03:10:33 [2020-09-24T07:10:33.411Z] include file processed
03:10:33 [2020-09-24T07:10:33.411Z] Result of testMethod = 5
03:10:33 [2020-09-24T07:10:33.411Z] End of script
03:10:33 [2020-09-24T07:10:33.668Z] Start of script
03:10:33 [2020-09-24T07:10:33.668Z] include file start
03:10:33 [2020-09-24T07:10:33.668Z] include file processed
03:10:33 [2020-09-24T07:10:33.668Z] Result of testMethod = 5
03:10:33 [2020-09-24T07:10:33.668Z] Traceback (most recent call last):
03:10:33 [2020-09-24T07:10:33.668Z]   File "(none)", line 184, in run
03:10:33 [2020-09-24T07:10:33.668Z]   File "__ref_L/Debug Test/Main.py_fgxulhurww", line 23, in <module>
03:10:33 [2020-09-24T07:10:33.668Z]   File "(none)", line 161, in trace_dispatch
03:10:33 [2020-09-24T07:10:33.668Z] org.eclipse.ease.ExitException: 
03:10:33 [2020-09-24T07:10:33.668Z] 
03:10:33 [2020-09-24T07:10:33.668Z] org.eclipse.ease.ExitException: org.eclipse.ease.ExitException: 
03:10:33 [2020-09-24T07:10:33.923Z] Traceback (most recent call last):
03:10:33 [2020-09-24T07:10:33.923Z]   File "(none)", line 184, in run
03:10:33 [2020-09-24T07:10:33.923Z]   File "__ref_L/Debug Test/Main.py_wstyxeodfx", line 1, in <module>
03:10:33 [2020-09-24T07:10:33.923Z]   File "(none)", line 161, in trace_dispatch
03:10:33 [2020-09-24T07:10:33.923Z] org.eclipse.ease.ExitException: 
03:10:33 [2020-09-24T07:10:33.923Z] 
03:10:33 [2020-09-24T07:10:33.923Z] org.eclipse.ease.ExitException: org.eclipse.ease.ExitException: 
03:10:34 [2020-09-24T07:10:34.179Z] Start of script
03:10:34 [2020-09-24T07:10:34.179Z] include file start
03:10:34 [2020-09-24T07:10:34.179Z] include file processed
03:10:34 [2020-09-24T07:10:34.179Z] Result of testMethod = 5
03:10:34 [2020-09-24T07:10:34.179Z] End of script
03:10:34 [2020-09-24T07:10:34.179Z] Start of script
03:10:34 [2020-09-24T07:10:34.179Z] include file start
03:10:34 [2020-09-24T07:10:34.179Z] include file processed
03:10:34 [2020-09-24T07:10:34.435Z] Result of testMethod = 5
03:10:34 [2020-09-24T07:10:34.435Z] End of script
03:10:34 [2020-09-24T07:10:34.690Z] Start of script
03:10:34 [2020-09-24T07:10:34.690Z] include file start
03:10:34 [2020-09-24T07:10:34.690Z] include file processed
03:10:34 [2020-09-24T07:10:34.690Z] Result of testMethod = 5
03:10:34 [2020-09-24T07:10:34.690Z] End of script
03:10:34 [2020-09-24T07:10:34.690Z] Tests run: 42, Failures: 0, Errors: 0, Skipped: 0, Time elapsed: 12.319 s - in org.eclipse.ease.lang.python.jython.debugger.JythonDebugTest
03:10:34 [2020-09-24T07:10:34.690Z] disconnectProcessInSuspendedState(org.eclipse.ease.lang.python.jython.debugger.JythonDebugTest)  Time elapsed: 1.522 s
03:10:34 [2020-09-24T07:10:34.690Z] stepReturnIncludeCommand(org.eclipse.ease.lang.python.jython.debugger.JythonDebugTest)  Time elapsed: 0.21 s
03:10:34 [2020-09-24T07:10:34.690Z] arrayVariableSorting(org.eclipse.ease.lang.python.jython.debugger.JythonDebugTest)  Time elapsed: 0.309 s
03:10:34 [2020-09-24T07:10:34.691Z] stepOverOnDebugTarget(org.eclipse.ease.lang.python.jython.debugger.JythonDebugTest)  Time elapsed: 0.309 s
03:10:34 [2020-09-24T07:10:34.691Z] hasDebugTarget(org.eclipse.ease.lang.python.jython.debugger.JythonDebugTest)  Time elapsed: 0.105 s
03:10:34 [2020-09-24T07:10:34.691Z] disconnectThreadInSuspendedState(org.eclipse.ease.lang.python.jython.debugger.JythonDebugTest)  Time elapsed: 0.208 s
03:10:34 [2020-09-24T07:10:34.691Z] stepReturnOnDebugTarget(org.eclipse.ease.lang.python.jython.debugger.JythonDebugTest)  Time elapsed: 0.31 s
03:10:34 [2020-09-24T07:10:34.691Z] nullVariable(org.eclipse.ease.lang.python.jython.debugger.JythonDebugTest)  Time elapsed: 0.307 s
03:10:34 [2020-09-24T07:10:34.691Z] stepOverOnStackFrame(org.eclipse.ease.lang.python.jython.debugger.JythonDebugTest)  Time elapsed: 0.308 s
03:10:34 [2020-09-24T07:10:34.691Z] resumeOnDebugTarget(org.eclipse.ease.lang.python.jython.debugger.JythonDebugTest)  Time elapsed: 0.206 s
03:10:34 [2020-09-24T07:10:34.691Z] modifyVariableKeepingType(org.eclipse.ease.lang.python.jython.debugger.JythonDebugTest)  Time elapsed: 0.507 s
03:10:34 [2020-09-24T07:10:34.691Z] resumeOnLastIncludeLine(org.eclipse.ease.lang.python.jython.debugger.JythonDebugTest)  Time elapsed: 0.207 s
03:10:34 [2020-09-24T07:10:34.691Z] stepReturnOnStackFrame(org.eclipse.ease.lang.python.jython.debugger.JythonDebugTest)  Time elapsed: 0.307 s
03:10:34 [2020-09-24T07:10:34.691Z] terminateStackFrameInSuspendedState(org.eclipse.ease.lang.python.jython.debugger.JythonDebugTest)  Time elapsed: 0.208 s
03:10:34 [2020-09-24T07:10:34.691Z] breakpointLocation(org.eclipse.ease.lang.python.jython.debugger.JythonDebugTest)  Time elapsed: 0.207 s
03:10:34 [2020-09-24T07:10:34.691Z] stepReturnOnThread(org.eclipse.ease.lang.python.jython.debugger.JythonDebugTest)  Time elapsed: 0.308 s
03:10:34 [2020-09-24T07:10:34.691Z] javaClassVariable(org.eclipse.ease.lang.python.jython.debugger.JythonDebugTest)  Time elapsed: 0.308 s
03:10:34 [2020-09-24T07:10:34.691Z] stepIntoOnThread(org.eclipse.ease.lang.python.jython.debugger.JythonDebugTest)  Time elapsed: 0.308 s
03:10:34 [2020-09-24T07:10:34.691Z] terminateThreadInSuspendedState(org.eclipse.ease.lang.python.jython.debugger.JythonDebugTest)  Time elapsed: 0.206 s
03:10:34 [2020-09-24T07:10:34.691Z] resumeOnThread(org.eclipse.ease.lang.python.jython.debugger.JythonDebugTest)  Time elapsed: 0.207 s
03:10:34 [2020-09-24T07:10:34.691Z] stepIntoOnStackFrame(org.eclipse.ease.lang.python.jython.debugger.JythonDebugTest)  Time elapsed: 0.306 s
03:10:34 [2020-09-24T07:10:34.691Z] terminateProcessInSuspendedState(org.eclipse.ease.lang.python.jython.debugger.JythonDebugTest)  Time elapsed: 0.207 s
03:10:34 [2020-09-24T07:10:34.691Z] stepOverOnProcess(org.eclipse.ease.lang.python.jython.debugger.JythonDebugTest)  Time elapsed: 0.307 s
03:10:34 [2020-09-24T07:10:34.691Z] nativeArrayVariable(org.eclipse.ease.lang.python.jython.debugger.JythonDebugTest)  Time elapsed: 0.306 s
03:10:34 [2020-09-24T07:10:34.691Z] disconnectDebugTargetInSuspendedState(org.eclipse.ease.lang.python.jython.debugger.JythonDebugTest)  Time elapsed: 0.206 s
03:10:34 [2020-09-24T07:10:34.691Z] stepIntoOnProcess(org.eclipse.ease.lang.python.jython.debugger.JythonDebugTest)  Time elapsed: 0.306 s
03:10:34 [2020-09-24T07:10:34.691Z] terminatedState(org.eclipse.ease.lang.python.jython.debugger.JythonDebugTest)  Time elapsed: 0.104 s
03:10:34 [2020-09-24T07:10:34.691Z] stepOverIncludeCommand(org.eclipse.ease.lang.python.jython.debugger.JythonDebugTest)  Time elapsed: 0.305 s
03:10:34 [2020-09-24T07:10:34.691Z] innerScopeVariableBeforeOuterScopeVariable(org.eclipse.ease.lang.python.jython.debugger.JythonDebugTest)  Time elapsed: 0.306 s
03:10:34 [2020-09-24T07:10:34.691Z] stepIntoIncludeCommand(org.eclipse.ease.lang.python.jython.debugger.JythonDebugTest)  Time elapsed: 0.305 s
03:10:34 [2020-09-24T07:10:34.691Z] primitiveStringVariable(org.eclipse.ease.lang.python.jython.debugger.JythonDebugTest)  Time elapsed: 0.306 s
03:10:34 [2020-09-24T07:10:34.691Z] resumeOnProcess(org.eclipse.ease.lang.python.jython.debugger.JythonDebugTest)  Time elapsed: 0.206 s
03:10:34 [2020-09-24T07:10:34.691Z] stepIntoOnDebugTarget(org.eclipse.ease.lang.python.jython.debugger.JythonDebugTest)  Time elapsed: 0.306 s
03:10:34 [2020-09-24T07:10:34.691Z] stepOverOnThread(org.eclipse.ease.lang.python.jython.debugger.JythonDebugTest)  Time elapsed: 0.306 s
03:10:34 [2020-09-24T07:10:34.691Z] suspendedState(org.eclipse.ease.lang.python.jython.debugger.JythonDebugTest)  Time elapsed: 0.206 s
03:10:34 [2020-09-24T07:10:34.691Z] primitiveDoubleVariable(org.eclipse.ease.lang.python.jython.debugger.JythonDebugTest)  Time elapsed: 0.305 s
03:10:34 [2020-09-24T07:10:34.691Z] resumeOnStackFrame(org.eclipse.ease.lang.python.jython.debugger.JythonDebugTest)  Time elapsed: 0.206 s
03:10:34 [2020-09-24T07:10:34.691Z] nativeObjectVariable(org.eclipse.ease.lang.python.jython.debugger.JythonDebugTest)  Time elapsed: 0.305 s
03:10:34 [2020-09-24T07:10:34.691Z] terminateDebugTargetInSuspendedState(org.eclipse.ease.lang.python.jython.debugger.JythonDebugTest)  Time elapsed: 0.206 s
03:10:34 [2020-09-24T07:10:34.691Z] disconnectStackFrameInSuspendedState(org.eclipse.ease.lang.python.jython.debugger.JythonDebugTest)  Time elapsed: 0.206 s
03:10:34 [2020-09-24T07:10:34.691Z] stepReturnOnProcess(org.eclipse.ease.lang.python.jython.debugger.JythonDebugTest)  Time elapsed: 0.306 s
03:10:34 [2020-09-24T07:10:34.691Z] evaluateWatchExpression(org.eclipse.ease.lang.python.jython.debugger.JythonDebugTest)  Time elapsed: 0.208 s
03:10:34 [2020-09-24T07:10:34.691Z] 
03:10:34 [2020-09-24T07:10:34.691Z] Results:
03:10:34 [2020-09-24T07:10:34.691Z] 
03:10:34 [2020-09-24T07:10:34.691Z] Tests run: 42, Failures: 0, Errors: 0, Skipped: 0
03:10:34 [2020-09-24T07:10:34.691Z] 
03:10:35 [2020-09-24T07:10:35.253Z] [INFO] All tests passed!
03:10:35 [2020-09-24T07:10:35.509Z] [INFO] 
03:10:35 [2020-09-24T07:10:35.509Z] [INFO] -----< org.eclipse.ease:org.eclipse.ease.lang.scriptarchive.test >------
03:10:35 [2020-09-24T07:10:35.509Z] [INFO] Building org.eclipse.ease.lang.scriptarchive.test 0.8.0-SNAPSHOT [44/48]
03:10:35 [2020-09-24T07:10:35.509Z] [INFO] ------------------------[ eclipse-test-plugin ]-------------------------
03:10:35 [2020-09-24T07:10:35.509Z] [INFO] 
03:10:35 [2020-09-24T07:10:35.509Z] [INFO] --- maven-clean-plugin:2.5:clean (default-clean) @ org.eclipse.ease.lang.scriptarchive.test ---
03:10:35 [2020-09-24T07:10:35.509Z] [INFO] 
03:10:35 [2020-09-24T07:10:35.509Z] [INFO] --- tycho-packaging-plugin:1.5.0:build-qualifier (default-build-qualifier) @ org.eclipse.ease.lang.scriptarchive.test ---
03:10:35 [2020-09-24T07:10:35.509Z] [INFO] The project's OSGi version is 0.8.0.I201910171213
03:10:35 [2020-09-24T07:10:35.509Z] [INFO] 
03:10:35 [2020-09-24T07:10:35.509Z] [INFO] --- tycho-packaging-plugin:1.5.0:validate-id (default-validate-id) @ org.eclipse.ease.lang.scriptarchive.test ---
03:10:35 [2020-09-24T07:10:35.509Z] [INFO] 
03:10:35 [2020-09-24T07:10:35.509Z] [INFO] --- tycho-packaging-plugin:1.5.0:validate-version (default-validate-version) @ org.eclipse.ease.lang.scriptarchive.test ---
03:10:35 [2020-09-24T07:10:35.509Z] [INFO] 
03:10:35 [2020-09-24T07:10:35.509Z] [INFO] >>> maven-javadoc-plugin:2.9.1:javadoc (build-docs) > generate-sources @ org.eclipse.ease.lang.scriptarchive.test >>>
03:10:35 [2020-09-24T07:10:35.509Z] [INFO] 
03:10:35 [2020-09-24T07:10:35.509Z] [INFO] --- tycho-packaging-plugin:1.5.0:build-qualifier (default-build-qualifier) @ org.eclipse.ease.lang.scriptarchive.test ---
03:10:35 [2020-09-24T07:10:35.509Z] [INFO] The project's OSGi version is 0.8.0.I201910171213
03:10:35 [2020-09-24T07:10:35.509Z] [INFO] 
03:10:35 [2020-09-24T07:10:35.509Z] [INFO] --- tycho-packaging-plugin:1.5.0:validate-id (default-validate-id) @ org.eclipse.ease.lang.scriptarchive.test ---
03:10:35 [2020-09-24T07:10:35.509Z] [INFO] 
03:10:35 [2020-09-24T07:10:35.509Z] [INFO] --- tycho-packaging-plugin:1.5.0:validate-version (default-validate-version) @ org.eclipse.ease.lang.scriptarchive.test ---
03:10:35 [2020-09-24T07:10:35.509Z] [INFO] 
03:10:35 [2020-09-24T07:10:35.509Z] [INFO] <<< maven-javadoc-plugin:2.9.1:javadoc (build-docs) < generate-sources @ org.eclipse.ease.lang.scriptarchive.test <<<
03:10:35 [2020-09-24T07:10:35.509Z] [INFO] 
03:10:35 [2020-09-24T07:10:35.509Z] [INFO] 
03:10:35 [2020-09-24T07:10:35.509Z] [INFO] --- maven-javadoc-plugin:2.9.1:javadoc (build-docs) @ org.eclipse.ease.lang.scriptarchive.test ---
03:10:35 [2020-09-24T07:10:35.509Z] [ERROR] Error fetching link: http://help.eclipse.org/oxygen/topic/org.eclipse.platform.doc.isv/reference/api/package-list. Ignored it.
03:10:36 [2020-09-24T07:10:36.905Z] [INFO] 
03:10:36 [2020-09-24T07:10:36.905Z] Loading source files for package org.eclipse.ease.lang.scriptarchive...
03:10:36 [2020-09-24T07:10:36.905Z] Constructing Javadoc information...
03:10:36 [2020-09-24T07:10:36.905Z] WARNING: Cannot open location "/home/jenkins/agent/workspace/ease.verify.core.gerrit/tests/org.eclipse.ease.lang.scriptarchive.test/target/javadoc-bundle-options/package-list"
03:10:36 [2020-09-24T07:10:36.905Z] No plugin definition found, skipping
03:10:36 [2020-09-24T07:10:36.905Z] No plugin definition found, skipping
03:10:36 [2020-09-24T07:10:36.905Z] [WARNING] Javadoc Warnings
03:10:36 [2020-09-24T07:10:36.905Z] [WARNING] Picked up JAVA_TOOL_OPTIONS: -Dmaven.ext.class.path="/home/jenkins/agent/workspace/ease.verify.core.gerrit@tmp/withMaven67bfed35/pipeline-maven-spy.jar" -Dorg.jenkinsci.plugins.pipeline.maven.reportsFolder="/home/jenkins/agent/workspace/ease.verify.core.gerrit@tmp/withMaven67bfed35"
03:10:36 [2020-09-24T07:10:36.905Z] [WARNING] javadoc: warning - The old Doclet and Taglet APIs in the packages
03:10:36 [2020-09-24T07:10:36.905Z] [WARNING] com.sun.javadoc, com.sun.tools.doclets and their implementations
03:10:36 [2020-09-24T07:10:36.905Z] [WARNING] are planned to be removed in a future JDK release. These
03:10:36 [2020-09-24T07:10:36.905Z] [WARNING] components have been superseded by the new APIs in jdk.javadoc.doclet.
03:10:36 [2020-09-24T07:10:36.905Z] [WARNING] Users are strongly recommended to migrate to the new APIs.
03:10:36 [2020-09-24T07:10:36.905Z] [INFO] 
03:10:36 [2020-09-24T07:10:36.905Z] [INFO] --- build-helper-maven-plugin:1.9.1:add-resource (add_help) @ org.eclipse.ease.lang.scriptarchive.test ---
03:10:36 [2020-09-24T07:10:36.905Z] [INFO] 
03:10:36 [2020-09-24T07:10:36.905Z] [INFO] --- maven-resources-plugin:2.4.3:resources (default-resources) @ org.eclipse.ease.lang.scriptarchive.test ---
03:10:36 [2020-09-24T07:10:36.905Z] [INFO] Using 'UTF-8' encoding to copy filtered resources.
03:10:36 [2020-09-24T07:10:36.905Z] [INFO] skip non existing resourceDirectory /home/jenkins/agent/workspace/ease.verify.core.gerrit/tests/org.eclipse.ease.lang.scriptarchive.test/src/main/resources
03:10:36 [2020-09-24T07:10:36.905Z] [INFO] skip non existing resourceDirectory /home/jenkins/agent/workspace/ease.verify.core.gerrit/tests/org.eclipse.ease.lang.scriptarchive.test/help
03:10:36 [2020-09-24T07:10:36.905Z] [INFO] 
03:10:36 [2020-09-24T07:10:36.905Z] [INFO] --- tycho-compiler-plugin:1.5.0:compile (default-compile) @ org.eclipse.ease.lang.scriptarchive.test ---
03:10:36 [2020-09-24T07:10:36.905Z] [INFO] Compiling 1 source file to /home/jenkins/agent/workspace/ease.verify.core.gerrit/tests/org.eclipse.ease.lang.scriptarchive.test/target/classes
03:10:36 [2020-09-24T07:10:36.905Z] [INFO] 
03:10:36 [2020-09-24T07:10:36.905Z] [INFO] --- maven-resources-plugin:2.4.3:testResources (default-testResources) @ org.eclipse.ease.lang.scriptarchive.test ---
03:10:36 [2020-09-24T07:10:36.905Z] [INFO] Using 'UTF-8' encoding to copy filtered resources.
03:10:36 [2020-09-24T07:10:36.905Z] [INFO] skip non existing resourceDirectory /home/jenkins/agent/workspace/ease.verify.core.gerrit/tests/org.eclipse.ease.lang.scriptarchive.test/src/test/resources
03:10:36 [2020-09-24T07:10:36.905Z] [INFO] 
03:10:36 [2020-09-24T07:10:36.905Z] [INFO] --- tycho-source-plugin:1.5.0:plugin-source (plugin-source) @ org.eclipse.ease.lang.scriptarchive.test ---
03:10:36 [2020-09-24T07:10:36.905Z] [INFO] Building jar: /home/jenkins/agent/workspace/ease.verify.core.gerrit/tests/org.eclipse.ease.lang.scriptarchive.test/target/org.eclipse.ease.lang.scriptarchive.test-0.8.0-SNAPSHOT-sources.jar
03:10:36 [2020-09-24T07:10:36.905Z] [INFO] 
03:10:36 [2020-09-24T07:10:36.905Z] [INFO] --- target-platform-configuration:1.5.0:target-platform (default-target-platform) @ org.eclipse.ease.lang.scriptarchive.test ---
03:10:36 [2020-09-24T07:10:36.905Z] [INFO] 
03:10:36 [2020-09-24T07:10:36.905Z] [INFO] --- tycho-packaging-plugin:1.5.0:package-plugin (default-package-plugin) @ org.eclipse.ease.lang.scriptarchive.test ---
03:10:36 [2020-09-24T07:10:36.905Z] [INFO] Building jar: /home/jenkins/agent/workspace/ease.verify.core.gerrit/tests/org.eclipse.ease.lang.scriptarchive.test/target/org.eclipse.ease.lang.scriptarchive.test-0.8.0-SNAPSHOT.jar
03:10:36 [2020-09-24T07:10:36.905Z] [INFO] 
03:10:36 [2020-09-24T07:10:36.905Z] [INFO] --- tycho-p2-plugin:1.5.0:p2-metadata-default (default-p2-metadata-default) @ org.eclipse.ease.lang.scriptarchive.test ---
03:10:36 [2020-09-24T07:10:36.905Z] [INFO] 
03:10:36 [2020-09-24T07:10:36.905Z] [INFO] --- tycho-source-feature-plugin:1.5.0:source-feature (source-feature) @ org.eclipse.ease.lang.scriptarchive.test ---
03:10:36 [2020-09-24T07:10:36.905Z] [INFO] 
03:10:36 [2020-09-24T07:10:36.905Z] [INFO] --- tycho-p2-plugin:1.5.0:p2-metadata (attached-p2-metadata) @ org.eclipse.ease.lang.scriptarchive.test ---
03:10:36 [2020-09-24T07:10:36.905Z] [INFO] 
03:10:36 [2020-09-24T07:10:36.905Z] [INFO] --- tycho-surefire-plugin:1.5.0:test (default-test) @ org.eclipse.ease.lang.scriptarchive.test ---
03:10:37 [2020-09-24T07:10:37.161Z] [INFO] Expected eclipse log file: /home/jenkins/agent/workspace/ease.verify.core.gerrit/tests/org.eclipse.ease.lang.scriptarchive.test/target/work/data/.metadata/.log
03:10:37 [2020-09-24T07:10:37.161Z] [INFO] Command line:
03:10:37 [2020-09-24T07:10:37.161Z] 	[/opt/tools/java/openjdk/jdk-11/11.0.2+9/bin/java, -Dosgi.noShutdown=false, -Dosgi.os=linux, -Dosgi.ws=gtk, -Dosgi.arch=x86_64, -Dosgi.clean=true, -jar, /home/jenkins/.m2/repository/p2/osgi/bundle/org.eclipse.equinox.launcher/1.5.800.v20200727-1323/org.eclipse.equinox.launcher-1.5.800.v20200727-1323.jar, -data, /home/jenkins/agent/workspace/ease.verify.core.gerrit/tests/org.eclipse.ease.lang.scriptarchive.test/target/work/data, -install, /home/jenkins/agent/workspace/ease.verify.core.gerrit/tests/org.eclipse.ease.lang.scriptarchive.test/target/work, -configuration, /home/jenkins/agent/workspace/ease.verify.core.gerrit/tests/org.eclipse.ease.lang.scriptarchive.test/target/work/configuration, -application, org.eclipse.tycho.surefire.osgibooter.headlesstest, -testproperties, /home/jenkins/agent/workspace/ease.verify.core.gerrit/tests/org.eclipse.ease.lang.scriptarchive.test/target/surefire.properties]
03:10:37 [2020-09-24T07:10:37.161Z] Picked up JAVA_TOOL_OPTIONS: -Dmaven.ext.class.path="/home/jenkins/agent/workspace/ease.verify.core.gerrit@tmp/withMaven67bfed35/pipeline-maven-spy.jar" -Dorg.jenkinsci.plugins.pipeline.maven.reportsFolder="/home/jenkins/agent/workspace/ease.verify.core.gerrit@tmp/withMaven67bfed35" 
03:10:39 [2020-09-24T07:10:39.051Z] Running org.eclipse.ease.lang.scriptarchive.ArchiveEngineTest
03:10:39 [2020-09-24T07:10:39.051Z] We are running from a zip file!
03:10:39 [2020-09-24T07:10:39.051Z] org.eclipse.ease.ScriptExecutionException: SyntaxError: missing ; before statement (workspace://__EASE_ScriptArchive_1/scripts/Master.js#3)
03:10:39 [2020-09-24T07:10:39.051Z] this is an error
03:10:39 [2020-09-24T07:10:39.051Z]        ^
03:10:39 [2020-09-24T07:10:39.051Z] 	at Master.js,workspace://__EASE_ScriptArchive_1/scripts/Master.js
03:10:39 [2020-09-24T07:10:39.051Z] org.eclipse.ease.ScriptExecutionException: SyntaxError: missing ; before statement (workspace://__EASE_ScriptArchive_1/scripts/Master.js#3)
03:10:39 [2020-09-24T07:10:39.051Z] this is an error
03:10:39 [2020-09-24T07:10:39.051Z]        ^
03:10:39 [2020-09-24T07:10:39.051Z] 	at Master.js,workspace://__EASE_ScriptArchive_1/scripts/Master.js
03:10:39 [2020-09-24T07:10:39.307Z] Tests run: 7, Failures: 0, Errors: 0, Skipped: 0, Time elapsed: 0.429 s - in org.eclipse.ease.lang.scriptarchive.ArchiveEngineTest
03:10:39 [2020-09-24T07:10:39.307Z] executeWithManifest(org.eclipse.ease.lang.scriptarchive.ArchiveEngineTest)  Time elapsed: 0.256 s
03:10:39 [2020-09-24T07:10:39.307Z] zipFileRegistration(org.eclipse.ease.lang.scriptarchive.ArchiveEngineTest)  Time elapsed: 0.005 s
03:10:39 [2020-09-24T07:10:39.307Z] engineIdRegistration(org.eclipse.ease.lang.scriptarchive.ArchiveEngineTest)  Time elapsed: 0.001 s
03:10:39 [2020-09-24T07:10:39.307Z] jarFileRegistration(org.eclipse.ease.lang.scriptarchive.ArchiveEngineTest)  Time elapsed: 0 s
03:10:39 [2020-09-24T07:10:39.307Z] sarFileRegistration(org.eclipse.ease.lang.scriptarchive.ArchiveEngineTest)  Time elapsed: 0 s
03:10:39 [2020-09-24T07:10:39.307Z] executeWithErrors(org.eclipse.ease.lang.scriptarchive.ArchiveEngineTest)  Time elapsed: 0.055 s
03:10:39 [2020-09-24T07:10:39.307Z] executeWithIncludes(org.eclipse.ease.lang.scriptarchive.ArchiveEngineTest)  Time elapsed: 0.08 s
03:10:39 [2020-09-24T07:10:39.307Z] 
03:10:39 [2020-09-24T07:10:39.307Z] Results:
03:10:39 [2020-09-24T07:10:39.307Z] 
03:10:39 [2020-09-24T07:10:39.307Z] Tests run: 7, Failures: 0, Errors: 0, Skipped: 0
03:10:39 [2020-09-24T07:10:39.307Z] 
03:10:39 [2020-09-24T07:10:39.868Z] [INFO] All tests passed!
03:10:39 [2020-09-24T07:10:39.868Z] [INFO] 
03:10:39 [2020-09-24T07:10:39.868Z] [INFO] --------< org.eclipse.ease:org.eclipse.ease.lang.unittest.test >--------
03:10:39 [2020-09-24T07:10:39.868Z] [INFO] Building org.eclipse.ease.lang.unittest.test 0.8.0-SNAPSHOT      [45/48]
03:10:39 [2020-09-24T07:10:39.868Z] [INFO] ------------------------[ eclipse-test-plugin ]-------------------------
03:10:39 [2020-09-24T07:10:39.868Z] [INFO] 
03:10:39 [2020-09-24T07:10:39.868Z] [INFO] --- maven-clean-plugin:2.5:clean (default-clean) @ org.eclipse.ease.lang.unittest.test ---
03:10:39 [2020-09-24T07:10:39.868Z] [INFO] 
03:10:39 [2020-09-24T07:10:39.868Z] [INFO] --- tycho-packaging-plugin:1.5.0:build-qualifier (default-build-qualifier) @ org.eclipse.ease.lang.unittest.test ---
03:10:39 [2020-09-24T07:10:39.868Z] [INFO] The project's OSGi version is 0.8.0.I201908141044
03:10:39 [2020-09-24T07:10:39.868Z] [INFO] 
03:10:39 [2020-09-24T07:10:39.868Z] [INFO] --- tycho-packaging-plugin:1.5.0:validate-id (default-validate-id) @ org.eclipse.ease.lang.unittest.test ---
03:10:39 [2020-09-24T07:10:39.868Z] [INFO] 
03:10:39 [2020-09-24T07:10:39.868Z] [INFO] --- tycho-packaging-plugin:1.5.0:validate-version (default-validate-version) @ org.eclipse.ease.lang.unittest.test ---
03:10:39 [2020-09-24T07:10:39.868Z] [INFO] 
03:10:39 [2020-09-24T07:10:39.868Z] [INFO] >>> maven-javadoc-plugin:2.9.1:javadoc (build-docs) > generate-sources @ org.eclipse.ease.lang.unittest.test >>>
03:10:39 [2020-09-24T07:10:39.868Z] [INFO] 
03:10:39 [2020-09-24T07:10:39.868Z] [INFO] --- tycho-packaging-plugin:1.5.0:build-qualifier (default-build-qualifier) @ org.eclipse.ease.lang.unittest.test ---
03:10:39 [2020-09-24T07:10:39.868Z] [INFO] The project's OSGi version is 0.8.0.I201908141044
03:10:39 [2020-09-24T07:10:39.868Z] [INFO] 
03:10:39 [2020-09-24T07:10:39.869Z] [INFO] --- tycho-packaging-plugin:1.5.0:validate-id (default-validate-id) @ org.eclipse.ease.lang.unittest.test ---
03:10:39 [2020-09-24T07:10:39.869Z] [INFO] 
03:10:39 [2020-09-24T07:10:39.869Z] [INFO] --- tycho-packaging-plugin:1.5.0:validate-version (default-validate-version) @ org.eclipse.ease.lang.unittest.test ---
03:10:39 [2020-09-24T07:10:39.869Z] [INFO] 
03:10:39 [2020-09-24T07:10:39.869Z] [INFO] <<< maven-javadoc-plugin:2.9.1:javadoc (build-docs) < generate-sources @ org.eclipse.ease.lang.unittest.test <<<
03:10:39 [2020-09-24T07:10:39.869Z] [INFO] 
03:10:39 [2020-09-24T07:10:39.869Z] [INFO] 
03:10:39 [2020-09-24T07:10:39.869Z] [INFO] --- maven-javadoc-plugin:2.9.1:javadoc (build-docs) @ org.eclipse.ease.lang.unittest.test ---
03:10:40 [2020-09-24T07:10:40.125Z] [ERROR] Error fetching link: http://help.eclipse.org/oxygen/topic/org.eclipse.platform.doc.isv/reference/api/package-list. Ignored it.
03:10:41 [2020-09-24T07:10:41.506Z] [INFO] 
03:10:41 [2020-09-24T07:10:41.506Z] Loading source files for package org.eclipse.ease.lang.unittest...
03:10:41 [2020-09-24T07:10:41.506Z] Constructing Javadoc information...
03:10:41 [2020-09-24T07:10:41.506Z] WARNING: Cannot open location "/home/jenkins/agent/workspace/ease.verify.core.gerrit/tests/org.eclipse.ease.lang.unittest.test/target/javadoc-bundle-options/package-list"
03:10:41 [2020-09-24T07:10:41.506Z] No plugin definition found, skipping
03:10:41 [2020-09-24T07:10:41.506Z] No plugin definition found, skipping
03:10:41 [2020-09-24T07:10:41.506Z] [WARNING] Javadoc Warnings
03:10:41 [2020-09-24T07:10:41.506Z] [WARNING] Picked up JAVA_TOOL_OPTIONS: -Dmaven.ext.class.path="/home/jenkins/agent/workspace/ease.verify.core.gerrit@tmp/withMaven67bfed35/pipeline-maven-spy.jar" -Dorg.jenkinsci.plugins.pipeline.maven.reportsFolder="/home/jenkins/agent/workspace/ease.verify.core.gerrit@tmp/withMaven67bfed35"
03:10:41 [2020-09-24T07:10:41.506Z] [WARNING] javadoc: warning - The old Doclet and Taglet APIs in the packages
03:10:41 [2020-09-24T07:10:41.506Z] [WARNING] com.sun.javadoc, com.sun.tools.doclets and their implementations
03:10:41 [2020-09-24T07:10:41.506Z] [WARNING] are planned to be removed in a future JDK release. These
03:10:41 [2020-09-24T07:10:41.506Z] [WARNING] components have been superseded by the new APIs in jdk.javadoc.doclet.
03:10:41 [2020-09-24T07:10:41.506Z] [WARNING] Users are strongly recommended to migrate to the new APIs.
03:10:41 [2020-09-24T07:10:41.506Z] [INFO] 
03:10:41 [2020-09-24T07:10:41.506Z] [INFO] --- build-helper-maven-plugin:1.9.1:add-resource (add_help) @ org.eclipse.ease.lang.unittest.test ---
03:10:41 [2020-09-24T07:10:41.506Z] [INFO] 
03:10:41 [2020-09-24T07:10:41.506Z] [INFO] --- maven-resources-plugin:2.4.3:resources (default-resources) @ org.eclipse.ease.lang.unittest.test ---
03:10:41 [2020-09-24T07:10:41.507Z] [INFO] Using 'UTF-8' encoding to copy filtered resources.
03:10:41 [2020-09-24T07:10:41.507Z] [INFO] skip non existing resourceDirectory /home/jenkins/agent/workspace/ease.verify.core.gerrit/tests/org.eclipse.ease.lang.unittest.test/src/main/resources
03:10:41 [2020-09-24T07:10:41.507Z] [INFO] skip non existing resourceDirectory /home/jenkins/agent/workspace/ease.verify.core.gerrit/tests/org.eclipse.ease.lang.unittest.test/help
03:10:41 [2020-09-24T07:10:41.507Z] [INFO] 
03:10:41 [2020-09-24T07:10:41.507Z] [INFO] --- tycho-compiler-plugin:1.5.0:compile (default-compile) @ org.eclipse.ease.lang.unittest.test ---
03:10:41 [2020-09-24T07:10:41.507Z] [INFO] Compiling 3 source files to /home/jenkins/agent/workspace/ease.verify.core.gerrit/tests/org.eclipse.ease.lang.unittest.test/target/classes
03:10:41 [2020-09-24T07:10:41.507Z] [INFO] 
03:10:41 [2020-09-24T07:10:41.507Z] [INFO] --- maven-resources-plugin:2.4.3:testResources (default-testResources) @ org.eclipse.ease.lang.unittest.test ---
03:10:41 [2020-09-24T07:10:41.507Z] [INFO] Using 'UTF-8' encoding to copy filtered resources.
03:10:41 [2020-09-24T07:10:41.507Z] [INFO] skip non existing resourceDirectory /home/jenkins/agent/workspace/ease.verify.core.gerrit/tests/org.eclipse.ease.lang.unittest.test/src/test/resources
03:10:41 [2020-09-24T07:10:41.507Z] [INFO] 
03:10:41 [2020-09-24T07:10:41.507Z] [INFO] --- tycho-source-plugin:1.5.0:plugin-source (plugin-source) @ org.eclipse.ease.lang.unittest.test ---
03:10:41 [2020-09-24T07:10:41.507Z] [WARNING] Bundle-Name header not found in /home/jenkins/agent/workspace/ease.verify.core.gerrit/tests/org.eclipse.ease.lang.unittest.test/META-INF/MANIFEST.MF, fallback to Bundle-SymbolicName for source bundle
03:10:41 [2020-09-24T07:10:41.507Z] [WARNING] Bundle-Vendor header not found in /home/jenkins/agent/workspace/ease.verify.core.gerrit/tests/org.eclipse.ease.lang.unittest.test/META-INF/MANIFEST.MF, fallback to 'unknown' for source bundle
03:10:41 [2020-09-24T07:10:41.507Z] [INFO] Building jar: /home/jenkins/agent/workspace/ease.verify.core.gerrit/tests/org.eclipse.ease.lang.unittest.test/target/org.eclipse.ease.lang.unittest.test-0.8.0-SNAPSHOT-sources.jar
03:10:41 [2020-09-24T07:10:41.507Z] [INFO] 
03:10:41 [2020-09-24T07:10:41.507Z] [INFO] --- target-platform-configuration:1.5.0:target-platform (default-target-platform) @ org.eclipse.ease.lang.unittest.test ---
03:10:41 [2020-09-24T07:10:41.507Z] [INFO] 
03:10:41 [2020-09-24T07:10:41.507Z] [INFO] --- tycho-packaging-plugin:1.5.0:package-plugin (default-package-plugin) @ org.eclipse.ease.lang.unittest.test ---
03:10:41 [2020-09-24T07:10:41.507Z] [INFO] Building jar: /home/jenkins/agent/workspace/ease.verify.core.gerrit/tests/org.eclipse.ease.lang.unittest.test/target/org.eclipse.ease.lang.unittest.test-0.8.0-SNAPSHOT.jar
03:10:41 [2020-09-24T07:10:41.507Z] [INFO] 
03:10:41 [2020-09-24T07:10:41.507Z] [INFO] --- tycho-p2-plugin:1.5.0:p2-metadata-default (default-p2-metadata-default) @ org.eclipse.ease.lang.unittest.test ---
03:10:41 [2020-09-24T07:10:41.507Z] [INFO] 
03:10:41 [2020-09-24T07:10:41.507Z] [INFO] --- tycho-source-feature-plugin:1.5.0:source-feature (source-feature) @ org.eclipse.ease.lang.unittest.test ---
03:10:41 [2020-09-24T07:10:41.507Z] [INFO] 
03:10:41 [2020-09-24T07:10:41.507Z] [INFO] --- tycho-p2-plugin:1.5.0:p2-metadata (attached-p2-metadata) @ org.eclipse.ease.lang.unittest.test ---
03:10:41 [2020-09-24T07:10:41.507Z] [INFO] 
03:10:41 [2020-09-24T07:10:41.507Z] [INFO] --- tycho-surefire-plugin:1.5.0:test (default-test) @ org.eclipse.ease.lang.unittest.test ---
03:10:41 [2020-09-24T07:10:41.803Z] [INFO] Expected eclipse log file: /home/jenkins/agent/workspace/ease.verify.core.gerrit/tests/org.eclipse.ease.lang.unittest.test/target/work/data/.metadata/.log
03:10:41 [2020-09-24T07:10:41.803Z] [INFO] Command line:
03:10:41 [2020-09-24T07:10:41.803Z] 	[/opt/tools/java/openjdk/jdk-11/11.0.2+9/bin/java, -Dosgi.noShutdown=false, -Dosgi.os=linux, -Dosgi.ws=gtk, -Dosgi.arch=x86_64, -Dosgi.clean=true, -jar, /home/jenkins/.m2/repository/p2/osgi/bundle/org.eclipse.equinox.launcher/1.5.800.v20200727-1323/org.eclipse.equinox.launcher-1.5.800.v20200727-1323.jar, -data, /home/jenkins/agent/workspace/ease.verify.core.gerrit/tests/org.eclipse.ease.lang.unittest.test/target/work/data, -install, /home/jenkins/agent/workspace/ease.verify.core.gerrit/tests/org.eclipse.ease.lang.unittest.test/target/work, -configuration, /home/jenkins/agent/workspace/ease.verify.core.gerrit/tests/org.eclipse.ease.lang.unittest.test/target/work/configuration, -application, org.eclipse.tycho.surefire.osgibooter.headlesstest, -testproperties, /home/jenkins/agent/workspace/ease.verify.core.gerrit/tests/org.eclipse.ease.lang.unittest.test/target/surefire.properties]
03:10:41 [2020-09-24T07:10:41.803Z] Picked up JAVA_TOOL_OPTIONS: -Dmaven.ext.class.path="/home/jenkins/agent/workspace/ease.verify.core.gerrit@tmp/withMaven67bfed35/pipeline-maven-spy.jar" -Dorg.jenkinsci.plugins.pipeline.maven.reportsFolder="/home/jenkins/agent/workspace/ease.verify.core.gerrit@tmp/withMaven67bfed35" 
03:10:43 [2020-09-24T07:10:43.691Z] 
03:10:43 [2020-09-24T07:10:43.691Z] Results:
03:10:43 [2020-09-24T07:10:43.691Z] 
03:10:43 [2020-09-24T07:10:43.691Z] Tests run: 0, Failures: 0, Errors: 0, Skipped: 0
03:10:43 [2020-09-24T07:10:43.691Z] 
03:10:44 [2020-09-24T07:10:44.618Z] An error has occurred. See the log file
03:10:44 [2020-09-24T07:10:44.618Z] /home/jenkins/agent/workspace/ease.verify.core.gerrit/tests/org.eclipse.ease.lang.unittest.test/target/work/data/.metadata/.log.
03:10:44 [2020-09-24T07:10:44.618Z] [INFO] ------------------------------------------------------------------------
03:10:44 [2020-09-24T07:10:44.618Z] [INFO] Reactor Summary:
03:10:44 [2020-09-24T07:10:44.618Z] [INFO] 
03:10:44 [2020-09-24T07:10:44.618Z] [INFO] org.eclipse.ease.releng 0.8.0-SNAPSHOT ............. SUCCESS [  3.638 s]
03:10:44 [2020-09-24T07:10:44.618Z] [INFO] org.eclipse.ease.classloader 0.8.0-SNAPSHOT ........ SUCCESS [  8.168 s]
03:10:44 [2020-09-24T07:10:44.618Z] [INFO] org.eclipse.ease 0.8.0-SNAPSHOT .................... SUCCESS [  3.203 s]
03:10:44 [2020-09-24T07:10:44.618Z] [INFO] org.eclipse.ease.ui 0.8.0-SNAPSHOT ................. SUCCESS [  3.278 s]
03:10:44 [2020-09-24T07:10:44.618Z] [INFO] org.eclipse.ease.ui.completions.java 0.8.0-SNAPSHOT  SUCCESS [  2.103 s]
03:10:44 [2020-09-24T07:10:44.618Z] [INFO] org.eclipse.ease.ui.scripts 0.8.0-SNAPSHOT ......... SUCCESS [  2.910 s]
03:10:44 [2020-09-24T07:10:44.618Z] [INFO] org.eclipse.ease.lang.javascript 0.8.0-SNAPSHOT .... SUCCESS [  1.617 s]
03:10:44 [2020-09-24T07:10:44.618Z] [INFO] org.eclipse.ease.lang.scriptarchive 0.8.0-SNAPSHOT . SUCCESS [  3.281 s]
03:10:44 [2020-09-24T07:10:44.618Z] [INFO] org.eclipse.ease.lang.python 0.8.0-SNAPSHOT ........ SUCCESS [  1.887 s]
03:10:44 [2020-09-24T07:10:44.618Z] [INFO] org.eclipse.ease.lang.python.py4j 0.8.0-SNAPSHOT ... SUCCESS [  1.817 s]
03:10:44 [2020-09-24T07:10:44.618Z] [INFO] org.eclipse.ease.lang.groovy 0.8.0-SNAPSHOT ........ SUCCESS [  1.605 s]
03:10:44 [2020-09-24T07:10:44.618Z] [INFO] org.eclipse.ease.lang.groovy.interpreter 0.8.0-SNAPSHOT SUCCESS [  1.692 s]
03:10:44 [2020-09-24T07:10:44.618Z] [INFO] org.eclipse.ease.lang.unittest 0.8.0-SNAPSHOT ...... SUCCESS [  3.484 s]
03:10:44 [2020-09-24T07:10:44.618Z] [INFO] org.eclipse.ease.lang.unittest.ui 0.8.0-SNAPSHOT ... SUCCESS [  2.735 s]
03:10:44 [2020-09-24T07:10:44.618Z] [INFO] org.eclipse.ease.lang.ruby 0.8.0-SNAPSHOT .......... SUCCESS [  1.823 s]
03:10:44 [2020-09-24T07:10:44.618Z] [INFO] org.eclipse.ease.lang.ruby.jruby 0.8.0-SNAPSHOT .... SUCCESS [  1.972 s]
03:10:44 [2020-09-24T07:10:44.618Z] [INFO] org.eclipse.ease.lang.javascript.nashorn 0.8.0-SNAPSHOT SUCCESS [  1.723 s]
03:10:44 [2020-09-24T07:10:44.618Z] [INFO] org.eclipse.ease.lang.javascript.rhino 0.8.0-SNAPSHOT SUCCESS [  2.054 s]
03:10:44 [2020-09-24T07:10:44.618Z] [INFO] org.eclipse.ease.lang.python.jython 0.8.0-SNAPSHOT . SUCCESS [  2.125 s]
03:10:44 [2020-09-24T07:10:44.618Z] [INFO] org.eclipse.ease.lang.javascript.ui 0.8.0-SNAPSHOT . SUCCESS [  1.798 s]
03:10:44 [2020-09-24T07:10:44.618Z] [INFO] org.eclipse.ease.lang.jvm.compiled 0.8.0-SNAPSHOT .. SUCCESS [  1.744 s]
03:10:44 [2020-09-24T07:10:44.618Z] [INFO] org.eclipse.ease.lang.scriptarchive.ui 0.8.0-SNAPSHOT SUCCESS [  1.788 s]
03:10:44 [2020-09-24T07:10:44.618Z] [INFO] org.eclipse.ease.help 0.8.0-SNAPSHOT ............... SUCCESS [  6.777 s]
03:10:44 [2020-09-24T07:10:44.618Z] [INFO] org.eclipse.ease.feature 0.8.0-SNAPSHOT ............ SUCCESS [  0.179 s]
03:10:44 [2020-09-24T07:10:44.618Z] [INFO] org.eclipse.ease.ui.feature 0.8.0-SNAPSHOT ......... SUCCESS [  0.115 s]
03:10:44 [2020-09-24T07:10:44.618Z] [INFO] org.eclipse.ease.lang.javascript.feature 0.8.0-SNAPSHOT SUCCESS [  0.096 s]
03:10:44 [2020-09-24T07:10:44.618Z] [INFO] org.eclipse.ease.lang.python.feature 0.8.0-SNAPSHOT  SUCCESS [  0.071 s]
03:10:44 [2020-09-24T07:10:44.618Z] [INFO] org.eclipse.ease.python.jython.feature 0.8.0-SNAPSHOT SUCCESS [  0.046 s]
03:10:44 [2020-09-24T07:10:44.618Z] [INFO] org.eclipse.ease.lang.python.py4j.feature 0.8.0-SNAPSHOT SUCCESS [  0.155 s]
03:10:44 [2020-09-24T07:10:44.618Z] [INFO] org.eclipse.ease.lang.jvm.feature 0.8.0-SNAPSHOT ... SUCCESS [  0.096 s]
03:10:44 [2020-09-24T07:10:44.618Z] [INFO] org.eclipse.ease.lang.groovy.feature 0.8.0-SNAPSHOT  SUCCESS [  0.041 s]
03:10:44 [2020-09-24T07:10:44.618Z] [INFO] org.eclipse.ease.lang.ruby.feature 0.8.0-SNAPSHOT .. SUCCESS [  0.091 s]
03:10:44 [2020-09-24T07:10:44.618Z] [INFO] org.eclipse.ease.lang.scriptarchive.feature 0.8.0-SNAPSHOT SUCCESS [  0.082 s]
03:10:44 [2020-09-24T07:10:44.618Z] [INFO] org.eclipse.ease.lang.unittest.feature 0.8.0-SNAPSHOT SUCCESS [  0.087 s]
03:10:44 [2020-09-24T07:10:44.618Z] [INFO] org.eclipse.ease.releng.target 0.8.0-SNAPSHOT ...... SUCCESS [  0.006 s]
03:10:44 [2020-09-24T07:10:44.618Z] [INFO] org.eclipse.ease.releng.p2 0.8.0-SNAPSHOT .......... SUCCESS [  3.356 s]
03:10:44 [2020-09-24T07:10:44.618Z] [INFO] org.eclipse.ease.testhelper 0.8.0-SNAPSHOT ......... SUCCESS [  1.663 s]
03:10:44 [2020-09-24T07:10:44.618Z] [INFO] org.eclipse.ease.test 0.8.0-SNAPSHOT ............... SUCCESS [ 15.167 s]
03:10:44 [2020-09-24T07:10:44.618Z] [INFO] org.eclipse.ease.lang.javascript.nashorn.test 0.8.0-SNAPSHOT SUCCESS [  4.772 s]
03:10:44 [2020-09-24T07:10:44.618Z] [INFO] org.eclipse.ease.lang.javascript.rhino.test 0.8.0-SNAPSHOT SUCCESS [ 16.063 s]
03:10:44 [2020-09-24T07:10:44.618Z] [INFO] org.eclipse.ease.lang.javascript.test 0.8.0-SNAPSHOT SUCCESS [  5.004 s]
03:10:44 [2020-09-24T07:10:44.618Z] [INFO] org.eclipse.ease.lang.python.test 0.8.0-SNAPSHOT ... SUCCESS [  3.952 s]
03:10:44 [2020-09-24T07:10:44.618Z] [INFO] org.eclipse.ease.lang.python.jython.test 0.8.0-SNAPSHOT SUCCESS [ 17.058 s]
03:10:44 [2020-09-24T07:10:44.618Z] [INFO] org.eclipse.ease.lang.scriptarchive.test 0.8.0-SNAPSHOT SUCCESS [  4.444 s]
03:10:44 [2020-09-24T07:10:44.618Z] [INFO] org.eclipse.ease.lang.unittest.test 0.8.0-SNAPSHOT . FAILURE [  4.633 s]
03:10:44 [2020-09-24T07:10:44.618Z] [INFO] org.eclipse.ease.ui.scripts.test 0.8.0-SNAPSHOT .... SKIPPED
03:10:44 [2020-09-24T07:10:44.618Z] [INFO] org.eclipse.ease.ui.test 0.8.0-SNAPSHOT ............ SKIPPED
03:10:44 [2020-09-24T07:10:44.618Z] [INFO] EASE (Incubation) 0.4.0-SNAPSHOT ................... SKIPPED
03:10:44 [2020-09-24T07:10:44.618Z] [INFO] ------------------------------------------------------------------------
03:10:44 [2020-09-24T07:10:44.618Z] [INFO] BUILD FAILURE
03:10:44 [2020-09-24T07:10:44.619Z] [INFO] ------------------------------------------------------------------------
03:10:44 [2020-09-24T07:10:44.619Z] [INFO] Total time:  04:53 min
03:10:44 [2020-09-24T07:10:44.619Z] [INFO] Finished at: 2020-09-24T07:10:44Z
03:10:44 [2020-09-24T07:10:44.619Z] [INFO] ------------------------------------------------------------------------
03:10:44 [2020-09-24T07:10:44.619Z] [INFO] [jenkins-event-spy] Generated /home/jenkins/agent/workspace/ease.verify.core.gerrit@tmp/withMaven67bfed35/maven-spy-20200924-070550-2138607256891403141727.log
03:10:44 [2020-09-24T07:10:44.619Z] [ERROR] Failed to execute goal org.eclipse.tycho:tycho-surefire-plugin:1.5.0:test (default-test) on project org.eclipse.ease.lang.unittest.test: An unexpected error occured while launching the test runtime (return code 13). See log /home/jenkins/agent/workspace/ease.verify.core.gerrit/tests/org.eclipse.ease.lang.unittest.test/target/work/data/.metadata/.log for details. -> [Help 1]
03:10:44 [2020-09-24T07:10:44.619Z] [ERROR] 
03:10:44 [2020-09-24T07:10:44.619Z] [ERROR] To see the full stack trace of the errors, re-run Maven with the -e switch.
03:10:44 [2020-09-24T07:10:44.619Z] [ERROR] Re-run Maven using the -X switch to enable full debug logging.
03:10:44 [2020-09-24T07:10:44.619Z] [ERROR] 
03:10:44 [2020-09-24T07:10:44.619Z] [ERROR] For more information about the errors and possible solutions, please read the following articles:
03:10:44 [2020-09-24T07:10:44.619Z] [ERROR] [Help 1] http://cwiki.apache.org/confluence/display/MAVEN/MojoFailureException
03:10:44 [2020-09-24T07:10:44.619Z] [ERROR] 
03:10:44 [2020-09-24T07:10:44.619Z] [ERROR] After correcting the problems, you can resume the build with the command
03:10:44 [2020-09-24T07:10:44.619Z] [ERROR]   mvn <args> -rf :org.eclipse.ease.lang.unittest.test
[Pipeline] }
03:10:46 [2020-09-24T07:10:46.721Z] [withMaven] Publishers: Pipeline Graph Publisher: 63 ms, Invoker Publisher: 1 ms, Junit Publisher: 1 ms, Dependencies Fingerprint Publisher: 956 ms, Findbugs Publisher: 1 ms
[Pipeline] // withMaven
[Pipeline] }
[Pipeline] // stage
[Pipeline] }
03:10:46 [2020-09-24T07:10:46.782Z] Failed in branch EASE Core
[Pipeline] // parallel
[Pipeline] }
[Pipeline] // stage
[Pipeline] stage
[Pipeline] { (Declarative: Post Actions)
[Pipeline] archiveArtifacts
03:10:46 [2020-09-24T07:10:46.886Z] Archiving artifacts
[Pipeline] emailext
03:11:09 [2020-09-24T07:11:09.549Z] Sending email to: christian.pontesegger@web.de
[Pipeline] }
[Pipeline] // stage
[Pipeline] }
[Pipeline] // timeout
[Pipeline] }
[Pipeline] // timestamps
[Pipeline] }
[Pipeline] // node
[Pipeline] End of Pipeline
ERROR: script returned exit code 1
Finished: FAILURE