AbortedConsole Output

Triggered by Gerrit: https://git.eclipse.org/r/c/ease/org.eclipse.ease.core/+/169729
Running in Durability level: PERFORMANCE_OPTIMIZED
[Pipeline] Start of Pipeline
[Pipeline] node
Still waiting to schedule task
Waiting for next available executor
Agent basic-pdrss is provisioned from template basic
---
apiVersion: "v1"
kind: "Pod"
metadata:
  annotations: {}
  labels:
    jenkins: "slave"
    jenkins/label: ""
  name: "basic-pdrss"
spec:
  containers:
  - env:
    - name: "JENKINS_SECRET"
      value: "********"
    - name: "JENKINS_TUNNEL"
      value: "jenkins-discovery.ease.svc.cluster.local:50000"
    - name: "JENKINS_AGENT_NAME"
      value: "basic-pdrss"
    - name: "JENKINS_REMOTING_JAVA_OPTS"
      value: "-showversion -XshowSettings:vm -Xmx256m -Dsun.zip.disableMemoryMapping=true\
        \ -Dorg.jenkinsci.remoting.engine.JnlpProtocol3.disabled=true -Dorg.jenkinsci.plugins.gitclient.CliGitAPIImpl.useSETSID=true"
    - name: "JAVA_TOOL_OPTIONS"
      value: ""
    - name: "_JAVA_OPTIONS"
      value: ""
    - name: "OPENJ9_JAVA_OPTIONS"
      value: "-XX:+IgnoreUnrecognizedVMOptions -XX:+IdleTuningCompactOnIdle -XX:+IdleTuningGcOnIdle"
    - name: "JENKINS_NAME"
      value: "basic-pdrss"
    - name: "JENKINS_AGENT_WORKDIR"
      value: "/home/jenkins/agent"
    - name: "JENKINS_URL"
      value: "http://jenkins-ui.ease.svc.cluster.local/ease/"
    image: "docker.io/eclipsecbi/jiro-agent-basic:remoting-4.2.1"
    imagePullPolicy: "Always"
    name: "jnlp"
    resources:
      limits:
        memory: "4096Mi"
        cpu: "2000m"
      requests:
        memory: "4096Mi"
        cpu: "1000m"
    securityContext:
      privileged: false
    tty: true
    volumeMounts:
    - mountPath: "/home/jenkins/.m2/toolchains.xml"
      name: "m2-dir"
      readOnly: true
      subPath: "toolchains.xml"
    - mountPath: "/home/jenkins/.mavenrc"
      name: "m2-dir"
      readOnly: true
      subPath: ".mavenrc"
    - mountPath: "/opt/tools"
      name: "volume-0"
      readOnly: false
    - mountPath: "/home/jenkins"
      name: "volume-2"
      readOnly: false
    - mountPath: "/home/jenkins/.m2/repository"
      name: "volume-3"
      readOnly: false
    - mountPath: "/home/jenkins/.m2/settings-security.xml"
      name: "m2-secret-dir"
      readOnly: true
      subPath: "settings-security.xml"
    - mountPath: "/home/jenkins/.m2/wrapper"
      name: "volume-4"
      readOnly: false
    - mountPath: "/home/jenkins/.m2/settings.xml"
      name: "m2-secret-dir"
      readOnly: true
      subPath: "settings.xml"
    - mountPath: "/home/jenkins/.ssh"
      name: "volume-1"
      readOnly: false
    - mountPath: "/home/jenkins/agent"
      name: "workspace-volume"
      readOnly: false
    workingDir: "/home/jenkins/agent"
  nodeSelector:
    beta.kubernetes.io/os: "linux"
  restartPolicy: "Never"
  securityContext: {}
  volumes:
  - name: "volume-0"
    persistentVolumeClaim:
      claimName: "tools-claim-jiro-ease"
      readOnly: true
  - name: "m2-secret-dir"
    secret:
      secretName: "m2-secret-dir"
  - emptyDir:
      medium: ""
    name: "volume-2"
  - configMap:
      name: "m2-dir"
    name: "m2-dir"
  - configMap:
      name: "known-hosts"
    name: "volume-1"
  - emptyDir:
      medium: ""
    name: "workspace-volume"
  - emptyDir:
      medium: ""
    name: "volume-4"
  - emptyDir:
      medium: ""
    name: "volume-3"

Running on basic-pdrss in /home/jenkins/agent/workspace/ease.verify.core.gerrit
[Pipeline] {
[Pipeline] timestamps
[Pipeline] {
[Pipeline] timeout
03:03:50 [2020-09-24T07:03:50.046Z] Timeout set to expire in 1 hr 0 min
[Pipeline] {
[Pipeline] stage
[Pipeline] { (Checkout)
[Pipeline] checkout
03:03:51 [2020-09-24T07:03:51.156Z] No credentials specified
03:03:51 [2020-09-24T07:03:51.158Z] Cloning the remote Git repository
03:03:51 [2020-09-24T07:03:51.171Z] Cloning repository git://git.eclipse.org/gitroot/ease/org.eclipse.ease.core.git
03:03:51 [2020-09-24T07:03:51.208Z]  > git init /home/jenkins/agent/workspace/ease.verify.core.gerrit # timeout=10
03:03:51 [2020-09-24T07:03:51.229Z] Fetching upstream changes from git://git.eclipse.org/gitroot/ease/org.eclipse.ease.core.git
03:03:51 [2020-09-24T07:03:51.230Z]  > git --version # timeout=10
03:03:51 [2020-09-24T07:03:51.232Z]  > git fetch --tags --force --progress -- git://git.eclipse.org/gitroot/ease/org.eclipse.ease.core.git +refs/heads/*:refs/remotes/origin/* # timeout=10
03:03:52 [2020-09-24T07:03:52.418Z] JENKINS-19022: warning: possible memory leak due to Git plugin usage; see: https://wiki.jenkins.io/display/JENKINS/Remove+Git+Plugin+BuildsByBranch+BuildData
03:03:52 [2020-09-24T07:03:52.419Z] Checking out Revision 79175b04a5a9210e0beb8fdadab59e0f440abc8e (refs/changes/29/169729/5)
03:03:52 [2020-09-24T07:03:52.154Z]  > git config remote.origin.url git://git.eclipse.org/gitroot/ease/org.eclipse.ease.core.git # timeout=10
03:03:52 [2020-09-24T07:03:52.158Z]  > git config --add remote.origin.fetch +refs/heads/*:refs/remotes/origin/* # timeout=10
03:03:52 [2020-09-24T07:03:52.165Z]  > git config remote.origin.url git://git.eclipse.org/gitroot/ease/org.eclipse.ease.core.git # timeout=10
03:03:52 [2020-09-24T07:03:52.174Z] Fetching upstream changes from git://git.eclipse.org/gitroot/ease/org.eclipse.ease.core.git
03:03:52 [2020-09-24T07:03:52.174Z]  > git fetch --tags --force --progress -- git://git.eclipse.org/gitroot/ease/org.eclipse.ease.core.git refs/changes/29/169729/5 # timeout=10
03:03:52 [2020-09-24T07:03:52.416Z]  > git rev-parse 79175b04a5a9210e0beb8fdadab59e0f440abc8e^{commit} # timeout=10
03:03:52 [2020-09-24T07:03:52.426Z]  > git config core.sparsecheckout # timeout=10
03:03:52 [2020-09-24T07:03:52.429Z]  > git checkout -f 79175b04a5a9210e0beb8fdadab59e0f440abc8e # timeout=10
03:03:55 [2020-09-24T07:03:55.946Z] Commit message: "Bug 567234: Upgrade target platform to 2020-09"
03:03:55 [2020-09-24T07:03:55.951Z]  > git rev-parse FETCH_HEAD^{commit} # timeout=10
03:03:56 [2020-09-24T07:03:56.030Z]  > git rev-list --no-walk e3a142720ef029527c4f0c162e1523b2fc5a1439 # timeout=10
03:03:56 [2020-09-24T07:03:56.044Z] Cleaning workspace
[Pipeline] }
[Pipeline] // stage
[Pipeline] stage
[Pipeline] { (Info)
[Pipeline] sh
03:03:56 [2020-09-24T07:03:56.671Z] + java -version
03:03:56 [2020-09-24T07:03:56.672Z] openjdk version "1.8.0_265"
03:03:56 [2020-09-24T07:03:56.672Z] OpenJDK Runtime Environment (build 1.8.0_265-b01)
03:03:56 [2020-09-24T07:03:56.672Z] Eclipse OpenJ9 VM (build openj9-0.21.0, JRE 1.8.0 Linux amd64-64-Bit Compressed References 20200728_727 (JIT enabled, AOT enabled)
03:03:56 [2020-09-24T07:03:56.672Z] OpenJ9   - 34cf4c075
03:03:56 [2020-09-24T07:03:56.672Z] OMR      - 113e54219
03:03:56 [2020-09-24T07:03:56.672Z] JCL      - c82ff0c20f based on jdk8u265-b01)
[Pipeline] }
[Pipeline] // stage
[Pipeline] stage
[Pipeline] { (Fetch Doclet)
[Pipeline] sh
03:03:57 [2020-09-24T07:03:57.030Z] + curl https://ci.eclipse.org/ease/job/ease.build.module.doclet/lastSuccessfulBuild/artifact/developers/org.eclipse.ease.helpgenerator/target/ease.module.doclet.jar --output ease.module.doclet.jar
03:03:57 [2020-09-24T07:03:57.030Z]   % Total    % Received % Xferd  Average Speed   Time    Time     Time  Current
03:03:57 [2020-09-24T07:03:57.030Z]                                  Dload  Upload   Total   Spent    Left  Speed
03:03:57 [2020-09-24T07:03:57.030Z] 
  0     0    0     0    0     0      0      0 --:--:-- --:--:-- --:--:--     0
100 88178  100 88178    0     0  1871k      0 --:--:-- --:--:-- --:--:-- 1871k
[Pipeline] }
[Pipeline] // stage
[Pipeline] stage
[Pipeline] { (Build)
[Pipeline] parallel
[Pipeline] { (Branch: EASE Core)
[Pipeline] { (Branch: Module Doclet)
[Pipeline] stage
[Pipeline] { (EASE Core)
[Pipeline] stage
[Pipeline] { (Module Doclet)
[Pipeline] withMaven
03:03:57 [2020-09-24T07:03:57.151Z] [withMaven] Options: [org.jenkinsci.plugins.pipeline.maven.publishers.GeneratedArtifactsPublisher[disabled=true], org.jenkinsci.plugins.pipeline.maven.publishers.FindbugsAnalysisPublisher[disabled='false', healthy='', unHealthy='', thresholdLimit='low'], org.jenkinsci.plugins.pipeline.maven.publishers.TasksScannerPublisher[disabled='true', healthy='', unHealthy='', thresholdLimit='low']]
03:03:57 [2020-09-24T07:03:57.152Z] [withMaven] Available options: 
03:03:57 [2020-09-24T07:03:57.152Z] [withMaven] using JDK installation openjdk-jdk11-latest
[Pipeline] withMaven
03:03:57 [2020-09-24T07:03:57.154Z] [withMaven] Options: [org.jenkinsci.plugins.pipeline.maven.publishers.GeneratedArtifactsPublisher[disabled=true], org.jenkinsci.plugins.pipeline.maven.publishers.FindbugsAnalysisPublisher[disabled='false', healthy='', unHealthy='', thresholdLimit='low'], org.jenkinsci.plugins.pipeline.maven.publishers.TasksScannerPublisher[disabled='true', healthy='', unHealthy='', thresholdLimit='low']]
03:03:57 [2020-09-24T07:03:57.155Z] [withMaven] Available options: 
03:03:57 [2020-09-24T07:03:57.155Z] [withMaven] using JDK installation oracle-jdk9-latest
03:03:57 [2020-09-24T07:03:57.160Z] [withMaven] using Maven installation 'apache-maven-latest'
03:03:57 [2020-09-24T07:03:57.161Z] [withMaven] using Maven installation 'apache-maven-latest'
[Pipeline] {
[Pipeline] {
[Pipeline] sh
[Pipeline] sh
03:03:57 [2020-09-24T07:03:57.653Z] + mvn clean verify -P module-docs,api-docs
03:03:57 [2020-09-24T07:03:57.653Z] ----- withMaven Wrapper script -----
03:03:57 [2020-09-24T07:03:57.653Z] Picked up JAVA_TOOL_OPTIONS: -Dmaven.ext.class.path="/home/jenkins/agent/workspace/ease.verify.core.gerrit@tmp/withMaven39b2d47c/pipeline-maven-spy.jar" -Dorg.jenkinsci.plugins.pipeline.maven.reportsFolder="/home/jenkins/agent/workspace/ease.verify.core.gerrit@tmp/withMaven39b2d47c" 
03:03:57 [2020-09-24T07:03:57.669Z] + mvn clean verify -f developers/org.eclipse.ease.helpgenerator/pom.xml
03:03:57 [2020-09-24T07:03:57.669Z] ----- withMaven Wrapper script -----
03:03:57 [2020-09-24T07:03:57.925Z] Picked up JAVA_TOOL_OPTIONS: -Dmaven.ext.class.path="/home/jenkins/agent/workspace/ease.verify.core.gerrit@tmp/withMavene69b7378/pipeline-maven-spy.jar" -Dorg.jenkinsci.plugins.pipeline.maven.reportsFolder="/home/jenkins/agent/workspace/ease.verify.core.gerrit@tmp/withMavene69b7378" 
03:03:58 [2020-09-24T07:03:58.889Z] Apache Maven 3.6.3 (cecedd343002696d0abb50b32b541b8a6ba2883f)
03:03:58 [2020-09-24T07:03:58.889Z] Maven home: /opt/tools/apache-maven/latest
03:03:58 [2020-09-24T07:03:58.889Z] Java version: 9.0.4, vendor: Oracle Corporation, runtime: /opt/tools/java/oracle/jdk-9/9.0.4
03:03:58 [2020-09-24T07:03:58.889Z] Default locale: en_US, platform encoding: UTF-8
03:03:58 [2020-09-24T07:03:58.889Z] OS name: "linux", version: "3.10.0-1062.el7.x86_64", arch: "amd64", family: "unix"
03:03:59 [2020-09-24T07:03:59.020Z] Apache Maven 3.6.3 (cecedd343002696d0abb50b32b541b8a6ba2883f)
03:03:59 [2020-09-24T07:03:59.020Z] Maven home: /opt/tools/apache-maven/latest
03:03:59 [2020-09-24T07:03:59.020Z] Java version: 11.0.2, vendor: Oracle Corporation, runtime: /opt/tools/java/openjdk/jdk-11/11.0.2+9
03:03:59 [2020-09-24T07:03:59.020Z] Default locale: en_US, platform encoding: UTF-8
03:03:59 [2020-09-24T07:03:59.020Z] OS name: "linux", version: "3.10.0-1062.el7.x86_64", arch: "amd64", family: "unix"
03:04:01 [2020-09-24T07:04:01.014Z] [INFO] [jenkins-event-spy] Generate /home/jenkins/agent/workspace/ease.verify.core.gerrit@tmp/withMavene69b7378/maven-spy-20200924-070400-7095198343717409515725.log.tmp ...
03:04:01 [2020-09-24T07:04:01.015Z] [INFO] [jenkins-event-spy] Generate /home/jenkins/agent/workspace/ease.verify.core.gerrit@tmp/withMaven39b2d47c/maven-spy-20200924-070400-71315898332488675268755.log.tmp ...
03:04:01 [2020-09-24T07:04:01.589Z] [INFO] Scanning for projects...
03:04:01 [2020-09-24T07:04:01.592Z] [INFO] Scanning for projects...
03:04:01 [2020-09-24T07:04:01.889Z] [WARNING] The project org.eclipse.ease:org.eclipse.ease.helpgenerator:jar:0.8.0-SNAPSHOT uses prerequisites which is only intended for maven-plugin projects but not for non maven-plugin projects. For such purposes you should use the maven-enforcer-plugin. See https://maven.apache.org/enforcer/enforcer-rules/requireMavenVersion.html
03:04:01 [2020-09-24T07:04:01.889Z] [INFO] 
03:04:01 [2020-09-24T07:04:01.889Z] [INFO] ----------< org.eclipse.ease:org.eclipse.ease.helpgenerator >-----------
03:04:01 [2020-09-24T07:04:01.889Z] [INFO] Building org.eclipse.ease.helpgenerator 0.8.0-SNAPSHOT
03:04:01 [2020-09-24T07:04:01.889Z] [INFO] --------------------------------[ jar ]---------------------------------
03:04:03 [2020-09-24T07:04:03.857Z] [INFO] 
03:04:03 [2020-09-24T07:04:03.857Z] [INFO] --- maven-clean-plugin:2.5:clean (default-clean) @ org.eclipse.ease.helpgenerator ---
03:04:04 [2020-09-24T07:04:04.114Z] [INFO] 
03:04:04 [2020-09-24T07:04:04.114Z] [INFO] --- maven-resources-plugin:2.6:resources (default-resources) @ org.eclipse.ease.helpgenerator ---
03:04:05 [2020-09-24T07:04:05.528Z] [INFO] Using 'UTF-8' encoding to copy filtered resources.
03:04:05 [2020-09-24T07:04:05.528Z] [INFO] skip non existing resourceDirectory /home/jenkins/agent/workspace/ease.verify.core.gerrit/developers/org.eclipse.ease.helpgenerator/src/main/resources
03:04:05 [2020-09-24T07:04:05.528Z] [INFO] 
03:04:05 [2020-09-24T07:04:05.528Z] [INFO] --- maven-compiler-plugin:3.6.1:compile (default-compile) @ org.eclipse.ease.helpgenerator ---
03:04:08 [2020-09-24T07:04:08.889Z] [INFO] Changes detected - recompiling the module!
03:04:08 [2020-09-24T07:04:08.889Z] [INFO] Compiling 24 source files to /home/jenkins/agent/workspace/ease.verify.core.gerrit/developers/org.eclipse.ease.helpgenerator/target/classes
03:04:12 [2020-09-24T07:04:12.495Z] [INFO] /home/jenkins/agent/workspace/ease.verify.core.gerrit/developers/org.eclipse.ease.helpgenerator/src/org/eclipse/ease/helpgenerator/sunapi/Java5ClassModel.java: Some input files use or override a deprecated API.
03:04:12 [2020-09-24T07:04:12.495Z] [INFO] /home/jenkins/agent/workspace/ease.verify.core.gerrit/developers/org.eclipse.ease.helpgenerator/src/org/eclipse/ease/helpgenerator/sunapi/Java5ClassModel.java: Recompile with -Xlint:deprecation for details.
03:04:12 [2020-09-24T07:04:12.495Z] [INFO] /home/jenkins/agent/workspace/ease.verify.core.gerrit/developers/org.eclipse.ease.helpgenerator/src/org/eclipse/ease/helpgenerator/XMLMemento.java: /home/jenkins/agent/workspace/ease.verify.core.gerrit/developers/org.eclipse.ease.helpgenerator/src/org/eclipse/ease/helpgenerator/XMLMemento.java uses unchecked or unsafe operations.
03:04:12 [2020-09-24T07:04:12.495Z] [INFO] /home/jenkins/agent/workspace/ease.verify.core.gerrit/developers/org.eclipse.ease.helpgenerator/src/org/eclipse/ease/helpgenerator/XMLMemento.java: Recompile with -Xlint:unchecked for details.
03:04:12 [2020-09-24T07:04:12.495Z] [INFO] 
03:04:12 [2020-09-24T07:04:12.495Z] [INFO] --- maven-resources-plugin:2.6:testResources (default-testResources) @ org.eclipse.ease.helpgenerator ---
03:04:12 [2020-09-24T07:04:12.495Z] [INFO] Using 'UTF-8' encoding to copy filtered resources.
03:04:12 [2020-09-24T07:04:12.495Z] [INFO] skip non existing resourceDirectory /home/jenkins/agent/workspace/ease.verify.core.gerrit/developers/org.eclipse.ease.helpgenerator/src/test/resources
03:04:12 [2020-09-24T07:04:12.495Z] [INFO] 
03:04:12 [2020-09-24T07:04:12.495Z] [INFO] --- maven-compiler-plugin:3.6.1:testCompile (default-testCompile) @ org.eclipse.ease.helpgenerator ---
03:04:12 [2020-09-24T07:04:12.495Z] [INFO] Changes detected - recompiling the module!
03:04:12 [2020-09-24T07:04:12.495Z] [INFO] Compiling 4 source files to /home/jenkins/agent/workspace/ease.verify.core.gerrit/developers/org.eclipse.ease.helpgenerator/target/test-classes
03:04:12 [2020-09-24T07:04:12.794Z] [INFO] /home/jenkins/agent/workspace/ease.verify.core.gerrit/developers/org.eclipse.ease.helpgenerator/test/org/eclipse/ease/helpgenerator/IntegrationTestJava5API.java: /home/jenkins/agent/workspace/ease.verify.core.gerrit/developers/org.eclipse.ease.helpgenerator/test/org/eclipse/ease/helpgenerator/IntegrationTestJava5API.java uses or overrides a deprecated API.
03:04:12 [2020-09-24T07:04:12.794Z] [INFO] /home/jenkins/agent/workspace/ease.verify.core.gerrit/developers/org.eclipse.ease.helpgenerator/test/org/eclipse/ease/helpgenerator/IntegrationTestJava5API.java: Recompile with -Xlint:deprecation for details.
03:04:12 [2020-09-24T07:04:12.794Z] [INFO] 
03:04:12 [2020-09-24T07:04:12.794Z] [INFO] --- maven-surefire-plugin:2.22.0:test (default-test) @ org.eclipse.ease.helpgenerator ---
03:04:15 [2020-09-24T07:04:15.592Z] [INFO] 
03:04:15 [2020-09-24T07:04:15.592Z] [INFO] -------------------------------------------------------
03:04:15 [2020-09-24T07:04:15.592Z] [INFO]  T E S T S
03:04:15 [2020-09-24T07:04:15.592Z] [INFO] -------------------------------------------------------
03:04:15 [2020-09-24T07:04:15.889Z] [INFO] Running org.eclipse.ease.helpgenerator.IntegrationTestJava11API
03:04:16 [2020-09-24T07:04:16.789Z] [WARNING] No explicit target runtime environment configuration. Build is platform dependent.
03:04:17 [2020-09-24T07:04:17.388Z] Loading source files for package org.eclipse.ease.helpgenerator.testproject.valid...
03:04:17 [2020-09-24T07:04:17.388Z] Constructing Javadoc information...
03:04:18 [2020-09-24T07:04:18.004Z] javadoc: warning - No class definition found for module "Invalid XML Module"
03:04:18 [2020-09-24T07:04:18.004Z] javadoc: warning - No class definition found for module "Missing Documentation Module"
03:04:18 [2020-09-24T07:04:18.004Z] 2 warnings
03:04:18 [2020-09-24T07:04:18.291Z] Loading source files for package org.eclipse.ease.helpgenerator.testproject.valid...
03:04:18 [2020-09-24T07:04:18.291Z] Constructing Javadoc information...
03:04:18 [2020-09-24T07:04:18.590Z] javadoc: warning - No class definition found for module "Invalid XML Module"
03:04:18 [2020-09-24T07:04:18.590Z] javadoc: warning - No class definition found for module "Missing Documentation Module"
03:04:18 [2020-09-24T07:04:18.590Z] 2 warnings
03:04:18 [2020-09-24T07:04:18.590Z] Loading source files for package org.eclipse.ease.helpgenerator.testproject.invalidxml...
03:04:18 [2020-09-24T07:04:18.590Z] Constructing Javadoc information...
03:04:18 [2020-09-24T07:04:18.590Z] javadoc: error - invalid file content for org.eclipse.ease.helpgenerator.testproject.invalidxml.InvalidXmlModule:	The element type "some" must be terminated by the matching end-tag "</some>".
03:04:18 [2020-09-24T07:04:18.590Z] javadoc: warning - No class definition found for module "Missing Documentation Module"
03:04:18 [2020-09-24T07:04:18.590Z] javadoc: warning - No class definition found for module "Deprecated Module"
03:04:18 [2020-09-24T07:04:18.590Z] javadoc: warning - No class definition found for module "Valid Test Module"
03:04:18 [2020-09-24T07:04:18.898Z] 1 error
03:04:18 [2020-09-24T07:04:18.898Z] 3 warnings
03:04:18 [2020-09-24T07:04:18.898Z] Loading source files for package org.eclipse.ease.helpgenerator.testproject.missingdocs...
03:04:18 [2020-09-24T07:04:18.898Z] Constructing Javadoc information...
03:04:18 [2020-09-24T07:04:18.898Z] javadoc: warning - No class definition found for module "Deprecated Module"
03:04:18 [2020-09-24T07:04:18.898Z] javadoc: error - Missing class comment for org.eclipse.ease.helpgenerator.testproject.missingdocs.MissingDocsModule
03:04:18 [2020-09-24T07:04:18.898Z] javadoc: error - Field documentation missing for org.eclipse.ease.helpgenerator.testproject.missingdocs.MissingDocsModule.UNIVERSAL_TRUTH
03:04:18 [2020-09-24T07:04:18.898Z] javadoc: error - Missing parameter documentation for org.eclipse.ease.helpgenerator.testproject.missingdocs.MissingDocsModule.baseParameters(b)
03:04:18 [2020-09-24T07:04:18.898Z] javadoc: error - Missing parameter documentation for org.eclipse.ease.helpgenerator.testproject.missingdocs.MissingDocsModule.baseParameters(data)
03:04:18 [2020-09-24T07:04:18.898Z] javadoc: error - Missing exception documentation for org.eclipse.ease.helpgenerator.testproject.missingdocs.MissingDocsModule.pleaseThrow() - java.io.IOException
03:04:18 [2020-09-24T07:04:18.898Z] javadoc: error - Missing comment for org.eclipse.ease.helpgenerator.testproject.missingdocs.MissingDocsModule.simple()
03:04:18 [2020-09-24T07:04:18.898Z] javadoc: error - Missing return statement documentation for org.eclipse.ease.helpgenerator.testproject.missingdocs.MissingDocsModule.thisIsAMethodWithALongName()
03:04:18 [2020-09-24T07:04:18.898Z] javadoc: warning - No class definition found for module "Invalid XML Module"
03:04:18 [2020-09-24T07:04:18.898Z] javadoc: warning - No class definition found for module "Valid Test Module"
03:04:18 [2020-09-24T07:04:18.898Z] 7 errors
03:04:18 [2020-09-24T07:04:18.898Z] 3 warnings
03:04:18 [2020-09-24T07:04:18.899Z] Loading source files for package org.eclipse.ease.helpgenerator.testproject.valid...
03:04:18 [2020-09-24T07:04:18.899Z] Constructing Javadoc information...
03:04:19 [2020-09-24T07:04:19.191Z] javadoc: warning - No class definition found for module "Missing Documentation Module"
03:04:19 [2020-09-24T07:04:19.191Z] javadoc: warning - No class definition found for module "Invalid XML Module"
03:04:19 [2020-09-24T07:04:19.191Z] 2 warnings
03:04:19 [2020-09-24T07:04:19.191Z] Loading source files for package org.eclipse.ease.helpgenerator.testproject.invalidxml...
03:04:19 [2020-09-24T07:04:19.191Z] Constructing Javadoc information...
03:04:19 [2020-09-24T07:04:19.191Z] javadoc: warning - No class definition found for module "Valid Test Module"
03:04:19 [2020-09-24T07:04:19.191Z] javadoc: warning - No class definition found for module "Missing Documentation Module"
03:04:19 [2020-09-24T07:04:19.191Z] javadoc: warning - No class definition found for module "Deprecated Module"
03:04:19 [2020-09-24T07:04:19.191Z] javadoc: warning - invalid file content for org.eclipse.ease.helpgenerator.testproject.invalidxml.InvalidXmlModule:	The element type "some" must be terminated by the matching end-tag "</some>".
03:04:19 [2020-09-24T07:04:19.191Z] 4 warnings
03:04:19 [2020-09-24T07:04:19.191Z] Loading source files for package org.eclipse.ease.helpgenerator.testproject.missingdocs...
03:04:19 [2020-09-24T07:04:19.191Z] Constructing Javadoc information...
03:04:19 [2020-09-24T07:04:19.490Z] javadoc: warning - No class definition found for module "Invalid XML Module"
03:04:19 [2020-09-24T07:04:19.490Z] javadoc: warning - Missing class comment for org.eclipse.ease.helpgenerator.testproject.missingdocs.MissingDocsModule
03:04:19 [2020-09-24T07:04:19.490Z] javadoc: warning - Field documentation missing for org.eclipse.ease.helpgenerator.testproject.missingdocs.MissingDocsModule.UNIVERSAL_TRUTH
03:04:19 [2020-09-24T07:04:19.490Z] javadoc: warning - Missing parameter documentation for org.eclipse.ease.helpgenerator.testproject.missingdocs.MissingDocsModule.baseParameters(b)
03:04:19 [2020-09-24T07:04:19.490Z] javadoc: warning - Missing parameter documentation for org.eclipse.ease.helpgenerator.testproject.missingdocs.MissingDocsModule.baseParameters(data)
03:04:19 [2020-09-24T07:04:19.490Z] javadoc: warning - Missing exception documentation for org.eclipse.ease.helpgenerator.testproject.missingdocs.MissingDocsModule.pleaseThrow() - java.io.IOException
03:04:19 [2020-09-24T07:04:19.490Z] javadoc: warning - Missing comment for org.eclipse.ease.helpgenerator.testproject.missingdocs.MissingDocsModule.simple()
03:04:19 [2020-09-24T07:04:19.490Z] javadoc: warning - Missing return statement documentation for org.eclipse.ease.helpgenerator.testproject.missingdocs.MissingDocsModule.thisIsAMethodWithALongName()
03:04:19 [2020-09-24T07:04:19.490Z] javadoc: warning - No class definition found for module "Deprecated Module"
03:04:19 [2020-09-24T07:04:19.490Z] javadoc: warning - No class definition found for module "Valid Test Module"
03:04:19 [2020-09-24T07:04:19.490Z] 10 warnings
03:04:19 [2020-09-24T07:04:19.490Z] [INFO] Tests run: 7, Failures: 0, Errors: 0, Skipped: 0, Time elapsed: 3.516 s - in org.eclipse.ease.helpgenerator.IntegrationTestJava11API
03:04:19 [2020-09-24T07:04:19.490Z] [INFO] Running org.eclipse.ease.helpgenerator.LinkProviderTest
03:04:19 [2020-09-24T07:04:19.490Z] [INFO] Tests run: 18, Failures: 0, Errors: 0, Skipped: 0, Time elapsed: 0.002 s - in org.eclipse.ease.helpgenerator.LinkProviderTest
03:04:19 [2020-09-24T07:04:19.490Z] [INFO] Running org.eclipse.ease.helpgenerator.IntegrationTestJava5API
03:04:19 [2020-09-24T07:04:19.490Z] Loading source files for package org.eclipse.ease.helpgenerator.testproject.valid...
03:04:19 [2020-09-24T07:04:19.490Z] Constructing Javadoc information...
03:04:19 [2020-09-24T07:04:19.795Z] WARNING: No class definition found for module "Invalid XML Module"
03:04:19 [2020-09-24T07:04:19.795Z] WARNING: No class definition found for module "Missing Documentation Module"
03:04:19 [2020-09-24T07:04:19.795Z] Loading source files for package org.eclipse.ease.helpgenerator.testproject.valid...
03:04:19 [2020-09-24T07:04:19.795Z] Constructing Javadoc information...
03:04:20 [2020-09-24T07:04:20.096Z] WARNING: No class definition found for module "Missing Documentation Module"
03:04:20 [2020-09-24T07:04:20.096Z] WARNING: No class definition found for module "Invalid XML Module"
03:04:20 [2020-09-24T07:04:20.096Z] Loading source files for package org.eclipse.ease.helpgenerator.testproject.invalidxml...
03:04:20 [2020-09-24T07:04:20.096Z] Constructing Javadoc information...
03:04:20 [2020-09-24T07:04:20.096Z] WARNING: No class definition found for module "Deprecated Module"
03:04:20 [2020-09-24T07:04:20.096Z] WARNING: No class definition found for module "Missing Documentation Module"
03:04:20 [2020-09-24T07:04:20.096Z] ERROR: invalid file content for InvalidXmlModule:	The element type "some" must be terminated by the matching end-tag "</some>".
03:04:20 [2020-09-24T07:04:20.096Z] WARNING: No class definition found for module "Valid Test Module"
03:04:20 [2020-09-24T07:04:20.096Z] Loading source files for package org.eclipse.ease.helpgenerator.testproject.missingdocs...
03:04:20 [2020-09-24T07:04:20.096Z] Constructing Javadoc information...
03:04:20 [2020-09-24T07:04:20.395Z] WARNING: No class definition found for module "Invalid XML Module"
03:04:20 [2020-09-24T07:04:20.395Z] WARNING: No class definition found for module "Deprecated Module"
03:04:20 [2020-09-24T07:04:20.395Z] ERROR: Missing class comment for MissingDocsModule
03:04:20 [2020-09-24T07:04:20.395Z] ERROR: Field documentation missing for org.eclipse.ease.helpgenerator.testproject.missingdocs.MissingDocsModule.UNIVERSAL_TRUTH
03:04:20 [2020-09-24T07:04:20.395Z] ERROR: Missing parameter documentation for MissingDocsModule.baseParameters(b)
03:04:20 [2020-09-24T07:04:20.395Z] ERROR: Missing parameter documentation for MissingDocsModule.baseParameters(data)
03:04:20 [2020-09-24T07:04:20.395Z] ERROR: Missing exception documentation for MissingDocsModule.pleaseThrow() - java.io.IOException
03:04:20 [2020-09-24T07:04:20.395Z] ERROR: Missing comment for MissingDocsModule.simple()
03:04:20 [2020-09-24T07:04:20.395Z] ERROR: Missing return statement documentation for MissingDocsModule.thisIsAMethodWithALongName()
03:04:20 [2020-09-24T07:04:20.395Z] WARNING: No class definition found for module "Valid Test Module"
03:04:20 [2020-09-24T07:04:20.395Z] Loading source files for package org.eclipse.ease.helpgenerator.testproject.valid...
03:04:20 [2020-09-24T07:04:20.395Z] Constructing Javadoc information...
03:04:20 [2020-09-24T07:04:20.395Z] WARNING: No class definition found for module "Invalid XML Module"
03:04:20 [2020-09-24T07:04:20.395Z] WARNING: No class definition found for module "Missing Documentation Module"
03:04:20 [2020-09-24T07:04:20.691Z] Loading source files for package org.eclipse.ease.helpgenerator.testproject.invalidxml...
03:04:20 [2020-09-24T07:04:20.691Z] Constructing Javadoc information...
03:04:20 [2020-09-24T07:04:20.691Z] WARNING: No class definition found for module "Deprecated Module"
03:04:20 [2020-09-24T07:04:20.691Z] WARNING: No class definition found for module "Valid Test Module"
03:04:20 [2020-09-24T07:04:20.691Z] WARNING: invalid file content for InvalidXmlModule:	The element type "some" must be terminated by the matching end-tag "</some>".
03:04:20 [2020-09-24T07:04:20.691Z] WARNING: No class definition found for module "Missing Documentation Module"
03:04:20 [2020-09-24T07:04:20.691Z] Loading source files for package org.eclipse.ease.helpgenerator.testproject.missingdocs...
03:04:20 [2020-09-24T07:04:20.691Z] Constructing Javadoc information...
03:04:20 [2020-09-24T07:04:20.691Z] WARNING: Missing class comment for MissingDocsModule
03:04:20 [2020-09-24T07:04:20.691Z] WARNING: Field documentation missing for org.eclipse.ease.helpgenerator.testproject.missingdocs.MissingDocsModule.UNIVERSAL_TRUTH
03:04:20 [2020-09-24T07:04:20.691Z] WARNING: Missing parameter documentation for MissingDocsModule.baseParameters(b)
03:04:20 [2020-09-24T07:04:20.691Z] WARNING: Missing parameter documentation for MissingDocsModule.baseParameters(data)
03:04:20 [2020-09-24T07:04:20.691Z] WARNING: Missing exception documentation for MissingDocsModule.pleaseThrow() - java.io.IOException
03:04:20 [2020-09-24T07:04:20.691Z] WARNING: Missing comment for MissingDocsModule.simple()
03:04:20 [2020-09-24T07:04:20.691Z] WARNING: Missing return statement documentation for MissingDocsModule.thisIsAMethodWithALongName()
03:04:20 [2020-09-24T07:04:20.691Z] WARNING: No class definition found for module "Valid Test Module"
03:04:20 [2020-09-24T07:04:20.691Z] WARNING: No class definition found for module "Invalid XML Module"
03:04:20 [2020-09-24T07:04:20.691Z] WARNING: No class definition found for module "Deprecated Module"
03:04:20 [2020-09-24T07:04:20.947Z] [INFO] Tests run: 7, Failures: 0, Errors: 0, Skipped: 0, Time elapsed: 1.393 s - in org.eclipse.ease.helpgenerator.IntegrationTestJava5API
03:04:21 [2020-09-24T07:04:21.204Z] [INFO] 
03:04:21 [2020-09-24T07:04:21.204Z] [INFO] Results:
03:04:21 [2020-09-24T07:04:21.205Z] [INFO] 
03:04:21 [2020-09-24T07:04:21.205Z] [INFO] Tests run: 32, Failures: 0, Errors: 0, Skipped: 0
03:04:21 [2020-09-24T07:04:21.205Z] [INFO] 
03:04:21 [2020-09-24T07:04:21.205Z] [INFO] 
03:04:21 [2020-09-24T07:04:21.205Z] [INFO] --- maven-jar-plugin:2.4:jar (default-jar) @ org.eclipse.ease.helpgenerator ---
03:04:22 [2020-09-24T07:04:22.164Z] [INFO] Building jar: /home/jenkins/agent/workspace/ease.verify.core.gerrit/developers/org.eclipse.ease.helpgenerator/target/ease.module.doclet.jar
03:04:22 [2020-09-24T07:04:22.164Z] [INFO] ------------------------------------------------------------------------
03:04:22 [2020-09-24T07:04:22.164Z] [INFO] BUILD SUCCESS
03:04:22 [2020-09-24T07:04:22.164Z] [INFO] ------------------------------------------------------------------------
03:04:22 [2020-09-24T07:04:22.164Z] [INFO] Total time:  20.821 s
03:04:22 [2020-09-24T07:04:22.164Z] [INFO] Finished at: 2020-09-24T07:04:21Z
03:04:22 [2020-09-24T07:04:22.164Z] [INFO] ------------------------------------------------------------------------
03:04:22 [2020-09-24T07:04:22.164Z] [INFO] [jenkins-event-spy] Generated /home/jenkins/agent/workspace/ease.verify.core.gerrit@tmp/withMavene69b7378/maven-spy-20200924-070400-7095198343717409515725.log
[Pipeline] }
03:04:22 [2020-09-24T07:04:22.253Z] [withMaven] junitPublisher - Archive test results for Maven artifact org.eclipse.ease:org.eclipse.ease.helpgenerator:jar:0.8.0-SNAPSHOT generated by maven-surefire-plugin:test (default-test): developers/org.eclipse.ease.helpgenerator/target/surefire-reports/*.xml
03:04:22 [2020-09-24T07:04:22.255Z] [withMaven] junitPublisher - Jenkins JUnit Attachments Plugin not found, can't publish test attachments.Recording test results
03:04:22 [2020-09-24T07:04:22.686Z] [withMaven] Publishers: Junit Publisher: 385 ms
[Pipeline] // withMaven
[Pipeline] }
[Pipeline] // stage
[Pipeline] }
03:04:25 [2020-09-24T07:04:25.332Z] [WARNING] No explicit target runtime environment configuration. Build is platform dependent.
03:04:28 [2020-09-24T07:04:28.258Z] [WARNING] No explicit target runtime environment configuration. Build is platform dependent.
03:04:28 [2020-09-24T07:04:28.258Z] [WARNING] No explicit target runtime environment configuration. Build is platform dependent.
03:04:28 [2020-09-24T07:04:28.258Z] [WARNING] No explicit target runtime environment configuration. Build is platform dependent.
03:04:28 [2020-09-24T07:04:28.258Z] [WARNING] No explicit target runtime environment configuration. Build is platform dependent.
03:04:28 [2020-09-24T07:04:28.258Z] [WARNING] No explicit target runtime environment configuration. Build is platform dependent.
03:04:28 [2020-09-24T07:04:28.258Z] [WARNING] No explicit target runtime environment configuration. Build is platform dependent.
03:04:28 [2020-09-24T07:04:28.258Z] [WARNING] No explicit target runtime environment configuration. Build is platform dependent.
03:04:28 [2020-09-24T07:04:28.258Z] [WARNING] No explicit target runtime environment configuration. Build is platform dependent.
03:04:28 [2020-09-24T07:04:28.258Z] [WARNING] No explicit target runtime environment configuration. Build is platform dependent.
03:04:28 [2020-09-24T07:04:28.258Z] [WARNING] No explicit target runtime environment configuration. Build is platform dependent.
03:04:28 [2020-09-24T07:04:28.258Z] [WARNING] No explicit target runtime environment configuration. Build is platform dependent.
03:04:28 [2020-09-24T07:04:28.258Z] [WARNING] No explicit target runtime environment configuration. Build is platform dependent.
03:04:28 [2020-09-24T07:04:28.258Z] [WARNING] No explicit target runtime environment configuration. Build is platform dependent.
03:04:28 [2020-09-24T07:04:28.258Z] [WARNING] No explicit target runtime environment configuration. Build is platform dependent.
03:04:28 [2020-09-24T07:04:28.259Z] [WARNING] No explicit target runtime environment configuration. Build is platform dependent.
03:04:28 [2020-09-24T07:04:28.259Z] [WARNING] No explicit target runtime environment configuration. Build is platform dependent.
03:04:28 [2020-09-24T07:04:28.259Z] [WARNING] No explicit target runtime environment configuration. Build is platform dependent.
03:04:28 [2020-09-24T07:04:28.259Z] [WARNING] No explicit target runtime environment configuration. Build is platform dependent.
03:04:28 [2020-09-24T07:04:28.259Z] [WARNING] No explicit target runtime environment configuration. Build is platform dependent.
03:04:28 [2020-09-24T07:04:28.259Z] [WARNING] No explicit target runtime environment configuration. Build is platform dependent.
03:04:28 [2020-09-24T07:04:28.259Z] [WARNING] No explicit target runtime environment configuration. Build is platform dependent.
03:04:28 [2020-09-24T07:04:28.259Z] [WARNING] No explicit target runtime environment configuration. Build is platform dependent.
03:04:28 [2020-09-24T07:04:28.259Z] [WARNING] No explicit target runtime environment configuration. Build is platform dependent.
03:04:28 [2020-09-24T07:04:28.259Z] [WARNING] No explicit target runtime environment configuration. Build is platform dependent.
03:04:28 [2020-09-24T07:04:28.259Z] [WARNING] No explicit target runtime environment configuration. Build is platform dependent.
03:04:28 [2020-09-24T07:04:28.259Z] [WARNING] No explicit target runtime environment configuration. Build is platform dependent.
03:04:28 [2020-09-24T07:04:28.259Z] [WARNING] No explicit target runtime environment configuration. Build is platform dependent.
03:04:28 [2020-09-24T07:04:28.259Z] [WARNING] No explicit target runtime environment configuration. Build is platform dependent.
03:04:28 [2020-09-24T07:04:28.259Z] [WARNING] No explicit target runtime environment configuration. Build is platform dependent.
03:04:28 [2020-09-24T07:04:28.259Z] [WARNING] No explicit target runtime environment configuration. Build is platform dependent.
03:04:28 [2020-09-24T07:04:28.259Z] [WARNING] No explicit target runtime environment configuration. Build is platform dependent.
03:04:28 [2020-09-24T07:04:28.259Z] [WARNING] No explicit target runtime environment configuration. Build is platform dependent.
Aborted by new patch set.
03:05:06 [2020-09-24T07:05:06.680Z] Sending interrupt signal to process
03:05:14 [2020-09-24T07:05:14.896Z] script returned exit code 143
[Pipeline] }
03:05:14 [2020-09-24T07:05:14.905Z] [withMaven] One or multiple Maven executions have been ignored by the Jenkins Pipeline Maven Plugin because they have been interrupted before completion (1). See Pipeline Maven Plugin FAQ for more details.
[Pipeline] // withMaven
[Pipeline] }
[Pipeline] // stage
[Pipeline] }
03:05:15 [2020-09-24T07:05:15.325Z] Failed in branch EASE Core
[Pipeline] // parallel
[Pipeline] }
[Pipeline] // stage
[Pipeline] }
[Pipeline] // timeout
[Pipeline] }
[Pipeline] // timestamps
[Pipeline] }
[Pipeline] // node
[Pipeline] End of Pipeline
Finished: ABORTED