AbortedConsole Output

Skipping 811 KB.. Full Log
e-sources @ org.eclipse.ease.lang.javascript.test >>>
02:15:35 [2020-09-24T06:15:35.877Z] [INFO] 
02:15:35 [2020-09-24T06:15:35.877Z] [INFO] --- tycho-packaging-plugin:1.5.0:build-qualifier (default-build-qualifier) @ org.eclipse.ease.lang.javascript.test ---
02:15:35 [2020-09-24T06:15:35.877Z] [INFO] The project's OSGi version is 0.8.0.I201910171213
02:15:35 [2020-09-24T06:15:35.877Z] [INFO] 
02:15:35 [2020-09-24T06:15:35.877Z] [INFO] --- tycho-packaging-plugin:1.5.0:validate-id (default-validate-id) @ org.eclipse.ease.lang.javascript.test ---
02:15:35 [2020-09-24T06:15:35.877Z] [INFO] 
02:15:35 [2020-09-24T06:15:35.877Z] [INFO] --- tycho-packaging-plugin:1.5.0:validate-version (default-validate-version) @ org.eclipse.ease.lang.javascript.test ---
02:15:35 [2020-09-24T06:15:35.877Z] [INFO] 
02:15:35 [2020-09-24T06:15:35.877Z] [INFO] <<< maven-javadoc-plugin:2.9.1:javadoc (build-docs) < generate-sources @ org.eclipse.ease.lang.javascript.test <<<
02:15:35 [2020-09-24T06:15:35.877Z] [INFO] 
02:15:35 [2020-09-24T06:15:35.877Z] [INFO] 
02:15:35 [2020-09-24T06:15:35.877Z] [INFO] --- maven-javadoc-plugin:2.9.1:javadoc (build-docs) @ org.eclipse.ease.lang.javascript.test ---
02:15:35 [2020-09-24T06:15:35.877Z] [ERROR] Error fetching link: http://help.eclipse.org/oxygen/topic/org.eclipse.platform.doc.isv/reference/api/package-list. Ignored it.
02:15:37 [2020-09-24T06:15:37.242Z] [INFO] 
02:15:37 [2020-09-24T06:15:37.242Z] Loading source files for package org.eclipse.ease.lang.javascript...
02:15:37 [2020-09-24T06:15:37.242Z] Constructing Javadoc information...
02:15:37 [2020-09-24T06:15:37.242Z] WARNING: Cannot open location "/home/jenkins/agent/workspace/ease.verify.core.gerrit/tests/org.eclipse.ease.lang.javascript.test/target/javadoc-bundle-options/package-list"
02:15:37 [2020-09-24T06:15:37.242Z] No plugin definition found, skipping
02:15:37 [2020-09-24T06:15:37.242Z] No plugin definition found, skipping
02:15:37 [2020-09-24T06:15:37.242Z] [WARNING] Javadoc Warnings
02:15:37 [2020-09-24T06:15:37.242Z] [WARNING] Picked up JAVA_TOOL_OPTIONS: -Dmaven.ext.class.path="/home/jenkins/agent/workspace/ease.verify.core.gerrit@tmp/withMaven32a4fffd/pipeline-maven-spy.jar" -Dorg.jenkinsci.plugins.pipeline.maven.reportsFolder="/home/jenkins/agent/workspace/ease.verify.core.gerrit@tmp/withMaven32a4fffd"
02:15:37 [2020-09-24T06:15:37.242Z] [WARNING] javadoc: warning - The old Doclet and Taglet APIs in the packages
02:15:37 [2020-09-24T06:15:37.242Z] [WARNING] com.sun.javadoc, com.sun.tools.doclets and their implementations
02:15:37 [2020-09-24T06:15:37.242Z] [WARNING] are planned to be removed in a future JDK release. These
02:15:37 [2020-09-24T06:15:37.242Z] [WARNING] components have been superseded by the new APIs in jdk.javadoc.doclet.
02:15:37 [2020-09-24T06:15:37.242Z] [WARNING] Users are strongly recommended to migrate to the new APIs.
02:15:37 [2020-09-24T06:15:37.242Z] [INFO] 
02:15:37 [2020-09-24T06:15:37.242Z] [INFO] --- build-helper-maven-plugin:1.9.1:add-resource (add_help) @ org.eclipse.ease.lang.javascript.test ---
02:15:37 [2020-09-24T06:15:37.242Z] [INFO] 
02:15:37 [2020-09-24T06:15:37.242Z] [INFO] --- maven-resources-plugin:2.4.3:resources (default-resources) @ org.eclipse.ease.lang.javascript.test ---
02:15:37 [2020-09-24T06:15:37.242Z] [INFO] Using 'UTF-8' encoding to copy filtered resources.
02:15:37 [2020-09-24T06:15:37.242Z] [INFO] skip non existing resourceDirectory /home/jenkins/agent/workspace/ease.verify.core.gerrit/tests/org.eclipse.ease.lang.javascript.test/src/main/resources
02:15:37 [2020-09-24T06:15:37.242Z] [INFO] skip non existing resourceDirectory /home/jenkins/agent/workspace/ease.verify.core.gerrit/tests/org.eclipse.ease.lang.javascript.test/help
02:15:37 [2020-09-24T06:15:37.242Z] [INFO] 
02:15:37 [2020-09-24T06:15:37.242Z] [INFO] --- tycho-compiler-plugin:1.5.0:compile (default-compile) @ org.eclipse.ease.lang.javascript.test ---
02:15:37 [2020-09-24T06:15:37.242Z] [INFO] Compiling 2 source files to /home/jenkins/agent/workspace/ease.verify.core.gerrit/tests/org.eclipse.ease.lang.javascript.test/target/classes
02:15:37 [2020-09-24T06:15:37.242Z] [INFO] 
02:15:37 [2020-09-24T06:15:37.242Z] [INFO] --- maven-resources-plugin:2.4.3:testResources (default-testResources) @ org.eclipse.ease.lang.javascript.test ---
02:15:37 [2020-09-24T06:15:37.242Z] [INFO] Using 'UTF-8' encoding to copy filtered resources.
02:15:37 [2020-09-24T06:15:37.242Z] [INFO] skip non existing resourceDirectory /home/jenkins/agent/workspace/ease.verify.core.gerrit/tests/org.eclipse.ease.lang.javascript.test/src/test/resources
02:15:37 [2020-09-24T06:15:37.242Z] [INFO] 
02:15:37 [2020-09-24T06:15:37.242Z] [INFO] --- tycho-source-plugin:1.5.0:plugin-source (plugin-source) @ org.eclipse.ease.lang.javascript.test ---
02:15:37 [2020-09-24T06:15:37.242Z] [WARNING] Bundle-Vendor header not found in /home/jenkins/agent/workspace/ease.verify.core.gerrit/tests/org.eclipse.ease.lang.javascript.test/META-INF/MANIFEST.MF, fallback to 'unknown' for source bundle
02:15:37 [2020-09-24T06:15:37.242Z] [INFO] Building jar: /home/jenkins/agent/workspace/ease.verify.core.gerrit/tests/org.eclipse.ease.lang.javascript.test/target/org.eclipse.ease.lang.javascript.test-0.8.0-SNAPSHOT-sources.jar
02:15:37 [2020-09-24T06:15:37.242Z] [INFO] 
02:15:37 [2020-09-24T06:15:37.242Z] [INFO] --- target-platform-configuration:1.5.0:target-platform (default-target-platform) @ org.eclipse.ease.lang.javascript.test ---
02:15:37 [2020-09-24T06:15:37.242Z] [INFO] 
02:15:37 [2020-09-24T06:15:37.242Z] [INFO] --- tycho-packaging-plugin:1.5.0:package-plugin (default-package-plugin) @ org.eclipse.ease.lang.javascript.test ---
02:15:37 [2020-09-24T06:15:37.242Z] [INFO] Building jar: /home/jenkins/agent/workspace/ease.verify.core.gerrit/tests/org.eclipse.ease.lang.javascript.test/target/org.eclipse.ease.lang.javascript.test-0.8.0-SNAPSHOT.jar
02:15:37 [2020-09-24T06:15:37.242Z] [INFO] 
02:15:37 [2020-09-24T06:15:37.242Z] [INFO] --- tycho-p2-plugin:1.5.0:p2-metadata-default (default-p2-metadata-default) @ org.eclipse.ease.lang.javascript.test ---
02:15:37 [2020-09-24T06:15:37.242Z] [INFO] 
02:15:37 [2020-09-24T06:15:37.242Z] [INFO] --- tycho-source-feature-plugin:1.5.0:source-feature (source-feature) @ org.eclipse.ease.lang.javascript.test ---
02:15:37 [2020-09-24T06:15:37.242Z] [INFO] 
02:15:37 [2020-09-24T06:15:37.242Z] [INFO] --- tycho-p2-plugin:1.5.0:p2-metadata (attached-p2-metadata) @ org.eclipse.ease.lang.javascript.test ---
02:15:37 [2020-09-24T06:15:37.242Z] [INFO] 
02:15:37 [2020-09-24T06:15:37.242Z] [INFO] --- tycho-surefire-plugin:1.5.0:test (default-test) @ org.eclipse.ease.lang.javascript.test ---
02:15:37 [2020-09-24T06:15:37.242Z] [INFO] Expected eclipse log file: /home/jenkins/agent/workspace/ease.verify.core.gerrit/tests/org.eclipse.ease.lang.javascript.test/target/work/data/.metadata/.log
02:15:37 [2020-09-24T06:15:37.242Z] [INFO] Command line:
02:15:37 [2020-09-24T06:15:37.243Z] 	[/opt/tools/java/openjdk/jdk-11/11.0.2+9/bin/java, -Dosgi.noShutdown=false, -Dosgi.os=linux, -Dosgi.ws=gtk, -Dosgi.arch=x86_64, -Dosgi.clean=true, -jar, /home/jenkins/.m2/repository/p2/osgi/bundle/org.eclipse.equinox.launcher/1.5.700.v20200207-2156/org.eclipse.equinox.launcher-1.5.700.v20200207-2156.jar, -data, /home/jenkins/agent/workspace/ease.verify.core.gerrit/tests/org.eclipse.ease.lang.javascript.test/target/work/data, -install, /home/jenkins/agent/workspace/ease.verify.core.gerrit/tests/org.eclipse.ease.lang.javascript.test/target/work, -configuration, /home/jenkins/agent/workspace/ease.verify.core.gerrit/tests/org.eclipse.ease.lang.javascript.test/target/work/configuration, -application, org.eclipse.tycho.surefire.osgibooter.headlesstest, -testproperties, /home/jenkins/agent/workspace/ease.verify.core.gerrit/tests/org.eclipse.ease.lang.javascript.test/target/surefire.properties]
02:15:37 [2020-09-24T06:15:37.243Z] Picked up JAVA_TOOL_OPTIONS: -Dmaven.ext.class.path="/home/jenkins/agent/workspace/ease.verify.core.gerrit@tmp/withMaven32a4fffd/pipeline-maven-spy.jar" -Dorg.jenkinsci.plugins.pipeline.maven.reportsFolder="/home/jenkins/agent/workspace/ease.verify.core.gerrit@tmp/withMaven32a4fffd" 
02:15:39 [2020-09-24T06:15:39.151Z] Running org.eclipse.ease.lang.javascript.JavaScriptCompletionContextTest
02:15:39 [2020-09-24T06:15:39.151Z] Tests run: 8, Failures: 0, Errors: 0, Skipped: 0, Time elapsed: 0.267 s - in org.eclipse.ease.lang.javascript.JavaScriptCompletionContextTest
02:15:39 [2020-09-24T06:15:39.151Z] verifyStaticClassTypes(org.eclipse.ease.lang.javascript.JavaScriptCompletionContextTest)  Time elapsed: 0.004 s
02:15:39 [2020-09-24T06:15:39.151Z] verifyClassInstanceTypes(org.eclipse.ease.lang.javascript.JavaScriptCompletionContextTest)  Time elapsed: 0.005 s
02:15:39 [2020-09-24T06:15:39.151Z] verifyTypesForScriptEngine(org.eclipse.ease.lang.javascript.JavaScriptCompletionContextTest)  Time elapsed: 0.099 s
02:15:39 [2020-09-24T06:15:39.151Z] verifyPackageTypes(org.eclipse.ease.lang.javascript.JavaScriptCompletionContextTest)  Time elapsed: 0.001 s
02:15:39 [2020-09-24T06:15:39.151Z] definedVariableTypes(org.eclipse.ease.lang.javascript.JavaScriptCompletionContextTest)  Time elapsed: 0.001 s
02:15:39 [2020-09-24T06:15:39.151Z] verifyStringLiteralTypes(org.eclipse.ease.lang.javascript.JavaScriptCompletionContextTest)  Time elapsed: 0 s
02:15:39 [2020-09-24T06:15:39.151Z] verifyUnknownTypes(org.eclipse.ease.lang.javascript.JavaScriptCompletionContextTest)  Time elapsed: 0 s
02:15:39 [2020-09-24T06:15:39.151Z] verifyNoneTypes(org.eclipse.ease.lang.javascript.JavaScriptCompletionContextTest)  Time elapsed: 0 s
02:15:39 [2020-09-24T06:15:39.151Z] Running org.eclipse.ease.lang.javascript.JavaScriptCodeFactoryTest
02:15:39 [2020-09-24T06:15:39.151Z] Tests run: 1, Failures: 0, Errors: 0, Skipped: 0, Time elapsed: 0.003 s - in org.eclipse.ease.lang.javascript.JavaScriptCodeFactoryTest
02:15:39 [2020-09-24T06:15:39.151Z] testCommentCreator(org.eclipse.ease.lang.javascript.JavaScriptCodeFactoryTest)  Time elapsed: 0.002 s
02:15:39 [2020-09-24T06:15:39.151Z] 
02:15:39 [2020-09-24T06:15:39.151Z] Results:
02:15:39 [2020-09-24T06:15:39.151Z] 
02:15:39 [2020-09-24T06:15:39.151Z] Tests run: 9, Failures: 0, Errors: 0, Skipped: 0
02:15:39 [2020-09-24T06:15:39.151Z] 
02:15:39 [2020-09-24T06:15:39.711Z] [INFO] All tests passed!
02:15:39 [2020-09-24T06:15:39.711Z] [INFO] 
02:15:39 [2020-09-24T06:15:39.711Z] [INFO] ---------< org.eclipse.ease:org.eclipse.ease.lang.python.test >---------
02:15:39 [2020-09-24T06:15:39.711Z] [INFO] Building org.eclipse.ease.lang.python.test 0.8.0-SNAPSHOT        [42/48]
02:15:39 [2020-09-24T06:15:39.711Z] [INFO] ------------------------[ eclipse-test-plugin ]-------------------------
02:15:39 [2020-09-24T06:15:39.711Z] [INFO] 
02:15:39 [2020-09-24T06:15:39.711Z] [INFO] --- maven-clean-plugin:2.5:clean (default-clean) @ org.eclipse.ease.lang.python.test ---
02:15:39 [2020-09-24T06:15:39.711Z] [INFO] 
02:15:39 [2020-09-24T06:15:39.711Z] [INFO] --- tycho-packaging-plugin:1.5.0:build-qualifier (default-build-qualifier) @ org.eclipse.ease.lang.python.test ---
02:15:39 [2020-09-24T06:15:39.711Z] [INFO] The project's OSGi version is 0.8.0.I201910171213
02:15:39 [2020-09-24T06:15:39.711Z] [INFO] 
02:15:39 [2020-09-24T06:15:39.711Z] [INFO] --- tycho-packaging-plugin:1.5.0:validate-id (default-validate-id) @ org.eclipse.ease.lang.python.test ---
02:15:39 [2020-09-24T06:15:39.711Z] [INFO] 
02:15:39 [2020-09-24T06:15:39.711Z] [INFO] --- tycho-packaging-plugin:1.5.0:validate-version (default-validate-version) @ org.eclipse.ease.lang.python.test ---
02:15:39 [2020-09-24T06:15:39.711Z] [INFO] 
02:15:39 [2020-09-24T06:15:39.711Z] [INFO] >>> maven-javadoc-plugin:2.9.1:javadoc (build-docs) > generate-sources @ org.eclipse.ease.lang.python.test >>>
02:15:39 [2020-09-24T06:15:39.711Z] [INFO] 
02:15:39 [2020-09-24T06:15:39.711Z] [INFO] --- tycho-packaging-plugin:1.5.0:build-qualifier (default-build-qualifier) @ org.eclipse.ease.lang.python.test ---
02:15:39 [2020-09-24T06:15:39.711Z] [INFO] The project's OSGi version is 0.8.0.I201910171213
02:15:39 [2020-09-24T06:15:39.711Z] [INFO] 
02:15:39 [2020-09-24T06:15:39.711Z] [INFO] --- tycho-packaging-plugin:1.5.0:validate-id (default-validate-id) @ org.eclipse.ease.lang.python.test ---
02:15:39 [2020-09-24T06:15:39.711Z] [INFO] 
02:15:39 [2020-09-24T06:15:39.711Z] [INFO] --- tycho-packaging-plugin:1.5.0:validate-version (default-validate-version) @ org.eclipse.ease.lang.python.test ---
02:15:39 [2020-09-24T06:15:39.711Z] [INFO] 
02:15:39 [2020-09-24T06:15:39.711Z] [INFO] <<< maven-javadoc-plugin:2.9.1:javadoc (build-docs) < generate-sources @ org.eclipse.ease.lang.python.test <<<
02:15:39 [2020-09-24T06:15:39.711Z] [INFO] 
02:15:39 [2020-09-24T06:15:39.711Z] [INFO] 
02:15:39 [2020-09-24T06:15:39.711Z] [INFO] --- maven-javadoc-plugin:2.9.1:javadoc (build-docs) @ org.eclipse.ease.lang.python.test ---
02:15:39 [2020-09-24T06:15:39.711Z] [ERROR] Error fetching link: http://help.eclipse.org/oxygen/topic/org.eclipse.platform.doc.isv/reference/api/package-list. Ignored it.
02:15:41 [2020-09-24T06:15:41.101Z] [INFO] 
02:15:41 [2020-09-24T06:15:41.101Z] Loading source files for package org.eclipse.ease.lang.python...
02:15:41 [2020-09-24T06:15:41.101Z] Constructing Javadoc information...
02:15:41 [2020-09-24T06:15:41.101Z] WARNING: Cannot open location "/home/jenkins/agent/workspace/ease.verify.core.gerrit/tests/org.eclipse.ease.lang.python.test/target/javadoc-bundle-options/package-list"
02:15:41 [2020-09-24T06:15:41.101Z] No plugin definition found, skipping
02:15:41 [2020-09-24T06:15:41.101Z] No plugin definition found, skipping
02:15:41 [2020-09-24T06:15:41.101Z] [WARNING] Javadoc Warnings
02:15:41 [2020-09-24T06:15:41.101Z] [WARNING] Picked up JAVA_TOOL_OPTIONS: -Dmaven.ext.class.path="/home/jenkins/agent/workspace/ease.verify.core.gerrit@tmp/withMaven32a4fffd/pipeline-maven-spy.jar" -Dorg.jenkinsci.plugins.pipeline.maven.reportsFolder="/home/jenkins/agent/workspace/ease.verify.core.gerrit@tmp/withMaven32a4fffd"
02:15:41 [2020-09-24T06:15:41.101Z] [WARNING] javadoc: warning - The old Doclet and Taglet APIs in the packages
02:15:41 [2020-09-24T06:15:41.101Z] [WARNING] com.sun.javadoc, com.sun.tools.doclets and their implementations
02:15:41 [2020-09-24T06:15:41.101Z] [WARNING] are planned to be removed in a future JDK release. These
02:15:41 [2020-09-24T06:15:41.101Z] [WARNING] components have been superseded by the new APIs in jdk.javadoc.doclet.
02:15:41 [2020-09-24T06:15:41.101Z] [WARNING] Users are strongly recommended to migrate to the new APIs.
02:15:41 [2020-09-24T06:15:41.101Z] [INFO] 
02:15:41 [2020-09-24T06:15:41.101Z] [INFO] --- build-helper-maven-plugin:1.9.1:add-resource (add_help) @ org.eclipse.ease.lang.python.test ---
02:15:41 [2020-09-24T06:15:41.101Z] [INFO] 
02:15:41 [2020-09-24T06:15:41.101Z] [INFO] --- maven-resources-plugin:2.4.3:resources (default-resources) @ org.eclipse.ease.lang.python.test ---
02:15:41 [2020-09-24T06:15:41.101Z] [INFO] Using 'UTF-8' encoding to copy filtered resources.
02:15:41 [2020-09-24T06:15:41.101Z] [INFO] skip non existing resourceDirectory /home/jenkins/agent/workspace/ease.verify.core.gerrit/tests/org.eclipse.ease.lang.python.test/src/main/resources
02:15:41 [2020-09-24T06:15:41.101Z] [INFO] skip non existing resourceDirectory /home/jenkins/agent/workspace/ease.verify.core.gerrit/tests/org.eclipse.ease.lang.python.test/help
02:15:41 [2020-09-24T06:15:41.101Z] [INFO] 
02:15:41 [2020-09-24T06:15:41.101Z] [INFO] --- tycho-compiler-plugin:1.5.0:compile (default-compile) @ org.eclipse.ease.lang.python.test ---
02:15:41 [2020-09-24T06:15:41.101Z] [INFO] Compiling 1 source file to /home/jenkins/agent/workspace/ease.verify.core.gerrit/tests/org.eclipse.ease.lang.python.test/target/classes
02:15:41 [2020-09-24T06:15:41.101Z] [INFO] 
02:15:41 [2020-09-24T06:15:41.101Z] [INFO] --- maven-resources-plugin:2.4.3:testResources (default-testResources) @ org.eclipse.ease.lang.python.test ---
02:15:41 [2020-09-24T06:15:41.101Z] [INFO] Using 'UTF-8' encoding to copy filtered resources.
02:15:41 [2020-09-24T06:15:41.101Z] [INFO] skip non existing resourceDirectory /home/jenkins/agent/workspace/ease.verify.core.gerrit/tests/org.eclipse.ease.lang.python.test/src/test/resources
02:15:41 [2020-09-24T06:15:41.101Z] [INFO] 
02:15:41 [2020-09-24T06:15:41.101Z] [INFO] --- tycho-source-plugin:1.5.0:plugin-source (plugin-source) @ org.eclipse.ease.lang.python.test ---
02:15:41 [2020-09-24T06:15:41.101Z] [WARNING] Bundle-Vendor header not found in /home/jenkins/agent/workspace/ease.verify.core.gerrit/tests/org.eclipse.ease.lang.python.test/META-INF/MANIFEST.MF, fallback to 'unknown' for source bundle
02:15:41 [2020-09-24T06:15:41.101Z] [INFO] Building jar: /home/jenkins/agent/workspace/ease.verify.core.gerrit/tests/org.eclipse.ease.lang.python.test/target/org.eclipse.ease.lang.python.test-0.8.0-SNAPSHOT-sources.jar
02:15:41 [2020-09-24T06:15:41.101Z] [INFO] 
02:15:41 [2020-09-24T06:15:41.101Z] [INFO] --- target-platform-configuration:1.5.0:target-platform (default-target-platform) @ org.eclipse.ease.lang.python.test ---
02:15:41 [2020-09-24T06:15:41.101Z] [INFO] 
02:15:41 [2020-09-24T06:15:41.101Z] [INFO] --- tycho-packaging-plugin:1.5.0:package-plugin (default-package-plugin) @ org.eclipse.ease.lang.python.test ---
02:15:41 [2020-09-24T06:15:41.101Z] [INFO] Building jar: /home/jenkins/agent/workspace/ease.verify.core.gerrit/tests/org.eclipse.ease.lang.python.test/target/org.eclipse.ease.lang.python.test-0.8.0-SNAPSHOT.jar
02:15:41 [2020-09-24T06:15:41.101Z] [INFO] 
02:15:41 [2020-09-24T06:15:41.101Z] [INFO] --- tycho-p2-plugin:1.5.0:p2-metadata-default (default-p2-metadata-default) @ org.eclipse.ease.lang.python.test ---
02:15:41 [2020-09-24T06:15:41.101Z] [INFO] 
02:15:41 [2020-09-24T06:15:41.101Z] [INFO] --- tycho-source-feature-plugin:1.5.0:source-feature (source-feature) @ org.eclipse.ease.lang.python.test ---
02:15:41 [2020-09-24T06:15:41.101Z] [INFO] 
02:15:41 [2020-09-24T06:15:41.101Z] [INFO] --- tycho-p2-plugin:1.5.0:p2-metadata (attached-p2-metadata) @ org.eclipse.ease.lang.python.test ---
02:15:41 [2020-09-24T06:15:41.101Z] [INFO] 
02:15:41 [2020-09-24T06:15:41.101Z] [INFO] --- tycho-surefire-plugin:1.5.0:test (default-test) @ org.eclipse.ease.lang.python.test ---
02:15:41 [2020-09-24T06:15:41.101Z] [INFO] Expected eclipse log file: /home/jenkins/agent/workspace/ease.verify.core.gerrit/tests/org.eclipse.ease.lang.python.test/target/work/data/.metadata/.log
02:15:41 [2020-09-24T06:15:41.101Z] [INFO] Command line:
02:15:41 [2020-09-24T06:15:41.102Z] 	[/opt/tools/java/openjdk/jdk-11/11.0.2+9/bin/java, -Dosgi.noShutdown=false, -Dosgi.os=linux, -Dosgi.ws=gtk, -Dosgi.arch=x86_64, -Dosgi.clean=true, -jar, /home/jenkins/.m2/repository/p2/osgi/bundle/org.eclipse.equinox.launcher/1.5.700.v20200207-2156/org.eclipse.equinox.launcher-1.5.700.v20200207-2156.jar, -data, /home/jenkins/agent/workspace/ease.verify.core.gerrit/tests/org.eclipse.ease.lang.python.test/target/work/data, -install, /home/jenkins/agent/workspace/ease.verify.core.gerrit/tests/org.eclipse.ease.lang.python.test/target/work, -configuration, /home/jenkins/agent/workspace/ease.verify.core.gerrit/tests/org.eclipse.ease.lang.python.test/target/work/configuration, -application, org.eclipse.tycho.surefire.osgibooter.headlesstest, -testproperties, /home/jenkins/agent/workspace/ease.verify.core.gerrit/tests/org.eclipse.ease.lang.python.test/target/surefire.properties]
02:15:41 [2020-09-24T06:15:41.102Z] Picked up JAVA_TOOL_OPTIONS: -Dmaven.ext.class.path="/home/jenkins/agent/workspace/ease.verify.core.gerrit@tmp/withMaven32a4fffd/pipeline-maven-spy.jar" -Dorg.jenkinsci.plugins.pipeline.maven.reportsFolder="/home/jenkins/agent/workspace/ease.verify.core.gerrit@tmp/withMaven32a4fffd" 
02:15:43 [2020-09-24T06:15:43.056Z] Running org.eclipse.ease.lang.python.PythonCodeFactoryTest
02:15:43 [2020-09-24T06:15:43.056Z] Tests run: 1, Failures: 0, Errors: 0, Skipped: 0, Time elapsed: 0.075 s - in org.eclipse.ease.lang.python.PythonCodeFactoryTest
02:15:43 [2020-09-24T06:15:43.056Z] testCommentCreator(org.eclipse.ease.lang.python.PythonCodeFactoryTest)  Time elapsed: 0.003 s
02:15:43 [2020-09-24T06:15:43.056Z] 
02:15:43 [2020-09-24T06:15:43.056Z] Results:
02:15:43 [2020-09-24T06:15:43.056Z] 
02:15:43 [2020-09-24T06:15:43.056Z] Tests run: 1, Failures: 0, Errors: 0, Skipped: 0
02:15:43 [2020-09-24T06:15:43.056Z] 
02:15:43 [2020-09-24T06:15:43.617Z] [INFO] All tests passed!
02:15:43 [2020-09-24T06:15:43.617Z] [INFO] 
02:15:43 [2020-09-24T06:15:43.617Z] [INFO] -----< org.eclipse.ease:org.eclipse.ease.lang.python.jython.test >------
02:15:43 [2020-09-24T06:15:43.617Z] [INFO] Building org.eclipse.ease.lang.python.jython.test 0.8.0-SNAPSHOT [43/48]
02:15:43 [2020-09-24T06:15:43.617Z] [INFO] ------------------------[ eclipse-test-plugin ]-------------------------
02:15:43 [2020-09-24T06:15:43.617Z] [INFO] 
02:15:43 [2020-09-24T06:15:43.617Z] [INFO] --- maven-clean-plugin:2.5:clean (default-clean) @ org.eclipse.ease.lang.python.jython.test ---
02:15:43 [2020-09-24T06:15:43.617Z] [INFO] 
02:15:43 [2020-09-24T06:15:43.617Z] [INFO] --- tycho-packaging-plugin:1.5.0:build-qualifier (default-build-qualifier) @ org.eclipse.ease.lang.python.jython.test ---
02:15:43 [2020-09-24T06:15:43.617Z] [INFO] The project's OSGi version is 0.8.0.I201911291239
02:15:43 [2020-09-24T06:15:43.618Z] [INFO] 
02:15:43 [2020-09-24T06:15:43.618Z] [INFO] --- tycho-packaging-plugin:1.5.0:validate-id (default-validate-id) @ org.eclipse.ease.lang.python.jython.test ---
02:15:43 [2020-09-24T06:15:43.618Z] [INFO] 
02:15:43 [2020-09-24T06:15:43.618Z] [INFO] --- tycho-packaging-plugin:1.5.0:validate-version (default-validate-version) @ org.eclipse.ease.lang.python.jython.test ---
02:15:43 [2020-09-24T06:15:43.618Z] [INFO] 
02:15:43 [2020-09-24T06:15:43.618Z] [INFO] >>> maven-javadoc-plugin:2.9.1:javadoc (build-docs) > generate-sources @ org.eclipse.ease.lang.python.jython.test >>>
02:15:43 [2020-09-24T06:15:43.618Z] [INFO] 
02:15:43 [2020-09-24T06:15:43.618Z] [INFO] --- tycho-packaging-plugin:1.5.0:build-qualifier (default-build-qualifier) @ org.eclipse.ease.lang.python.jython.test ---
02:15:43 [2020-09-24T06:15:43.618Z] [INFO] The project's OSGi version is 0.8.0.I201911291239
02:15:43 [2020-09-24T06:15:43.618Z] [INFO] 
02:15:43 [2020-09-24T06:15:43.618Z] [INFO] --- tycho-packaging-plugin:1.5.0:validate-id (default-validate-id) @ org.eclipse.ease.lang.python.jython.test ---
02:15:43 [2020-09-24T06:15:43.618Z] [INFO] 
02:15:43 [2020-09-24T06:15:43.618Z] [INFO] --- tycho-packaging-plugin:1.5.0:validate-version (default-validate-version) @ org.eclipse.ease.lang.python.jython.test ---
02:15:43 [2020-09-24T06:15:43.618Z] [INFO] 
02:15:43 [2020-09-24T06:15:43.618Z] [INFO] <<< maven-javadoc-plugin:2.9.1:javadoc (build-docs) < generate-sources @ org.eclipse.ease.lang.python.jython.test <<<
02:15:43 [2020-09-24T06:15:43.618Z] [INFO] 
02:15:43 [2020-09-24T06:15:43.618Z] [INFO] 
02:15:43 [2020-09-24T06:15:43.618Z] [INFO] --- maven-javadoc-plugin:2.9.1:javadoc (build-docs) @ org.eclipse.ease.lang.python.jython.test ---
02:15:43 [2020-09-24T06:15:43.618Z] [ERROR] Error fetching link: http://help.eclipse.org/oxygen/topic/org.eclipse.platform.doc.isv/reference/api/package-list. Ignored it.
02:15:45 [2020-09-24T06:15:45.027Z] [INFO] 
02:15:45 [2020-09-24T06:15:45.027Z] Loading source files for package org.eclipse.ease.lang.python.jython.debugger...
02:15:45 [2020-09-24T06:15:45.027Z] Constructing Javadoc information...
02:15:45 [2020-09-24T06:15:45.027Z] WARNING: Cannot open location "/home/jenkins/agent/workspace/ease.verify.core.gerrit/tests/org.eclipse.ease.lang.python.jython.test/target/javadoc-bundle-options/package-list"
02:15:45 [2020-09-24T06:15:45.027Z] No plugin definition found, skipping
02:15:45 [2020-09-24T06:15:45.027Z] No plugin definition found, skipping
02:15:45 [2020-09-24T06:15:45.027Z] [WARNING] Javadoc Warnings
02:15:45 [2020-09-24T06:15:45.027Z] [WARNING] Picked up JAVA_TOOL_OPTIONS: -Dmaven.ext.class.path="/home/jenkins/agent/workspace/ease.verify.core.gerrit@tmp/withMaven32a4fffd/pipeline-maven-spy.jar" -Dorg.jenkinsci.plugins.pipeline.maven.reportsFolder="/home/jenkins/agent/workspace/ease.verify.core.gerrit@tmp/withMaven32a4fffd"
02:15:45 [2020-09-24T06:15:45.027Z] [WARNING] javadoc: warning - The old Doclet and Taglet APIs in the packages
02:15:45 [2020-09-24T06:15:45.027Z] [WARNING] com.sun.javadoc, com.sun.tools.doclets and their implementations
02:15:45 [2020-09-24T06:15:45.027Z] [WARNING] are planned to be removed in a future JDK release. These
02:15:45 [2020-09-24T06:15:45.027Z] [WARNING] components have been superseded by the new APIs in jdk.javadoc.doclet.
02:15:45 [2020-09-24T06:15:45.027Z] [WARNING] Users are strongly recommended to migrate to the new APIs.
02:15:45 [2020-09-24T06:15:45.027Z] [INFO] 
02:15:45 [2020-09-24T06:15:45.027Z] [INFO] --- build-helper-maven-plugin:1.9.1:add-resource (add_help) @ org.eclipse.ease.lang.python.jython.test ---
02:15:45 [2020-09-24T06:15:45.027Z] [INFO] 
02:15:45 [2020-09-24T06:15:45.027Z] [INFO] --- maven-resources-plugin:2.4.3:resources (default-resources) @ org.eclipse.ease.lang.python.jython.test ---
02:15:45 [2020-09-24T06:15:45.027Z] [INFO] Using 'UTF-8' encoding to copy filtered resources.
02:15:45 [2020-09-24T06:15:45.027Z] [INFO] skip non existing resourceDirectory /home/jenkins/agent/workspace/ease.verify.core.gerrit/tests/org.eclipse.ease.lang.python.jython.test/src/main/resources
02:15:45 [2020-09-24T06:15:45.027Z] [INFO] skip non existing resourceDirectory /home/jenkins/agent/workspace/ease.verify.core.gerrit/tests/org.eclipse.ease.lang.python.jython.test/help
02:15:45 [2020-09-24T06:15:45.027Z] [INFO] 
02:15:45 [2020-09-24T06:15:45.027Z] [INFO] --- tycho-compiler-plugin:1.5.0:compile (default-compile) @ org.eclipse.ease.lang.python.jython.test ---
02:15:45 [2020-09-24T06:15:45.027Z] [INFO] Compiling 1 source file to /home/jenkins/agent/workspace/ease.verify.core.gerrit/tests/org.eclipse.ease.lang.python.jython.test/target/classes
02:15:45 [2020-09-24T06:15:45.027Z] [INFO] 
02:15:45 [2020-09-24T06:15:45.027Z] [INFO] --- maven-resources-plugin:2.4.3:testResources (default-testResources) @ org.eclipse.ease.lang.python.jython.test ---
02:15:45 [2020-09-24T06:15:45.027Z] [INFO] Using 'UTF-8' encoding to copy filtered resources.
02:15:45 [2020-09-24T06:15:45.027Z] [INFO] skip non existing resourceDirectory /home/jenkins/agent/workspace/ease.verify.core.gerrit/tests/org.eclipse.ease.lang.python.jython.test/src/test/resources
02:15:45 [2020-09-24T06:15:45.027Z] [INFO] 
02:15:45 [2020-09-24T06:15:45.027Z] [INFO] --- tycho-source-plugin:1.5.0:plugin-source (plugin-source) @ org.eclipse.ease.lang.python.jython.test ---
02:15:45 [2020-09-24T06:15:45.027Z] [WARNING] Bundle-Vendor header not found in /home/jenkins/agent/workspace/ease.verify.core.gerrit/tests/org.eclipse.ease.lang.python.jython.test/META-INF/MANIFEST.MF, fallback to 'unknown' for source bundle
02:15:45 [2020-09-24T06:15:45.027Z] [INFO] Building jar: /home/jenkins/agent/workspace/ease.verify.core.gerrit/tests/org.eclipse.ease.lang.python.jython.test/target/org.eclipse.ease.lang.python.jython.test-0.8.0-SNAPSHOT-sources.jar
02:15:45 [2020-09-24T06:15:45.027Z] [INFO] 
02:15:45 [2020-09-24T06:15:45.027Z] [INFO] --- target-platform-configuration:1.5.0:target-platform (default-target-platform) @ org.eclipse.ease.lang.python.jython.test ---
02:15:45 [2020-09-24T06:15:45.027Z] [INFO] 
02:15:45 [2020-09-24T06:15:45.027Z] [INFO] --- tycho-packaging-plugin:1.5.0:package-plugin (default-package-plugin) @ org.eclipse.ease.lang.python.jython.test ---
02:15:45 [2020-09-24T06:15:45.028Z] [INFO] Building jar: /home/jenkins/agent/workspace/ease.verify.core.gerrit/tests/org.eclipse.ease.lang.python.jython.test/target/org.eclipse.ease.lang.python.jython.test-0.8.0-SNAPSHOT.jar
02:15:45 [2020-09-24T06:15:45.028Z] [INFO] 
02:15:45 [2020-09-24T06:15:45.028Z] [INFO] --- tycho-p2-plugin:1.5.0:p2-metadata-default (default-p2-metadata-default) @ org.eclipse.ease.lang.python.jython.test ---
02:15:45 [2020-09-24T06:15:45.028Z] [INFO] 
02:15:45 [2020-09-24T06:15:45.028Z] [INFO] --- tycho-source-feature-plugin:1.5.0:source-feature (source-feature) @ org.eclipse.ease.lang.python.jython.test ---
02:15:45 [2020-09-24T06:15:45.028Z] [INFO] 
02:15:45 [2020-09-24T06:15:45.028Z] [INFO] --- tycho-p2-plugin:1.5.0:p2-metadata (attached-p2-metadata) @ org.eclipse.ease.lang.python.jython.test ---
02:15:45 [2020-09-24T06:15:45.028Z] [INFO] 
02:15:45 [2020-09-24T06:15:45.028Z] [INFO] --- tycho-surefire-plugin:1.5.0:test (default-test) @ org.eclipse.ease.lang.python.jython.test ---
02:15:45 [2020-09-24T06:15:45.598Z] [INFO] Expected eclipse log file: /home/jenkins/agent/workspace/ease.verify.core.gerrit/tests/org.eclipse.ease.lang.python.jython.test/target/work/data/.metadata/.log
02:15:45 [2020-09-24T06:15:45.598Z] [INFO] Command line:
02:15:45 [2020-09-24T06:15:45.598Z] 	[/opt/tools/java/openjdk/jdk-11/11.0.2+9/bin/java, -Dosgi.noShutdown=false, -Dosgi.os=linux, -Dosgi.ws=gtk, -Dosgi.arch=x86_64, -Dosgi.clean=true, -jar, /home/jenkins/.m2/repository/p2/osgi/bundle/org.eclipse.equinox.launcher/1.5.700.v20200207-2156/org.eclipse.equinox.launcher-1.5.700.v20200207-2156.jar, -data, /home/jenkins/agent/workspace/ease.verify.core.gerrit/tests/org.eclipse.ease.lang.python.jython.test/target/work/data, -install, /home/jenkins/agent/workspace/ease.verify.core.gerrit/tests/org.eclipse.ease.lang.python.jython.test/target/work, -configuration, /home/jenkins/agent/workspace/ease.verify.core.gerrit/tests/org.eclipse.ease.lang.python.jython.test/target/work/configuration, -application, org.eclipse.tycho.surefire.osgibooter.headlesstest, -testproperties, /home/jenkins/agent/workspace/ease.verify.core.gerrit/tests/org.eclipse.ease.lang.python.jython.test/target/surefire.properties]
02:15:45 [2020-09-24T06:15:45.598Z] Picked up JAVA_TOOL_OPTIONS: -Dmaven.ext.class.path="/home/jenkins/agent/workspace/ease.verify.core.gerrit@tmp/withMaven32a4fffd/pipeline-maven-spy.jar" -Dorg.jenkinsci.plugins.pipeline.maven.reportsFolder="/home/jenkins/agent/workspace/ease.verify.core.gerrit@tmp/withMaven32a4fffd" 
02:15:47 [2020-09-24T06:15:47.515Z] WARNING: An illegal reflective access operation has occurred
02:15:47 [2020-09-24T06:15:47.515Z] WARNING: Illegal reflective access by org.python.core.PySystemState (file:/home/jenkins/agent/workspace/ease.verify.core.gerrit/tests/org.eclipse.ease.lang.python.jython.test/target/work/plugins/org.jython_2.7.0.I201609090924/jython.jar) to method java.io.Console.encoding()
02:15:47 [2020-09-24T06:15:47.515Z] WARNING: Please consider reporting this to the maintainers of org.python.core.PySystemState
02:15:47 [2020-09-24T06:15:47.515Z] WARNING: Use --illegal-access=warn to enable warnings of further illegal reflective access operations
02:15:47 [2020-09-24T06:15:47.515Z] WARNING: All illegal access operations will be denied in a future release
02:15:47 [2020-09-24T06:15:47.515Z] Running org.eclipse.ease.lang.python.jython.debugger.JythonDebugTest
02:15:49 [2020-09-24T06:15:49.450Z] Start of script
02:15:49 [2020-09-24T06:15:49.450Z] include file start
02:15:49 [2020-09-24T06:15:49.450Z] include file processed
02:15:49 [2020-09-24T06:15:49.450Z] Result of testMethod = 5
02:15:49 [2020-09-24T06:15:49.450Z] End of script
02:15:49 [2020-09-24T06:15:49.450Z] Start of script
02:15:49 [2020-09-24T06:15:49.450Z] include file start
02:15:49 [2020-09-24T06:15:49.450Z] include file processed
02:15:49 [2020-09-24T06:15:49.450Z] Result of testMethod = 5
02:15:49 [2020-09-24T06:15:49.450Z] End of script
02:15:49 [2020-09-24T06:15:49.450Z] Start of script
02:15:49 [2020-09-24T06:15:49.450Z] include file start
02:15:49 [2020-09-24T06:15:49.450Z] include file processed
02:15:49 [2020-09-24T06:15:49.450Z] Result of testMethod = 5
02:15:49 [2020-09-24T06:15:49.707Z] Traceback (most recent call last):
02:15:49 [2020-09-24T06:15:49.707Z]   File "(none)", line 184, in run
02:15:49 [2020-09-24T06:15:49.707Z]   File "__ref_L/Debug Test/Main.py_rfrytwyllt", line 23, in <module>
02:15:49 [2020-09-24T06:15:49.707Z]   File "(none)", line 161, in trace_dispatch
02:15:49 [2020-09-24T06:15:49.707Z] org.eclipse.ease.ExitException: 
02:15:49 [2020-09-24T06:15:49.707Z] 
02:15:49 [2020-09-24T06:15:49.707Z] org.eclipse.ease.ExitException: org.eclipse.ease.ExitException: 
02:15:49 [2020-09-24T06:15:49.707Z] Start of script
02:15:49 [2020-09-24T06:15:49.707Z] include file start
02:15:49 [2020-09-24T06:15:49.707Z] include file processed
02:15:49 [2020-09-24T06:15:49.962Z] Result of testMethod = 5
02:15:49 [2020-09-24T06:15:49.962Z] End of script
02:15:50 [2020-09-24T06:15:50.217Z] Start of script
02:15:50 [2020-09-24T06:15:50.217Z] include file start
02:15:50 [2020-09-24T06:15:50.217Z] include file processed
02:15:50 [2020-09-24T06:15:50.217Z] Result of testMethod = 5
02:15:50 [2020-09-24T06:15:50.217Z] End of script
02:15:50 [2020-09-24T06:15:50.473Z] Start of script
02:15:50 [2020-09-24T06:15:50.473Z] include file start
02:15:50 [2020-09-24T06:15:50.473Z] include file processed
02:15:50 [2020-09-24T06:15:50.473Z] Result of testMethod = 5
02:15:50 [2020-09-24T06:15:50.473Z] End of script
02:15:50 [2020-09-24T06:15:50.728Z] Start of script
02:15:50 [2020-09-24T06:15:50.728Z] include file start
02:15:50 [2020-09-24T06:15:50.728Z] include file processed
02:15:50 [2020-09-24T06:15:50.728Z] Result of testMethod = 5
02:15:50 [2020-09-24T06:15:50.984Z] Traceback (most recent call last):
02:15:50 [2020-09-24T06:15:50.984Z]   File "(none)", line 184, in run
02:15:50 [2020-09-24T06:15:50.984Z]   File "__ref_L/Debug Test/Main.py_zurccabaml", line 23, in <module>
02:15:50 [2020-09-24T06:15:50.984Z]   File "(none)", line 161, in trace_dispatch
02:15:50 [2020-09-24T06:15:50.984Z] org.eclipse.ease.ExitException: 
02:15:50 [2020-09-24T06:15:50.984Z] 
02:15:50 [2020-09-24T06:15:50.984Z] org.eclipse.ease.ExitException: org.eclipse.ease.ExitException: 
02:15:50 [2020-09-24T06:15:50.984Z] Start of script
02:15:50 [2020-09-24T06:15:50.984Z] include file start
02:15:50 [2020-09-24T06:15:50.984Z] include file processed
02:15:51 [2020-09-24T06:15:51.240Z] Result of testMethod = 5
02:15:51 [2020-09-24T06:15:51.240Z] End of script
02:15:51 [2020-09-24T06:15:51.240Z] Start of script
02:15:51 [2020-09-24T06:15:51.240Z] include file start
02:15:51 [2020-09-24T06:15:51.240Z] include file processed
02:15:51 [2020-09-24T06:15:51.240Z] Result of testMethod = 5
02:15:51 [2020-09-24T06:15:51.495Z] End of script
02:15:51 [2020-09-24T06:15:51.495Z] Start of script
02:15:51 [2020-09-24T06:15:51.495Z] include file start
02:15:51 [2020-09-24T06:15:51.495Z] include file processed
02:15:52 [2020-09-24T06:15:52.057Z] Traceback (most recent call last):
02:15:52 [2020-09-24T06:15:52.057Z]   File "(none)", line 184, in run
02:15:52 [2020-09-24T06:15:52.057Z]   File "__ref_L/Debug Test/Main.py_cueizmigkg", line 22, in <module>
02:15:52 [2020-09-24T06:15:52.057Z]   File "(none)", line 161, in trace_dispatch
02:15:52 [2020-09-24T06:15:52.057Z] org.eclipse.ease.ExitException: 
02:15:52 [2020-09-24T06:15:52.057Z] 
02:15:52 [2020-09-24T06:15:52.057Z] org.eclipse.ease.ExitException: org.eclipse.ease.ExitException: 
02:15:52 [2020-09-24T06:15:52.057Z] Start of script
02:15:52 [2020-09-24T06:15:52.057Z] include file start
02:15:52 [2020-09-24T06:15:52.057Z] include file processed
02:15:52 [2020-09-24T06:15:52.057Z] Result of testMethod = 5
02:15:52 [2020-09-24T06:15:52.057Z] End of script
02:15:52 [2020-09-24T06:15:52.312Z] Start of script
02:15:52 [2020-09-24T06:15:52.312Z] include file start
02:15:52 [2020-09-24T06:15:52.312Z] include file processed
02:15:52 [2020-09-24T06:15:52.312Z] Result of testMethod = 5
02:15:52 [2020-09-24T06:15:52.312Z] End of script
02:15:52 [2020-09-24T06:15:52.567Z] Traceback (most recent call last):
02:15:52 [2020-09-24T06:15:52.567Z]   File "(none)", line 184, in run
02:15:52 [2020-09-24T06:15:52.567Z]   File "__ref_L/Debug Test/Main.py_yhloxzmpyl", line 1, in <module>
02:15:52 [2020-09-24T06:15:52.567Z]   File "(none)", line 161, in trace_dispatch
02:15:52 [2020-09-24T06:15:52.567Z] org.eclipse.ease.ExitException: 
02:15:52 [2020-09-24T06:15:52.567Z] 
02:15:52 [2020-09-24T06:15:52.567Z] org.eclipse.ease.ExitException: org.eclipse.ease.ExitException: 
02:15:52 [2020-09-24T06:15:52.823Z] Start of script
02:15:52 [2020-09-24T06:15:52.823Z] include file start
02:15:52 [2020-09-24T06:15:52.823Z] include file processed
02:15:52 [2020-09-24T06:15:52.823Z] Result of testMethod = 5
02:15:52 [2020-09-24T06:15:52.823Z] End of script
02:15:53 [2020-09-24T06:15:53.080Z] Start of script
02:15:53 [2020-09-24T06:15:53.080Z] include file start
02:15:53 [2020-09-24T06:15:53.080Z] include file processed
02:15:53 [2020-09-24T06:15:53.080Z] Result of testMethod = 5
02:15:53 [2020-09-24T06:15:53.080Z] End of script
02:15:53 [2020-09-24T06:15:53.335Z] Start of script
02:15:53 [2020-09-24T06:15:53.335Z] include file start
02:15:53 [2020-09-24T06:15:53.335Z] include file processed
02:15:53 [2020-09-24T06:15:53.335Z] Result of testMethod = 5
02:15:53 [2020-09-24T06:15:53.592Z] Traceback (most recent call last):
02:15:53 [2020-09-24T06:15:53.592Z]   File "(none)", line 184, in run
02:15:53 [2020-09-24T06:15:53.592Z]   File "__ref_L/Debug Test/Main.py_tcsnojhnzs", line 23, in <module>
02:15:53 [2020-09-24T06:15:53.592Z]   File "(none)", line 161, in trace_dispatch
02:15:53 [2020-09-24T06:15:53.592Z] org.eclipse.ease.ExitException: 
02:15:53 [2020-09-24T06:15:53.592Z] 
02:15:53 [2020-09-24T06:15:53.592Z] org.eclipse.ease.ExitException: org.eclipse.ease.ExitException: 
02:15:53 [2020-09-24T06:15:53.592Z] Start of script
02:15:53 [2020-09-24T06:15:53.592Z] include file start
02:15:53 [2020-09-24T06:15:53.592Z] include file processed
02:15:53 [2020-09-24T06:15:53.847Z] Result of testMethod = 5
02:15:53 [2020-09-24T06:15:53.847Z] End of script
02:15:54 [2020-09-24T06:15:54.102Z] Traceback (most recent call last):
02:15:54 [2020-09-24T06:15:54.102Z]   File "(none)", line 184, in run
02:15:54 [2020-09-24T06:15:54.102Z]   File "__ref_L/Debug Test/Main.py_bkeebgrguz", line 1, in <module>
02:15:54 [2020-09-24T06:15:54.102Z]   File "(none)", line 161, in trace_dispatch
02:15:54 [2020-09-24T06:15:54.102Z] org.eclipse.ease.ExitException: 
02:15:54 [2020-09-24T06:15:54.102Z] 
02:15:54 [2020-09-24T06:15:54.102Z] org.eclipse.ease.ExitException: org.eclipse.ease.ExitException: 
02:15:54 [2020-09-24T06:15:54.102Z] Start of script
02:15:54 [2020-09-24T06:15:54.102Z] include file start
02:15:54 [2020-09-24T06:15:54.102Z] include file processed
02:15:54 [2020-09-24T06:15:54.102Z] Result of testMethod = 5
02:15:54 [2020-09-24T06:15:54.102Z] End of script
02:15:54 [2020-09-24T06:15:54.357Z] Start of script
02:15:54 [2020-09-24T06:15:54.357Z] include file start
02:15:54 [2020-09-24T06:15:54.357Z] include file processed
02:15:54 [2020-09-24T06:15:54.613Z] Result of testMethod = 5
02:15:54 [2020-09-24T06:15:54.613Z] End of script
02:15:54 [2020-09-24T06:15:54.613Z] Traceback (most recent call last):
02:15:54 [2020-09-24T06:15:54.613Z]   File "(none)", line 184, in run
02:15:54 [2020-09-24T06:15:54.613Z]   File "__ref_L/Debug Test/Main.py_cbdwnoayom", line 1, in <module>
02:15:54 [2020-09-24T06:15:54.613Z]   File "(none)", line 161, in trace_dispatch
02:15:54 [2020-09-24T06:15:54.613Z] org.eclipse.ease.ExitException: 
02:15:54 [2020-09-24T06:15:54.613Z] 
02:15:54 [2020-09-24T06:15:54.613Z] org.eclipse.ease.ExitException: org.eclipse.ease.ExitException: 
02:15:54 [2020-09-24T06:15:54.868Z] Start of script
02:15:54 [2020-09-24T06:15:54.868Z] include file start
02:15:54 [2020-09-24T06:15:54.868Z] include file processed
02:15:55 [2020-09-24T06:15:55.123Z] Result of testMethod = 5
02:15:55 [2020-09-24T06:15:55.123Z] End of script
02:15:55 [2020-09-24T06:15:55.123Z] Start of script
02:15:55 [2020-09-24T06:15:55.123Z] include file start
02:15:55 [2020-09-24T06:15:55.123Z] include file processed
02:15:55 [2020-09-24T06:15:55.123Z] Result of testMethod = 5
02:15:55 [2020-09-24T06:15:55.378Z] Traceback (most recent call last):
02:15:55 [2020-09-24T06:15:55.378Z]   File "(none)", line 184, in run
02:15:55 [2020-09-24T06:15:55.378Z]   File "__ref_L/Debug Test/Main.py_koctutrlhf", line 23, in <module>
02:15:55 [2020-09-24T06:15:55.378Z]   File "(none)", line 161, in trace_dispatch
02:15:55 [2020-09-24T06:15:55.378Z] org.eclipse.ease.ExitException: 
02:15:55 [2020-09-24T06:15:55.378Z] 
02:15:55 [2020-09-24T06:15:55.378Z] org.eclipse.ease.ExitException: org.eclipse.ease.ExitException: 
02:15:55 [2020-09-24T06:15:55.634Z] Start of script
02:15:55 [2020-09-24T06:15:55.634Z] include file start
02:15:55 [2020-09-24T06:15:55.634Z] include file processed
02:15:55 [2020-09-24T06:15:55.634Z] Result of testMethod = 5
02:15:55 [2020-09-24T06:15:55.634Z] End of script
02:15:55 [2020-09-24T06:15:55.634Z] Start of script
02:15:55 [2020-09-24T06:15:55.634Z] include file start
02:15:55 [2020-09-24T06:15:55.634Z] include file processed
02:15:55 [2020-09-24T06:15:55.891Z] Result of testMethod = 5
02:15:55 [2020-09-24T06:15:55.891Z] End of script
02:15:55 [2020-09-24T06:15:55.891Z] Start of script
02:15:55 [2020-09-24T06:15:55.891Z] include file start
02:15:55 [2020-09-24T06:15:55.891Z] include file processed
02:15:55 [2020-09-24T06:15:55.891Z] Result of testMethod = 5
02:15:55 [2020-09-24T06:15:55.891Z] End of script
02:15:56 [2020-09-24T06:15:56.146Z] Start of script
02:15:56 [2020-09-24T06:15:56.146Z] include file start
02:15:56 [2020-09-24T06:15:56.146Z] include file processed
02:15:56 [2020-09-24T06:15:56.146Z] Result of testMethod = 5
02:15:56 [2020-09-24T06:15:56.146Z] End of script
02:15:56 [2020-09-24T06:15:56.402Z] Start of script
02:15:56 [2020-09-24T06:15:56.402Z] include file start
02:15:56 [2020-09-24T06:15:56.402Z] include file processed
02:15:56 [2020-09-24T06:15:56.657Z] Traceback (most recent call last):
02:15:56 [2020-09-24T06:15:56.657Z]   File "(none)", line 184, in run
02:15:56 [2020-09-24T06:15:56.657Z]   File "__ref_L/Debug Test/Main.py_fnybqbuugd", line 21, in <module>
02:15:56 [2020-09-24T06:15:56.657Z]   File "__ref_L/Debug Test/Main.py_fnybqbuugd", line 18, in testMethod
02:15:56 [2020-09-24T06:15:56.657Z]   File "(none)", line 161, in trace_dispatch
02:15:56 [2020-09-24T06:15:56.657Z] org.eclipse.ease.ExitException: 
02:15:56 [2020-09-24T06:15:56.657Z] 
02:15:56 [2020-09-24T06:15:56.657Z] org.eclipse.ease.ExitException: org.eclipse.ease.ExitException: 
02:15:56 [2020-09-24T06:15:56.657Z] Start of script
02:15:56 [2020-09-24T06:15:56.912Z] include file start
02:15:56 [2020-09-24T06:15:56.912Z] include file processed
02:15:56 [2020-09-24T06:15:56.912Z] Result of testMethod = 5
02:15:56 [2020-09-24T06:15:56.912Z] End of script
02:15:56 [2020-09-24T06:15:56.912Z] Start of script
02:15:56 [2020-09-24T06:15:56.912Z] include file start
02:15:56 [2020-09-24T06:15:56.912Z] include file processed
02:15:56 [2020-09-24T06:15:56.912Z] Result of testMethod = 5
02:15:57 [2020-09-24T06:15:57.167Z] Traceback (most recent call last):
02:15:57 [2020-09-24T06:15:57.167Z]   File "(none)", line 184, in run
02:15:57 [2020-09-24T06:15:57.167Z]   File "__ref_L/Debug Test/Main.py_ookafgnfbk", line 23, in <module>
02:15:57 [2020-09-24T06:15:57.167Z]   File "(none)", line 161, in trace_dispatch
02:15:57 [2020-09-24T06:15:57.167Z] org.eclipse.ease.ExitException: 
02:15:57 [2020-09-24T06:15:57.167Z] 
02:15:57 [2020-09-24T06:15:57.167Z] org.eclipse.ease.ExitException: org.eclipse.ease.ExitException: 
02:15:57 [2020-09-24T06:15:57.167Z] Start of script
02:15:57 [2020-09-24T06:15:57.167Z] include file start
02:15:57 [2020-09-24T06:15:57.167Z] include file processed
02:15:57 [2020-09-24T06:15:57.168Z] Result of testMethod = 5
02:15:57 [2020-09-24T06:15:57.423Z] End of script
02:15:57 [2020-09-24T06:15:57.423Z] Start of script
02:15:57 [2020-09-24T06:15:57.423Z] include file start
02:15:57 [2020-09-24T06:15:57.423Z] include file processed
02:15:57 [2020-09-24T06:15:57.679Z] Result of testMethod = 5
02:15:57 [2020-09-24T06:15:57.679Z] End of script
02:15:57 [2020-09-24T06:15:57.679Z] Start of script
02:15:57 [2020-09-24T06:15:57.679Z] include file start
02:15:57 [2020-09-24T06:15:57.679Z] include file processed
02:15:57 [2020-09-24T06:15:57.935Z] Result of testMethod = 5
02:15:57 [2020-09-24T06:15:57.935Z] End of script
02:15:58 [2020-09-24T06:15:58.191Z] Start of script
02:15:58 [2020-09-24T06:15:58.191Z] include file start
02:15:58 [2020-09-24T06:15:58.191Z] include file processed
02:15:58 [2020-09-24T06:15:58.191Z] Result of testMethod = 5
02:15:58 [2020-09-24T06:15:58.191Z] End of script
02:15:58 [2020-09-24T06:15:58.191Z] Start of script
02:15:58 [2020-09-24T06:15:58.191Z] include file start
02:15:58 [2020-09-24T06:15:58.191Z] include file processed
02:15:58 [2020-09-24T06:15:58.191Z] Result of testMethod = 5
02:15:58 [2020-09-24T06:15:58.447Z] Traceback (most recent call last):
02:15:58 [2020-09-24T06:15:58.447Z]   File "(none)", line 184, in run
02:15:58 [2020-09-24T06:15:58.447Z]   File "__ref_L/Debug Test/Main.py_qxwmabewbk", line 23, in <module>
02:15:58 [2020-09-24T06:15:58.447Z]   File "(none)", line 161, in trace_dispatch
02:15:58 [2020-09-24T06:15:58.447Z] org.eclipse.ease.ExitException: 
02:15:58 [2020-09-24T06:15:58.447Z] 
02:15:58 [2020-09-24T06:15:58.447Z] org.eclipse.ease.ExitException: org.eclipse.ease.ExitException: 
02:15:58 [2020-09-24T06:15:58.702Z] Start of script
02:15:58 [2020-09-24T06:15:58.702Z] include file start
02:15:58 [2020-09-24T06:15:58.702Z] include file processed
02:15:58 [2020-09-24T06:15:58.702Z] Result of testMethod = 5
02:15:58 [2020-09-24T06:15:58.702Z] End of script
02:15:58 [2020-09-24T06:15:58.702Z] Start of script
02:15:58 [2020-09-24T06:15:58.702Z] include file start
02:15:58 [2020-09-24T06:15:58.702Z] include file processed
02:15:58 [2020-09-24T06:15:58.702Z] Result of testMethod = 5
02:15:58 [2020-09-24T06:15:58.958Z] Traceback (most recent call last):
02:15:58 [2020-09-24T06:15:58.958Z]   File "(none)", line 184, in run
02:15:58 [2020-09-24T06:15:58.958Z]   File "__ref_L/Debug Test/Main.py_jwujjkohnd", line 23, in <module>
02:15:58 [2020-09-24T06:15:58.958Z]   File "(none)", line 161, in trace_dispatch
02:15:58 [2020-09-24T06:15:58.958Z] org.eclipse.ease.ExitException: 
02:15:58 [2020-09-24T06:15:58.958Z] 
02:15:58 [2020-09-24T06:15:58.958Z] org.eclipse.ease.ExitException: org.eclipse.ease.ExitException: 
02:15:59 [2020-09-24T06:15:59.213Z] Traceback (most recent call last):
02:15:59 [2020-09-24T06:15:59.213Z]   File "(none)", line 184, in run
02:15:59 [2020-09-24T06:15:59.213Z]   File "__ref_L/Debug Test/Main.py_dyiosagdxq", line 1, in <module>
02:15:59 [2020-09-24T06:15:59.213Z]   File "(none)", line 161, in trace_dispatch
02:15:59 [2020-09-24T06:15:59.213Z] org.eclipse.ease.ExitException: 
02:15:59 [2020-09-24T06:15:59.213Z] 
02:15:59 [2020-09-24T06:15:59.213Z] org.eclipse.ease.ExitException: org.eclipse.ease.ExitException: 
02:15:59 [2020-09-24T06:15:59.469Z] Start of script
02:15:59 [2020-09-24T06:15:59.469Z] include file start
02:15:59 [2020-09-24T06:15:59.469Z] include file processed
02:15:59 [2020-09-24T06:15:59.469Z] Result of testMethod = 5
02:15:59 [2020-09-24T06:15:59.469Z] End of script
02:15:59 [2020-09-24T06:15:59.469Z] Start of script
02:15:59 [2020-09-24T06:15:59.469Z] include file start
02:15:59 [2020-09-24T06:15:59.469Z] include file processed
02:15:59 [2020-09-24T06:15:59.725Z] Result of testMethod = 5
02:15:59 [2020-09-24T06:15:59.725Z] End of script
02:15:59 [2020-09-24T06:15:59.725Z] Start of script
02:15:59 [2020-09-24T06:15:59.725Z] include file start
02:15:59 [2020-09-24T06:15:59.725Z] include file processed
02:15:59 [2020-09-24T06:15:59.725Z] Result of testMethod = 5
02:15:59 [2020-09-24T06:15:59.980Z] End of script
02:15:59 [2020-09-24T06:15:59.980Z] Tests run: 42, Failures: 0, Errors: 0, Skipped: 0, Time elapsed: 12.57 s - in org.eclipse.ease.lang.python.jython.debugger.JythonDebugTest
02:15:59 [2020-09-24T06:15:59.980Z] disconnectProcessInSuspendedState(org.eclipse.ease.lang.python.jython.debugger.JythonDebugTest)  Time elapsed: 1.749 s
02:15:59 [2020-09-24T06:15:59.980Z] stepReturnIncludeCommand(org.eclipse.ease.lang.python.jython.debugger.JythonDebugTest)  Time elapsed: 0.215 s
02:15:59 [2020-09-24T06:15:59.980Z] arrayVariableSorting(org.eclipse.ease.lang.python.jython.debugger.JythonDebugTest)  Time elapsed: 0.31 s
02:15:59 [2020-09-24T06:15:59.980Z] stepOverOnDebugTarget(org.eclipse.ease.lang.python.jython.debugger.JythonDebugTest)  Time elapsed: 0.309 s
02:15:59 [2020-09-24T06:15:59.980Z] hasDebugTarget(org.eclipse.ease.lang.python.jython.debugger.JythonDebugTest)  Time elapsed: 0.105 s
02:15:59 [2020-09-24T06:15:59.980Z] disconnectThreadInSuspendedState(org.eclipse.ease.lang.python.jython.debugger.JythonDebugTest)  Time elapsed: 0.209 s
02:15:59 [2020-09-24T06:15:59.980Z] stepReturnOnDebugTarget(org.eclipse.ease.lang.python.jython.debugger.JythonDebugTest)  Time elapsed: 0.308 s
02:15:59 [2020-09-24T06:15:59.980Z] nullVariable(org.eclipse.ease.lang.python.jython.debugger.JythonDebugTest)  Time elapsed: 0.307 s
02:15:59 [2020-09-24T06:15:59.980Z] stepOverOnStackFrame(org.eclipse.ease.lang.python.jython.debugger.JythonDebugTest)  Time elapsed: 0.309 s
02:15:59 [2020-09-24T06:15:59.980Z] resumeOnDebugTarget(org.eclipse.ease.lang.python.jython.debugger.JythonDebugTest)  Time elapsed: 0.208 s
02:15:59 [2020-09-24T06:15:59.980Z] modifyVariableKeepingType(org.eclipse.ease.lang.python.jython.debugger.JythonDebugTest)  Time elapsed: 0.507 s
02:15:59 [2020-09-24T06:15:59.980Z] resumeOnLastIncludeLine(org.eclipse.ease.lang.python.jython.debugger.JythonDebugTest)  Time elapsed: 0.208 s
02:15:59 [2020-09-24T06:15:59.980Z] stepReturnOnStackFrame(org.eclipse.ease.lang.python.jython.debugger.JythonDebugTest)  Time elapsed: 0.307 s
02:15:59 [2020-09-24T06:15:59.980Z] terminateStackFrameInSuspendedState(org.eclipse.ease.lang.python.jython.debugger.JythonDebugTest)  Time elapsed: 0.209 s
02:15:59 [2020-09-24T06:15:59.980Z] breakpointLocation(org.eclipse.ease.lang.python.jython.debugger.JythonDebugTest)  Time elapsed: 0.207 s
02:15:59 [2020-09-24T06:15:59.980Z] stepReturnOnThread(org.eclipse.ease.lang.python.jython.debugger.JythonDebugTest)  Time elapsed: 0.31 s
02:15:59 [2020-09-24T06:15:59.980Z] javaClassVariable(org.eclipse.ease.lang.python.jython.debugger.JythonDebugTest)  Time elapsed: 0.309 s
02:15:59 [2020-09-24T06:15:59.980Z] stepIntoOnThread(org.eclipse.ease.lang.python.jython.debugger.JythonDebugTest)  Time elapsed: 0.309 s
02:15:59 [2020-09-24T06:15:59.980Z] terminateThreadInSuspendedState(org.eclipse.ease.lang.python.jython.debugger.JythonDebugTest)  Time elapsed: 0.207 s
02:15:59 [2020-09-24T06:15:59.980Z] resumeOnThread(org.eclipse.ease.lang.python.jython.debugger.JythonDebugTest)  Time elapsed: 0.207 s
02:15:59 [2020-09-24T06:15:59.980Z] stepIntoOnStackFrame(org.eclipse.ease.lang.python.jython.debugger.JythonDebugTest)  Time elapsed: 0.307 s
02:15:59 [2020-09-24T06:15:59.980Z] terminateProcessInSuspendedState(org.eclipse.ease.lang.python.jython.debugger.JythonDebugTest)  Time elapsed: 0.206 s
02:15:59 [2020-09-24T06:15:59.980Z] stepOverOnProcess(org.eclipse.ease.lang.python.jython.debugger.JythonDebugTest)  Time elapsed: 0.308 s
02:15:59 [2020-09-24T06:15:59.980Z] nativeArrayVariable(org.eclipse.ease.lang.python.jython.debugger.JythonDebugTest)  Time elapsed: 0.306 s
02:15:59 [2020-09-24T06:15:59.980Z] disconnectDebugTargetInSuspendedState(org.eclipse.ease.lang.python.jython.debugger.JythonDebugTest)  Time elapsed: 0.206 s
02:15:59 [2020-09-24T06:15:59.980Z] stepIntoOnProcess(org.eclipse.ease.lang.python.jython.debugger.JythonDebugTest)  Time elapsed: 0.306 s
02:15:59 [2020-09-24T06:15:59.980Z] terminatedState(org.eclipse.ease.lang.python.jython.debugger.JythonDebugTest)  Time elapsed: 0.104 s
02:15:59 [2020-09-24T06:15:59.980Z] stepOverIncludeCommand(org.eclipse.ease.lang.python.jython.debugger.JythonDebugTest)  Time elapsed: 0.306 s
02:15:59 [2020-09-24T06:15:59.980Z] innerScopeVariableBeforeOuterScopeVariable(org.eclipse.ease.lang.python.jython.debugger.JythonDebugTest)  Time elapsed: 0.306 s
02:15:59 [2020-09-24T06:15:59.980Z] stepIntoIncludeCommand(org.eclipse.ease.lang.python.jython.debugger.JythonDebugTest)  Time elapsed: 0.304 s
02:15:59 [2020-09-24T06:15:59.980Z] primitiveStringVariable(org.eclipse.ease.lang.python.jython.debugger.JythonDebugTest)  Time elapsed: 0.307 s
02:15:59 [2020-09-24T06:15:59.980Z] resumeOnProcess(org.eclipse.ease.lang.python.jython.debugger.JythonDebugTest)  Time elapsed: 0.206 s
02:15:59 [2020-09-24T06:15:59.980Z] stepIntoOnDebugTarget(org.eclipse.ease.lang.python.jython.debugger.JythonDebugTest)  Time elapsed: 0.307 s
02:15:59 [2020-09-24T06:15:59.980Z] stepOverOnThread(org.eclipse.ease.lang.python.jython.debugger.JythonDebugTest)  Time elapsed: 0.307 s
02:15:59 [2020-09-24T06:15:59.980Z] suspendedState(org.eclipse.ease.lang.python.jython.debugger.JythonDebugTest)  Time elapsed: 0.206 s
02:15:59 [2020-09-24T06:15:59.980Z] primitiveDoubleVariable(org.eclipse.ease.lang.python.jython.debugger.JythonDebugTest)  Time elapsed: 0.306 s
02:15:59 [2020-09-24T06:15:59.980Z] resumeOnStackFrame(org.eclipse.ease.lang.python.jython.debugger.JythonDebugTest)  Time elapsed: 0.206 s
02:15:59 [2020-09-24T06:15:59.981Z] nativeObjectVariable(org.eclipse.ease.lang.python.jython.debugger.JythonDebugTest)  Time elapsed: 0.306 s
02:15:59 [2020-09-24T06:15:59.981Z] terminateDebugTargetInSuspendedState(org.eclipse.ease.lang.python.jython.debugger.JythonDebugTest)  Time elapsed: 0.206 s
02:15:59 [2020-09-24T06:15:59.981Z] disconnectStackFrameInSuspendedState(org.eclipse.ease.lang.python.jython.debugger.JythonDebugTest)  Time elapsed: 0.206 s
02:15:59 [2020-09-24T06:15:59.981Z] stepReturnOnProcess(org.eclipse.ease.lang.python.jython.debugger.JythonDebugTest)  Time elapsed: 0.306 s
02:15:59 [2020-09-24T06:15:59.981Z] evaluateWatchExpression(org.eclipse.ease.lang.python.jython.debugger.JythonDebugTest)  Time elapsed: 0.208 s
02:15:59 [2020-09-24T06:15:59.981Z] 
02:15:59 [2020-09-24T06:15:59.981Z] Results:
02:15:59 [2020-09-24T06:15:59.981Z] 
02:15:59 [2020-09-24T06:15:59.981Z] Tests run: 42, Failures: 0, Errors: 0, Skipped: 0
02:15:59 [2020-09-24T06:15:59.981Z] 
02:16:00 [2020-09-24T06:16:00.541Z] [INFO] All tests passed!
02:16:00 [2020-09-24T06:16:00.541Z] [INFO] 
02:16:00 [2020-09-24T06:16:00.541Z] [INFO] ------< org.eclipse.ease:org.eclipse.ease.lang.python.py4j.test >-------
02:16:00 [2020-09-24T06:16:00.541Z] [INFO] Building org.eclipse.ease.lang.python.py4j.test 0.8.0-SNAPSHOT   [44/48]
02:16:00 [2020-09-24T06:16:00.541Z] [INFO] ------------------------[ eclipse-test-plugin ]-------------------------
02:16:00 [2020-09-24T06:16:00.541Z] [INFO] 
02:16:00 [2020-09-24T06:16:00.541Z] [INFO] --- maven-clean-plugin:2.5:clean (default-clean) @ org.eclipse.ease.lang.python.py4j.test ---
02:16:00 [2020-09-24T06:16:00.541Z] [INFO] 
02:16:00 [2020-09-24T06:16:00.541Z] [INFO] --- tycho-packaging-plugin:1.5.0:build-qualifier (default-build-qualifier) @ org.eclipse.ease.lang.python.py4j.test ---
02:16:00 [2020-09-24T06:16:00.541Z] [INFO] The project's OSGi version is 0.8.0.I201912021001
02:16:00 [2020-09-24T06:16:00.541Z] [INFO] 
02:16:00 [2020-09-24T06:16:00.541Z] [INFO] --- tycho-packaging-plugin:1.5.0:validate-id (default-validate-id) @ org.eclipse.ease.lang.python.py4j.test ---
02:16:00 [2020-09-24T06:16:00.541Z] [INFO] 
02:16:00 [2020-09-24T06:16:00.541Z] [INFO] --- tycho-packaging-plugin:1.5.0:validate-version (default-validate-version) @ org.eclipse.ease.lang.python.py4j.test ---
02:16:00 [2020-09-24T06:16:00.541Z] [INFO] 
02:16:00 [2020-09-24T06:16:00.541Z] [INFO] >>> maven-javadoc-plugin:2.9.1:javadoc (build-docs) > generate-sources @ org.eclipse.ease.lang.python.py4j.test >>>
02:16:00 [2020-09-24T06:16:00.541Z] [INFO] 
02:16:00 [2020-09-24T06:16:00.541Z] [INFO] --- tycho-packaging-plugin:1.5.0:build-qualifier (default-build-qualifier) @ org.eclipse.ease.lang.python.py4j.test ---
02:16:00 [2020-09-24T06:16:00.541Z] [INFO] The project's OSGi version is 0.8.0.I201912021001
02:16:00 [2020-09-24T06:16:00.541Z] [INFO] 
02:16:00 [2020-09-24T06:16:00.541Z] [INFO] --- tycho-packaging-plugin:1.5.0:validate-id (default-validate-id) @ org.eclipse.ease.lang.python.py4j.test ---
02:16:00 [2020-09-24T06:16:00.541Z] [INFO] 
02:16:00 [2020-09-24T06:16:00.541Z] [INFO] --- tycho-packaging-plugin:1.5.0:validate-version (default-validate-version) @ org.eclipse.ease.lang.python.py4j.test ---
02:16:00 [2020-09-24T06:16:00.541Z] [INFO] 
02:16:00 [2020-09-24T06:16:00.541Z] [INFO] <<< maven-javadoc-plugin:2.9.1:javadoc (build-docs) < generate-sources @ org.eclipse.ease.lang.python.py4j.test <<<
02:16:00 [2020-09-24T06:16:00.541Z] [INFO] 
02:16:00 [2020-09-24T06:16:00.541Z] [INFO] 
02:16:00 [2020-09-24T06:16:00.541Z] [INFO] --- maven-javadoc-plugin:2.9.1:javadoc (build-docs) @ org.eclipse.ease.lang.python.py4j.test ---
02:16:00 [2020-09-24T06:16:00.798Z] [ERROR] Error fetching link: http://help.eclipse.org/oxygen/topic/org.eclipse.platform.doc.isv/reference/api/package-list. Ignored it.
02:16:02 [2020-09-24T06:16:02.597Z] [INFO] 
02:16:02 [2020-09-24T06:16:02.597Z] Loading source files for package org.eclipse.ease.lang.python.py4j...
02:16:02 [2020-09-24T06:16:02.597Z] Loading source files for package org.eclipse.ease.lang.python.py4j.modules...
02:16:02 [2020-09-24T06:16:02.597Z] Constructing Javadoc information...
02:16:02 [2020-09-24T06:16:02.597Z] WARNING: Cannot open location "/home/jenkins/agent/workspace/ease.verify.core.gerrit/tests/org.eclipse.ease.lang.python.py4j.test/target/javadoc-bundle-options/package-list"
02:16:02 [2020-09-24T06:16:02.597Z] [WARNING] Javadoc Warnings
02:16:02 [2020-09-24T06:16:02.597Z] [WARNING] Picked up JAVA_TOOL_OPTIONS: -Dmaven.ext.class.path="/home/jenkins/agent/workspace/ease.verify.core.gerrit@tmp/withMaven32a4fffd/pipeline-maven-spy.jar" -Dorg.jenkinsci.plugins.pipeline.maven.reportsFolder="/home/jenkins/agent/workspace/ease.verify.core.gerrit@tmp/withMaven32a4fffd"
02:16:02 [2020-09-24T06:16:02.597Z] [WARNING] javadoc: warning - The old Doclet and Taglet APIs in the packages
02:16:02 [2020-09-24T06:16:02.598Z] [WARNING] com.sun.javadoc, com.sun.tools.doclets and their implementations
02:16:02 [2020-09-24T06:16:02.598Z] [WARNING] are planned to be removed in a future JDK release. These
02:16:02 [2020-09-24T06:16:02.598Z] [WARNING] components have been superseded by the new APIs in jdk.javadoc.doclet.
02:16:02 [2020-09-24T06:16:02.598Z] [WARNING] Users are strongly recommended to migrate to the new APIs.
02:16:02 [2020-09-24T06:16:02.598Z] [INFO] 
02:16:02 [2020-09-24T06:16:02.598Z] [INFO] --- build-helper-maven-plugin:1.9.1:add-resource (add_help) @ org.eclipse.ease.lang.python.py4j.test ---
02:16:02 [2020-09-24T06:16:02.598Z] [INFO] 
02:16:02 [2020-09-24T06:16:02.598Z] [INFO] --- maven-resources-plugin:2.4.3:resources (default-resources) @ org.eclipse.ease.lang.python.py4j.test ---
02:16:02 [2020-09-24T06:16:02.598Z] [INFO] Using 'UTF-8' encoding to copy filtered resources.
02:16:02 [2020-09-24T06:16:02.598Z] [INFO] skip non existing resourceDirectory /home/jenkins/agent/workspace/ease.verify.core.gerrit/tests/org.eclipse.ease.lang.python.py4j.test/src/main/resources
02:16:02 [2020-09-24T06:16:02.598Z] [INFO] Copying 2 resources to help
02:16:02 [2020-09-24T06:16:02.598Z] [INFO] 
02:16:02 [2020-09-24T06:16:02.598Z] [INFO] --- tycho-compiler-plugin:1.5.0:compile (default-compile) @ org.eclipse.ease.lang.python.py4j.test ---
02:16:02 [2020-09-24T06:16:02.598Z] [INFO] Compiling 10 source files to /home/jenkins/agent/workspace/ease.verify.core.gerrit/tests/org.eclipse.ease.lang.python.py4j.test/target/classes
02:16:02 [2020-09-24T06:16:02.598Z] [INFO] 
02:16:02 [2020-09-24T06:16:02.598Z] [INFO] --- maven-resources-plugin:2.4.3:testResources (default-testResources) @ org.eclipse.ease.lang.python.py4j.test ---
02:16:02 [2020-09-24T06:16:02.598Z] [INFO] Using 'UTF-8' encoding to copy filtered resources.
02:16:02 [2020-09-24T06:16:02.598Z] [INFO] skip non existing resourceDirectory /home/jenkins/agent/workspace/ease.verify.core.gerrit/tests/org.eclipse.ease.lang.python.py4j.test/src/test/resources
02:16:02 [2020-09-24T06:16:02.598Z] [INFO] 
02:16:02 [2020-09-24T06:16:02.598Z] [INFO] --- tycho-source-plugin:1.5.0:plugin-source (plugin-source) @ org.eclipse.ease.lang.python.py4j.test ---
02:16:02 [2020-09-24T06:16:02.598Z] [INFO] Building jar: /home/jenkins/agent/workspace/ease.verify.core.gerrit/tests/org.eclipse.ease.lang.python.py4j.test/target/org.eclipse.ease.lang.python.py4j.test-0.8.0-SNAPSHOT-sources.jar
02:16:02 [2020-09-24T06:16:02.598Z] [INFO] 
02:16:02 [2020-09-24T06:16:02.598Z] [INFO] --- target-platform-configuration:1.5.0:target-platform (default-target-platform) @ org.eclipse.ease.lang.python.py4j.test ---
02:16:02 [2020-09-24T06:16:02.598Z] [INFO] 
02:16:02 [2020-09-24T06:16:02.598Z] [INFO] --- tycho-packaging-plugin:1.5.0:package-plugin (default-package-plugin) @ org.eclipse.ease.lang.python.py4j.test ---
02:16:02 [2020-09-24T06:16:02.892Z] [INFO] Building jar: /home/jenkins/agent/workspace/ease.verify.core.gerrit/tests/org.eclipse.ease.lang.python.py4j.test/target/org.eclipse.ease.lang.python.py4j.test-0.8.0-SNAPSHOT.jar
02:16:02 [2020-09-24T06:16:02.892Z] [INFO] 
02:16:02 [2020-09-24T06:16:02.892Z] [INFO] --- tycho-p2-plugin:1.5.0:p2-metadata-default (default-p2-metadata-default) @ org.eclipse.ease.lang.python.py4j.test ---
02:16:02 [2020-09-24T06:16:02.892Z] [INFO] 
02:16:02 [2020-09-24T06:16:02.892Z] [INFO] --- tycho-source-feature-plugin:1.5.0:source-feature (source-feature) @ org.eclipse.ease.lang.python.py4j.test ---
02:16:02 [2020-09-24T06:16:02.892Z] [INFO] 
02:16:02 [2020-09-24T06:16:02.892Z] [INFO] --- tycho-p2-plugin:1.5.0:p2-metadata (attached-p2-metadata) @ org.eclipse.ease.lang.python.py4j.test ---
02:16:02 [2020-09-24T06:16:02.892Z] [INFO] 
02:16:02 [2020-09-24T06:16:02.892Z] [INFO] --- tycho-surefire-plugin:1.5.0:test (default-test) @ org.eclipse.ease.lang.python.py4j.test ---
02:16:02 [2020-09-24T06:16:02.892Z] [INFO] Expected eclipse log file: /home/jenkins/agent/workspace/ease.verify.core.gerrit/tests/org.eclipse.ease.lang.python.py4j.test/target/work/data/.metadata/.log
02:16:02 [2020-09-24T06:16:02.892Z] [INFO] Command line:
02:16:02 [2020-09-24T06:16:02.892Z] 	[/opt/tools/java/openjdk/jdk-11/11.0.2+9/bin/java, -Dosgi.noShutdown=false, -Dosgi.os=linux, -Dosgi.ws=gtk, -Dosgi.arch=x86_64, -Dosgi.clean=true, -jar, /home/jenkins/.m2/repository/p2/osgi/bundle/org.eclipse.equinox.launcher/1.5.700.v20200207-2156/org.eclipse.equinox.launcher-1.5.700.v20200207-2156.jar, -data, /home/jenkins/agent/workspace/ease.verify.core.gerrit/tests/org.eclipse.ease.lang.python.py4j.test/target/work/data, -install, /home/jenkins/agent/workspace/ease.verify.core.gerrit/tests/org.eclipse.ease.lang.python.py4j.test/target/work, -configuration, /home/jenkins/agent/workspace/ease.verify.core.gerrit/tests/org.eclipse.ease.lang.python.py4j.test/target/work/configuration, -application, org.eclipse.tycho.surefire.osgibooter.headlesstest, -testproperties, /home/jenkins/agent/workspace/ease.verify.core.gerrit/tests/org.eclipse.ease.lang.python.py4j.test/target/surefire.properties]
02:16:02 [2020-09-24T06:16:02.892Z] Picked up JAVA_TOOL_OPTIONS: -Dmaven.ext.class.path="/home/jenkins/agent/workspace/ease.verify.core.gerrit@tmp/withMaven32a4fffd/pipeline-maven-spy.jar" -Dorg.jenkinsci.plugins.pipeline.maven.reportsFolder="/home/jenkins/agent/workspace/ease.verify.core.gerrit@tmp/withMaven32a4fffd" 
02:16:04 [2020-09-24T06:16:04.781Z] Running org.eclipse.ease.lang.python.py4j.ScriptModeEngineTest
02:16:04 [2020-09-24T06:16:04.781Z] ----------------------------------------------
02:16:04 [2020-09-24T06:16:04.781Z] Starting test: invalidSyntax(org.eclipse.ease.lang.python.py4j.ScriptModeEngineTest)
02:16:14 [2020-09-24T06:16:14.718Z] 
02:16:14 [2020-09-24T06:16:14.718Z] Finished test: invalidSyntax(org.eclipse.ease.lang.python.py4j.ScriptModeEngineTest)
02:16:14 [2020-09-24T06:16:14.718Z] ----------------------------------------------
02:16:14 [2020-09-24T06:16:14.718Z] ----------------------------------------------
02:16:14 [2020-09-24T06:16:14.718Z] Starting test: getScriptEngine(org.eclipse.ease.lang.python.py4j.ScriptModeEngineTest)
02:16:24 [2020-09-24T06:16:24.659Z] 
02:16:24 [2020-09-24T06:16:24.659Z] Finished test: getScriptEngine(org.eclipse.ease.lang.python.py4j.ScriptModeEngineTest)
02:16:24 [2020-09-24T06:16:24.659Z] ----------------------------------------------
02:16:24 [2020-09-24T06:16:24.659Z] ----------------------------------------------
02:16:24 [2020-09-24T06:16:24.659Z] Starting test: incompleteStatement(org.eclipse.ease.lang.python.py4j.ScriptModeEngineTest)
02:16:36 [2020-09-24T06:16:36.822Z] 
02:16:36 [2020-09-24T06:16:36.822Z] Finished test: incompleteStatement(org.eclipse.ease.lang.python.py4j.ScriptModeEngineTest)
02:16:36 [2020-09-24T06:16:36.822Z] ----------------------------------------------
02:16:36 [2020-09-24T06:16:36.822Z] ----------------------------------------------
02:16:36 [2020-09-24T06:16:36.822Z] Starting test: multiLineStatement(org.eclipse.ease.lang.python.py4j.ScriptModeEngineTest)
02:16:44 [2020-09-24T06:16:44.906Z] 
02:16:44 [2020-09-24T06:16:44.906Z] Finished test: multiLineStatement(org.eclipse.ease.lang.python.py4j.ScriptModeEngineTest)
02:16:44 [2020-09-24T06:16:44.906Z] ----------------------------------------------
02:16:44 [2020-09-24T06:16:44.906Z] ----------------------------------------------
02:16:44 [2020-09-24T06:16:44.906Z] Starting test: runtimeError(org.eclipse.ease.lang.python.py4j.ScriptModeEngineTest)
02:16:54 [2020-09-24T06:16:54.844Z] 
02:16:54 [2020-09-24T06:16:54.844Z] Finished test: runtimeError(org.eclipse.ease.lang.python.py4j.ScriptModeEngineTest)
02:16:54 [2020-09-24T06:16:54.844Z] ----------------------------------------------
02:16:54 [2020-09-24T06:16:54.844Z] ----------------------------------------------
02:16:54 [2020-09-24T06:16:54.844Z] Starting test: javaIntArray(org.eclipse.ease.lang.python.py4j.ScriptModeEngineTest)
02:17:04 [2020-09-24T06:17:04.782Z] 
02:17:04 [2020-09-24T06:17:04.782Z] Finished test: javaIntArray(org.eclipse.ease.lang.python.py4j.ScriptModeEngineTest)
02:17:04 [2020-09-24T06:17:04.782Z] ----------------------------------------------
02:17:04 [2020-09-24T06:17:04.782Z] ----------------------------------------------
02:17:04 [2020-09-24T06:17:04.782Z] Starting test: javaDoubleArray(org.eclipse.ease.lang.python.py4j.ScriptModeEngineTest)
02:17:16 [2020-09-24T06:17:16.949Z] 
02:17:16 [2020-09-24T06:17:16.949Z] Finished test: javaDoubleArray(org.eclipse.ease.lang.python.py4j.ScriptModeEngineTest)
02:17:16 [2020-09-24T06:17:16.949Z] ----------------------------------------------
02:17:16 [2020-09-24T06:17:16.949Z] ----------------------------------------------
02:17:16 [2020-09-24T06:17:16.949Z] Starting test: pythonSet(org.eclipse.ease.lang.python.py4j.ScriptModeEngineTest)
02:17:25 [2020-09-24T06:17:25.032Z] 
02:17:25 [2020-09-24T06:17:25.033Z] Finished test: pythonSet(org.eclipse.ease.lang.python.py4j.ScriptModeEngineTest)
02:17:25 [2020-09-24T06:17:25.033Z] ----------------------------------------------
02:17:25 [2020-09-24T06:17:25.033Z] ----------------------------------------------
02:17:25 [2020-09-24T06:17:25.033Z] Starting test: javaStringArray(org.eclipse.ease.lang.python.py4j.ScriptModeEngineTest)
02:17:34 [2020-09-24T06:17:34.973Z] 
02:17:34 [2020-09-24T06:17:34.973Z] Finished test: javaStringArray(org.eclipse.ease.lang.python.py4j.ScriptModeEngineTest)
02:17:34 [2020-09-24T06:17:34.973Z] ----------------------------------------------
02:17:34 [2020-09-24T06:17:34.973Z] ----------------------------------------------
02:17:34 [2020-09-24T06:17:34.973Z] Starting test: javaShortArray(org.eclipse.ease.lang.python.py4j.ScriptModeEngineTest)
02:18:07 [2020-09-24T06:18:07.000Z] 
02:18:07 [2020-09-24T06:18:07.000Z] Finished test: javaShortArray(org.eclipse.ease.lang.python.py4j.ScriptModeEngineTest)
02:18:07 [2020-09-24T06:18:07.000Z] ----------------------------------------------
02:18:07 [2020-09-24T06:18:07.000Z] ----------------------------------------------
02:18:07 [2020-09-24T06:18:07.000Z] Starting test: javaBooleanArray(org.eclipse.ease.lang.python.py4j.ScriptModeEngineTest)
02:18:15 [2020-09-24T06:18:15.086Z] 
02:18:15 [2020-09-24T06:18:15.086Z] Finished test: javaBooleanArray(org.eclipse.ease.lang.python.py4j.ScriptModeEngineTest)
02:18:15 [2020-09-24T06:18:15.086Z] ----------------------------------------------
02:18:15 [2020-09-24T06:18:15.086Z] ----------------------------------------------
02:18:15 [2020-09-24T06:18:15.086Z] Starting test: javaObjectArray(org.eclipse.ease.lang.python.py4j.ScriptModeEngineTest)
02:18:25 [2020-09-24T06:18:25.026Z] 
02:18:25 [2020-09-24T06:18:25.026Z] Finished test: javaObjectArray(org.eclipse.ease.lang.python.py4j.ScriptModeEngineTest)
02:18:25 [2020-09-24T06:18:25.026Z] ----------------------------------------------
02:18:25 [2020-09-24T06:18:25.026Z] ----------------------------------------------
02:18:25 [2020-09-24T06:18:25.026Z] Starting test: javaIntegerArray(org.eclipse.ease.lang.python.py4j.ScriptModeEngineTest)
02:18:34 [2020-09-24T06:18:34.959Z] 
02:18:34 [2020-09-24T06:18:34.959Z] Finished test: javaIntegerArray(org.eclipse.ease.lang.python.py4j.ScriptModeEngineTest)
02:18:34 [2020-09-24T06:18:34.959Z] ----------------------------------------------
02:18:34 [2020-09-24T06:18:34.959Z] ----------------------------------------------
02:18:34 [2020-09-24T06:18:34.959Z] Starting test: javaInteger(org.eclipse.ease.lang.python.py4j.ScriptModeEngineTest)
02:18:47 [2020-09-24T06:18:47.120Z] 
02:18:47 [2020-09-24T06:18:47.120Z] Finished test: javaInteger(org.eclipse.ease.lang.python.py4j.ScriptModeEngineTest)
02:18:47 [2020-09-24T06:18:47.120Z] ----------------------------------------------
02:18:47 [2020-09-24T06:18:47.120Z] ----------------------------------------------
02:18:47 [2020-09-24T06:18:47.120Z] Starting test: javaString(org.eclipse.ease.lang.python.py4j.ScriptModeEngineTest)
02:18:55 [2020-09-24T06:18:55.203Z] 
02:18:55 [2020-09-24T06:18:55.203Z] Finished test: javaString(org.eclipse.ease.lang.python.py4j.ScriptModeEngineTest)
02:18:55 [2020-09-24T06:18:55.203Z] ----------------------------------------------
02:18:55 [2020-09-24T06:18:55.203Z] ----------------------------------------------
02:18:55 [2020-09-24T06:18:55.203Z] Starting test: javaByteArray(org.eclipse.ease.lang.python.py4j.ScriptModeEngineTest)
02:19:05 [2020-09-24T06:19:05.141Z] 
02:19:05 [2020-09-24T06:19:05.141Z] Finished test: javaByteArray(org.eclipse.ease.lang.python.py4j.ScriptModeEngineTest)
02:19:05 [2020-09-24T06:19:05.141Z] ----------------------------------------------
02:19:05 [2020-09-24T06:19:05.141Z] ----------------------------------------------
02:19:05 [2020-09-24T06:19:05.141Z] Starting test: createEclipseClass(org.eclipse.ease.lang.python.py4j.ScriptModeEngineTest)
02:19:15 [2020-09-24T06:19:15.079Z] 
02:19:15 [2020-09-24T06:19:15.079Z] Finished test: createEclipseClass(org.eclipse.ease.lang.python.py4j.ScriptModeEngineTest)
02:19:15 [2020-09-24T06:19:15.079Z] ----------------------------------------------
02:19:15 [2020-09-24T06:19:15.079Z] ----------------------------------------------
02:19:15 [2020-09-24T06:19:15.079Z] Starting test: pythonString(org.eclipse.ease.lang.python.py4j.ScriptModeEngineTest)
02:19:25 [2020-09-24T06:19:25.020Z] 
02:19:25 [2020-09-24T06:19:25.020Z] Finished test: pythonString(org.eclipse.ease.lang.python.py4j.ScriptModeEngineTest)
02:19:25 [2020-09-24T06:19:25.020Z] ----------------------------------------------
02:19:25 [2020-09-24T06:19:25.020Z] ----------------------------------------------
02:19:25 [2020-09-24T06:19:25.020Z] Starting test: varargs(org.eclipse.ease.lang.python.py4j.ScriptModeEngineTest)
02:19:37 [2020-09-24T06:19:37.183Z] 
02:19:37 [2020-09-24T06:19:37.183Z] Finished test: varargs(org.eclipse.ease.lang.python.py4j.ScriptModeEngineTest)
02:19:37 [2020-09-24T06:19:37.183Z] ----------------------------------------------
02:19:37 [2020-09-24T06:19:37.183Z] ----------------------------------------------
02:19:37 [2020-09-24T06:19:37.183Z] Starting test: createJavaType(org.eclipse.ease.lang.python.py4j.ScriptModeEngineTest)
02:19:45 [2020-09-24T06:19:45.268Z] 
02:19:45 [2020-09-24T06:19:45.268Z] Finished test: createJavaType(org.eclipse.ease.lang.python.py4j.ScriptModeEngineTest)
02:19:45 [2020-09-24T06:19:45.268Z] ----------------------------------------------
02:19:45 [2020-09-24T06:19:45.268Z] ----------------------------------------------
02:19:45 [2020-09-24T06:19:45.268Z] Starting test: javaFloatArray(org.eclipse.ease.lang.python.py4j.ScriptModeEngineTest)
02:19:55 [2020-09-24T06:19:55.206Z] 
02:19:55 [2020-09-24T06:19:55.206Z] Finished test: javaFloatArray(org.eclipse.ease.lang.python.py4j.ScriptModeEngineTest)
02:19:55 [2020-09-24T06:19:55.206Z] ----------------------------------------------
02:19:55 [2020-09-24T06:19:55.207Z] ----------------------------------------------
02:19:55 [2020-09-24T06:19:55.207Z] Starting test: implementJavaInterface(org.eclipse.ease.lang.python.py4j.ScriptModeEngineTest)
02:20:27 [2020-09-24T06:20:27.227Z] 
02:20:27 [2020-09-24T06:20:27.227Z] Finished test: implementJavaInterface(org.eclipse.ease.lang.python.py4j.ScriptModeEngineTest)
02:20:27 [2020-09-24T06:20:27.227Z] ----------------------------------------------
02:20:27 [2020-09-24T06:20:27.227Z] ----------------------------------------------
02:20:27 [2020-09-24T06:20:27.227Z] Starting test: pythonDict(org.eclipse.ease.lang.python.py4j.ScriptModeEngineTest)
02:20:35 [2020-09-24T06:20:35.312Z] 
02:20:35 [2020-09-24T06:20:35.312Z] Finished test: pythonDict(org.eclipse.ease.lang.python.py4j.ScriptModeEngineTest)
02:20:35 [2020-09-24T06:20:35.312Z] ----------------------------------------------
02:20:35 [2020-09-24T06:20:35.312Z] ----------------------------------------------
02:20:35 [2020-09-24T06:20:35.312Z] Starting test: pythonList(org.eclipse.ease.lang.python.py4j.ScriptModeEngineTest)
02:20:45 [2020-09-24T06:20:45.255Z] 
02:20:45 [2020-09-24T06:20:45.255Z] Finished test: pythonList(org.eclipse.ease.lang.python.py4j.ScriptModeEngineTest)
02:20:45 [2020-09-24T06:20:45.255Z] ----------------------------------------------
02:20:45 [2020-09-24T06:20:45.255Z] ----------------------------------------------
02:20:45 [2020-09-24T06:20:45.255Z] Starting test: testMultiple(org.eclipse.ease.lang.python.py4j.ScriptModeEngineTest)
02:20:55 [2020-09-24T06:20:55.197Z] 
02:20:55 [2020-09-24T06:20:55.197Z] Finished test: testMultiple(org.eclipse.ease.lang.python.py4j.ScriptModeEngineTest)
02:20:55 [2020-09-24T06:20:55.197Z] ----------------------------------------------
02:20:55 [2020-09-24T06:20:55.197Z] ----------------------------------------------
02:20:55 [2020-09-24T06:20:55.197Z] Starting test: javaLongArray(org.eclipse.ease.lang.python.py4j.ScriptModeEngineTest)
02:21:07 [2020-09-24T06:21:07.362Z] 
02:21:07 [2020-09-24T06:21:07.362Z] Finished test: javaLongArray(org.eclipse.ease.lang.python.py4j.ScriptModeEngineTest)
02:21:07 [2020-09-24T06:21:07.362Z] ----------------------------------------------
02:21:07 [2020-09-24T06:21:07.362Z] ----------------------------------------------
02:21:07 [2020-09-24T06:21:07.362Z] Starting test: createPythonObject(org.eclipse.ease.lang.python.py4j.ScriptModeEngineTest)
02:21:15 [2020-09-24T06:21:15.443Z] 
02:21:15 [2020-09-24T06:21:15.443Z] Finished test: createPythonObject(org.eclipse.ease.lang.python.py4j.ScriptModeEngineTest)
02:21:15 [2020-09-24T06:21:15.443Z] ----------------------------------------------
02:21:15 [2020-09-24T06:21:15.443Z] ----------------------------------------------
02:21:15 [2020-09-24T06:21:15.443Z] Starting test: pythonInteger(org.eclipse.ease.lang.python.py4j.ScriptModeEngineTest)
02:21:25 [2020-09-24T06:21:25.382Z] 
02:21:25 [2020-09-24T06:21:25.382Z] Finished test: pythonInteger(org.eclipse.ease.lang.python.py4j.ScriptModeEngineTest)
02:21:25 [2020-09-24T06:21:25.382Z] ----------------------------------------------
02:21:25 [2020-09-24T06:21:25.382Z] Tests run: 55, Failures: 51, Errors: 2, Skipped: 2, Time elapsed: 320.697 s <<< FAILURE! - in org.eclipse.ease.lang.python.py4j.ScriptModeEngineTest
02:21:25 [2020-09-24T06:21:25.382Z] invalidSyntax(org.eclipse.ease.lang.python.py4j.ScriptModeEngineTest)  Time elapsed: 10.089 s  <<< FAILURE!
02:21:25 [2020-09-24T06:21:25.382Z] java.lang.AssertionError: 
02:21:25 [2020-09-24T06:21:25.382Z] 
02:21:25 [2020-09-24T06:21:25.382Z] Expected: a string containing "SyntaxError"
02:21:25 [2020-09-24T06:21:25.382Z]      but: was ""
02:21:25 [2020-09-24T06:21:25.382Z] 	at org.eclipse.ease.lang.python.py4j.ScriptModeEngineTest.invalidSyntax(ScriptModeEngineTest.java:66)
02:21:25 [2020-09-24T06:21:25.382Z] 
02:21:25 [2020-09-24T06:21:25.382Z] invalidSyntax(org.eclipse.ease.lang.python.py4j.ScriptModeEngineTest)  Time elapsed: 10.089 s  <<< FAILURE!
02:21:25 [2020-09-24T06:21:25.382Z] java.lang.AssertionError
02:21:25 [2020-09-24T06:21:25.382Z] 
02:21:25 [2020-09-24T06:21:25.382Z] getScriptEngine(org.eclipse.ease.lang.python.py4j.ScriptModeEngineTest)  Time elapsed: 10.017 s  <<< FAILURE!
02:21:25 [2020-09-24T06:21:25.382Z] java.lang.AssertionError: expected null, but was:<org.eclipse.ease.ScriptExecutionException: Engine got terminated>
02:21:25 [2020-09-24T06:21:25.382Z] 	at org.eclipse.ease.lang.python.py4j.ScriptModeEngineTest.getScriptEngine(ScriptModeEngineTest.java:52)
02:21:25 [2020-09-24T06:21:25.382Z] 
02:21:25 [2020-09-24T06:21:25.382Z] getScriptEngine(org.eclipse.ease.lang.python.py4j.ScriptModeEngineTest)  Time elapsed: 10.017 s  <<< FAILURE!
02:21:25 [2020-09-24T06:21:25.382Z] java.lang.AssertionError
02:21:25 [2020-09-24T06:21:25.382Z] 
02:21:25 [2020-09-24T06:21:25.382Z] callExit(org.eclipse.ease.lang.python.py4j.ScriptModeEngineTest) skipped
02:21:25 [2020-09-24T06:21:25.382Z] multiLinesOfCode(org.eclipse.ease.lang.python.py4j.ScriptModeEngineTest) skipped
02:21:25 [2020-09-24T06:21:25.382Z] incompleteStatement(org.eclipse.ease.lang.python.py4j.ScriptModeEngineTest)  Time elapsed: 10.025 s  <<< FAILURE!
02:21:25 [2020-09-24T06:21:25.382Z] java.lang.AssertionError: 
02:21:25 [2020-09-24T06:21:25.382Z] 
02:21:25 [2020-09-24T06:21:25.382Z] Expected: a string containing "SyntaxError"
02:21:25 [2020-09-24T06:21:25.382Z]      but: was ""
02:21:25 [2020-09-24T06:21:25.382Z] 	at org.eclipse.ease.lang.python.py4j.ScriptModeEngineTest.incompleteStatement(ScriptModeEngineTest.java:59)
02:21:25 [2020-09-24T06:21:25.382Z] 
02:21:25 [2020-09-24T06:21:25.382Z] incompleteStatement(org.eclipse.ease.lang.python.py4j.ScriptModeEngineTest)  Time elapsed: 10.025 s  <<< FAILURE!
02:21:25 [2020-09-24T06:21:25.382Z] java.lang.AssertionError
02:21:25 [2020-09-24T06:21:25.382Z] 
02:21:25 [2020-09-24T06:21:25.382Z] multiLineStatement(org.eclipse.ease.lang.python.py4j.ScriptModeEngineTest)  Time elapsed: 10.026 s  <<< FAILURE!
02:21:25 [2020-09-24T06:21:25.382Z] java.lang.AssertionError: expected null, but was:<org.eclipse.ease.ScriptExecutionException: Engine got terminated>
02:21:25 [2020-09-24T06:21:25.382Z] 	at org.eclipse.ease.lang.python.py4j.ScriptModeEngineTest.executeCode(ScriptModeEngineTest.java:37)
02:21:25 [2020-09-24T06:21:25.382Z] 	at org.eclipse.ease.lang.python.py4j.ScriptModeEngineTest.multiLineStatement(ScriptModeEngineTest.java:77)
02:21:25 [2020-09-24T06:21:25.382Z] 
02:21:25 [2020-09-24T06:21:25.382Z] multiLineStatement(org.eclipse.ease.lang.python.py4j.ScriptModeEngineTest)  Time elapsed: 10.026 s  <<< FAILURE!
02:21:25 [2020-09-24T06:21:25.382Z] java.lang.AssertionError
02:21:25 [2020-09-24T06:21:25.382Z] 
02:21:25 [2020-09-24T06:21:25.382Z] runtimeError(org.eclipse.ease.lang.python.py4j.ScriptModeEngineTest)  Time elapsed: 10.025 s  <<< FAILURE!
02:21:25 [2020-09-24T06:21:25.382Z] java.lang.AssertionError: 
02:21:25 [2020-09-24T06:21:25.382Z] 
02:21:25 [2020-09-24T06:21:25.382Z] Expected: a string containing "NameError"
02:21:25 [2020-09-24T06:21:25.382Z]      but: was ""
02:21:25 [2020-09-24T06:21:25.382Z] 	at org.eclipse.ease.lang.python.py4j.ScriptModeEngineTest.runtimeError(ScriptModeEngineTest.java:72)
02:21:25 [2020-09-24T06:21:25.382Z] 
02:21:25 [2020-09-24T06:21:25.382Z] runtimeError(org.eclipse.ease.lang.python.py4j.ScriptModeEngineTest)  Time elapsed: 10.025 s  <<< FAILURE!
02:21:25 [2020-09-24T06:21:25.382Z] java.lang.AssertionError
02:21:25 [2020-09-24T06:21:25.382Z] 
02:21:25 [2020-09-24T06:21:25.382Z] javaIntArray(org.eclipse.ease.lang.python.py4j.ScriptModeEngineTest)  Time elapsed: 10.029 s  <<< FAILURE!
02:21:25 [2020-09-24T06:21:25.382Z] java.lang.AssertionError: expected null, but was:<org.eclipse.ease.ScriptExecutionException: Engine got terminated>
02:21:25 [2020-09-24T06:21:25.382Z] 	at org.eclipse.ease.lang.python.py4j.ScriptModeEngineTest.executeCode(ScriptModeEngineTest.java:37)
02:21:25 [2020-09-24T06:21:25.382Z] 
02:21:25 [2020-09-24T06:21:25.382Z] javaIntArray(org.eclipse.ease.lang.python.py4j.ScriptModeEngineTest)  Time elapsed: 10.029 s  <<< FAILURE!
02:21:25 [2020-09-24T06:21:25.382Z] java.lang.AssertionError
02:21:25 [2020-09-24T06:21:25.382Z] 
02:21:25 [2020-09-24T06:21:25.382Z] javaDoubleArray(org.eclipse.ease.lang.python.py4j.ScriptModeEngineTest)  Time elapsed: 10.023 s  <<< FAILURE!
02:21:25 [2020-09-24T06:21:25.382Z] java.lang.AssertionError: expected null, but was:<org.eclipse.ease.ScriptExecutionException: Engine got terminated>
02:21:25 [2020-09-24T06:21:25.382Z] 	at org.eclipse.ease.lang.python.py4j.ScriptModeEngineTest.executeCode(ScriptModeEngineTest.java:37)
02:21:25 [2020-09-24T06:21:25.382Z] 
02:21:25 [2020-09-24T06:21:25.382Z] javaDoubleArray(org.eclipse.ease.lang.python.py4j.ScriptModeEngineTest)  Time elapsed: 10.023 s  <<< FAILURE!
02:21:25 [2020-09-24T06:21:25.382Z] java.lang.AssertionError
02:21:25 [2020-09-24T06:21:25.382Z] 
02:21:25 [2020-09-24T06:21:25.382Z] pythonSet(org.eclipse.ease.lang.python.py4j.ScriptModeEngineTest)  Time elapsed: 10.029 s  <<< FAILURE!
02:21:25 [2020-09-24T06:21:25.382Z] java.lang.AssertionError: expected null, but was:<org.eclipse.ease.ScriptExecutionException: Engine got terminated>
02:21:25 [2020-09-24T06:21:25.383Z] 	at org.eclipse.ease.lang.python.py4j.ScriptModeEngineTest.executeCode(ScriptModeEngineTest.java:37)
02:21:25 [2020-09-24T06:21:25.383Z] 
02:21:25 [2020-09-24T06:21:25.383Z] pythonSet(org.eclipse.ease.lang.python.py4j.ScriptModeEngineTest)  Time elapsed: 10.03 s  <<< FAILURE!
02:21:25 [2020-09-24T06:21:25.383Z] java.lang.AssertionError
02:21:25 [2020-09-24T06:21:25.383Z] 
02:21:25 [2020-09-24T06:21:25.383Z] javaStringArray(org.eclipse.ease.lang.python.py4j.ScriptModeEngineTest)  Time elapsed: 10.025 s  <<< FAILURE!
02:21:25 [2020-09-24T06:21:25.383Z] java.lang.AssertionError: expected null, but was:<org.eclipse.ease.ScriptExecutionException: Engine got terminated>
02:21:25 [2020-09-24T06:21:25.383Z] 	at org.eclipse.ease.lang.python.py4j.ScriptModeEngineTest.executeCode(ScriptModeEngineTest.java:37)
02:21:25 [2020-09-24T06:21:25.383Z] 
02:21:25 [2020-09-24T06:21:25.383Z] javaStringArray(org.eclipse.ease.lang.python.py4j.ScriptModeEngineTest)  Time elapsed: 10.025 s  <<< FAILURE!
02:21:25 [2020-09-24T06:21:25.383Z] java.lang.AssertionError
02:21:25 [2020-09-24T06:21:25.383Z] 
02:21:25 [2020-09-24T06:21:25.383Z] javaShortArray(org.eclipse.ease.lang.python.py4j.ScriptModeEngineTest)  Time elapsed: 30.002 s  <<< ERROR!
02:21:25 [2020-09-24T06:21:25.383Z] org.junit.runners.model.TestTimedOutException: test timed out after 30000 milliseconds
02:21:25 [2020-09-24T06:21:25.383Z] 	at org.eclipse.ease.lang.python.py4j.ScriptModeEngineTest.executeCode(ScriptModeEngineTest.java:35)
02:21:25 [2020-09-24T06:21:25.383Z] 
02:21:25 [2020-09-24T06:21:25.383Z] javaBooleanArray(org.eclipse.ease.lang.python.py4j.ScriptModeEngineTest)  Time elapsed: 10.031 s  <<< FAILURE!
02:21:25 [2020-09-24T06:21:25.383Z] java.lang.AssertionError
02:21:25 [2020-09-24T06:21:25.383Z] 
02:21:25 [2020-09-24T06:21:25.383Z] javaObjectArray(org.eclipse.ease.lang.python.py4j.ScriptModeEngineTest)  Time elapsed: 10.019 s  <<< FAILURE!
02:21:25 [2020-09-24T06:21:25.383Z] java.lang.AssertionError: expected null, but was:<org.eclipse.ease.ScriptExecutionException: Engine got terminated>
02:21:25 [2020-09-24T06:21:25.383Z] 	at org.eclipse.ease.lang.python.py4j.ScriptModeEngineTest.executeCode(ScriptModeEngineTest.java:37)
02:21:25 [2020-09-24T06:21:25.383Z] 
02:21:25 [2020-09-24T06:21:25.383Z] javaObjectArray(org.eclipse.ease.lang.python.py4j.ScriptModeEngineTest)  Time elapsed: 10.019 s  <<< FAILURE!
02:21:25 [2020-09-24T06:21:25.383Z] java.lang.AssertionError
02:21:25 [2020-09-24T06:21:25.383Z] 
02:21:25 [2020-09-24T06:21:25.383Z] javaIntegerArray(org.eclipse.ease.lang.python.py4j.ScriptModeEngineTest)  Time elapsed: 10.015 s  <<< FAILURE!
02:21:25 [2020-09-24T06:21:25.383Z] java.lang.AssertionError: expected null, but was:<org.eclipse.ease.ScriptExecutionException: Engine got terminated>
02:21:25 [2020-09-24T06:21:25.383Z] 	at org.eclipse.ease.lang.python.py4j.ScriptModeEngineTest.executeCode(ScriptModeEngineTest.java:37)
02:21:25 [2020-09-24T06:21:25.383Z] 
02:21:25 [2020-09-24T06:21:25.383Z] javaIntegerArray(org.eclipse.ease.lang.python.py4j.ScriptModeEngineTest)  Time elapsed: 10.015 s  <<< FAILURE!
02:21:25 [2020-09-24T06:21:25.383Z] java.lang.AssertionError
02:21:25 [2020-09-24T06:21:25.383Z] 
02:21:25 [2020-09-24T06:21:25.383Z] javaInteger(org.eclipse.ease.lang.python.py4j.ScriptModeEngineTest)  Time elapsed: 10.017 s  <<< FAILURE!
02:21:25 [2020-09-24T06:21:25.383Z] java.lang.AssertionError: expected null, but was:<org.eclipse.ease.ScriptExecutionException: Engine got terminated>
02:21:25 [2020-09-24T06:21:25.383Z] 	at org.eclipse.ease.lang.python.py4j.ScriptModeEngineTest.executeCode(ScriptModeEngineTest.java:37)
02:21:25 [2020-09-24T06:21:25.383Z] 
02:21:25 [2020-09-24T06:21:25.383Z] javaInteger(org.eclipse.ease.lang.python.py4j.ScriptModeEngineTest)  Time elapsed: 10.017 s  <<< FAILURE!
02:21:25 [2020-09-24T06:21:25.383Z] java.lang.AssertionError
02:21:25 [2020-09-24T06:21:25.383Z] 
02:21:25 [2020-09-24T06:21:25.383Z] javaString(org.eclipse.ease.lang.python.py4j.ScriptModeEngineTest)  Time elapsed: 10.016 s  <<< FAILURE!
02:21:25 [2020-09-24T06:21:25.383Z] java.lang.AssertionError: expected null, but was:<org.eclipse.ease.ScriptExecutionException: Engine got terminated>
02:21:25 [2020-09-24T06:21:25.383Z] 	at org.eclipse.ease.lang.python.py4j.ScriptModeEngineTest.executeCode(ScriptModeEngineTest.java:37)
02:21:25 [2020-09-24T06:21:25.383Z] 
02:21:25 [2020-09-24T06:21:25.383Z] javaString(org.eclipse.ease.lang.python.py4j.ScriptModeEngineTest)  Time elapsed: 10.016 s  <<< FAILURE!
02:21:25 [2020-09-24T06:21:25.383Z] java.lang.AssertionError
02:21:25 [2020-09-24T06:21:25.383Z] 
02:21:25 [2020-09-24T06:21:25.383Z] javaByteArray(org.eclipse.ease.lang.python.py4j.ScriptModeEngineTest)  Time elapsed: 10.021 s  <<< FAILURE!
02:21:25 [2020-09-24T06:21:25.383Z] java.lang.AssertionError: expected null, but was:<org.eclipse.ease.ScriptExecutionException: Engine got terminated>
02:21:25 [2020-09-24T06:21:25.383Z] 	at org.eclipse.ease.lang.python.py4j.ScriptModeEngineTest.executeCode(ScriptModeEngineTest.java:37)
02:21:25 [2020-09-24T06:21:25.383Z] 
02:21:25 [2020-09-24T06:21:25.383Z] javaByteArray(org.eclipse.ease.lang.python.py4j.ScriptModeEngineTest)  Time elapsed: 10.021 s  <<< FAILURE!
02:21:25 [2020-09-24T06:21:25.383Z] java.lang.AssertionError
02:21:25 [2020-09-24T06:21:25.383Z] 
02:21:25 [2020-09-24T06:21:25.383Z] createEclipseClass(org.eclipse.ease.lang.python.py4j.ScriptModeEngineTest)  Time elapsed: 10.02 s  <<< FAILURE!
02:21:25 [2020-09-24T06:21:25.383Z] java.lang.AssertionError: expected null, but was:<org.eclipse.ease.ScriptExecutionException: Engine got terminated>
02:21:25 [2020-09-24T06:21:25.383Z] 	at org.eclipse.ease.lang.python.py4j.ScriptModeEngineTest.executeCode(ScriptModeEngineTest.java:37)
02:21:25 [2020-09-24T06:21:25.383Z] 
02:21:25 [2020-09-24T06:21:25.383Z] createEclipseClass(org.eclipse.ease.lang.python.py4j.ScriptModeEngineTest)  Time elapsed: 10.02 s  <<< FAILURE!
02:21:25 [2020-09-24T06:21:25.383Z] java.lang.AssertionError
02:21:25 [2020-09-24T06:21:25.383Z] 
02:21:25 [2020-09-24T06:21:25.383Z] pythonString(org.eclipse.ease.lang.python.py4j.ScriptModeEngineTest)  Time elapsed: 10.024 s  <<< FAILURE!
02:21:25 [2020-09-24T06:21:25.383Z] java.lang.AssertionError: expected null, but was:<org.eclipse.ease.ScriptExecutionException: Engine got terminated>
02:21:25 [2020-09-24T06:21:25.383Z] 	at org.eclipse.ease.lang.python.py4j.ScriptModeEngineTest.executeCode(ScriptModeEngineTest.java:37)
02:21:25 [2020-09-24T06:21:25.383Z] 
02:21:25 [2020-09-24T06:21:25.383Z] pythonString(org.eclipse.ease.lang.python.py4j.ScriptModeEngineTest)  Time elapsed: 10.024 s  <<< FAILURE!
02:21:25 [2020-09-24T06:21:25.383Z] java.lang.AssertionError
02:21:25 [2020-09-24T06:21:25.383Z] 
02:21:25 [2020-09-24T06:21:25.383Z] varargs(org.eclipse.ease.lang.python.py4j.ScriptModeEngineTest)  Time elapsed: 10.018 s  <<< FAILURE!
02:21:25 [2020-09-24T06:21:25.383Z] java.lang.AssertionError: expected null, but was:<org.eclipse.ease.ScriptExecutionException: Engine got terminated>
02:21:25 [2020-09-24T06:21:25.383Z] 	at org.eclipse.ease.lang.python.py4j.ScriptModeEngineTest.executeCode(ScriptModeEngineTest.java:37)
02:21:25 [2020-09-24T06:21:25.383Z] 
02:21:25 [2020-09-24T06:21:25.383Z] varargs(org.eclipse.ease.lang.python.py4j.ScriptModeEngineTest)  Time elapsed: 10.018 s  <<< FAILURE!
02:21:25 [2020-09-24T06:21:25.383Z] java.lang.AssertionError
02:21:25 [2020-09-24T06:21:25.383Z] 
02:21:25 [2020-09-24T06:21:25.383Z] createJavaType(org.eclipse.ease.lang.python.py4j.ScriptModeEngineTest)  Time elapsed: 10.022 s  <<< FAILURE!
02:21:25 [2020-09-24T06:21:25.383Z] java.lang.AssertionError: expected null, but was:<org.eclipse.ease.ScriptExecutionException: Engine got terminated>
02:21:25 [2020-09-24T06:21:25.383Z] 	at org.eclipse.ease.lang.python.py4j.ScriptModeEngineTest.executeCode(ScriptModeEngineTest.java:37)
02:21:25 [2020-09-24T06:21:25.383Z] 
02:21:25 [2020-09-24T06:21:25.383Z] createJavaType(org.eclipse.ease.lang.python.py4j.ScriptModeEngineTest)  Time elapsed: 10.022 s  <<< FAILURE!
02:21:25 [2020-09-24T06:21:25.383Z] java.lang.AssertionError
02:21:25 [2020-09-24T06:21:25.383Z] 
02:21:25 [2020-09-24T06:21:25.383Z] javaFloatArray(org.eclipse.ease.lang.python.py4j.ScriptModeEngineTest)  Time elapsed: 10.016 s  <<< FAILURE!
02:21:25 [2020-09-24T06:21:25.383Z] java.lang.AssertionError: expected null, but was:<org.eclipse.ease.ScriptExecutionException: Engine got terminated>
02:21:25 [2020-09-24T06:21:25.383Z] 	at org.eclipse.ease.lang.python.py4j.ScriptModeEngineTest.executeCode(ScriptModeEngineTest.java:37)
02:21:25 [2020-09-24T06:21:25.383Z] 
02:21:25 [2020-09-24T06:21:25.383Z] javaFloatArray(org.eclipse.ease.lang.python.py4j.ScriptModeEngineTest)  Time elapsed: 10.016 s  <<< FAILURE!
02:21:25 [2020-09-24T06:21:25.383Z] java.lang.AssertionError
02:21:25 [2020-09-24T06:21:25.383Z] 
02:21:25 [2020-09-24T06:21:25.383Z] implementJavaInterface(org.eclipse.ease.lang.python.py4j.ScriptModeEngineTest)  Time elapsed: 30.002 s  <<< ERROR!
02:21:25 [2020-09-24T06:21:25.383Z] org.junit.runners.model.TestTimedOutException: test timed out after 30000 milliseconds
02:21:25 [2020-09-24T06:21:25.383Z] 	at org.eclipse.ease.lang.python.py4j.ScriptModeEngineTest.executeCode(ScriptModeEngineTest.java:30)
02:21:25 [2020-09-24T06:21:25.383Z] 
02:21:25 [2020-09-24T06:21:25.383Z] pythonDict(org.eclipse.ease.lang.python.py4j.ScriptModeEngineTest)  Time elapsed: 10.031 s  <<< FAILURE!
02:21:25 [2020-09-24T06:21:25.383Z] java.lang.AssertionError: expected null, but was:<org.eclipse.ease.ScriptExecutionException: Engine got terminated>
02:21:25 [2020-09-24T06:21:25.383Z] 	at org.eclipse.ease.lang.python.py4j.ScriptModeEngineTest.executeCode(ScriptModeEngineTest.java:37)
02:21:25 [2020-09-24T06:21:25.383Z] 
02:21:25 [2020-09-24T06:21:25.384Z] pythonDict(org.eclipse.ease.lang.python.py4j.ScriptModeEngineTest)  Time elapsed: 10.031 s  <<< FAILURE!
02:21:25 [2020-09-24T06:21:25.384Z] java.lang.AssertionError
02:21:25 [2020-09-24T06:21:25.384Z] 
02:21:25 [2020-09-24T06:21:25.384Z] pythonList(org.eclipse.ease.lang.python.py4j.ScriptModeEngineTest)  Time elapsed: 10.025 s  <<< FAILURE!
02:21:25 [2020-09-24T06:21:25.384Z] java.lang.AssertionError: expected null, but was:<org.eclipse.ease.ScriptExecutionException: Engine got terminated>
02:21:25 [2020-09-24T06:21:25.384Z] 	at org.eclipse.ease.lang.python.py4j.ScriptModeEngineTest.executeCode(ScriptModeEngineTest.java:37)
02:21:25 [2020-09-24T06:21:25.384Z] 
02:21:25 [2020-09-24T06:21:25.384Z] pythonList(org.eclipse.ease.lang.python.py4j.ScriptModeEngineTest)  Time elapsed: 10.025 s  <<< FAILURE!
02:21:25 [2020-09-24T06:21:25.384Z] java.lang.AssertionError
02:21:25 [2020-09-24T06:21:25.384Z] 
02:21:25 [2020-09-24T06:21:25.384Z] testMultiple(org.eclipse.ease.lang.python.py4j.ScriptModeEngineTest)  Time elapsed: 10.025 s  <<< FAILURE!
02:21:25 [2020-09-24T06:21:25.384Z] java.lang.AssertionError: expected null, but was:<org.eclipse.ease.ScriptExecutionException: Engine got terminated>
02:21:25 [2020-09-24T06:21:25.384Z] 	at org.eclipse.ease.lang.python.py4j.ScriptModeEngineTest.executeCode(ScriptModeEngineTest.java:37)
02:21:25 [2020-09-24T06:21:25.384Z] 
02:21:25 [2020-09-24T06:21:25.384Z] testMultiple(org.eclipse.ease.lang.python.py4j.ScriptModeEngineTest)  Time elapsed: 10.026 s  <<< FAILURE!
02:21:25 [2020-09-24T06:21:25.384Z] java.lang.AssertionError
02:21:25 [2020-09-24T06:21:25.384Z] 
02:21:25 [2020-09-24T06:21:25.384Z] javaLongArray(org.eclipse.ease.lang.python.py4j.ScriptModeEngineTest)  Time elapsed: 10.028 s  <<< FAILURE!
02:21:25 [2020-09-24T06:21:25.384Z] java.lang.AssertionError: expected null, but was:<org.eclipse.ease.ScriptExecutionException: Engine got terminated>
02:21:25 [2020-09-24T06:21:25.384Z] 
02:21:25 [2020-09-24T06:21:25.384Z] javaLongArray(org.eclipse.ease.lang.python.py4j.ScriptModeEngineTest)  Time elapsed: 10.029 s  <<< FAILURE!
02:21:25 [2020-09-24T06:21:25.384Z] java.lang.AssertionError
02:21:25 [2020-09-24T06:21:25.384Z] 
02:21:25 [2020-09-24T06:21:25.384Z] createPythonObject(org.eclipse.ease.lang.python.py4j.ScriptModeEngineTest)  Time elapsed: 10.024 s  <<< FAILURE!
02:21:25 [2020-09-24T06:21:25.384Z] java.lang.AssertionError: expected null, but was:<org.eclipse.ease.ScriptExecutionException: Engine got terminated>
02:21:25 [2020-09-24T06:21:25.384Z] 
02:21:25 [2020-09-24T06:21:25.384Z] createPythonObject(org.eclipse.ease.lang.python.py4j.ScriptModeEngineTest)  Time elapsed: 10.024 s  <<< FAILURE!
02:21:25 [2020-09-24T06:21:25.384Z] java.lang.AssertionError
02:21:25 [2020-09-24T06:21:25.384Z] 
02:21:25 [2020-09-24T06:21:25.384Z] pythonInteger(org.eclipse.ease.lang.python.py4j.ScriptModeEngineTest)  Time elapsed: 10.027 s  <<< FAILURE!
02:21:25 [2020-09-24T06:21:25.384Z] java.lang.AssertionError: expected null, but was:<org.eclipse.ease.ScriptExecutionException: Engine got terminated>
02:21:25 [2020-09-24T06:21:25.384Z] 	at org.eclipse.ease.lang.python.py4j.ScriptModeEngineTest.executeCode(ScriptModeEngineTest.java:37)
02:21:25 [2020-09-24T06:21:25.384Z] 
02:21:25 [2020-09-24T06:21:25.384Z] pythonInteger(org.eclipse.ease.lang.python.py4j.ScriptModeEngineTest)  Time elapsed: 10.027 s  <<< FAILURE!
02:21:25 [2020-09-24T06:21:25.384Z] java.lang.AssertionError
02:21:25 [2020-09-24T06:21:25.384Z] 
02:21:25 [2020-09-24T06:21:25.384Z] Running org.eclipse.ease.lang.python.py4j.ShellModeEngineTest
02:21:25 [2020-09-24T06:21:25.384Z] ----------------------------------------------
02:21:25 [2020-09-24T06:21:25.384Z] Starting test: invalidSyntax(org.eclipse.ease.lang.python.py4j.ShellModeEngineTest)
02:21:35 [2020-09-24T06:21:35.324Z] 
02:21:35 [2020-09-24T06:21:35.324Z] Finished test: invalidSyntax(org.eclipse.ease.lang.python.py4j.ShellModeEngineTest)
02:21:35 [2020-09-24T06:21:35.324Z] ----------------------------------------------
02:21:35 [2020-09-24T06:21:35.324Z] ----------------------------------------------
02:21:35 [2020-09-24T06:21:35.324Z] Starting test: optionalModuleParameters(org.eclipse.ease.lang.python.py4j.ShellModeEngineTest)
02:21:47 [2020-09-24T06:21:47.492Z] 
02:21:47 [2020-09-24T06:21:47.492Z] Finished test: optionalModuleParameters(org.eclipse.ease.lang.python.py4j.ShellModeEngineTest)
02:21:47 [2020-09-24T06:21:47.492Z] ----------------------------------------------
02:21:47 [2020-09-24T06:21:47.492Z] ----------------------------------------------
02:21:47 [2020-09-24T06:21:47.492Z] Starting test: getScriptEngine(org.eclipse.ease.lang.python.py4j.ShellModeEngineTest)
02:21:55 [2020-09-24T06:21:55.572Z] 
02:21:55 [2020-09-24T06:21:55.572Z] Finished test: getScriptEngine(org.eclipse.ease.lang.python.py4j.ShellModeEngineTest)
02:21:55 [2020-09-24T06:21:55.572Z] ----------------------------------------------
02:21:55 [2020-09-24T06:21:55.572Z] ----------------------------------------------
02:21:55 [2020-09-24T06:21:55.572Z] Starting test: callModuleCode(org.eclipse.ease.lang.python.py4j.ShellModeEngineTest)
02:22:05 [2020-09-24T06:22:05.514Z] 
02:22:05 [2020-09-24T06:22:05.514Z] Finished test: callModuleCode(org.eclipse.ease.lang.python.py4j.ShellModeEngineTest)
02:22:05 [2020-09-24T06:22:05.514Z] ----------------------------------------------
02:22:05 [2020-09-24T06:22:05.514Z] ----------------------------------------------
02:22:05 [2020-09-24T06:22:05.514Z] Starting test: incompleteStatement(org.eclipse.ease.lang.python.py4j.ShellModeEngineTest)
02:22:15 [2020-09-24T06:22:15.453Z] 
02:22:15 [2020-09-24T06:22:15.453Z] Finished test: incompleteStatement(org.eclipse.ease.lang.python.py4j.ShellModeEngineTest)
02:22:15 [2020-09-24T06:22:15.453Z] ----------------------------------------------
02:22:15 [2020-09-24T06:22:15.453Z] ----------------------------------------------
02:22:15 [2020-09-24T06:22:15.453Z] Starting test: multiLineStatement(org.eclipse.ease.lang.python.py4j.ShellModeEngineTest)
02:22:25 [2020-09-24T06:22:25.391Z] 
02:22:25 [2020-09-24T06:22:25.391Z] Finished test: multiLineStatement(org.eclipse.ease.lang.python.py4j.ShellModeEngineTest)
02:22:25 [2020-09-24T06:22:25.391Z] ----------------------------------------------
02:22:25 [2020-09-24T06:22:25.391Z] ----------------------------------------------
02:22:25 [2020-09-24T06:22:25.391Z] Starting test: runtimeError(org.eclipse.ease.lang.python.py4j.ShellModeEngineTest)
02:22:37 [2020-09-24T06:22:37.556Z] 
02:22:37 [2020-09-24T06:22:37.557Z] Finished test: runtimeError(org.eclipse.ease.lang.python.py4j.ShellModeEngineTest)
02:22:37 [2020-09-24T06:22:37.557Z] ----------------------------------------------
02:22:37 [2020-09-24T06:22:37.557Z] ----------------------------------------------
02:22:37 [2020-09-24T06:22:37.557Z] Starting test: javaIntArray(org.eclipse.ease.lang.python.py4j.ShellModeEngineTest)
02:23:09 [2020-09-24T06:23:09.577Z] 
02:23:09 [2020-09-24T06:23:09.577Z] Finished test: javaIntArray(org.eclipse.ease.lang.python.py4j.ShellModeEngineTest)
02:23:09 [2020-09-24T06:23:09.577Z] ----------------------------------------------
02:23:09 [2020-09-24T06:23:09.577Z] ----------------------------------------------
02:23:09 [2020-09-24T06:23:09.577Z] Starting test: javaDoubleArray(org.eclipse.ease.lang.python.py4j.ShellModeEngineTest)
02:23:16 [2020-09-24T06:23:16.127Z] 
02:23:16 [2020-09-24T06:23:16.127Z] Finished test: javaDoubleArray(org.eclipse.ease.lang.python.py4j.ShellModeEngineTest)
02:23:16 [2020-09-24T06:23:16.127Z] ----------------------------------------------
02:23:16 [2020-09-24T06:23:16.127Z] ----------------------------------------------
02:23:16 [2020-09-24T06:23:16.127Z] Starting test: pythonSet(org.eclipse.ease.lang.python.py4j.ShellModeEngineTest)
02:23:26 [2020-09-24T06:23:26.068Z] 
02:23:26 [2020-09-24T06:23:26.068Z] Finished test: pythonSet(org.eclipse.ease.lang.python.py4j.ShellModeEngineTest)
02:23:26 [2020-09-24T06:23:26.068Z] ----------------------------------------------
02:23:26 [2020-09-24T06:23:26.068Z] ----------------------------------------------
02:23:26 [2020-09-24T06:23:26.068Z] Starting test: javaStringArray(org.eclipse.ease.lang.python.py4j.ShellModeEngineTest)
02:23:58 [2020-09-24T06:23:58.089Z] 
02:23:58 [2020-09-24T06:23:58.089Z] Finished test: javaStringArray(org.eclipse.ease.lang.python.py4j.ShellModeEngineTest)
02:23:58 [2020-09-24T06:23:58.089Z] ----------------------------------------------
02:23:58 [2020-09-24T06:23:58.089Z] ----------------------------------------------
02:23:58 [2020-09-24T06:23:58.089Z] Starting test: javaShortArray(org.eclipse.ease.lang.python.py4j.ShellModeEngineTest)
02:24:06 [2020-09-24T06:24:06.170Z] 
02:24:06 [2020-09-24T06:24:06.170Z] Finished test: javaShortArray(org.eclipse.ease.lang.python.py4j.ShellModeEngineTest)
02:24:06 [2020-09-24T06:24:06.170Z] ----------------------------------------------
02:24:06 [2020-09-24T06:24:06.170Z] ----------------------------------------------
02:24:06 [2020-09-24T06:24:06.170Z] Starting test: javaBooleanArray(org.eclipse.ease.lang.python.py4j.ShellModeEngineTest)
02:24:16 [2020-09-24T06:24:16.106Z] 
02:24:16 [2020-09-24T06:24:16.106Z] Finished test: javaBooleanArray(org.eclipse.ease.lang.python.py4j.ShellModeEngineTest)
02:24:16 [2020-09-24T06:24:16.106Z] ----------------------------------------------
02:24:16 [2020-09-24T06:24:16.106Z] ----------------------------------------------
02:24:16 [2020-09-24T06:24:16.106Z] Starting test: javaObjectArray(org.eclipse.ease.lang.python.py4j.ShellModeEngineTest)
02:24:26 [2020-09-24T06:24:26.046Z] 
02:24:26 [2020-09-24T06:24:26.046Z] Finished test: javaObjectArray(org.eclipse.ease.lang.python.py4j.ShellModeEngineTest)
02:24:26 [2020-09-24T06:24:26.046Z] ----------------------------------------------
02:24:26 [2020-09-24T06:24:26.047Z] ----------------------------------------------
02:24:26 [2020-09-24T06:24:26.047Z] Starting test: javaIntegerArray(org.eclipse.ease.lang.python.py4j.ShellModeEngineTest)
02:24:35 [2020-09-24T06:24:35.985Z] 
02:24:35 [2020-09-24T06:24:35.985Z] Finished test: javaIntegerArray(org.eclipse.ease.lang.python.py4j.ShellModeEngineTest)
02:24:35 [2020-09-24T06:24:35.985Z] ----------------------------------------------
02:24:35 [2020-09-24T06:24:35.985Z] ----------------------------------------------
02:24:35 [2020-09-24T06:24:35.985Z] Starting test: javaInteger(org.eclipse.ease.lang.python.py4j.ShellModeEngineTest)
02:24:45 [2020-09-24T06:24:45.926Z] 
02:24:45 [2020-09-24T06:24:45.926Z] Finished test: javaInteger(org.eclipse.ease.lang.python.py4j.ShellModeEngineTest)
02:24:45 [2020-09-24T06:24:45.926Z] ----------------------------------------------
02:24:45 [2020-09-24T06:24:45.926Z] ----------------------------------------------
02:24:45 [2020-09-24T06:24:45.926Z] Starting test: javaString(org.eclipse.ease.lang.python.py4j.ShellModeEngineTest)
02:24:55 [2020-09-24T06:24:55.864Z] 
02:24:55 [2020-09-24T06:24:55.864Z] Finished test: javaString(org.eclipse.ease.lang.python.py4j.ShellModeEngineTest)
02:24:55 [2020-09-24T06:24:55.864Z] ----------------------------------------------
02:24:55 [2020-09-24T06:24:55.864Z] ----------------------------------------------
02:24:55 [2020-09-24T06:24:55.864Z] Starting test: javaByteArray(org.eclipse.ease.lang.python.py4j.ShellModeEngineTest)
02:25:05 [2020-09-24T06:25:05.803Z] 
02:25:05 [2020-09-24T06:25:05.803Z] Finished test: javaByteArray(org.eclipse.ease.lang.python.py4j.ShellModeEngineTest)
02:25:05 [2020-09-24T06:25:05.803Z] ----------------------------------------------
02:25:05 [2020-09-24T06:25:05.803Z] ----------------------------------------------
02:25:05 [2020-09-24T06:25:05.803Z] Starting test: createEclipseClass(org.eclipse.ease.lang.python.py4j.ShellModeEngineTest)
02:25:15 [2020-09-24T06:25:15.743Z] 
02:25:15 [2020-09-24T06:25:15.743Z] Finished test: createEclipseClass(org.eclipse.ease.lang.python.py4j.ShellModeEngineTest)
02:25:15 [2020-09-24T06:25:15.743Z] ----------------------------------------------
02:25:15 [2020-09-24T06:25:15.743Z] ----------------------------------------------
02:25:15 [2020-09-24T06:25:15.743Z] Starting test: pythonString(org.eclipse.ease.lang.python.py4j.ShellModeEngineTest)
02:25:25 [2020-09-24T06:25:25.686Z] 
02:25:25 [2020-09-24T06:25:25.686Z] Finished test: pythonString(org.eclipse.ease.lang.python.py4j.ShellModeEngineTest)
02:25:25 [2020-09-24T06:25:25.686Z] ----------------------------------------------
02:25:25 [2020-09-24T06:25:25.686Z] ----------------------------------------------
02:25:25 [2020-09-24T06:25:25.686Z] Starting test: varargs(org.eclipse.ease.lang.python.py4j.ShellModeEngineTest)
02:25:37 [2020-09-24T06:25:37.851Z] 
02:25:37 [2020-09-24T06:25:37.851Z] Finished test: varargs(org.eclipse.ease.lang.python.py4j.ShellModeEngineTest)
02:25:37 [2020-09-24T06:25:37.851Z] ----------------------------------------------
02:25:37 [2020-09-24T06:25:37.851Z] ----------------------------------------------
02:25:37 [2020-09-24T06:25:37.851Z] Starting test: createJavaType(org.eclipse.ease.lang.python.py4j.ShellModeEngineTest)
02:25:45 [2020-09-24T06:25:45.933Z] 
02:25:45 [2020-09-24T06:25:45.933Z] Finished test: createJavaType(org.eclipse.ease.lang.python.py4j.ShellModeEngineTest)
02:25:45 [2020-09-24T06:25:45.933Z] ----------------------------------------------
02:25:45 [2020-09-24T06:25:45.933Z] ----------------------------------------------
02:25:45 [2020-09-24T06:25:45.933Z] Starting test: javaFloatArray(org.eclipse.ease.lang.python.py4j.ShellModeEngineTest)
02:25:55 [2020-09-24T06:25:55.868Z] 
02:25:55 [2020-09-24T06:25:55.868Z] Finished test: javaFloatArray(org.eclipse.ease.lang.python.py4j.ShellModeEngineTest)
02:25:55 [2020-09-24T06:25:55.868Z] ----------------------------------------------
02:25:55 [2020-09-24T06:25:55.868Z] ----------------------------------------------
02:25:55 [2020-09-24T06:25:55.868Z] Starting test: implementJavaInterface(org.eclipse.ease.lang.python.py4j.ShellModeEngineTest)
02:26:27 [2020-09-24T06:26:27.892Z] 
02:26:27 [2020-09-24T06:26:27.892Z] Finished test: implementJavaInterface(org.eclipse.ease.lang.python.py4j.ShellModeEngineTest)
02:26:27 [2020-09-24T06:26:27.892Z] ----------------------------------------------
02:26:27 [2020-09-24T06:26:27.892Z] ----------------------------------------------
02:26:27 [2020-09-24T06:26:27.892Z] Starting test: pythonDict(org.eclipse.ease.lang.python.py4j.ShellModeEngineTest)
02:26:36 [2020-09-24T06:26:36.896Z] 
02:26:36 [2020-09-24T06:26:36.896Z] Finished test: pythonDict(org.eclipse.ease.lang.python.py4j.ShellModeEngineTest)
02:26:36 [2020-09-24T06:26:36.896Z] ----------------------------------------------
02:26:36 [2020-09-24T06:26:36.896Z] ----------------------------------------------
02:26:36 [2020-09-24T06:26:36.896Z] Starting test: pythonList(org.eclipse.ease.lang.python.py4j.ShellModeEngineTest)
02:26:46 [2020-09-24T06:26:46.836Z] 
02:26:46 [2020-09-24T06:26:46.836Z] Finished test: pythonList(org.eclipse.ease.lang.python.py4j.ShellModeEngineTest)
02:26:46 [2020-09-24T06:26:46.836Z] ----------------------------------------------
02:26:46 [2020-09-24T06:26:46.836Z] ----------------------------------------------
02:26:46 [2020-09-24T06:26:46.836Z] Starting test: testMultiple(org.eclipse.ease.lang.python.py4j.ShellModeEngineTest)
02:26:56 [2020-09-24T06:26:56.775Z] 
02:26:56 [2020-09-24T06:26:56.775Z] Finished test: testMultiple(org.eclipse.ease.lang.python.py4j.ShellModeEngineTest)
02:26:56 [2020-09-24T06:26:56.775Z] ----------------------------------------------
02:26:56 [2020-09-24T06:26:56.775Z] ----------------------------------------------
02:26:56 [2020-09-24T06:26:56.775Z] Starting test: javaLongArray(org.eclipse.ease.lang.python.py4j.ShellModeEngineTest)
02:27:28 [2020-09-24T06:27:28.795Z] 
02:27:28 [2020-09-24T06:27:28.795Z] Finished test: javaLongArray(org.eclipse.ease.lang.python.py4j.ShellModeEngineTest)
02:27:28 [2020-09-24T06:27:28.795Z] ----------------------------------------------
02:27:28 [2020-09-24T06:27:28.795Z] ----------------------------------------------
02:27:28 [2020-09-24T06:27:28.795Z] Starting test: createPythonObject(org.eclipse.ease.lang.python.py4j.ShellModeEngineTest)
02:27:36 [2020-09-24T06:27:36.876Z] 
02:27:36 [2020-09-24T06:27:36.876Z] Finished test: createPythonObject(org.eclipse.ease.lang.python.py4j.ShellModeEngineTest)
02:27:36 [2020-09-24T06:27:36.876Z] ----------------------------------------------
02:27:36 [2020-09-24T06:27:36.876Z] ----------------------------------------------
02:27:36 [2020-09-24T06:27:36.876Z] Starting test: pythonInteger(org.eclipse.ease.lang.python.py4j.ShellModeEngineTest)
02:27:46 [2020-09-24T06:27:46.817Z] 
02:27:46 [2020-09-24T06:27:46.817Z] Finished test: pythonInteger(org.eclipse.ease.lang.python.py4j.ShellModeEngineTest)
02:27:46 [2020-09-24T06:27:46.817Z] ----------------------------------------------
02:27:46 [2020-09-24T06:27:46.817Z] Tests run: 59, Failures: 51, Errors: 4, Skipped: 4, Time elapsed: 380.657 s <<< FAILURE! - in org.eclipse.ease.lang.python.py4j.ShellModeEngineTest
02:27:46 [2020-09-24T06:27:46.817Z] invalidSyntax(org.eclipse.ease.lang.python.py4j.ShellModeEngineTest)  Time elapsed: 10.025 s  <<< FAILURE!
02:27:46 [2020-09-24T06:27:46.817Z] java.lang.AssertionError: 
02:27:46 [2020-09-24T06:27:46.817Z] 
02:27:46 [2020-09-24T06:27:46.817Z] Expected: a string containing "SyntaxError"
02:27:46 [2020-09-24T06:27:46.817Z]      but: was ""
02:27:46 [2020-09-24T06:27:46.817Z] 	at org.eclipse.ease.lang.python.py4j.ShellModeEngineTest.invalidSyntax(ShellModeEngineTest.java:110)
02:27:46 [2020-09-24T06:27:46.817Z] 
02:27:46 [2020-09-24T06:27:46.817Z] invalidSyntax(org.eclipse.ease.lang.python.py4j.ShellModeEngineTest)  Time elapsed: 10.025 s  <<< FAILURE!
02:27:46 [2020-09-24T06:27:46.817Z] java.lang.AssertionError
02:27:46 [2020-09-24T06:27:46.817Z] 
02:27:46 [2020-09-24T06:27:46.817Z] print_(org.eclipse.ease.lang.python.py4j.ShellModeEngineTest) skipped
02:27:46 [2020-09-24T06:27:46.817Z] optionalModuleParameters(org.eclipse.ease.lang.python.py4j.ShellModeEngineTest)  Time elapsed: 10.026 s  <<< FAILURE!
02:27:46 [2020-09-24T06:27:46.817Z] java.lang.AssertionError: expected null, but was:<org.eclipse.ease.ScriptExecutionException: Engine got terminated>
02:27:46 [2020-09-24T06:27:46.817Z] 	at org.eclipse.ease.lang.python.py4j.ShellModeEngineTest.optionalModuleParameters(ShellModeEngineTest.java:52)
02:27:46 [2020-09-24T06:27:46.817Z] 
02:27:46 [2020-09-24T06:27:46.817Z] optionalModuleParameters(org.eclipse.ease.lang.python.py4j.ShellModeEngineTest)  Time elapsed: 10.026 s  <<< FAILURE!
02:27:46 [2020-09-24T06:27:46.817Z] java.lang.AssertionError
02:27:46 [2020-09-24T06:27:46.817Z] 
02:27:46 [2020-09-24T06:27:46.817Z] print_TextNoNewline(org.eclipse.ease.lang.python.py4j.ShellModeEngineTest) skipped
02:27:46 [2020-09-24T06:27:46.817Z] getScriptEngine(org.eclipse.ease.lang.python.py4j.ShellModeEngineTest)  Time elapsed: 10.023 s  <<< FAILURE!
02:27:46 [2020-09-24T06:27:46.817Z] java.lang.AssertionError: expected null, but was:<org.eclipse.ease.ScriptExecutionException: Engine got terminated>
02:27:46 [2020-09-24T06:27:46.817Z] 	at org.eclipse.ease.lang.python.py4j.ShellModeEngineTest.getScriptEngine(ShellModeEngineTest.java:58)
02:27:46 [2020-09-24T06:27:46.817Z] 
02:27:46 [2020-09-24T06:27:46.817Z] getScriptEngine(org.eclipse.ease.lang.python.py4j.ShellModeEngineTest)  Time elapsed: 10.024 s  <<< FAILURE!
02:27:46 [2020-09-24T06:27:46.818Z] java.lang.AssertionError
02:27:46 [2020-09-24T06:27:46.818Z] 
02:27:46 [2020-09-24T06:27:46.818Z] print_Text(org.eclipse.ease.lang.python.py4j.ShellModeEngineTest) skipped
02:27:46 [2020-09-24T06:27:46.818Z] callModuleCode(org.eclipse.ease.lang.python.py4j.ShellModeEngineTest)  Time elapsed: 10.027 s  <<< FAILURE!
02:27:46 [2020-09-24T06:27:46.818Z] java.lang.AssertionError: expected null, but was:<org.eclipse.ease.ScriptExecutionException: Engine got terminated>
02:27:46 [2020-09-24T06:27:46.818Z] 	at org.eclipse.ease.lang.python.py4j.ShellModeEngineTest.callModuleCode(ShellModeEngineTest.java:46)
02:27:46 [2020-09-24T06:27:46.818Z] 
02:27:46 [2020-09-24T06:27:46.818Z] callModuleCode(org.eclipse.ease.lang.python.py4j.ShellModeEngineTest)  Time elapsed: 10.027 s  <<< FAILURE!
02:27:46 [2020-09-24T06:27:46.818Z] java.lang.AssertionError
02:27:46 [2020-09-24T06:27:46.818Z] 
02:27:46 [2020-09-24T06:27:46.818Z] print_NoNewline(org.eclipse.ease.lang.python.py4j.ShellModeEngineTest) skipped
02:27:46 [2020-09-24T06:27:46.818Z] incompleteStatement(org.eclipse.ease.lang.python.py4j.ShellModeEngineTest)  Time elapsed: 10.025 s  <<< FAILURE!
02:27:46 [2020-09-24T06:27:46.818Z] java.lang.AssertionError: expected null, but was:<org.eclipse.ease.ScriptExecutionException: Engine got terminated>
02:27:46 [2020-09-24T06:27:46.818Z] 	at org.eclipse.ease.lang.python.py4j.ShellModeEngineTest.incompleteStatement(ShellModeEngineTest.java:92)
02:27:46 [2020-09-24T06:27:46.818Z] 
02:27:46 [2020-09-24T06:27:46.818Z] incompleteStatement(org.eclipse.ease.lang.python.py4j.ShellModeEngineTest)  Time elapsed: 10.025 s  <<< FAILURE!
02:27:46 [2020-09-24T06:27:46.818Z] java.lang.AssertionError
02:27:46 [2020-09-24T06:27:46.818Z] 
02:27:46 [2020-09-24T06:27:46.818Z] multiLineStatement(org.eclipse.ease.lang.python.py4j.ShellModeEngineTest)  Time elapsed: 10.025 s  <<< FAILURE!
02:27:46 [2020-09-24T06:27:46.818Z] java.lang.AssertionError: expected null, but was:<org.eclipse.ease.ScriptExecutionException: Engine got terminated>
02:27:46 [2020-09-24T06:27:46.818Z] 	at org.eclipse.ease.lang.python.py4j.ShellModeEngineTest.multiLineStatement(ShellModeEngineTest.java:97)
02:27:46 [2020-09-24T06:27:46.818Z] 
02:27:46 [2020-09-24T06:27:46.818Z] multiLineStatement(org.eclipse.ease.lang.python.py4j.ShellModeEngineTest)  Time elapsed: 10.025 s  <<< FAILURE!
02:27:46 [2020-09-24T06:27:46.818Z] java.lang.AssertionError
02:27:46 [2020-09-24T06:27:46.818Z] 
02:27:46 [2020-09-24T06:27:46.818Z] runtimeError(org.eclipse.ease.lang.python.py4j.ShellModeEngineTest)  Time elapsed: 10.023 s  <<< FAILURE!
02:27:46 [2020-09-24T06:27:46.818Z] java.lang.AssertionError: 
02:27:46 [2020-09-24T06:27:46.818Z] 
02:27:46 [2020-09-24T06:27:46.818Z] Expected: a string containing "NameError"
02:27:46 [2020-09-24T06:27:46.818Z]      but: was ""
02:27:46 [2020-09-24T06:27:46.818Z] 	at org.eclipse.ease.lang.python.py4j.ShellModeEngineTest.runtimeError(ShellModeEngineTest.java:118)
02:27:46 [2020-09-24T06:27:46.818Z] 
02:27:46 [2020-09-24T06:27:46.818Z] runtimeError(org.eclipse.ease.lang.python.py4j.ShellModeEngineTest)  Time elapsed: 10.023 s  <<< FAILURE!
02:27:46 [2020-09-24T06:27:46.818Z] java.lang.AssertionError
02:27:46 [2020-09-24T06:27:46.818Z] 
02:27:46 [2020-09-24T06:27:46.818Z] javaIntArray(org.eclipse.ease.lang.python.py4j.ShellModeEngineTest)  Time elapsed: 30.002 s  <<< ERROR!
02:27:46 [2020-09-24T06:27:46.818Z] org.junit.runners.model.TestTimedOutException: test timed out after 30000 milliseconds
02:27:46 [2020-09-24T06:27:46.818Z] 	at org.eclipse.ease.lang.python.py4j.ShellModeEngineTest.executeCode(ShellModeEngineTest.java:36)
02:27:46 [2020-09-24T06:27:46.818Z] 
02:27:46 [2020-09-24T06:27:46.818Z] javaDoubleArray(org.eclipse.ease.lang.python.py4j.ShellModeEngineTest)  Time elapsed: 10.029 s  <<< FAILURE!
02:27:46 [2020-09-24T06:27:46.818Z] java.lang.AssertionError: expected null, but was:<org.eclipse.ease.ScriptExecutionException: Engine got terminated>
02:27:46 [2020-09-24T06:27:46.818Z] 	at org.eclipse.ease.lang.python.py4j.ShellModeEngineTest.executeCode(ShellModeEngineTest.java:38)
02:27:46 [2020-09-24T06:27:46.818Z] 
02:27:46 [2020-09-24T06:27:46.818Z] javaDoubleArray(org.eclipse.ease.lang.python.py4j.ShellModeEngineTest)  Time elapsed: 10.029 s  <<< FAILURE!
02:27:46 [2020-09-24T06:27:46.818Z] java.lang.AssertionError
02:27:46 [2020-09-24T06:27:46.818Z] 
02:27:46 [2020-09-24T06:27:46.818Z] pythonSet(org.eclipse.ease.lang.python.py4j.ShellModeEngineTest)  Time elapsed: 10.024 s  <<< FAILURE!
02:27:46 [2020-09-24T06:27:46.818Z] java.lang.AssertionError: expected null, but was:<org.eclipse.ease.ScriptExecutionException: Engine got terminated>
02:27:46 [2020-09-24T06:27:46.818Z] 	at org.eclipse.ease.lang.python.py4j.ShellModeEngineTest.executeCode(ShellModeEngineTest.java:38)
02:27:46 [2020-09-24T06:27:46.818Z] 
02:27:46 [2020-09-24T06:27:46.818Z] pythonSet(org.eclipse.ease.lang.python.py4j.ShellModeEngineTest)  Time elapsed: 10.024 s  <<< FAILURE!
02:27:46 [2020-09-24T06:27:46.818Z] java.lang.AssertionError
02:27:46 [2020-09-24T06:27:46.818Z] 
02:27:46 [2020-09-24T06:27:46.818Z] javaStringArray(org.eclipse.ease.lang.python.py4j.ShellModeEngineTest)  Time elapsed: 30.002 s  <<< ERROR!
02:27:46 [2020-09-24T06:27:46.818Z] org.junit.runners.model.TestTimedOutException: test timed out after 30000 milliseconds
02:27:46 [2020-09-24T06:27:46.818Z] 	at org.eclipse.ease.lang.python.py4j.ShellModeEngineTest.executeCode(ShellModeEngineTest.java:36)
02:27:46 [2020-09-24T06:27:46.818Z] 
02:27:46 [2020-09-24T06:27:46.818Z] javaShortArray(org.eclipse.ease.lang.python.py4j.ShellModeEngineTest)  Time elapsed: 10.023 s  <<< FAILURE!
02:27:46 [2020-09-24T06:27:46.818Z] java.lang.AssertionError: expected null, but was:<org.eclipse.ease.ScriptExecutionException: Engine got terminated>
02:27:46 [2020-09-24T06:27:46.818Z] 	at org.eclipse.ease.lang.python.py4j.ShellModeEngineTest.executeCode(ShellModeEngineTest.java:38)
02:27:46 [2020-09-24T06:27:46.818Z] 
02:27:46 [2020-09-24T06:27:46.818Z] javaShortArray(org.eclipse.ease.lang.python.py4j.ShellModeEngineTest)  Time elapsed: 10.023 s  <<< FAILURE!
02:27:46 [2020-09-24T06:27:46.818Z] java.lang.AssertionError
02:27:46 [2020-09-24T06:27:46.818Z] 
02:27:46 [2020-09-24T06:27:46.818Z] javaBooleanArray(org.eclipse.ease.lang.python.py4j.ShellModeEngineTest)  Time elapsed: 10.022 s  <<< FAILURE!
02:27:46 [2020-09-24T06:27:46.818Z] java.lang.AssertionError
02:27:46 [2020-09-24T06:27:46.818Z] 
02:27:46 [2020-09-24T06:27:46.818Z] javaObjectArray(org.eclipse.ease.lang.python.py4j.ShellModeEngineTest)  Time elapsed: 10.024 s  <<< FAILURE!
02:27:46 [2020-09-24T06:27:46.818Z] java.lang.AssertionError: expected null, but was:<org.eclipse.ease.ScriptExecutionException: Engine got terminated>
02:27:46 [2020-09-24T06:27:46.818Z] 	at org.eclipse.ease.lang.python.py4j.ShellModeEngineTest.executeCode(ShellModeEngineTest.java:38)
02:27:46 [2020-09-24T06:27:46.818Z] 
02:27:46 [2020-09-24T06:27:46.818Z] javaObjectArray(org.eclipse.ease.lang.python.py4j.ShellModeEngineTest)  Time elapsed: 10.024 s  <<< FAILURE!
02:27:46 [2020-09-24T06:27:46.818Z] java.lang.AssertionError
02:27:46 [2020-09-24T06:27:46.818Z] 
02:27:46 [2020-09-24T06:27:46.818Z] javaIntegerArray(org.eclipse.ease.lang.python.py4j.ShellModeEngineTest)  Time elapsed: 10.023 s  <<< FAILURE!
02:27:46 [2020-09-24T06:27:46.818Z] java.lang.AssertionError: expected null, but was:<org.eclipse.ease.ScriptExecutionException: Engine got terminated>
02:27:46 [2020-09-24T06:27:46.818Z] 	at org.eclipse.ease.lang.python.py4j.ShellModeEngineTest.executeCode(ShellModeEngineTest.java:38)
02:27:46 [2020-09-24T06:27:46.818Z] 
02:27:46 [2020-09-24T06:27:46.818Z] javaIntegerArray(org.eclipse.ease.lang.python.py4j.ShellModeEngineTest)  Time elapsed: 10.023 s  <<< FAILURE!
02:27:46 [2020-09-24T06:27:46.818Z] java.lang.AssertionError
02:27:46 [2020-09-24T06:27:46.818Z] 
02:27:46 [2020-09-24T06:27:46.818Z] javaInteger(org.eclipse.ease.lang.python.py4j.ShellModeEngineTest)  Time elapsed: 10.028 s  <<< FAILURE!
02:27:46 [2020-09-24T06:27:46.818Z] java.lang.AssertionError: expected null, but was:<org.eclipse.ease.ScriptExecutionException: Engine got terminated>
02:27:46 [2020-09-24T06:27:46.818Z] 	at org.eclipse.ease.lang.python.py4j.ShellModeEngineTest.executeCode(ShellModeEngineTest.java:38)
02:27:46 [2020-09-24T06:27:46.818Z] 
02:27:46 [2020-09-24T06:27:46.818Z] javaInteger(org.eclipse.ease.lang.python.py4j.ShellModeEngineTest)  Time elapsed: 10.028 s  <<< FAILURE!
02:27:46 [2020-09-24T06:27:46.818Z] java.lang.AssertionError
02:27:46 [2020-09-24T06:27:46.818Z] 
02:27:46 [2020-09-24T06:27:46.818Z] javaString(org.eclipse.ease.lang.python.py4j.ShellModeEngineTest)  Time elapsed: 10.026 s  <<< FAILURE!
02:27:46 [2020-09-24T06:27:46.818Z] java.lang.AssertionError: expected null, but was:<org.eclipse.ease.ScriptExecutionException: Engine got terminated>
02:27:46 [2020-09-24T06:27:46.818Z] 	at org.eclipse.ease.lang.python.py4j.ShellModeEngineTest.executeCode(ShellModeEngineTest.java:38)
02:27:46 [2020-09-24T06:27:46.818Z] 
02:27:46 [2020-09-24T06:27:46.818Z] javaString(org.eclipse.ease.lang.python.py4j.ShellModeEngineTest)  Time elapsed: 10.026 s  <<< FAILURE!
02:27:46 [2020-09-24T06:27:46.818Z] java.lang.AssertionError
02:27:46 [2020-09-24T06:27:46.818Z] 
02:27:46 [2020-09-24T06:27:46.818Z] javaByteArray(org.eclipse.ease.lang.python.py4j.ShellModeEngineTest)  Time elapsed: 10.029 s  <<< FAILURE!
02:27:46 [2020-09-24T06:27:46.819Z] java.lang.AssertionError: expected null, but was:<org.eclipse.ease.ScriptExecutionException: Engine got terminated>
02:27:46 [2020-09-24T06:27:46.819Z] 	at org.eclipse.ease.lang.python.py4j.ShellModeEngineTest.executeCode(ShellModeEngineTest.java:38)
02:27:46 [2020-09-24T06:27:46.819Z] 
02:27:46 [2020-09-24T06:27:46.819Z] javaByteArray(org.eclipse.ease.lang.python.py4j.ShellModeEngineTest)  Time elapsed: 10.029 s  <<< FAILURE!
02:27:46 [2020-09-24T06:27:46.819Z] java.lang.AssertionError
02:27:46 [2020-09-24T06:27:46.819Z] 
02:27:46 [2020-09-24T06:27:46.819Z] createEclipseClass(org.eclipse.ease.lang.python.py4j.ShellModeEngineTest)  Time elapsed: 10.022 s  <<< FAILURE!
02:27:46 [2020-09-24T06:27:46.819Z] java.lang.AssertionError: expected null, but was:<org.eclipse.ease.ScriptExecutionException: Engine got terminated>
02:27:46 [2020-09-24T06:27:46.819Z] 	at org.eclipse.ease.lang.python.py4j.ShellModeEngineTest.executeCode(ShellModeEngineTest.java:38)
02:27:46 [2020-09-24T06:27:46.819Z] 
02:27:46 [2020-09-24T06:27:46.819Z] createEclipseClass(org.eclipse.ease.lang.python.py4j.ShellModeEngineTest)  Time elapsed: 10.022 s  <<< FAILURE!
02:27:46 [2020-09-24T06:27:46.819Z] java.lang.AssertionError
02:27:46 [2020-09-24T06:27:46.819Z] 
02:27:46 [2020-09-24T06:27:46.819Z] pythonString(org.eclipse.ease.lang.python.py4j.ShellModeEngineTest)  Time elapsed: 10.022 s  <<< FAILURE!
02:27:46 [2020-09-24T06:27:46.819Z] java.lang.AssertionError: expected null, but was:<org.eclipse.ease.ScriptExecutionException: Engine got terminated>
02:27:46 [2020-09-24T06:27:46.819Z] 	at org.eclipse.ease.lang.python.py4j.ShellModeEngineTest.executeCode(ShellModeEngineTest.java:38)
02:27:46 [2020-09-24T06:27:46.819Z] 
02:27:46 [2020-09-24T06:27:46.819Z] pythonString(org.eclipse.ease.lang.python.py4j.ShellModeEngineTest)  Time elapsed: 10.022 s  <<< FAILURE!
02:27:46 [2020-09-24T06:27:46.819Z] java.lang.AssertionError
02:27:46 [2020-09-24T06:27:46.819Z] 
02:27:46 [2020-09-24T06:27:46.819Z] varargs(org.eclipse.ease.lang.python.py4j.ShellModeEngineTest)  Time elapsed: 10.027 s  <<< FAILURE!
02:27:46 [2020-09-24T06:27:46.819Z] java.lang.AssertionError: expected null, but was:<org.eclipse.ease.ScriptExecutionException: Engine got terminated>
02:27:46 [2020-09-24T06:27:46.819Z] 	at org.eclipse.ease.lang.python.py4j.ShellModeEngineTest.executeCode(ShellModeEngineTest.java:38)
02:27:46 [2020-09-24T06:27:46.819Z] 
02:27:46 [2020-09-24T06:27:46.819Z] varargs(org.eclipse.ease.lang.python.py4j.ShellModeEngineTest)  Time elapsed: 10.027 s  <<< FAILURE!
02:27:46 [2020-09-24T06:27:46.819Z] java.lang.AssertionError
02:27:46 [2020-09-24T06:27:46.819Z] 
02:27:46 [2020-09-24T06:27:46.819Z] createJavaType(org.eclipse.ease.lang.python.py4j.ShellModeEngineTest)  Time elapsed: 10.021 s  <<< FAILURE!
02:27:46 [2020-09-24T06:27:46.819Z] java.lang.AssertionError: expected null, but was:<org.eclipse.ease.ScriptExecutionException: Engine got terminated>
02:27:46 [2020-09-24T06:27:46.819Z] 	at org.eclipse.ease.lang.python.py4j.ShellModeEngineTest.executeCode(ShellModeEngineTest.java:38)
02:27:46 [2020-09-24T06:27:46.819Z] 
02:27:46 [2020-09-24T06:27:46.819Z] createJavaType(org.eclipse.ease.lang.python.py4j.ShellModeEngineTest)  Time elapsed: 10.021 s  <<< FAILURE!
02:27:46 [2020-09-24T06:27:46.819Z] java.lang.AssertionError
02:27:46 [2020-09-24T06:27:46.819Z] 
02:27:46 [2020-09-24T06:27:46.819Z] javaFloatArray(org.eclipse.ease.lang.python.py4j.ShellModeEngineTest)  Time elapsed: 10.025 s  <<< FAILURE!
02:27:46 [2020-09-24T06:27:46.819Z] java.lang.AssertionError: expected null, but was:<org.eclipse.ease.ScriptExecutionException: Engine got terminated>
02:27:46 [2020-09-24T06:27:46.819Z] 	at org.eclipse.ease.lang.python.py4j.ShellModeEngineTest.executeCode(ShellModeEngineTest.java:38)
02:27:46 [2020-09-24T06:27:46.819Z] 
02:27:46 [2020-09-24T06:27:46.819Z] javaFloatArray(org.eclipse.ease.lang.python.py4j.ShellModeEngineTest)  Time elapsed: 10.025 s  <<< FAILURE!
02:27:46 [2020-09-24T06:27:46.819Z] java.lang.AssertionError
02:27:46 [2020-09-24T06:27:46.819Z] 
02:27:46 [2020-09-24T06:27:46.819Z] implementJavaInterface(org.eclipse.ease.lang.python.py4j.ShellModeEngineTest)  Time elapsed: 30.002 s  <<< ERROR!
02:27:46 [2020-09-24T06:27:46.819Z] org.junit.runners.model.TestTimedOutException: test timed out after 30000 milliseconds
02:27:46 [2020-09-24T06:27:46.819Z] 	at org.eclipse.ease.lang.python.py4j.ShellModeEngineTest.executeCode(ShellModeEngineTest.java:31)
02:27:46 [2020-09-24T06:27:46.819Z] 
02:27:46 [2020-09-24T06:27:46.819Z] pythonDict(org.eclipse.ease.lang.python.py4j.ShellModeEngineTest)  Time elapsed: 10.029 s  <<< FAILURE!
02:27:46 [2020-09-24T06:27:46.819Z] java.lang.AssertionError: expected null, but was:<org.eclipse.ease.ScriptExecutionException: Engine got terminated>
02:27:46 [2020-09-24T06:27:46.819Z] 	at org.eclipse.ease.lang.python.py4j.ShellModeEngineTest.executeCode(ShellModeEngineTest.java:38)
02:27:46 [2020-09-24T06:27:46.819Z] 
02:27:46 [2020-09-24T06:27:46.819Z] pythonDict(org.eclipse.ease.lang.python.py4j.ShellModeEngineTest)  Time elapsed: 10.029 s  <<< FAILURE!
02:27:46 [2020-09-24T06:27:46.819Z] java.lang.AssertionError
02:27:46 [2020-09-24T06:27:46.819Z] 
02:27:46 [2020-09-24T06:27:46.819Z] pythonList(org.eclipse.ease.lang.python.py4j.ShellModeEngineTest)  Time elapsed: 10.022 s  <<< FAILURE!
02:27:46 [2020-09-24T06:27:46.819Z] java.lang.AssertionError: expected null, but was:<org.eclipse.ease.ScriptExecutionException: Engine got terminated>
02:27:46 [2020-09-24T06:27:46.819Z] 	at org.eclipse.ease.lang.python.py4j.ShellModeEngineTest.executeCode(ShellModeEngineTest.java:38)
02:27:46 [2020-09-24T06:27:46.819Z] 
02:27:46 [2020-09-24T06:27:46.819Z] pythonList(org.eclipse.ease.lang.python.py4j.ShellModeEngineTest)  Time elapsed: 10.022 s  <<< FAILURE!
02:27:46 [2020-09-24T06:27:46.819Z] java.lang.AssertionError
02:27:46 [2020-09-24T06:27:46.819Z] 
02:27:46 [2020-09-24T06:27:46.819Z] testMultiple(org.eclipse.ease.lang.python.py4j.ShellModeEngineTest)  Time elapsed: 10.023 s  <<< FAILURE!
02:27:46 [2020-09-24T06:27:46.819Z] java.lang.AssertionError: expected null, but was:<org.eclipse.ease.ScriptExecutionException: Engine got terminated>
02:27:46 [2020-09-24T06:27:46.819Z] 	at org.eclipse.ease.lang.python.py4j.ShellModeEngineTest.executeCode(ShellModeEngineTest.java:38)
02:27:46 [2020-09-24T06:27:46.819Z] 
02:27:46 [2020-09-24T06:27:46.819Z] testMultiple(org.eclipse.ease.lang.python.py4j.ShellModeEngineTest)  Time elapsed: 10.023 s  <<< FAILURE!
02:27:46 [2020-09-24T06:27:46.819Z] java.lang.AssertionError
02:27:46 [2020-09-24T06:27:46.819Z] 
02:27:46 [2020-09-24T06:27:46.819Z] javaLongArray(org.eclipse.ease.lang.python.py4j.ShellModeEngineTest)  Time elapsed: 30.003 s  <<< ERROR!
02:27:46 [2020-09-24T06:27:46.819Z] org.junit.runners.model.TestTimedOutException: test timed out after 30000 milliseconds
02:27:46 [2020-09-24T06:27:46.819Z] 
02:27:46 [2020-09-24T06:27:46.819Z] createPythonObject(org.eclipse.ease.lang.python.py4j.ShellModeEngineTest)  Time elapsed: 10.028 s  <<< FAILURE!
02:27:46 [2020-09-24T06:27:46.819Z] java.lang.AssertionError: expected null, but was:<org.eclipse.ease.ScriptExecutionException: Engine got terminated>
02:27:46 [2020-09-24T06:27:46.819Z] 
02:27:46 [2020-09-24T06:27:46.819Z] createPythonObject(org.eclipse.ease.lang.python.py4j.ShellModeEngineTest)  Time elapsed: 10.028 s  <<< FAILURE!
02:27:46 [2020-09-24T06:27:46.819Z] java.lang.AssertionError
02:27:46 [2020-09-24T06:27:46.819Z] 
02:27:46 [2020-09-24T06:27:46.819Z] pythonInteger(org.eclipse.ease.lang.python.py4j.ShellModeEngineTest)  Time elapsed: 10.023 s  <<< FAILURE!
02:27:46 [2020-09-24T06:27:46.819Z] java.lang.AssertionError: expected null, but was:<org.eclipse.ease.ScriptExecutionException: Engine got terminated>
02:27:46 [2020-09-24T06:27:46.819Z] 	at org.eclipse.ease.lang.python.py4j.ShellModeEngineTest.executeCode(ShellModeEngineTest.java:38)
02:27:46 [2020-09-24T06:27:46.819Z] 
02:27:46 [2020-09-24T06:27:46.819Z] pythonInteger(org.eclipse.ease.lang.python.py4j.ShellModeEngineTest)  Time elapsed: 10.023 s  <<< FAILURE!
02:27:46 [2020-09-24T06:27:46.819Z] java.lang.AssertionError
02:27:46 [2020-09-24T06:27:46.819Z] 
02:27:46 [2020-09-24T06:27:46.819Z] Running org.eclipse.ease.lang.python.py4j.Py4JEngineTest
02:27:46 [2020-09-24T06:27:46.819Z] Tests run: 3, Failures: 0, Errors: 0, Skipped: 3, Time elapsed: 0.001 s - in org.eclipse.ease.lang.python.py4j.Py4JEngineTest
02:27:46 [2020-09-24T06:27:46.819Z] print(org.eclipse.ease.lang.python.py4j.Py4JEngineTest) skipped
02:27:46 [2020-09-24T06:27:46.819Z] mixedMode(org.eclipse.ease.lang.python.py4j.Py4JEngineTest) skipped
02:27:46 [2020-09-24T06:27:46.819Z] cleanShutdown(org.eclipse.ease.lang.python.py4j.Py4JEngineTest) skipped
02:27:46 [2020-09-24T06:27:46.819Z] Running org.eclipse.ease.lang.python.py4j.Py4jDebugTest
02:27:46 [2020-09-24T06:27:46.819Z] WARNING: An illegal reflective access operation has occurred
02:27:46 [2020-09-24T06:27:46.819Z] WARNING: Illegal reflective access by org.mockito.cglib.core.ReflectUtils$2 (file:/home/jenkins/.m2/repository/p2/osgi/bundle/org.mockito/1.9.5.v201605172210/org.mockito-1.9.5.v201605172210.jar) to method java.lang.ClassLoader.defineClass(java.lang.String,byte[],int,int,java.security.ProtectionDomain)
02:27:46 [2020-09-24T06:27:46.819Z] WARNING: Please consider reporting this to the maintainers of org.mockito.cglib.core.ReflectUtils$2
02:27:46 [2020-09-24T06:27:46.819Z] WARNING: Use --illegal-access=warn to enable warnings of further illegal reflective access operations
02:27:46 [2020-09-24T06:27:46.820Z] WARNING: All illegal access operations will be denied in a future release
Aborted by Christian Pontesegger
02:56:52 [2020-09-24T06:56:52.189Z] Sending interrupt signal to process
02:56:53 [2020-09-24T06:56:53.851Z] [INFO] ------------------------------------------------------------------------
02:56:53 [2020-09-24T06:56:53.851Z] [INFO] Reactor Summary:
02:56:53 [2020-09-24T06:56:53.851Z] [INFO] 
02:56:53 [2020-09-24T06:56:53.851Z] [INFO] org.eclipse.ease.releng 0.8.0-SNAPSHOT ............. SUCCESS [  4.025 s]
02:56:53 [2020-09-24T06:56:53.851Z] [INFO] org.eclipse.ease.classloader 0.8.0-SNAPSHOT ........ SUCCESS [  7.696 s]
02:56:53 [2020-09-24T06:56:53.851Z] [INFO] org.eclipse.ease 0.8.0-SNAPSHOT .................... SUCCESS [  3.886 s]
02:56:53 [2020-09-24T06:56:53.851Z] [INFO] org.eclipse.ease.ui 0.8.0-SNAPSHOT ................. SUCCESS [  3.423 s]
02:56:53 [2020-09-24T06:56:53.851Z] [INFO] org.eclipse.ease.ui.completions.java 0.8.0-SNAPSHOT  SUCCESS [  2.188 s]
02:56:53 [2020-09-24T06:56:53.851Z] [INFO] org.eclipse.ease.ui.scripts 0.8.0-SNAPSHOT ......... SUCCESS [  2.707 s]
02:56:53 [2020-09-24T06:56:53.851Z] [INFO] org.eclipse.ease.lang.javascript 0.8.0-SNAPSHOT .... SUCCESS [  2.318 s]
02:56:53 [2020-09-24T06:56:53.851Z] [INFO] org.eclipse.ease.lang.scriptarchive 0.8.0-SNAPSHOT . SUCCESS [  1.985 s]
02:56:53 [2020-09-24T06:56:53.851Z] [INFO] org.eclipse.ease.lang.python 0.8.0-SNAPSHOT ........ SUCCESS [  2.290 s]
02:56:53 [2020-09-24T06:56:53.851Z] [INFO] org.eclipse.ease.lang.python.py4j 0.8.0-SNAPSHOT ... SUCCESS [  1.977 s]
02:56:53 [2020-09-24T06:56:53.851Z] [INFO] org.eclipse.ease.lang.groovy 0.8.0-SNAPSHOT ........ SUCCESS [  1.646 s]
02:56:53 [2020-09-24T06:56:53.851Z] [INFO] org.eclipse.ease.lang.groovy.interpreter 0.8.0-SNAPSHOT SUCCESS [  1.705 s]
02:56:53 [2020-09-24T06:56:53.851Z] [INFO] org.eclipse.ease.lang.unittest 0.8.0-SNAPSHOT ...... SUCCESS [  2.577 s]
02:56:53 [2020-09-24T06:56:53.851Z] [INFO] org.eclipse.ease.lang.unittest.ui 0.8.0-SNAPSHOT ... SUCCESS [  2.298 s]
02:56:53 [2020-09-24T06:56:53.851Z] [INFO] org.eclipse.ease.lang.ruby 0.8.0-SNAPSHOT .......... SUCCESS [  1.706 s]
02:56:53 [2020-09-24T06:56:53.851Z] [INFO] org.eclipse.ease.lang.ruby.jruby 0.8.0-SNAPSHOT .... SUCCESS [  1.727 s]
02:56:53 [2020-09-24T06:56:53.851Z] [INFO] org.eclipse.ease.lang.javascript.nashorn 0.8.0-SNAPSHOT SUCCESS [  1.726 s]
02:56:53 [2020-09-24T06:56:53.851Z] [INFO] org.eclipse.ease.lang.javascript.rhino 0.8.0-SNAPSHOT SUCCESS [  2.030 s]
02:56:53 [2020-09-24T06:56:53.851Z] [INFO] org.eclipse.ease.lang.python.jython 0.8.0-SNAPSHOT . SUCCESS [  1.797 s]
02:56:53 [2020-09-24T06:56:53.851Z] [INFO] org.eclipse.ease.lang.javascript.ui 0.8.0-SNAPSHOT . SUCCESS [  1.861 s]
02:56:53 [2020-09-24T06:56:53.851Z] [INFO] org.eclipse.ease.lang.jvm.compiled 0.8.0-SNAPSHOT .. SUCCESS [  1.721 s]
02:56:53 [2020-09-24T06:56:53.851Z] [INFO] org.eclipse.ease.lang.scriptarchive.ui 0.8.0-SNAPSHOT SUCCESS [  1.710 s]
02:56:53 [2020-09-24T06:56:53.852Z] [INFO] org.eclipse.ease.help 0.8.0-SNAPSHOT ............... SUCCESS [  6.755 s]
02:56:53 [2020-09-24T06:56:53.852Z] [INFO] org.eclipse.ease.feature 0.8.0-SNAPSHOT ............ SUCCESS [  0.140 s]
02:56:53 [2020-09-24T06:56:53.852Z] [INFO] org.eclipse.ease.ui.feature 0.8.0-SNAPSHOT ......... SUCCESS [  0.120 s]
02:56:53 [2020-09-24T06:56:53.852Z] [INFO] org.eclipse.ease.lang.javascript.feature 0.8.0-SNAPSHOT SUCCESS [  0.087 s]
02:56:53 [2020-09-24T06:56:53.852Z] [INFO] org.eclipse.ease.lang.python.feature 0.8.0-SNAPSHOT  SUCCESS [  0.099 s]
02:56:53 [2020-09-24T06:56:53.852Z] [INFO] org.eclipse.ease.python.jython.feature 0.8.0-SNAPSHOT SUCCESS [  0.116 s]
02:56:53 [2020-09-24T06:56:53.852Z] [INFO] org.eclipse.ease.lang.python.py4j.feature 0.8.0-SNAPSHOT SUCCESS [  0.077 s]
02:56:53 [2020-09-24T06:56:53.852Z] [INFO] org.eclipse.ease.lang.jvm.feature 0.8.0-SNAPSHOT ... SUCCESS [  0.091 s]
02:56:53 [2020-09-24T06:56:53.852Z] [INFO] org.eclipse.ease.lang.groovy.feature 0.8.0-SNAPSHOT  SUCCESS [  0.082 s]
02:56:53 [2020-09-24T06:56:53.852Z] [INFO] org.eclipse.ease.lang.ruby.feature 0.8.0-SNAPSHOT .. SUCCESS [  0.089 s]
02:56:53 [2020-09-24T06:56:53.852Z] [INFO] org.eclipse.ease.lang.scriptarchive.feature 0.8.0-SNAPSHOT SUCCESS [  0.113 s]
02:56:53 [2020-09-24T06:56:53.852Z] [INFO] org.eclipse.ease.lang.unittest.feature 0.8.0-SNAPSHOT SUCCESS [  0.091 s]
02:56:53 [2020-09-24T06:56:53.852Z] [INFO] org.eclipse.ease.releng.target 0.8.0-SNAPSHOT ...... SUCCESS [  0.007 s]
02:56:53 [2020-09-24T06:56:53.852Z] [INFO] org.eclipse.ease.releng.p2 0.8.0-SNAPSHOT .......... SUCCESS [  3.327 s]
02:56:53 [2020-09-24T06:56:53.852Z] [INFO] org.eclipse.ease.testhelper 0.8.0-SNAPSHOT ......... SUCCESS [  1.787 s]
02:56:53 [2020-09-24T06:56:53.852Z] [INFO] org.eclipse.ease.test 0.8.0-SNAPSHOT ............... SUCCESS [ 18.156 s]
02:56:53 [2020-09-24T06:56:53.852Z] [INFO] org.eclipse.ease.lang.javascript.nashorn.test 0.8.0-SNAPSHOT SUCCESS [  4.795 s]
02:56:53 [2020-09-24T06:56:53.852Z] [INFO] org.eclipse.ease.lang.javascript.rhino.test 0.8.0-SNAPSHOT SUCCESS [ 15.851 s]
02:56:53 [2020-09-24T06:56:53.852Z] [INFO] org.eclipse.ease.lang.javascript.test 0.8.0-SNAPSHOT SUCCESS [  3.961 s]
02:56:53 [2020-09-24T06:56:53.852Z] [INFO] org.eclipse.ease.lang.python.test 0.8.0-SNAPSHOT ... SUCCESS [  3.917 s]
02:56:53 [2020-09-24T06:56:53.852Z] [INFO] org.eclipse.ease.lang.python.jython.test 0.8.0-SNAPSHOT SUCCESS [ 17.110 s]
02:56:53 [2020-09-24T06:56:53.852Z] [INFO] org.eclipse.ease.lang.python.py4j.test 0.8.0-SNAPSHOT FAILURE [40:52 min]
02:56:53 [2020-09-24T06:56:53.852Z] [INFO] org.eclipse.ease.lang.scriptarchive.test 0.8.0-SNAPSHOT SKIPPED
02:56:53 [2020-09-24T06:56:53.852Z] [INFO] org.eclipse.ease.lang.unittest.test 0.8.0-SNAPSHOT . SKIPPED
02:56:53 [2020-09-24T06:56:53.852Z] [INFO] org.eclipse.ease.ui.test 0.8.0-SNAPSHOT ............ SKIPPED
02:56:53 [2020-09-24T06:56:53.852Z] [INFO] EASE (Incubation) 0.4.0-SNAPSHOT ................... SKIPPED
02:56:53 [2020-09-24T06:56:53.852Z] [INFO] ------------------------------------------------------------------------
02:56:53 [2020-09-24T06:56:53.852Z] [INFO] BUILD FAILURE
02:56:53 [2020-09-24T06:56:53.852Z] [INFO] ------------------------------------------------------------------------
02:56:53 [2020-09-24T06:56:53.852Z] [INFO] Total time:  45:22 min
02:56:53 [2020-09-24T06:56:53.852Z] [INFO] Finished at: 2020-09-24T06:56:52Z
02:56:53 [2020-09-24T06:56:53.852Z] [INFO] ------------------------------------------------------------------------
02:56:53 [2020-09-24T06:56:53.852Z] [INFO] [jenkins-event-spy] Generated /home/jenkins/agent/workspace/ease.verify.core.gerrit@tmp/withMaven32a4fffd/maven-spy-20200924-061130-126149779743238503266.log
02:56:53 [2020-09-24T06:56:53.852Z] [ERROR] Failed to execute goal org.eclipse.tycho:tycho-surefire-plugin:1.5.0:test (default-test) on project org.eclipse.ease.lang.python.py4j.test: An unexpected error occured while launching the test runtime (return code 143). See log /home/jenkins/agent/workspace/ease.verify.core.gerrit/tests/org.eclipse.ease.lang.python.py4j.test/target/work/data/.metadata/.log for details. -> [Help 1]
02:56:53 [2020-09-24T06:56:53.852Z] [ERROR] 
02:56:53 [2020-09-24T06:56:53.852Z] [ERROR] To see the full stack trace of the errors, re-run Maven with the -e switch.
02:56:53 [2020-09-24T06:56:53.852Z] [ERROR] Re-run Maven using the -X switch to enable full debug logging.
02:56:53 [2020-09-24T06:56:53.852Z] [ERROR] 
02:56:53 [2020-09-24T06:56:53.852Z] [ERROR] For more information about the errors and possible solutions, please read the following articles:
02:56:53 [2020-09-24T06:56:53.852Z] [ERROR] [Help 1] http://cwiki.apache.org/confluence/display/MAVEN/MojoFailureException
02:56:53 [2020-09-24T06:56:53.852Z] [ERROR] 
02:56:53 [2020-09-24T06:56:53.852Z] [ERROR] After correcting the problems, you can resume the build with the command
02:56:53 [2020-09-24T06:56:53.852Z] [ERROR]   mvn <args> -rf :org.eclipse.ease.lang.python.py4j.test
02:56:53 [2020-09-24T06:56:53.855Z] script returned exit code 143
[Pipeline] }
02:56:55 [2020-09-24T06:56:55.682Z] [withMaven] Publishers: Pipeline Graph Publisher: 49 ms, Invoker Publisher: 2 ms, Junit Publisher: 1 ms, Concordion Publisher: 1 ms, Dependencies Fingerprint Publisher: 1619 ms, Findbugs Publisher: 1 ms
[Pipeline] // withMaven
[Pipeline] }
[Pipeline] // stage
[Pipeline] }
02:56:55 [2020-09-24T06:56:55.744Z] Failed in branch EASE Core
[Pipeline] // parallel
[Pipeline] }
[Pipeline] // stage
[Pipeline] }
[Pipeline] // timeout
[Pipeline] }
[Pipeline] // timestamps
[Pipeline] }
[Pipeline] // node
[Pipeline] End of Pipeline
Finished: ABORTED