AbortedConsole Output

Skipping 18,543 KB.. Full Log
2T19:53:53.566Z] 	... 3 more
15:53:53 [2020-09-22T19:53:53.566Z] Caused by: java.io.IOException: error=2, No such file or directory
15:53:53 [2020-09-22T19:53:53.566Z] 	at java.base/java.lang.ProcessImpl.forkAndExec(Native Method)
15:53:53 [2020-09-22T19:53:53.566Z] 	at java.base/java.lang.ProcessImpl.<init>(ProcessImpl.java:340)
15:53:53 [2020-09-22T19:53:53.566Z] 	at java.base/java.lang.ProcessImpl.start(ProcessImpl.java:271)
15:53:53 [2020-09-22T19:53:53.566Z] 	at java.base/java.lang.ProcessBuilder.start(ProcessBuilder.java:1107)
15:53:53 [2020-09-22T19:53:53.566Z] 	... 6 more
15:53:53 [2020-09-22T19:53:53.566Z] 
15:53:53 [2020-09-22T19:53:53.566Z] !ENTRY org.eclipse.ease 4 0 2020-09-22 19:53:53.204
15:53:53 [2020-09-22T19:53:53.566Z] !MESSAGE Could not setup script engine
15:53:53 [2020-09-22T19:53:53.566Z] !STACK 0
15:53:53 [2020-09-22T19:53:53.566Z] org.eclipse.ease.ScriptEngineException: Failed to start Python process. Please check the setting for the Python interpreter in Preferences -> Scripting -> Python Scripting:
15:53:53 [2020-09-22T19:53:53.566Z] Cannot run program "python": error=2, No such file or directory
15:53:53 [2020-09-22T19:53:53.566Z] 	at org.eclipse.ease.lang.python.py4j.internal.Py4jScriptEngine.setupEngine(Py4jScriptEngine.java:139)
15:53:53 [2020-09-22T19:53:53.566Z] 	at org.eclipse.ease.AbstractScriptEngine.setupRun(AbstractScriptEngine.java:298)
15:53:53 [2020-09-22T19:53:53.566Z] 	at org.eclipse.ease.AbstractScriptEngine.run(AbstractScriptEngine.java:264)
15:53:53 [2020-09-22T19:53:53.566Z] 	at org.eclipse.core.internal.jobs.Worker.run(Worker.java:63)
15:53:53 [2020-09-22T19:53:53.566Z] Caused by: java.io.IOException: Cannot run program "python": error=2, No such file or directory
15:53:53 [2020-09-22T19:53:53.566Z] 	at java.base/java.lang.ProcessBuilder.start(ProcessBuilder.java:1128)
15:53:53 [2020-09-22T19:53:53.566Z] 	at java.base/java.lang.ProcessBuilder.start(ProcessBuilder.java:1071)
15:53:53 [2020-09-22T19:53:53.566Z] 	at org.eclipse.ease.lang.python.py4j.internal.Py4jScriptEngine.startPythonProcess(Py4jScriptEngine.java:179)
15:53:53 [2020-09-22T19:53:53.566Z] 	at org.eclipse.ease.lang.python.py4j.internal.Py4jScriptEngine.setupEngine(Py4jScriptEngine.java:122)
15:53:53 [2020-09-22T19:53:53.566Z] 	... 3 more
15:53:53 [2020-09-22T19:53:53.566Z] Caused by: java.io.IOException: error=2, No such file or directory
15:53:53 [2020-09-22T19:53:53.566Z] 	at java.base/java.lang.ProcessImpl.forkAndExec(Native Method)
15:53:53 [2020-09-22T19:53:53.566Z] 	at java.base/java.lang.ProcessImpl.<init>(ProcessImpl.java:340)
15:53:53 [2020-09-22T19:53:53.566Z] 	at java.base/java.lang.ProcessImpl.start(ProcessImpl.java:271)
15:53:53 [2020-09-22T19:53:53.566Z] 	at java.base/java.lang.ProcessBuilder.start(ProcessBuilder.java:1107)
15:53:53 [2020-09-22T19:53:53.566Z] 	... 6 more
15:54:03 [2020-09-22T19:54:03.505Z] 
15:54:03 [2020-09-22T19:54:03.505Z] Finished test: runtimeError(org.eclipse.ease.lang.python.py4j.ShellModeEngineTest)
15:54:03 [2020-09-22T19:54:03.505Z] ----------------------------------------------
15:54:03 [2020-09-22T19:54:03.505Z] ----------------------------------------------
15:54:03 [2020-09-22T19:54:03.505Z] Starting test: javaIntArray(org.eclipse.ease.lang.python.py4j.ShellModeEngineTest)
15:54:03 [2020-09-22T19:54:03.505Z] 
15:54:03 [2020-09-22T19:54:03.505Z] !ENTRY org.eclipse.ease 4 0 2020-09-22 19:54:03.228
15:54:03 [2020-09-22T19:54:03.505Z] !MESSAGE Could not setup script engine
15:54:03 [2020-09-22T19:54:03.505Z] !STACK 0
15:54:03 [2020-09-22T19:54:03.505Z] org.eclipse.ease.ScriptEngineException: Failed to start Python process. Please check the setting for the Python interpreter in Preferences -> Scripting -> Python Scripting:
15:54:03 [2020-09-22T19:54:03.505Z] Cannot run program "python": error=2, No such file or directory
15:54:03 [2020-09-22T19:54:03.505Z] 	at org.eclipse.ease.lang.python.py4j.internal.Py4jScriptEngine.setupEngine(Py4jScriptEngine.java:139)
15:54:03 [2020-09-22T19:54:03.505Z] 	at org.eclipse.ease.AbstractScriptEngine.setupRun(AbstractScriptEngine.java:298)
15:54:03 [2020-09-22T19:54:03.505Z] 	at org.eclipse.ease.AbstractScriptEngine.run(AbstractScriptEngine.java:264)
15:54:03 [2020-09-22T19:54:03.505Z] 	at org.eclipse.core.internal.jobs.Worker.run(Worker.java:63)
15:54:03 [2020-09-22T19:54:03.505Z] Caused by: java.io.IOException: Cannot run program "python": error=2, No such file or directory
15:54:03 [2020-09-22T19:54:03.505Z] 	at java.base/java.lang.ProcessBuilder.start(ProcessBuilder.java:1128)
15:54:03 [2020-09-22T19:54:03.505Z] 	at java.base/java.lang.ProcessBuilder.start(ProcessBuilder.java:1071)
15:54:03 [2020-09-22T19:54:03.505Z] 	at org.eclipse.ease.lang.python.py4j.internal.Py4jScriptEngine.startPythonProcess(Py4jScriptEngine.java:179)
15:54:03 [2020-09-22T19:54:03.505Z] 	at org.eclipse.ease.lang.python.py4j.internal.Py4jScriptEngine.setupEngine(Py4jScriptEngine.java:122)
15:54:03 [2020-09-22T19:54:03.505Z] 	... 3 more
15:54:03 [2020-09-22T19:54:03.505Z] Caused by: java.io.IOException: error=2, No such file or directory
15:54:03 [2020-09-22T19:54:03.505Z] 	at java.base/java.lang.ProcessImpl.forkAndExec(Native Method)
15:54:03 [2020-09-22T19:54:03.505Z] 	at java.base/java.lang.ProcessImpl.<init>(ProcessImpl.java:340)
15:54:03 [2020-09-22T19:54:03.505Z] 	at java.base/java.lang.ProcessImpl.start(ProcessImpl.java:271)
15:54:03 [2020-09-22T19:54:03.505Z] 	at java.base/java.lang.ProcessBuilder.start(ProcessBuilder.java:1107)
15:54:03 [2020-09-22T19:54:03.505Z] 	... 6 more
15:54:03 [2020-09-22T19:54:03.505Z] 
15:54:03 [2020-09-22T19:54:03.505Z] !ENTRY org.eclipse.ease 4 0 2020-09-22 19:54:03.229
15:54:03 [2020-09-22T19:54:03.505Z] !MESSAGE Could not setup script engine
15:54:03 [2020-09-22T19:54:03.505Z] !STACK 0
15:54:03 [2020-09-22T19:54:03.505Z] org.eclipse.ease.ScriptEngineException: Failed to start Python process. Please check the setting for the Python interpreter in Preferences -> Scripting -> Python Scripting:
15:54:03 [2020-09-22T19:54:03.505Z] Cannot run program "python": error=2, No such file or directory
15:54:03 [2020-09-22T19:54:03.505Z] 	at org.eclipse.ease.lang.python.py4j.internal.Py4jScriptEngine.setupEngine(Py4jScriptEngine.java:139)
15:54:03 [2020-09-22T19:54:03.505Z] 	at org.eclipse.ease.AbstractScriptEngine.setupRun(AbstractScriptEngine.java:298)
15:54:03 [2020-09-22T19:54:03.505Z] 	at org.eclipse.ease.AbstractScriptEngine.run(AbstractScriptEngine.java:264)
15:54:03 [2020-09-22T19:54:03.505Z] 	at org.eclipse.core.internal.jobs.Worker.run(Worker.java:63)
15:54:03 [2020-09-22T19:54:03.505Z] Caused by: java.io.IOException: Cannot run program "python": error=2, No such file or directory
15:54:03 [2020-09-22T19:54:03.505Z] 	at java.base/java.lang.ProcessBuilder.start(ProcessBuilder.java:1128)
15:54:03 [2020-09-22T19:54:03.505Z] 	at java.base/java.lang.ProcessBuilder.start(ProcessBuilder.java:1071)
15:54:03 [2020-09-22T19:54:03.505Z] 	at org.eclipse.ease.lang.python.py4j.internal.Py4jScriptEngine.startPythonProcess(Py4jScriptEngine.java:179)
15:54:03 [2020-09-22T19:54:03.505Z] 	at org.eclipse.ease.lang.python.py4j.internal.Py4jScriptEngine.setupEngine(Py4jScriptEngine.java:122)
15:54:03 [2020-09-22T19:54:03.505Z] 	... 3 more
15:54:03 [2020-09-22T19:54:03.505Z] Caused by: java.io.IOException: error=2, No such file or directory
15:54:03 [2020-09-22T19:54:03.506Z] 	at java.base/java.lang.ProcessImpl.forkAndExec(Native Method)
15:54:03 [2020-09-22T19:54:03.506Z] 	at java.base/java.lang.ProcessImpl.<init>(ProcessImpl.java:340)
15:54:03 [2020-09-22T19:54:03.506Z] 	at java.base/java.lang.ProcessImpl.start(ProcessImpl.java:271)
15:54:03 [2020-09-22T19:54:03.506Z] 	at java.base/java.lang.ProcessBuilder.start(ProcessBuilder.java:1107)
15:54:03 [2020-09-22T19:54:03.506Z] 	... 6 more
15:54:13 [2020-09-22T19:54:13.448Z] 
15:54:13 [2020-09-22T19:54:13.448Z] Finished test: javaIntArray(org.eclipse.ease.lang.python.py4j.ShellModeEngineTest)
15:54:13 [2020-09-22T19:54:13.448Z] ----------------------------------------------
15:54:13 [2020-09-22T19:54:13.448Z] ----------------------------------------------
15:54:13 [2020-09-22T19:54:13.448Z] Starting test: javaDoubleArray(org.eclipse.ease.lang.python.py4j.ShellModeEngineTest)
15:54:13 [2020-09-22T19:54:13.448Z] 
15:54:13 [2020-09-22T19:54:13.448Z] !ENTRY org.eclipse.ease 4 0 2020-09-22 19:54:13.256
15:54:13 [2020-09-22T19:54:13.448Z] !MESSAGE Could not setup script engine
15:54:13 [2020-09-22T19:54:13.448Z] !STACK 0
15:54:13 [2020-09-22T19:54:13.448Z] org.eclipse.ease.ScriptEngineException: Failed to start Python process. Please check the setting for the Python interpreter in Preferences -> Scripting -> Python Scripting:
15:54:13 [2020-09-22T19:54:13.448Z] Cannot run program "python": error=2, No such file or directory
15:54:13 [2020-09-22T19:54:13.448Z] 	at org.eclipse.ease.lang.python.py4j.internal.Py4jScriptEngine.setupEngine(Py4jScriptEngine.java:139)
15:54:13 [2020-09-22T19:54:13.448Z] 	at org.eclipse.ease.AbstractScriptEngine.setupRun(AbstractScriptEngine.java:298)
15:54:13 [2020-09-22T19:54:13.448Z] 	at org.eclipse.ease.AbstractScriptEngine.run(AbstractScriptEngine.java:264)
15:54:13 [2020-09-22T19:54:13.448Z] 	at org.eclipse.core.internal.jobs.Worker.run(Worker.java:63)
15:54:13 [2020-09-22T19:54:13.448Z] Caused by: java.io.IOException: Cannot run program "python": error=2, No such file or directory
15:54:13 [2020-09-22T19:54:13.448Z] 	at java.base/java.lang.ProcessBuilder.start(ProcessBuilder.java:1128)
15:54:13 [2020-09-22T19:54:13.448Z] 	at java.base/java.lang.ProcessBuilder.start(ProcessBuilder.java:1071)
15:54:13 [2020-09-22T19:54:13.448Z] 	at org.eclipse.ease.lang.python.py4j.internal.Py4jScriptEngine.startPythonProcess(Py4jScriptEngine.java:179)
15:54:13 [2020-09-22T19:54:13.448Z] 	at org.eclipse.ease.lang.python.py4j.internal.Py4jScriptEngine.setupEngine(Py4jScriptEngine.java:122)
15:54:13 [2020-09-22T19:54:13.448Z] 	... 3 more
15:54:13 [2020-09-22T19:54:13.448Z] Caused by: java.io.IOException: error=2, No such file or directory
15:54:13 [2020-09-22T19:54:13.448Z] 	at java.base/java.lang.ProcessImpl.forkAndExec(Native Method)
15:54:13 [2020-09-22T19:54:13.448Z] 	at java.base/java.lang.ProcessImpl.<init>(ProcessImpl.java:340)
15:54:13 [2020-09-22T19:54:13.448Z] 	at java.base/java.lang.ProcessImpl.start(ProcessImpl.java:271)
15:54:13 [2020-09-22T19:54:13.448Z] 	at java.base/java.lang.ProcessBuilder.start(ProcessBuilder.java:1107)
15:54:13 [2020-09-22T19:54:13.448Z] 	... 6 more
15:54:13 [2020-09-22T19:54:13.448Z] 
15:54:13 [2020-09-22T19:54:13.448Z] !ENTRY org.eclipse.ease 4 0 2020-09-22 19:54:13.257
15:54:13 [2020-09-22T19:54:13.448Z] !MESSAGE Could not setup script engine
15:54:13 [2020-09-22T19:54:13.448Z] !STACK 0
15:54:13 [2020-09-22T19:54:13.448Z] org.eclipse.ease.ScriptEngineException: Failed to start Python process. Please check the setting for the Python interpreter in Preferences -> Scripting -> Python Scripting:
15:54:13 [2020-09-22T19:54:13.448Z] Cannot run program "python": error=2, No such file or directory
15:54:13 [2020-09-22T19:54:13.448Z] 	at org.eclipse.ease.lang.python.py4j.internal.Py4jScriptEngine.setupEngine(Py4jScriptEngine.java:139)
15:54:13 [2020-09-22T19:54:13.448Z] 	at org.eclipse.ease.AbstractScriptEngine.setupRun(AbstractScriptEngine.java:298)
15:54:13 [2020-09-22T19:54:13.448Z] 	at org.eclipse.ease.AbstractScriptEngine.run(AbstractScriptEngine.java:264)
15:54:13 [2020-09-22T19:54:13.448Z] 	at org.eclipse.core.internal.jobs.Worker.run(Worker.java:63)
15:54:13 [2020-09-22T19:54:13.448Z] Caused by: java.io.IOException: Cannot run program "python": error=2, No such file or directory
15:54:13 [2020-09-22T19:54:13.448Z] 	at java.base/java.lang.ProcessBuilder.start(ProcessBuilder.java:1128)
15:54:13 [2020-09-22T19:54:13.448Z] 	at java.base/java.lang.ProcessBuilder.start(ProcessBuilder.java:1071)
15:54:13 [2020-09-22T19:54:13.448Z] 	at org.eclipse.ease.lang.python.py4j.internal.Py4jScriptEngine.startPythonProcess(Py4jScriptEngine.java:179)
15:54:13 [2020-09-22T19:54:13.448Z] 	at org.eclipse.ease.lang.python.py4j.internal.Py4jScriptEngine.setupEngine(Py4jScriptEngine.java:122)
15:54:13 [2020-09-22T19:54:13.448Z] 	... 3 more
15:54:13 [2020-09-22T19:54:13.448Z] Caused by: java.io.IOException: error=2, No such file or directory
15:54:13 [2020-09-22T19:54:13.448Z] 	at java.base/java.lang.ProcessImpl.forkAndExec(Native Method)
15:54:13 [2020-09-22T19:54:13.448Z] 	at java.base/java.lang.ProcessImpl.<init>(ProcessImpl.java:340)
15:54:13 [2020-09-22T19:54:13.448Z] 	at java.base/java.lang.ProcessImpl.start(ProcessImpl.java:271)
15:54:13 [2020-09-22T19:54:13.448Z] 	at java.base/java.lang.ProcessBuilder.start(ProcessBuilder.java:1107)
15:54:13 [2020-09-22T19:54:13.448Z] 	... 6 more
15:54:23 [2020-09-22T19:54:23.390Z] 
15:54:23 [2020-09-22T19:54:23.390Z] Finished test: javaDoubleArray(org.eclipse.ease.lang.python.py4j.ShellModeEngineTest)
15:54:23 [2020-09-22T19:54:23.390Z] ----------------------------------------------
15:54:23 [2020-09-22T19:54:23.390Z] ----------------------------------------------
15:54:23 [2020-09-22T19:54:23.390Z] Starting test: pythonSet(org.eclipse.ease.lang.python.py4j.ShellModeEngineTest)
15:54:23 [2020-09-22T19:54:23.390Z] 
15:54:23 [2020-09-22T19:54:23.390Z] !ENTRY org.eclipse.ease 4 0 2020-09-22 19:54:23.277
15:54:23 [2020-09-22T19:54:23.390Z] !MESSAGE Could not setup script engine
15:54:23 [2020-09-22T19:54:23.390Z] !STACK 0
15:54:23 [2020-09-22T19:54:23.390Z] org.eclipse.ease.ScriptEngineException: Failed to start Python process. Please check the setting for the Python interpreter in Preferences -> Scripting -> Python Scripting:
15:54:23 [2020-09-22T19:54:23.390Z] Cannot run program "python": error=2, No such file or directory
15:54:23 [2020-09-22T19:54:23.390Z] 	at org.eclipse.ease.lang.python.py4j.internal.Py4jScriptEngine.setupEngine(Py4jScriptEngine.java:139)
15:54:23 [2020-09-22T19:54:23.390Z] 	at org.eclipse.ease.AbstractScriptEngine.setupRun(AbstractScriptEngine.java:298)
15:54:23 [2020-09-22T19:54:23.390Z] 	at org.eclipse.ease.AbstractScriptEngine.run(AbstractScriptEngine.java:264)
15:54:23 [2020-09-22T19:54:23.390Z] 	at org.eclipse.core.internal.jobs.Worker.run(Worker.java:63)
15:54:23 [2020-09-22T19:54:23.390Z] Caused by: java.io.IOException: Cannot run program "python": error=2, No such file or directory
15:54:23 [2020-09-22T19:54:23.390Z] 	at java.base/java.lang.ProcessBuilder.start(ProcessBuilder.java:1128)
15:54:23 [2020-09-22T19:54:23.390Z] 	at java.base/java.lang.ProcessBuilder.start(ProcessBuilder.java:1071)
15:54:23 [2020-09-22T19:54:23.390Z] 	at org.eclipse.ease.lang.python.py4j.internal.Py4jScriptEngine.startPythonProcess(Py4jScriptEngine.java:179)
15:54:23 [2020-09-22T19:54:23.390Z] 	at org.eclipse.ease.lang.python.py4j.internal.Py4jScriptEngine.setupEngine(Py4jScriptEngine.java:122)
15:54:23 [2020-09-22T19:54:23.390Z] 	... 3 more
15:54:23 [2020-09-22T19:54:23.390Z] Caused by: java.io.IOException: error=2, No such file or directory
15:54:23 [2020-09-22T19:54:23.390Z] 	at java.base/java.lang.ProcessImpl.forkAndExec(Native Method)
15:54:23 [2020-09-22T19:54:23.390Z] 	at java.base/java.lang.ProcessImpl.<init>(ProcessImpl.java:340)
15:54:23 [2020-09-22T19:54:23.390Z] 	at java.base/java.lang.ProcessImpl.start(ProcessImpl.java:271)
15:54:23 [2020-09-22T19:54:23.390Z] 	at java.base/java.lang.ProcessBuilder.start(ProcessBuilder.java:1107)
15:54:23 [2020-09-22T19:54:23.390Z] 	... 6 more
15:54:23 [2020-09-22T19:54:23.390Z] 
15:54:23 [2020-09-22T19:54:23.390Z] !ENTRY org.eclipse.ease 4 0 2020-09-22 19:54:23.278
15:54:23 [2020-09-22T19:54:23.390Z] !MESSAGE Could not setup script engine
15:54:23 [2020-09-22T19:54:23.390Z] !STACK 0
15:54:23 [2020-09-22T19:54:23.390Z] org.eclipse.ease.ScriptEngineException: Failed to start Python process. Please check the setting for the Python interpreter in Preferences -> Scripting -> Python Scripting:
15:54:23 [2020-09-22T19:54:23.390Z] Cannot run program "python": error=2, No such file or directory
15:54:23 [2020-09-22T19:54:23.391Z] 	at org.eclipse.ease.lang.python.py4j.internal.Py4jScriptEngine.setupEngine(Py4jScriptEngine.java:139)
15:54:23 [2020-09-22T19:54:23.391Z] 	at org.eclipse.ease.AbstractScriptEngine.setupRun(AbstractScriptEngine.java:298)
15:54:23 [2020-09-22T19:54:23.391Z] 	at org.eclipse.ease.AbstractScriptEngine.run(AbstractScriptEngine.java:264)
15:54:23 [2020-09-22T19:54:23.391Z] 	at org.eclipse.core.internal.jobs.Worker.run(Worker.java:63)
15:54:23 [2020-09-22T19:54:23.391Z] Caused by: java.io.IOException: Cannot run program "python": error=2, No such file or directory
15:54:23 [2020-09-22T19:54:23.391Z] 	at java.base/java.lang.ProcessBuilder.start(ProcessBuilder.java:1128)
15:54:23 [2020-09-22T19:54:23.391Z] 	at java.base/java.lang.ProcessBuilder.start(ProcessBuilder.java:1071)
15:54:23 [2020-09-22T19:54:23.391Z] 	at org.eclipse.ease.lang.python.py4j.internal.Py4jScriptEngine.startPythonProcess(Py4jScriptEngine.java:179)
15:54:23 [2020-09-22T19:54:23.391Z] 	at org.eclipse.ease.lang.python.py4j.internal.Py4jScriptEngine.setupEngine(Py4jScriptEngine.java:122)
15:54:23 [2020-09-22T19:54:23.391Z] 	... 3 more
15:54:23 [2020-09-22T19:54:23.391Z] Caused by: java.io.IOException: error=2, No such file or directory
15:54:23 [2020-09-22T19:54:23.391Z] 	at java.base/java.lang.ProcessImpl.forkAndExec(Native Method)
15:54:23 [2020-09-22T19:54:23.391Z] 	at java.base/java.lang.ProcessImpl.<init>(ProcessImpl.java:340)
15:54:23 [2020-09-22T19:54:23.391Z] 	at java.base/java.lang.ProcessImpl.start(ProcessImpl.java:271)
15:54:23 [2020-09-22T19:54:23.391Z] 	at java.base/java.lang.ProcessBuilder.start(ProcessBuilder.java:1107)
15:54:23 [2020-09-22T19:54:23.391Z] 	... 6 more
15:54:33 [2020-09-22T19:54:33.334Z] 
15:54:33 [2020-09-22T19:54:33.334Z] Finished test: pythonSet(org.eclipse.ease.lang.python.py4j.ShellModeEngineTest)
15:54:33 [2020-09-22T19:54:33.334Z] ----------------------------------------------
15:54:33 [2020-09-22T19:54:33.334Z] ----------------------------------------------
15:54:33 [2020-09-22T19:54:33.334Z] Starting test: javaStringArray(org.eclipse.ease.lang.python.py4j.ShellModeEngineTest)
15:54:33 [2020-09-22T19:54:33.334Z] 
15:54:33 [2020-09-22T19:54:33.334Z] !ENTRY org.eclipse.ease 4 0 2020-09-22 19:54:33.302
15:54:33 [2020-09-22T19:54:33.334Z] !MESSAGE Could not setup script engine
15:54:33 [2020-09-22T19:54:33.334Z] !STACK 0
15:54:33 [2020-09-22T19:54:33.334Z] org.eclipse.ease.ScriptEngineException: Failed to start Python process. Please check the setting for the Python interpreter in Preferences -> Scripting -> Python Scripting:
15:54:33 [2020-09-22T19:54:33.334Z] Cannot run program "python": error=2, No such file or directory
15:54:33 [2020-09-22T19:54:33.334Z] 	at org.eclipse.ease.lang.python.py4j.internal.Py4jScriptEngine.setupEngine(Py4jScriptEngine.java:139)
15:54:33 [2020-09-22T19:54:33.334Z] 	at org.eclipse.ease.AbstractScriptEngine.setupRun(AbstractScriptEngine.java:298)
15:54:33 [2020-09-22T19:54:33.334Z] 	at org.eclipse.ease.AbstractScriptEngine.run(AbstractScriptEngine.java:264)
15:54:33 [2020-09-22T19:54:33.334Z] 	at org.eclipse.core.internal.jobs.Worker.run(Worker.java:63)
15:54:33 [2020-09-22T19:54:33.334Z] Caused by: java.io.IOException: Cannot run program "python": error=2, No such file or directory
15:54:33 [2020-09-22T19:54:33.334Z] 	at java.base/java.lang.ProcessBuilder.start(ProcessBuilder.java:1128)
15:54:33 [2020-09-22T19:54:33.334Z] 	at java.base/java.lang.ProcessBuilder.start(ProcessBuilder.java:1071)
15:54:33 [2020-09-22T19:54:33.334Z] 	at org.eclipse.ease.lang.python.py4j.internal.Py4jScriptEngine.startPythonProcess(Py4jScriptEngine.java:179)
15:54:33 [2020-09-22T19:54:33.334Z] 	at org.eclipse.ease.lang.python.py4j.internal.Py4jScriptEngine.setupEngine(Py4jScriptEngine.java:122)
15:54:33 [2020-09-22T19:54:33.334Z] 	... 3 more
15:54:33 [2020-09-22T19:54:33.334Z] Caused by: java.io.IOException: error=2, No such file or directory
15:54:33 [2020-09-22T19:54:33.334Z] 	at java.base/java.lang.ProcessImpl.forkAndExec(Native Method)
15:54:33 [2020-09-22T19:54:33.334Z] 	at java.base/java.lang.ProcessImpl.<init>(ProcessImpl.java:340)
15:54:33 [2020-09-22T19:54:33.334Z] 	at java.base/java.lang.ProcessImpl.start(ProcessImpl.java:271)
15:54:33 [2020-09-22T19:54:33.334Z] 	at java.base/java.lang.ProcessBuilder.start(ProcessBuilder.java:1107)
15:54:33 [2020-09-22T19:54:33.334Z] 	... 6 more
15:54:33 [2020-09-22T19:54:33.334Z] 
15:54:33 [2020-09-22T19:54:33.334Z] !ENTRY org.eclipse.ease 4 0 2020-09-22 19:54:33.303
15:54:33 [2020-09-22T19:54:33.334Z] !MESSAGE Could not setup script engine
15:54:33 [2020-09-22T19:54:33.334Z] !STACK 0
15:54:33 [2020-09-22T19:54:33.334Z] org.eclipse.ease.ScriptEngineException: Failed to start Python process. Please check the setting for the Python interpreter in Preferences -> Scripting -> Python Scripting:
15:54:33 [2020-09-22T19:54:33.334Z] Cannot run program "python": error=2, No such file or directory
15:54:33 [2020-09-22T19:54:33.334Z] 	at org.eclipse.ease.lang.python.py4j.internal.Py4jScriptEngine.setupEngine(Py4jScriptEngine.java:139)
15:54:33 [2020-09-22T19:54:33.334Z] 	at org.eclipse.ease.AbstractScriptEngine.setupRun(AbstractScriptEngine.java:298)
15:54:33 [2020-09-22T19:54:33.334Z] 	at org.eclipse.ease.AbstractScriptEngine.run(AbstractScriptEngine.java:264)
15:54:33 [2020-09-22T19:54:33.334Z] 	at org.eclipse.core.internal.jobs.Worker.run(Worker.java:63)
15:54:33 [2020-09-22T19:54:33.334Z] Caused by: java.io.IOException: Cannot run program "python": error=2, No such file or directory
15:54:33 [2020-09-22T19:54:33.334Z] 	at java.base/java.lang.ProcessBuilder.start(ProcessBuilder.java:1128)
15:54:33 [2020-09-22T19:54:33.334Z] 	at java.base/java.lang.ProcessBuilder.start(ProcessBuilder.java:1071)
15:54:33 [2020-09-22T19:54:33.334Z] 	at org.eclipse.ease.lang.python.py4j.internal.Py4jScriptEngine.startPythonProcess(Py4jScriptEngine.java:179)
15:54:33 [2020-09-22T19:54:33.334Z] 	at org.eclipse.ease.lang.python.py4j.internal.Py4jScriptEngine.setupEngine(Py4jScriptEngine.java:122)
15:54:33 [2020-09-22T19:54:33.334Z] 	... 3 more
15:54:33 [2020-09-22T19:54:33.334Z] Caused by: java.io.IOException: error=2, No such file or directory
15:54:33 [2020-09-22T19:54:33.334Z] 	at java.base/java.lang.ProcessImpl.forkAndExec(Native Method)
15:54:33 [2020-09-22T19:54:33.334Z] 	at java.base/java.lang.ProcessImpl.<init>(ProcessImpl.java:340)
15:54:33 [2020-09-22T19:54:33.334Z] 	at java.base/java.lang.ProcessImpl.start(ProcessImpl.java:271)
15:54:33 [2020-09-22T19:54:33.334Z] 	at java.base/java.lang.ProcessBuilder.start(ProcessBuilder.java:1107)
15:54:33 [2020-09-22T19:54:33.334Z] 	... 6 more
15:54:45 [2020-09-22T19:54:45.500Z] 
15:54:45 [2020-09-22T19:54:45.500Z] Finished test: javaStringArray(org.eclipse.ease.lang.python.py4j.ShellModeEngineTest)
15:54:45 [2020-09-22T19:54:45.500Z] ----------------------------------------------
15:54:45 [2020-09-22T19:54:45.500Z] ----------------------------------------------
15:54:45 [2020-09-22T19:54:45.500Z] Starting test: javaShortArray(org.eclipse.ease.lang.python.py4j.ShellModeEngineTest)
15:54:45 [2020-09-22T19:54:45.500Z] 
15:54:45 [2020-09-22T19:54:45.500Z] !ENTRY org.eclipse.ease 4 0 2020-09-22 19:54:43.324
15:54:45 [2020-09-22T19:54:45.500Z] !MESSAGE Could not setup script engine
15:54:45 [2020-09-22T19:54:45.500Z] !STACK 0
15:54:45 [2020-09-22T19:54:45.500Z] org.eclipse.ease.ScriptEngineException: Failed to start Python process. Please check the setting for the Python interpreter in Preferences -> Scripting -> Python Scripting:
15:54:45 [2020-09-22T19:54:45.500Z] Cannot run program "python": error=2, No such file or directory
15:54:45 [2020-09-22T19:54:45.500Z] 	at org.eclipse.ease.lang.python.py4j.internal.Py4jScriptEngine.setupEngine(Py4jScriptEngine.java:139)
15:54:45 [2020-09-22T19:54:45.500Z] 	at org.eclipse.ease.AbstractScriptEngine.setupRun(AbstractScriptEngine.java:298)
15:54:45 [2020-09-22T19:54:45.500Z] 	at org.eclipse.ease.AbstractScriptEngine.run(AbstractScriptEngine.java:264)
15:54:45 [2020-09-22T19:54:45.500Z] 	at org.eclipse.core.internal.jobs.Worker.run(Worker.java:63)
15:54:45 [2020-09-22T19:54:45.500Z] Caused by: java.io.IOException: Cannot run program "python": error=2, No such file or directory
15:54:45 [2020-09-22T19:54:45.500Z] 	at java.base/java.lang.ProcessBuilder.start(ProcessBuilder.java:1128)
15:54:45 [2020-09-22T19:54:45.500Z] 	at java.base/java.lang.ProcessBuilder.start(ProcessBuilder.java:1071)
15:54:45 [2020-09-22T19:54:45.500Z] 	at org.eclipse.ease.lang.python.py4j.internal.Py4jScriptEngine.startPythonProcess(Py4jScriptEngine.java:179)
15:54:45 [2020-09-22T19:54:45.500Z] 	at org.eclipse.ease.lang.python.py4j.internal.Py4jScriptEngine.setupEngine(Py4jScriptEngine.java:122)
15:54:45 [2020-09-22T19:54:45.500Z] 	... 3 more
15:54:45 [2020-09-22T19:54:45.500Z] Caused by: java.io.IOException: error=2, No such file or directory
15:54:45 [2020-09-22T19:54:45.500Z] 	at java.base/java.lang.ProcessImpl.forkAndExec(Native Method)
15:54:45 [2020-09-22T19:54:45.500Z] 	at java.base/java.lang.ProcessImpl.<init>(ProcessImpl.java:340)
15:54:45 [2020-09-22T19:54:45.500Z] 	at java.base/java.lang.ProcessImpl.start(ProcessImpl.java:271)
15:54:45 [2020-09-22T19:54:45.500Z] 	at java.base/java.lang.ProcessBuilder.start(ProcessBuilder.java:1107)
15:54:45 [2020-09-22T19:54:45.500Z] 	... 6 more
15:54:45 [2020-09-22T19:54:45.500Z] 
15:54:45 [2020-09-22T19:54:45.500Z] !ENTRY org.eclipse.ease 4 0 2020-09-22 19:54:43.325
15:54:45 [2020-09-22T19:54:45.500Z] !MESSAGE Could not setup script engine
15:54:45 [2020-09-22T19:54:45.500Z] !STACK 0
15:54:45 [2020-09-22T19:54:45.500Z] org.eclipse.ease.ScriptEngineException: Failed to start Python process. Please check the setting for the Python interpreter in Preferences -> Scripting -> Python Scripting:
15:54:45 [2020-09-22T19:54:45.500Z] Cannot run program "python": error=2, No such file or directory
15:54:45 [2020-09-22T19:54:45.500Z] 	at org.eclipse.ease.lang.python.py4j.internal.Py4jScriptEngine.setupEngine(Py4jScriptEngine.java:139)
15:54:45 [2020-09-22T19:54:45.500Z] 	at org.eclipse.ease.AbstractScriptEngine.setupRun(AbstractScriptEngine.java:298)
15:54:45 [2020-09-22T19:54:45.500Z] 	at org.eclipse.ease.AbstractScriptEngine.run(AbstractScriptEngine.java:264)
15:54:45 [2020-09-22T19:54:45.500Z] 	at org.eclipse.core.internal.jobs.Worker.run(Worker.java:63)
15:54:45 [2020-09-22T19:54:45.500Z] Caused by: java.io.IOException: Cannot run program "python": error=2, No such file or directory
15:54:45 [2020-09-22T19:54:45.500Z] 	at java.base/java.lang.ProcessBuilder.start(ProcessBuilder.java:1128)
15:54:45 [2020-09-22T19:54:45.500Z] 	at java.base/java.lang.ProcessBuilder.start(ProcessBuilder.java:1071)
15:54:45 [2020-09-22T19:54:45.500Z] 	at org.eclipse.ease.lang.python.py4j.internal.Py4jScriptEngine.startPythonProcess(Py4jScriptEngine.java:179)
15:54:45 [2020-09-22T19:54:45.500Z] 	at org.eclipse.ease.lang.python.py4j.internal.Py4jScriptEngine.setupEngine(Py4jScriptEngine.java:122)
15:54:45 [2020-09-22T19:54:45.500Z] 	... 3 more
15:54:45 [2020-09-22T19:54:45.500Z] Caused by: java.io.IOException: error=2, No such file or directory
15:54:45 [2020-09-22T19:54:45.500Z] 	at java.base/java.lang.ProcessImpl.forkAndExec(Native Method)
15:54:45 [2020-09-22T19:54:45.500Z] 	at java.base/java.lang.ProcessImpl.<init>(ProcessImpl.java:340)
15:54:45 [2020-09-22T19:54:45.500Z] 	at java.base/java.lang.ProcessImpl.start(ProcessImpl.java:271)
15:54:45 [2020-09-22T19:54:45.500Z] 	at java.base/java.lang.ProcessBuilder.start(ProcessBuilder.java:1107)
15:54:45 [2020-09-22T19:54:45.500Z] 	... 6 more
15:54:53 [2020-09-22T19:54:53.583Z] 
15:54:53 [2020-09-22T19:54:53.583Z] Finished test: javaShortArray(org.eclipse.ease.lang.python.py4j.ShellModeEngineTest)
15:54:53 [2020-09-22T19:54:53.583Z] ----------------------------------------------
15:54:53 [2020-09-22T19:54:53.583Z] ----------------------------------------------
15:54:53 [2020-09-22T19:54:53.583Z] Starting test: javaBooleanArray(org.eclipse.ease.lang.python.py4j.ShellModeEngineTest)
15:54:53 [2020-09-22T19:54:53.583Z] 
15:54:53 [2020-09-22T19:54:53.583Z] !ENTRY org.eclipse.ease 4 0 2020-09-22 19:54:53.349
15:54:53 [2020-09-22T19:54:53.583Z] !MESSAGE Could not setup script engine
15:54:53 [2020-09-22T19:54:53.583Z] !STACK 0
15:54:53 [2020-09-22T19:54:53.583Z] org.eclipse.ease.ScriptEngineException: Failed to start Python process. Please check the setting for the Python interpreter in Preferences -> Scripting -> Python Scripting:
15:54:53 [2020-09-22T19:54:53.583Z] Cannot run program "python": error=2, No such file or directory
15:54:53 [2020-09-22T19:54:53.583Z] 	at org.eclipse.ease.lang.python.py4j.internal.Py4jScriptEngine.setupEngine(Py4jScriptEngine.java:139)
15:54:53 [2020-09-22T19:54:53.583Z] 	at org.eclipse.ease.AbstractScriptEngine.setupRun(AbstractScriptEngine.java:298)
15:54:53 [2020-09-22T19:54:53.583Z] 	at org.eclipse.ease.AbstractScriptEngine.run(AbstractScriptEngine.java:264)
15:54:53 [2020-09-22T19:54:53.583Z] 	at org.eclipse.core.internal.jobs.Worker.run(Worker.java:63)
15:54:53 [2020-09-22T19:54:53.583Z] Caused by: java.io.IOException: Cannot run program "python": error=2, No such file or directory
15:54:53 [2020-09-22T19:54:53.583Z] 	at java.base/java.lang.ProcessBuilder.start(ProcessBuilder.java:1128)
15:54:53 [2020-09-22T19:54:53.583Z] 	at java.base/java.lang.ProcessBuilder.start(ProcessBuilder.java:1071)
15:54:53 [2020-09-22T19:54:53.583Z] 	at org.eclipse.ease.lang.python.py4j.internal.Py4jScriptEngine.startPythonProcess(Py4jScriptEngine.java:179)
15:54:53 [2020-09-22T19:54:53.583Z] 	at org.eclipse.ease.lang.python.py4j.internal.Py4jScriptEngine.setupEngine(Py4jScriptEngine.java:122)
15:54:53 [2020-09-22T19:54:53.583Z] 	... 3 more
15:54:53 [2020-09-22T19:54:53.583Z] Caused by: java.io.IOException: error=2, No such file or directory
15:54:53 [2020-09-22T19:54:53.583Z] 	at java.base/java.lang.ProcessImpl.forkAndExec(Native Method)
15:54:53 [2020-09-22T19:54:53.583Z] 	at java.base/java.lang.ProcessImpl.<init>(ProcessImpl.java:340)
15:54:53 [2020-09-22T19:54:53.583Z] 	at java.base/java.lang.ProcessImpl.start(ProcessImpl.java:271)
15:54:53 [2020-09-22T19:54:53.583Z] 	at java.base/java.lang.ProcessBuilder.start(ProcessBuilder.java:1107)
15:54:53 [2020-09-22T19:54:53.583Z] 	... 6 more
15:54:53 [2020-09-22T19:54:53.583Z] 
15:54:53 [2020-09-22T19:54:53.584Z] !ENTRY org.eclipse.ease 4 0 2020-09-22 19:54:53.350
15:54:53 [2020-09-22T19:54:53.584Z] !MESSAGE Could not setup script engine
15:54:53 [2020-09-22T19:54:53.584Z] !STACK 0
15:54:53 [2020-09-22T19:54:53.584Z] org.eclipse.ease.ScriptEngineException: Failed to start Python process. Please check the setting for the Python interpreter in Preferences -> Scripting -> Python Scripting:
15:54:53 [2020-09-22T19:54:53.584Z] Cannot run program "python": error=2, No such file or directory
15:54:53 [2020-09-22T19:54:53.584Z] 	at org.eclipse.ease.lang.python.py4j.internal.Py4jScriptEngine.setupEngine(Py4jScriptEngine.java:139)
15:54:53 [2020-09-22T19:54:53.584Z] 	at org.eclipse.ease.AbstractScriptEngine.setupRun(AbstractScriptEngine.java:298)
15:54:53 [2020-09-22T19:54:53.584Z] 	at org.eclipse.ease.AbstractScriptEngine.run(AbstractScriptEngine.java:264)
15:54:53 [2020-09-22T19:54:53.584Z] 	at org.eclipse.core.internal.jobs.Worker.run(Worker.java:63)
15:54:53 [2020-09-22T19:54:53.584Z] Caused by: java.io.IOException: Cannot run program "python": error=2, No such file or directory
15:54:53 [2020-09-22T19:54:53.584Z] 	at java.base/java.lang.ProcessBuilder.start(ProcessBuilder.java:1128)
15:54:53 [2020-09-22T19:54:53.584Z] 	at java.base/java.lang.ProcessBuilder.start(ProcessBuilder.java:1071)
15:54:53 [2020-09-22T19:54:53.584Z] 	at org.eclipse.ease.lang.python.py4j.internal.Py4jScriptEngine.startPythonProcess(Py4jScriptEngine.java:179)
15:54:53 [2020-09-22T19:54:53.584Z] 	at org.eclipse.ease.lang.python.py4j.internal.Py4jScriptEngine.setupEngine(Py4jScriptEngine.java:122)
15:54:53 [2020-09-22T19:54:53.584Z] 	... 3 more
15:54:53 [2020-09-22T19:54:53.584Z] Caused by: java.io.IOException: error=2, No such file or directory
15:54:53 [2020-09-22T19:54:53.584Z] 	at java.base/java.lang.ProcessImpl.forkAndExec(Native Method)
15:54:53 [2020-09-22T19:54:53.584Z] 	at java.base/java.lang.ProcessImpl.<init>(ProcessImpl.java:340)
15:54:53 [2020-09-22T19:54:53.584Z] 	at java.base/java.lang.ProcessImpl.start(ProcessImpl.java:271)
15:54:53 [2020-09-22T19:54:53.584Z] 	at java.base/java.lang.ProcessBuilder.start(ProcessBuilder.java:1107)
15:54:53 [2020-09-22T19:54:53.584Z] 	... 6 more
15:55:03 [2020-09-22T19:55:03.524Z] 
15:55:03 [2020-09-22T19:55:03.524Z] Finished test: javaBooleanArray(org.eclipse.ease.lang.python.py4j.ShellModeEngineTest)
15:55:03 [2020-09-22T19:55:03.524Z] ----------------------------------------------
15:55:03 [2020-09-22T19:55:03.524Z] ----------------------------------------------
15:55:03 [2020-09-22T19:55:03.524Z] Starting test: javaObjectArray(org.eclipse.ease.lang.python.py4j.ShellModeEngineTest)
15:55:03 [2020-09-22T19:55:03.524Z] 
15:55:03 [2020-09-22T19:55:03.524Z] !ENTRY org.eclipse.ease 4 0 2020-09-22 19:55:03.376
15:55:03 [2020-09-22T19:55:03.524Z] !MESSAGE Could not setup script engine
15:55:03 [2020-09-22T19:55:03.524Z] !STACK 0
15:55:03 [2020-09-22T19:55:03.524Z] org.eclipse.ease.ScriptEngineException: Failed to start Python process. Please check the setting for the Python interpreter in Preferences -> Scripting -> Python Scripting:
15:55:03 [2020-09-22T19:55:03.524Z] Cannot run program "python": error=2, No such file or directory
15:55:03 [2020-09-22T19:55:03.524Z] 	at org.eclipse.ease.lang.python.py4j.internal.Py4jScriptEngine.setupEngine(Py4jScriptEngine.java:139)
15:55:03 [2020-09-22T19:55:03.524Z] 	at org.eclipse.ease.AbstractScriptEngine.setupRun(AbstractScriptEngine.java:298)
15:55:03 [2020-09-22T19:55:03.524Z] 	at org.eclipse.ease.AbstractScriptEngine.run(AbstractScriptEngine.java:264)
15:55:03 [2020-09-22T19:55:03.524Z] 	at org.eclipse.core.internal.jobs.Worker.run(Worker.java:63)
15:55:03 [2020-09-22T19:55:03.524Z] Caused by: java.io.IOException: Cannot run program "python": error=2, No such file or directory
15:55:03 [2020-09-22T19:55:03.524Z] 	at java.base/java.lang.ProcessBuilder.start(ProcessBuilder.java:1128)
15:55:03 [2020-09-22T19:55:03.524Z] 	at java.base/java.lang.ProcessBuilder.start(ProcessBuilder.java:1071)
15:55:03 [2020-09-22T19:55:03.524Z] 	at org.eclipse.ease.lang.python.py4j.internal.Py4jScriptEngine.startPythonProcess(Py4jScriptEngine.java:179)
15:55:03 [2020-09-22T19:55:03.524Z] 	at org.eclipse.ease.lang.python.py4j.internal.Py4jScriptEngine.setupEngine(Py4jScriptEngine.java:122)
15:55:03 [2020-09-22T19:55:03.524Z] 	... 3 more
15:55:03 [2020-09-22T19:55:03.524Z] Caused by: java.io.IOException: error=2, No such file or directory
15:55:03 [2020-09-22T19:55:03.524Z] 	at java.base/java.lang.ProcessImpl.forkAndExec(Native Method)
15:55:03 [2020-09-22T19:55:03.524Z] 	at java.base/java.lang.ProcessImpl.<init>(ProcessImpl.java:340)
15:55:03 [2020-09-22T19:55:03.524Z] 	at java.base/java.lang.ProcessImpl.start(ProcessImpl.java:271)
15:55:03 [2020-09-22T19:55:03.524Z] 	at java.base/java.lang.ProcessBuilder.start(ProcessBuilder.java:1107)
15:55:03 [2020-09-22T19:55:03.524Z] 	... 6 more
15:55:03 [2020-09-22T19:55:03.524Z] 
15:55:03 [2020-09-22T19:55:03.524Z] !ENTRY org.eclipse.ease 4 0 2020-09-22 19:55:03.378
15:55:03 [2020-09-22T19:55:03.524Z] !MESSAGE Could not setup script engine
15:55:03 [2020-09-22T19:55:03.524Z] !STACK 0
15:55:03 [2020-09-22T19:55:03.524Z] org.eclipse.ease.ScriptEngineException: Failed to start Python process. Please check the setting for the Python interpreter in Preferences -> Scripting -> Python Scripting:
15:55:03 [2020-09-22T19:55:03.524Z] Cannot run program "python": error=2, No such file or directory
15:55:03 [2020-09-22T19:55:03.524Z] 	at org.eclipse.ease.lang.python.py4j.internal.Py4jScriptEngine.setupEngine(Py4jScriptEngine.java:139)
15:55:03 [2020-09-22T19:55:03.524Z] 	at org.eclipse.ease.AbstractScriptEngine.setupRun(AbstractScriptEngine.java:298)
15:55:03 [2020-09-22T19:55:03.525Z] 	at org.eclipse.ease.AbstractScriptEngine.run(AbstractScriptEngine.java:264)
15:55:03 [2020-09-22T19:55:03.525Z] 	at org.eclipse.core.internal.jobs.Worker.run(Worker.java:63)
15:55:03 [2020-09-22T19:55:03.525Z] Caused by: java.io.IOException: Cannot run program "python": error=2, No such file or directory
15:55:03 [2020-09-22T19:55:03.525Z] 	at java.base/java.lang.ProcessBuilder.start(ProcessBuilder.java:1128)
15:55:03 [2020-09-22T19:55:03.525Z] 	at java.base/java.lang.ProcessBuilder.start(ProcessBuilder.java:1071)
15:55:03 [2020-09-22T19:55:03.525Z] 	at org.eclipse.ease.lang.python.py4j.internal.Py4jScriptEngine.startPythonProcess(Py4jScriptEngine.java:179)
15:55:03 [2020-09-22T19:55:03.525Z] 	at org.eclipse.ease.lang.python.py4j.internal.Py4jScriptEngine.setupEngine(Py4jScriptEngine.java:122)
15:55:03 [2020-09-22T19:55:03.525Z] 	... 3 more
15:55:03 [2020-09-22T19:55:03.525Z] Caused by: java.io.IOException: error=2, No such file or directory
15:55:03 [2020-09-22T19:55:03.525Z] 	at java.base/java.lang.ProcessImpl.forkAndExec(Native Method)
15:55:03 [2020-09-22T19:55:03.525Z] 	at java.base/java.lang.ProcessImpl.<init>(ProcessImpl.java:340)
15:55:03 [2020-09-22T19:55:03.525Z] 	at java.base/java.lang.ProcessImpl.start(ProcessImpl.java:271)
15:55:03 [2020-09-22T19:55:03.525Z] 	at java.base/java.lang.ProcessBuilder.start(ProcessBuilder.java:1107)
15:55:03 [2020-09-22T19:55:03.525Z] 	... 6 more
15:55:13 [2020-09-22T19:55:13.469Z] 
15:55:13 [2020-09-22T19:55:13.469Z] Finished test: javaObjectArray(org.eclipse.ease.lang.python.py4j.ShellModeEngineTest)
15:55:13 [2020-09-22T19:55:13.469Z] ----------------------------------------------
15:55:13 [2020-09-22T19:55:13.469Z] ----------------------------------------------
15:55:13 [2020-09-22T19:55:13.469Z] Starting test: javaIntegerArray(org.eclipse.ease.lang.python.py4j.ShellModeEngineTest)
15:55:13 [2020-09-22T19:55:13.469Z] 
15:55:13 [2020-09-22T19:55:13.469Z] !ENTRY org.eclipse.ease 4 0 2020-09-22 19:55:13.399
15:55:13 [2020-09-22T19:55:13.469Z] !MESSAGE Could not setup script engine
15:55:13 [2020-09-22T19:55:13.470Z] !STACK 0
15:55:13 [2020-09-22T19:55:13.470Z] org.eclipse.ease.ScriptEngineException: Failed to start Python process. Please check the setting for the Python interpreter in Preferences -> Scripting -> Python Scripting:
15:55:13 [2020-09-22T19:55:13.470Z] Cannot run program "python": error=2, No such file or directory
15:55:13 [2020-09-22T19:55:13.470Z] 	at org.eclipse.ease.lang.python.py4j.internal.Py4jScriptEngine.setupEngine(Py4jScriptEngine.java:139)
15:55:13 [2020-09-22T19:55:13.470Z] 	at org.eclipse.ease.AbstractScriptEngine.setupRun(AbstractScriptEngine.java:298)
15:55:13 [2020-09-22T19:55:13.470Z] 	at org.eclipse.ease.AbstractScriptEngine.run(AbstractScriptEngine.java:264)
15:55:13 [2020-09-22T19:55:13.470Z] 	at org.eclipse.core.internal.jobs.Worker.run(Worker.java:63)
15:55:13 [2020-09-22T19:55:13.470Z] Caused by: java.io.IOException: Cannot run program "python": error=2, No such file or directory
15:55:13 [2020-09-22T19:55:13.470Z] 	at java.base/java.lang.ProcessBuilder.start(ProcessBuilder.java:1128)
15:55:13 [2020-09-22T19:55:13.470Z] 	at java.base/java.lang.ProcessBuilder.start(ProcessBuilder.java:1071)
15:55:13 [2020-09-22T19:55:13.470Z] 	at org.eclipse.ease.lang.python.py4j.internal.Py4jScriptEngine.startPythonProcess(Py4jScriptEngine.java:179)
15:55:13 [2020-09-22T19:55:13.470Z] 	at org.eclipse.ease.lang.python.py4j.internal.Py4jScriptEngine.setupEngine(Py4jScriptEngine.java:122)
15:55:13 [2020-09-22T19:55:13.470Z] 	... 3 more
15:55:13 [2020-09-22T19:55:13.470Z] Caused by: java.io.IOException: error=2, No such file or directory
15:55:13 [2020-09-22T19:55:13.470Z] 	at java.base/java.lang.ProcessImpl.forkAndExec(Native Method)
15:55:13 [2020-09-22T19:55:13.470Z] 	at java.base/java.lang.ProcessImpl.<init>(ProcessImpl.java:340)
15:55:13 [2020-09-22T19:55:13.470Z] 	at java.base/java.lang.ProcessImpl.start(ProcessImpl.java:271)
15:55:13 [2020-09-22T19:55:13.470Z] 	at java.base/java.lang.ProcessBuilder.start(ProcessBuilder.java:1107)
15:55:13 [2020-09-22T19:55:13.470Z] 	... 6 more
15:55:13 [2020-09-22T19:55:13.470Z] 
15:55:13 [2020-09-22T19:55:13.470Z] !ENTRY org.eclipse.ease 4 0 2020-09-22 19:55:13.400
15:55:13 [2020-09-22T19:55:13.470Z] !MESSAGE Could not setup script engine
15:55:13 [2020-09-22T19:55:13.470Z] !STACK 0
15:55:13 [2020-09-22T19:55:13.470Z] org.eclipse.ease.ScriptEngineException: Failed to start Python process. Please check the setting for the Python interpreter in Preferences -> Scripting -> Python Scripting:
15:55:13 [2020-09-22T19:55:13.470Z] Cannot run program "python": error=2, No such file or directory
15:55:13 [2020-09-22T19:55:13.470Z] 	at org.eclipse.ease.lang.python.py4j.internal.Py4jScriptEngine.setupEngine(Py4jScriptEngine.java:139)
15:55:13 [2020-09-22T19:55:13.470Z] 	at org.eclipse.ease.AbstractScriptEngine.setupRun(AbstractScriptEngine.java:298)
15:55:13 [2020-09-22T19:55:13.470Z] 	at org.eclipse.ease.AbstractScriptEngine.run(AbstractScriptEngine.java:264)
15:55:13 [2020-09-22T19:55:13.470Z] 	at org.eclipse.core.internal.jobs.Worker.run(Worker.java:63)
15:55:13 [2020-09-22T19:55:13.470Z] Caused by: java.io.IOException: Cannot run program "python": error=2, No such file or directory
15:55:13 [2020-09-22T19:55:13.470Z] 	at java.base/java.lang.ProcessBuilder.start(ProcessBuilder.java:1128)
15:55:13 [2020-09-22T19:55:13.470Z] 	at java.base/java.lang.ProcessBuilder.start(ProcessBuilder.java:1071)
15:55:13 [2020-09-22T19:55:13.470Z] 	at org.eclipse.ease.lang.python.py4j.internal.Py4jScriptEngine.startPythonProcess(Py4jScriptEngine.java:179)
15:55:13 [2020-09-22T19:55:13.470Z] 	at org.eclipse.ease.lang.python.py4j.internal.Py4jScriptEngine.setupEngine(Py4jScriptEngine.java:122)
15:55:13 [2020-09-22T19:55:13.470Z] 	... 3 more
15:55:13 [2020-09-22T19:55:13.470Z] Caused by: java.io.IOException: error=2, No such file or directory
15:55:13 [2020-09-22T19:55:13.470Z] 	at java.base/java.lang.ProcessImpl.forkAndExec(Native Method)
15:55:13 [2020-09-22T19:55:13.470Z] 	at java.base/java.lang.ProcessImpl.<init>(ProcessImpl.java:340)
15:55:13 [2020-09-22T19:55:13.470Z] 	at java.base/java.lang.ProcessImpl.start(ProcessImpl.java:271)
15:55:13 [2020-09-22T19:55:13.470Z] 	at java.base/java.lang.ProcessBuilder.start(ProcessBuilder.java:1107)
15:55:13 [2020-09-22T19:55:13.470Z] 	... 6 more
15:55:25 [2020-09-22T19:55:25.639Z] 
15:55:25 [2020-09-22T19:55:25.639Z] Finished test: javaIntegerArray(org.eclipse.ease.lang.python.py4j.ShellModeEngineTest)
15:55:25 [2020-09-22T19:55:25.639Z] ----------------------------------------------
15:55:25 [2020-09-22T19:55:25.639Z] ----------------------------------------------
15:55:25 [2020-09-22T19:55:25.639Z] Starting test: javaInteger(org.eclipse.ease.lang.python.py4j.ShellModeEngineTest)
15:55:25 [2020-09-22T19:55:25.639Z] 
15:55:25 [2020-09-22T19:55:25.639Z] !ENTRY org.eclipse.ease 4 0 2020-09-22 19:55:23.424
15:55:25 [2020-09-22T19:55:25.639Z] !MESSAGE Could not setup script engine
15:55:25 [2020-09-22T19:55:25.639Z] !STACK 0
15:55:25 [2020-09-22T19:55:25.639Z] org.eclipse.ease.ScriptEngineException: Failed to start Python process. Please check the setting for the Python interpreter in Preferences -> Scripting -> Python Scripting:
15:55:25 [2020-09-22T19:55:25.639Z] Cannot run program "python": error=2, No such file or directory
15:55:25 [2020-09-22T19:55:25.639Z] 	at org.eclipse.ease.lang.python.py4j.internal.Py4jScriptEngine.setupEngine(Py4jScriptEngine.java:139)
15:55:25 [2020-09-22T19:55:25.639Z] 	at org.eclipse.ease.AbstractScriptEngine.setupRun(AbstractScriptEngine.java:298)
15:55:25 [2020-09-22T19:55:25.639Z] 	at org.eclipse.ease.AbstractScriptEngine.run(AbstractScriptEngine.java:264)
15:55:25 [2020-09-22T19:55:25.639Z] 	at org.eclipse.core.internal.jobs.Worker.run(Worker.java:63)
15:55:25 [2020-09-22T19:55:25.639Z] Caused by: java.io.IOException: Cannot run program "python": error=2, No such file or directory
15:55:25 [2020-09-22T19:55:25.640Z] 	at java.base/java.lang.ProcessBuilder.start(ProcessBuilder.java:1128)
15:55:25 [2020-09-22T19:55:25.640Z] 	at java.base/java.lang.ProcessBuilder.start(ProcessBuilder.java:1071)
15:55:25 [2020-09-22T19:55:25.640Z] 	at org.eclipse.ease.lang.python.py4j.internal.Py4jScriptEngine.startPythonProcess(Py4jScriptEngine.java:179)
15:55:25 [2020-09-22T19:55:25.640Z] 	at org.eclipse.ease.lang.python.py4j.internal.Py4jScriptEngine.setupEngine(Py4jScriptEngine.java:122)
15:55:25 [2020-09-22T19:55:25.640Z] 	... 3 more
15:55:25 [2020-09-22T19:55:25.640Z] Caused by: java.io.IOException: error=2, No such file or directory
15:55:25 [2020-09-22T19:55:25.640Z] 	at java.base/java.lang.ProcessImpl.forkAndExec(Native Method)
15:55:25 [2020-09-22T19:55:25.640Z] 	at java.base/java.lang.ProcessImpl.<init>(ProcessImpl.java:340)
15:55:25 [2020-09-22T19:55:25.640Z] 	at java.base/java.lang.ProcessImpl.start(ProcessImpl.java:271)
15:55:25 [2020-09-22T19:55:25.640Z] 	at java.base/java.lang.ProcessBuilder.start(ProcessBuilder.java:1107)
15:55:25 [2020-09-22T19:55:25.640Z] 	... 6 more
15:55:25 [2020-09-22T19:55:25.640Z] 
15:55:25 [2020-09-22T19:55:25.640Z] !ENTRY org.eclipse.ease 4 0 2020-09-22 19:55:23.425
15:55:25 [2020-09-22T19:55:25.640Z] !MESSAGE Could not setup script engine
15:55:25 [2020-09-22T19:55:25.640Z] !STACK 0
15:55:25 [2020-09-22T19:55:25.640Z] org.eclipse.ease.ScriptEngineException: Failed to start Python process. Please check the setting for the Python interpreter in Preferences -> Scripting -> Python Scripting:
15:55:25 [2020-09-22T19:55:25.640Z] Cannot run program "python": error=2, No such file or directory
15:55:25 [2020-09-22T19:55:25.640Z] 	at org.eclipse.ease.lang.python.py4j.internal.Py4jScriptEngine.setupEngine(Py4jScriptEngine.java:139)
15:55:25 [2020-09-22T19:55:25.640Z] 	at org.eclipse.ease.AbstractScriptEngine.setupRun(AbstractScriptEngine.java:298)
15:55:25 [2020-09-22T19:55:25.640Z] 	at org.eclipse.ease.AbstractScriptEngine.run(AbstractScriptEngine.java:264)
15:55:25 [2020-09-22T19:55:25.640Z] 	at org.eclipse.core.internal.jobs.Worker.run(Worker.java:63)
15:55:25 [2020-09-22T19:55:25.640Z] Caused by: java.io.IOException: Cannot run program "python": error=2, No such file or directory
15:55:25 [2020-09-22T19:55:25.640Z] 	at java.base/java.lang.ProcessBuilder.start(ProcessBuilder.java:1128)
15:55:25 [2020-09-22T19:55:25.640Z] 	at java.base/java.lang.ProcessBuilder.start(ProcessBuilder.java:1071)
15:55:25 [2020-09-22T19:55:25.640Z] 	at org.eclipse.ease.lang.python.py4j.internal.Py4jScriptEngine.startPythonProcess(Py4jScriptEngine.java:179)
15:55:25 [2020-09-22T19:55:25.640Z] 	at org.eclipse.ease.lang.python.py4j.internal.Py4jScriptEngine.setupEngine(Py4jScriptEngine.java:122)
15:55:25 [2020-09-22T19:55:25.640Z] 	... 3 more
15:55:25 [2020-09-22T19:55:25.640Z] Caused by: java.io.IOException: error=2, No such file or directory
15:55:25 [2020-09-22T19:55:25.640Z] 	at java.base/java.lang.ProcessImpl.forkAndExec(Native Method)
15:55:25 [2020-09-22T19:55:25.640Z] 	at java.base/java.lang.ProcessImpl.<init>(ProcessImpl.java:340)
15:55:25 [2020-09-22T19:55:25.640Z] 	at java.base/java.lang.ProcessImpl.start(ProcessImpl.java:271)
15:55:25 [2020-09-22T19:55:25.640Z] 	at java.base/java.lang.ProcessBuilder.start(ProcessBuilder.java:1107)
15:55:25 [2020-09-22T19:55:25.640Z] 	... 6 more
15:55:33 [2020-09-22T19:55:33.723Z] 
15:55:33 [2020-09-22T19:55:33.723Z] Finished test: javaInteger(org.eclipse.ease.lang.python.py4j.ShellModeEngineTest)
15:55:33 [2020-09-22T19:55:33.723Z] ----------------------------------------------
15:55:33 [2020-09-22T19:55:33.723Z] ----------------------------------------------
15:55:33 [2020-09-22T19:55:33.723Z] Starting test: javaString(org.eclipse.ease.lang.python.py4j.ShellModeEngineTest)
15:55:33 [2020-09-22T19:55:33.723Z] 
15:55:33 [2020-09-22T19:55:33.723Z] !ENTRY org.eclipse.ease 4 0 2020-09-22 19:55:33.450
15:55:33 [2020-09-22T19:55:33.723Z] !MESSAGE Could not setup script engine
15:55:33 [2020-09-22T19:55:33.723Z] !STACK 0
15:55:33 [2020-09-22T19:55:33.723Z] org.eclipse.ease.ScriptEngineException: Failed to start Python process. Please check the setting for the Python interpreter in Preferences -> Scripting -> Python Scripting:
15:55:33 [2020-09-22T19:55:33.723Z] Cannot run program "python": error=2, No such file or directory
15:55:33 [2020-09-22T19:55:33.723Z] 	at org.eclipse.ease.lang.python.py4j.internal.Py4jScriptEngine.setupEngine(Py4jScriptEngine.java:139)
15:55:33 [2020-09-22T19:55:33.723Z] 	at org.eclipse.ease.AbstractScriptEngine.setupRun(AbstractScriptEngine.java:298)
15:55:33 [2020-09-22T19:55:33.723Z] 	at org.eclipse.ease.AbstractScriptEngine.run(AbstractScriptEngine.java:264)
15:55:33 [2020-09-22T19:55:33.723Z] 	at org.eclipse.core.internal.jobs.Worker.run(Worker.java:63)
15:55:33 [2020-09-22T19:55:33.723Z] Caused by: java.io.IOException: Cannot run program "python": error=2, No such file or directory
15:55:33 [2020-09-22T19:55:33.723Z] 	at java.base/java.lang.ProcessBuilder.start(ProcessBuilder.java:1128)
15:55:33 [2020-09-22T19:55:33.723Z] 	at java.base/java.lang.ProcessBuilder.start(ProcessBuilder.java:1071)
15:55:33 [2020-09-22T19:55:33.723Z] 	at org.eclipse.ease.lang.python.py4j.internal.Py4jScriptEngine.startPythonProcess(Py4jScriptEngine.java:179)
15:55:33 [2020-09-22T19:55:33.723Z] 	at org.eclipse.ease.lang.python.py4j.internal.Py4jScriptEngine.setupEngine(Py4jScriptEngine.java:122)
15:55:33 [2020-09-22T19:55:33.723Z] 	... 3 more
15:55:33 [2020-09-22T19:55:33.723Z] Caused by: java.io.IOException: error=2, No such file or directory
15:55:33 [2020-09-22T19:55:33.723Z] 	at java.base/java.lang.ProcessImpl.forkAndExec(Native Method)
15:55:33 [2020-09-22T19:55:33.723Z] 	at java.base/java.lang.ProcessImpl.<init>(ProcessImpl.java:340)
15:55:33 [2020-09-22T19:55:33.723Z] 	at java.base/java.lang.ProcessImpl.start(ProcessImpl.java:271)
15:55:33 [2020-09-22T19:55:33.723Z] 	at java.base/java.lang.ProcessBuilder.start(ProcessBuilder.java:1107)
15:55:33 [2020-09-22T19:55:33.723Z] 	... 6 more
15:55:33 [2020-09-22T19:55:33.723Z] 
15:55:33 [2020-09-22T19:55:33.723Z] !ENTRY org.eclipse.ease 4 0 2020-09-22 19:55:33.451
15:55:33 [2020-09-22T19:55:33.723Z] !MESSAGE Could not setup script engine
15:55:33 [2020-09-22T19:55:33.723Z] !STACK 0
15:55:33 [2020-09-22T19:55:33.723Z] org.eclipse.ease.ScriptEngineException: Failed to start Python process. Please check the setting for the Python interpreter in Preferences -> Scripting -> Python Scripting:
15:55:33 [2020-09-22T19:55:33.723Z] Cannot run program "python": error=2, No such file or directory
15:55:33 [2020-09-22T19:55:33.723Z] 	at org.eclipse.ease.lang.python.py4j.internal.Py4jScriptEngine.setupEngine(Py4jScriptEngine.java:139)
15:55:33 [2020-09-22T19:55:33.723Z] 	at org.eclipse.ease.AbstractScriptEngine.setupRun(AbstractScriptEngine.java:298)
15:55:33 [2020-09-22T19:55:33.723Z] 	at org.eclipse.ease.AbstractScriptEngine.run(AbstractScriptEngine.java:264)
15:55:33 [2020-09-22T19:55:33.723Z] 	at org.eclipse.core.internal.jobs.Worker.run(Worker.java:63)
15:55:33 [2020-09-22T19:55:33.723Z] Caused by: java.io.IOException: Cannot run program "python": error=2, No such file or directory
15:55:33 [2020-09-22T19:55:33.723Z] 	at java.base/java.lang.ProcessBuilder.start(ProcessBuilder.java:1128)
15:55:33 [2020-09-22T19:55:33.723Z] 	at java.base/java.lang.ProcessBuilder.start(ProcessBuilder.java:1071)
15:55:33 [2020-09-22T19:55:33.723Z] 	at org.eclipse.ease.lang.python.py4j.internal.Py4jScriptEngine.startPythonProcess(Py4jScriptEngine.java:179)
15:55:33 [2020-09-22T19:55:33.723Z] 	at org.eclipse.ease.lang.python.py4j.internal.Py4jScriptEngine.setupEngine(Py4jScriptEngine.java:122)
15:55:33 [2020-09-22T19:55:33.723Z] 	... 3 more
15:55:33 [2020-09-22T19:55:33.723Z] Caused by: java.io.IOException: error=2, No such file or directory
15:55:33 [2020-09-22T19:55:33.723Z] 	at java.base/java.lang.ProcessImpl.forkAndExec(Native Method)
15:55:33 [2020-09-22T19:55:33.723Z] 	at java.base/java.lang.ProcessImpl.<init>(ProcessImpl.java:340)
15:55:33 [2020-09-22T19:55:33.723Z] 	at java.base/java.lang.ProcessImpl.start(ProcessImpl.java:271)
15:55:33 [2020-09-22T19:55:33.723Z] 	at java.base/java.lang.ProcessBuilder.start(ProcessBuilder.java:1107)
15:55:33 [2020-09-22T19:55:33.723Z] 	... 6 more
15:55:43 [2020-09-22T19:55:43.661Z] 
15:55:43 [2020-09-22T19:55:43.661Z] Finished test: javaString(org.eclipse.ease.lang.python.py4j.ShellModeEngineTest)
15:55:43 [2020-09-22T19:55:43.661Z] ----------------------------------------------
15:55:43 [2020-09-22T19:55:43.661Z] ----------------------------------------------
15:55:43 [2020-09-22T19:55:43.661Z] Starting test: javaByteArray(org.eclipse.ease.lang.python.py4j.ShellModeEngineTest)
15:55:43 [2020-09-22T19:55:43.661Z] 
15:55:43 [2020-09-22T19:55:43.661Z] !ENTRY org.eclipse.ease 4 0 2020-09-22 19:55:43.471
15:55:43 [2020-09-22T19:55:43.661Z] !MESSAGE Could not setup script engine
15:55:43 [2020-09-22T19:55:43.661Z] !STACK 0
15:55:43 [2020-09-22T19:55:43.661Z] org.eclipse.ease.ScriptEngineException: Failed to start Python process. Please check the setting for the Python interpreter in Preferences -> Scripting -> Python Scripting:
15:55:43 [2020-09-22T19:55:43.661Z] Cannot run program "python": error=2, No such file or directory
15:55:43 [2020-09-22T19:55:43.661Z] 	at org.eclipse.ease.lang.python.py4j.internal.Py4jScriptEngine.setupEngine(Py4jScriptEngine.java:139)
15:55:43 [2020-09-22T19:55:43.661Z] 	at org.eclipse.ease.AbstractScriptEngine.setupRun(AbstractScriptEngine.java:298)
15:55:43 [2020-09-22T19:55:43.661Z] 	at org.eclipse.ease.AbstractScriptEngine.run(AbstractScriptEngine.java:264)
15:55:43 [2020-09-22T19:55:43.661Z] 	at org.eclipse.core.internal.jobs.Worker.run(Worker.java:63)
15:55:43 [2020-09-22T19:55:43.661Z] Caused by: java.io.IOException: Cannot run program "python": error=2, No such file or directory
15:55:43 [2020-09-22T19:55:43.661Z] 	at java.base/java.lang.ProcessBuilder.start(ProcessBuilder.java:1128)
15:55:43 [2020-09-22T19:55:43.661Z] 	at java.base/java.lang.ProcessBuilder.start(ProcessBuilder.java:1071)
15:55:43 [2020-09-22T19:55:43.661Z] 	at org.eclipse.ease.lang.python.py4j.internal.Py4jScriptEngine.startPythonProcess(Py4jScriptEngine.java:179)
15:55:43 [2020-09-22T19:55:43.661Z] 	at org.eclipse.ease.lang.python.py4j.internal.Py4jScriptEngine.setupEngine(Py4jScriptEngine.java:122)
15:55:43 [2020-09-22T19:55:43.661Z] 	... 3 more
15:55:43 [2020-09-22T19:55:43.661Z] Caused by: java.io.IOException: error=2, No such file or directory
15:55:43 [2020-09-22T19:55:43.662Z] 	at java.base/java.lang.ProcessImpl.forkAndExec(Native Method)
15:55:43 [2020-09-22T19:55:43.662Z] 	at java.base/java.lang.ProcessImpl.<init>(ProcessImpl.java:340)
15:55:43 [2020-09-22T19:55:43.662Z] 	at java.base/java.lang.ProcessImpl.start(ProcessImpl.java:271)
15:55:43 [2020-09-22T19:55:43.662Z] 	at java.base/java.lang.ProcessBuilder.start(ProcessBuilder.java:1107)
15:55:43 [2020-09-22T19:55:43.662Z] 	... 6 more
15:55:43 [2020-09-22T19:55:43.662Z] 
15:55:43 [2020-09-22T19:55:43.662Z] !ENTRY org.eclipse.ease 4 0 2020-09-22 19:55:43.473
15:55:43 [2020-09-22T19:55:43.662Z] !MESSAGE Could not setup script engine
15:55:43 [2020-09-22T19:55:43.662Z] !STACK 0
15:55:43 [2020-09-22T19:55:43.662Z] org.eclipse.ease.ScriptEngineException: Failed to start Python process. Please check the setting for the Python interpreter in Preferences -> Scripting -> Python Scripting:
15:55:43 [2020-09-22T19:55:43.662Z] Cannot run program "python": error=2, No such file or directory
15:55:43 [2020-09-22T19:55:43.662Z] 	at org.eclipse.ease.lang.python.py4j.internal.Py4jScriptEngine.setupEngine(Py4jScriptEngine.java:139)
15:55:43 [2020-09-22T19:55:43.662Z] 	at org.eclipse.ease.AbstractScriptEngine.setupRun(AbstractScriptEngine.java:298)
15:55:43 [2020-09-22T19:55:43.662Z] 	at org.eclipse.ease.AbstractScriptEngine.run(AbstractScriptEngine.java:264)
15:55:43 [2020-09-22T19:55:43.662Z] 	at org.eclipse.core.internal.jobs.Worker.run(Worker.java:63)
15:55:43 [2020-09-22T19:55:43.662Z] Caused by: java.io.IOException: Cannot run program "python": error=2, No such file or directory
15:55:43 [2020-09-22T19:55:43.662Z] 	at java.base/java.lang.ProcessBuilder.start(ProcessBuilder.java:1128)
15:55:43 [2020-09-22T19:55:43.662Z] 	at java.base/java.lang.ProcessBuilder.start(ProcessBuilder.java:1071)
15:55:43 [2020-09-22T19:55:43.662Z] 	at org.eclipse.ease.lang.python.py4j.internal.Py4jScriptEngine.startPythonProcess(Py4jScriptEngine.java:179)
15:55:43 [2020-09-22T19:55:43.662Z] 	at org.eclipse.ease.lang.python.py4j.internal.Py4jScriptEngine.setupEngine(Py4jScriptEngine.java:122)
15:55:43 [2020-09-22T19:55:43.662Z] 	... 3 more
15:55:43 [2020-09-22T19:55:43.662Z] Caused by: java.io.IOException: error=2, No such file or directory
15:55:43 [2020-09-22T19:55:43.662Z] 	at java.base/java.lang.ProcessImpl.forkAndExec(Native Method)
15:55:43 [2020-09-22T19:55:43.662Z] 	at java.base/java.lang.ProcessImpl.<init>(ProcessImpl.java:340)
15:55:43 [2020-09-22T19:55:43.662Z] 	at java.base/java.lang.ProcessImpl.start(ProcessImpl.java:271)
15:55:43 [2020-09-22T19:55:43.662Z] 	at java.base/java.lang.ProcessBuilder.start(ProcessBuilder.java:1107)
15:55:43 [2020-09-22T19:55:43.662Z] 	... 6 more
15:55:53 [2020-09-22T19:55:53.617Z] 
15:55:53 [2020-09-22T19:55:53.617Z] Finished test: javaByteArray(org.eclipse.ease.lang.python.py4j.ShellModeEngineTest)
15:55:53 [2020-09-22T19:55:53.617Z] ----------------------------------------------
15:55:53 [2020-09-22T19:55:53.617Z] ----------------------------------------------
15:55:53 [2020-09-22T19:55:53.617Z] Starting test: createEclipseClass(org.eclipse.ease.lang.python.py4j.ShellModeEngineTest)
15:55:53 [2020-09-22T19:55:53.617Z] 
15:55:53 [2020-09-22T19:55:53.617Z] !ENTRY org.eclipse.ease 4 0 2020-09-22 19:55:53.495
15:55:53 [2020-09-22T19:55:53.617Z] !MESSAGE Could not setup script engine
15:55:53 [2020-09-22T19:55:53.617Z] !STACK 0
15:55:53 [2020-09-22T19:55:53.617Z] org.eclipse.ease.ScriptEngineException: Failed to start Python process. Please check the setting for the Python interpreter in Preferences -> Scripting -> Python Scripting:
15:55:53 [2020-09-22T19:55:53.617Z] Cannot run program "python": error=2, No such file or directory
15:55:53 [2020-09-22T19:55:53.618Z] 	at org.eclipse.ease.lang.python.py4j.internal.Py4jScriptEngine.setupEngine(Py4jScriptEngine.java:139)
15:55:53 [2020-09-22T19:55:53.618Z] 	at org.eclipse.ease.AbstractScriptEngine.setupRun(AbstractScriptEngine.java:298)
15:55:53 [2020-09-22T19:55:53.618Z] 	at org.eclipse.ease.AbstractScriptEngine.run(AbstractScriptEngine.java:264)
15:55:53 [2020-09-22T19:55:53.618Z] 	at org.eclipse.core.internal.jobs.Worker.run(Worker.java:63)
15:55:53 [2020-09-22T19:55:53.618Z] Caused by: java.io.IOException: Cannot run program "python": error=2, No such file or directory
15:55:53 [2020-09-22T19:55:53.618Z] 	at java.base/java.lang.ProcessBuilder.start(ProcessBuilder.java:1128)
15:55:53 [2020-09-22T19:55:53.618Z] 	at java.base/java.lang.ProcessBuilder.start(ProcessBuilder.java:1071)
15:55:53 [2020-09-22T19:55:53.618Z] 	at org.eclipse.ease.lang.python.py4j.internal.Py4jScriptEngine.startPythonProcess(Py4jScriptEngine.java:179)
15:55:53 [2020-09-22T19:55:53.618Z] 	at org.eclipse.ease.lang.python.py4j.internal.Py4jScriptEngine.setupEngine(Py4jScriptEngine.java:122)
15:55:53 [2020-09-22T19:55:53.618Z] 	... 3 more
15:55:53 [2020-09-22T19:55:53.618Z] Caused by: java.io.IOException: error=2, No such file or directory
15:55:53 [2020-09-22T19:55:53.618Z] 	at java.base/java.lang.ProcessImpl.forkAndExec(Native Method)
15:55:53 [2020-09-22T19:55:53.618Z] 	at java.base/java.lang.ProcessImpl.<init>(ProcessImpl.java:340)
15:55:53 [2020-09-22T19:55:53.618Z] 	at java.base/java.lang.ProcessImpl.start(ProcessImpl.java:271)
15:55:53 [2020-09-22T19:55:53.618Z] 	at java.base/java.lang.ProcessBuilder.start(ProcessBuilder.java:1107)
15:55:53 [2020-09-22T19:55:53.618Z] 	... 6 more
15:55:53 [2020-09-22T19:55:53.618Z] 
15:55:53 [2020-09-22T19:55:53.618Z] !ENTRY org.eclipse.ease 4 0 2020-09-22 19:55:53.496
15:55:53 [2020-09-22T19:55:53.618Z] !MESSAGE Could not setup script engine
15:55:53 [2020-09-22T19:55:53.618Z] !STACK 0
15:55:53 [2020-09-22T19:55:53.618Z] org.eclipse.ease.ScriptEngineException: Failed to start Python process. Please check the setting for the Python interpreter in Preferences -> Scripting -> Python Scripting:
15:55:53 [2020-09-22T19:55:53.618Z] Cannot run program "python": error=2, No such file or directory
15:55:53 [2020-09-22T19:55:53.618Z] 	at org.eclipse.ease.lang.python.py4j.internal.Py4jScriptEngine.setupEngine(Py4jScriptEngine.java:139)
15:55:53 [2020-09-22T19:55:53.618Z] 	at org.eclipse.ease.AbstractScriptEngine.setupRun(AbstractScriptEngine.java:298)
15:55:53 [2020-09-22T19:55:53.618Z] 	at org.eclipse.ease.AbstractScriptEngine.run(AbstractScriptEngine.java:264)
15:55:53 [2020-09-22T19:55:53.618Z] 	at org.eclipse.core.internal.jobs.Worker.run(Worker.java:63)
15:55:53 [2020-09-22T19:55:53.618Z] Caused by: java.io.IOException: Cannot run program "python": error=2, No such file or directory
15:55:53 [2020-09-22T19:55:53.618Z] 	at java.base/java.lang.ProcessBuilder.start(ProcessBuilder.java:1128)
15:55:53 [2020-09-22T19:55:53.618Z] 	at java.base/java.lang.ProcessBuilder.start(ProcessBuilder.java:1071)
15:55:53 [2020-09-22T19:55:53.618Z] 	at org.eclipse.ease.lang.python.py4j.internal.Py4jScriptEngine.startPythonProcess(Py4jScriptEngine.java:179)
15:55:53 [2020-09-22T19:55:53.618Z] 	at org.eclipse.ease.lang.python.py4j.internal.Py4jScriptEngine.setupEngine(Py4jScriptEngine.java:122)
15:55:53 [2020-09-22T19:55:53.618Z] 	... 3 more
15:55:53 [2020-09-22T19:55:53.618Z] Caused by: java.io.IOException: error=2, No such file or directory
15:55:53 [2020-09-22T19:55:53.618Z] 	at java.base/java.lang.ProcessImpl.forkAndExec(Native Method)
15:55:53 [2020-09-22T19:55:53.618Z] 	at java.base/java.lang.ProcessImpl.<init>(ProcessImpl.java:340)
15:55:53 [2020-09-22T19:55:53.618Z] 	at java.base/java.lang.ProcessImpl.start(ProcessImpl.java:271)
15:55:53 [2020-09-22T19:55:53.618Z] 	at java.base/java.lang.ProcessBuilder.start(ProcessBuilder.java:1107)
15:55:53 [2020-09-22T19:55:53.618Z] 	... 6 more
15:56:03 [2020-09-22T19:56:03.563Z] 
15:56:03 [2020-09-22T19:56:03.563Z] Finished test: createEclipseClass(org.eclipse.ease.lang.python.py4j.ShellModeEngineTest)
15:56:03 [2020-09-22T19:56:03.563Z] ----------------------------------------------
15:56:03 [2020-09-22T19:56:03.563Z] ----------------------------------------------
15:56:03 [2020-09-22T19:56:03.563Z] Starting test: pythonString(org.eclipse.ease.lang.python.py4j.ShellModeEngineTest)
15:56:03 [2020-09-22T19:56:03.563Z] 
15:56:03 [2020-09-22T19:56:03.563Z] !ENTRY org.eclipse.ease 4 0 2020-09-22 19:56:03.520
15:56:03 [2020-09-22T19:56:03.563Z] !MESSAGE Could not setup script engine
15:56:03 [2020-09-22T19:56:03.563Z] !STACK 0
15:56:03 [2020-09-22T19:56:03.563Z] org.eclipse.ease.ScriptEngineException: Failed to start Python process. Please check the setting for the Python interpreter in Preferences -> Scripting -> Python Scripting:
15:56:03 [2020-09-22T19:56:03.563Z] Cannot run program "python": error=2, No such file or directory
15:56:03 [2020-09-22T19:56:03.563Z] 	at org.eclipse.ease.lang.python.py4j.internal.Py4jScriptEngine.setupEngine(Py4jScriptEngine.java:139)
15:56:03 [2020-09-22T19:56:03.563Z] 	at org.eclipse.ease.AbstractScriptEngine.setupRun(AbstractScriptEngine.java:298)
15:56:03 [2020-09-22T19:56:03.563Z] 	at org.eclipse.ease.AbstractScriptEngine.run(AbstractScriptEngine.java:264)
15:56:03 [2020-09-22T19:56:03.563Z] 	at org.eclipse.core.internal.jobs.Worker.run(Worker.java:63)
15:56:03 [2020-09-22T19:56:03.563Z] Caused by: java.io.IOException: Cannot run program "python": error=2, No such file or directory
15:56:03 [2020-09-22T19:56:03.563Z] 	at java.base/java.lang.ProcessBuilder.start(ProcessBuilder.java:1128)
15:56:03 [2020-09-22T19:56:03.563Z] 	at java.base/java.lang.ProcessBuilder.start(ProcessBuilder.java:1071)
15:56:03 [2020-09-22T19:56:03.563Z] 	at org.eclipse.ease.lang.python.py4j.internal.Py4jScriptEngine.startPythonProcess(Py4jScriptEngine.java:179)
15:56:03 [2020-09-22T19:56:03.563Z] 	at org.eclipse.ease.lang.python.py4j.internal.Py4jScriptEngine.setupEngine(Py4jScriptEngine.java:122)
15:56:03 [2020-09-22T19:56:03.563Z] 	... 3 more
15:56:03 [2020-09-22T19:56:03.563Z] Caused by: java.io.IOException: error=2, No such file or directory
15:56:03 [2020-09-22T19:56:03.563Z] 	at java.base/java.lang.ProcessImpl.forkAndExec(Native Method)
15:56:03 [2020-09-22T19:56:03.563Z] 	at java.base/java.lang.ProcessImpl.<init>(ProcessImpl.java:340)
15:56:03 [2020-09-22T19:56:03.563Z] 	at java.base/java.lang.ProcessImpl.start(ProcessImpl.java:271)
15:56:03 [2020-09-22T19:56:03.563Z] 	at java.base/java.lang.ProcessBuilder.start(ProcessBuilder.java:1107)
15:56:03 [2020-09-22T19:56:03.563Z] 	... 6 more
15:56:03 [2020-09-22T19:56:03.563Z] 
15:56:03 [2020-09-22T19:56:03.563Z] !ENTRY org.eclipse.ease 4 0 2020-09-22 19:56:03.521
15:56:03 [2020-09-22T19:56:03.563Z] !MESSAGE Could not setup script engine
15:56:03 [2020-09-22T19:56:03.563Z] !STACK 0
15:56:03 [2020-09-22T19:56:03.563Z] org.eclipse.ease.ScriptEngineException: Failed to start Python process. Please check the setting for the Python interpreter in Preferences -> Scripting -> Python Scripting:
15:56:03 [2020-09-22T19:56:03.563Z] Cannot run program "python": error=2, No such file or directory
15:56:03 [2020-09-22T19:56:03.563Z] 	at org.eclipse.ease.lang.python.py4j.internal.Py4jScriptEngine.setupEngine(Py4jScriptEngine.java:139)
15:56:03 [2020-09-22T19:56:03.563Z] 	at org.eclipse.ease.AbstractScriptEngine.setupRun(AbstractScriptEngine.java:298)
15:56:03 [2020-09-22T19:56:03.563Z] 	at org.eclipse.ease.AbstractScriptEngine.run(AbstractScriptEngine.java:264)
15:56:03 [2020-09-22T19:56:03.563Z] 	at org.eclipse.core.internal.jobs.Worker.run(Worker.java:63)
15:56:03 [2020-09-22T19:56:03.563Z] Caused by: java.io.IOException: Cannot run program "python": error=2, No such file or directory
15:56:03 [2020-09-22T19:56:03.563Z] 	at java.base/java.lang.ProcessBuilder.start(ProcessBuilder.java:1128)
15:56:03 [2020-09-22T19:56:03.563Z] 	at java.base/java.lang.ProcessBuilder.start(ProcessBuilder.java:1071)
15:56:03 [2020-09-22T19:56:03.563Z] 	at org.eclipse.ease.lang.python.py4j.internal.Py4jScriptEngine.startPythonProcess(Py4jScriptEngine.java:179)
15:56:03 [2020-09-22T19:56:03.563Z] 	at org.eclipse.ease.lang.python.py4j.internal.Py4jScriptEngine.setupEngine(Py4jScriptEngine.java:122)
15:56:03 [2020-09-22T19:56:03.563Z] 	... 3 more
15:56:03 [2020-09-22T19:56:03.563Z] Caused by: java.io.IOException: error=2, No such file or directory
15:56:03 [2020-09-22T19:56:03.563Z] 	at java.base/java.lang.ProcessImpl.forkAndExec(Native Method)
15:56:03 [2020-09-22T19:56:03.563Z] 	at java.base/java.lang.ProcessImpl.<init>(ProcessImpl.java:340)
15:56:03 [2020-09-22T19:56:03.563Z] 	at java.base/java.lang.ProcessImpl.start(ProcessImpl.java:271)
15:56:03 [2020-09-22T19:56:03.563Z] 	at java.base/java.lang.ProcessBuilder.start(ProcessBuilder.java:1107)
15:56:03 [2020-09-22T19:56:03.563Z] 	... 6 more
15:56:15 [2020-09-22T19:56:15.736Z] 
15:56:15 [2020-09-22T19:56:15.736Z] Finished test: pythonString(org.eclipse.ease.lang.python.py4j.ShellModeEngineTest)
15:56:15 [2020-09-22T19:56:15.736Z] ----------------------------------------------
15:56:15 [2020-09-22T19:56:15.736Z] ----------------------------------------------
15:56:15 [2020-09-22T19:56:15.736Z] Starting test: varargs(org.eclipse.ease.lang.python.py4j.ShellModeEngineTest)
15:56:15 [2020-09-22T19:56:15.736Z] 
15:56:15 [2020-09-22T19:56:15.736Z] !ENTRY org.eclipse.ease 4 0 2020-09-22 19:56:13.546
15:56:15 [2020-09-22T19:56:15.736Z] !MESSAGE Could not setup script engine
15:56:15 [2020-09-22T19:56:15.737Z] !STACK 0
15:56:15 [2020-09-22T19:56:15.737Z] org.eclipse.ease.ScriptEngineException: Failed to start Python process. Please check the setting for the Python interpreter in Preferences -> Scripting -> Python Scripting:
15:56:15 [2020-09-22T19:56:15.737Z] Cannot run program "python": error=2, No such file or directory
15:56:15 [2020-09-22T19:56:15.737Z] 	at org.eclipse.ease.lang.python.py4j.internal.Py4jScriptEngine.setupEngine(Py4jScriptEngine.java:139)
15:56:15 [2020-09-22T19:56:15.737Z] 	at org.eclipse.ease.AbstractScriptEngine.setupRun(AbstractScriptEngine.java:298)
15:56:15 [2020-09-22T19:56:15.737Z] 	at org.eclipse.ease.AbstractScriptEngine.run(AbstractScriptEngine.java:264)
15:56:15 [2020-09-22T19:56:15.737Z] 	at org.eclipse.core.internal.jobs.Worker.run(Worker.java:63)
15:56:15 [2020-09-22T19:56:15.737Z] Caused by: java.io.IOException: Cannot run program "python": error=2, No such file or directory
15:56:15 [2020-09-22T19:56:15.737Z] 	at java.base/java.lang.ProcessBuilder.start(ProcessBuilder.java:1128)
15:56:15 [2020-09-22T19:56:15.737Z] 	at java.base/java.lang.ProcessBuilder.start(ProcessBuilder.java:1071)
15:56:15 [2020-09-22T19:56:15.737Z] 	at org.eclipse.ease.lang.python.py4j.internal.Py4jScriptEngine.startPythonProcess(Py4jScriptEngine.java:179)
15:56:15 [2020-09-22T19:56:15.737Z] 	at org.eclipse.ease.lang.python.py4j.internal.Py4jScriptEngine.setupEngine(Py4jScriptEngine.java:122)
15:56:15 [2020-09-22T19:56:15.737Z] 	... 3 more
15:56:15 [2020-09-22T19:56:15.737Z] Caused by: java.io.IOException: error=2, No such file or directory
15:56:15 [2020-09-22T19:56:15.737Z] 	at java.base/java.lang.ProcessImpl.forkAndExec(Native Method)
15:56:15 [2020-09-22T19:56:15.737Z] 	at java.base/java.lang.ProcessImpl.<init>(ProcessImpl.java:340)
15:56:15 [2020-09-22T19:56:15.737Z] 	at java.base/java.lang.ProcessImpl.start(ProcessImpl.java:271)
15:56:15 [2020-09-22T19:56:15.737Z] 	at java.base/java.lang.ProcessBuilder.start(ProcessBuilder.java:1107)
15:56:15 [2020-09-22T19:56:15.737Z] 	... 6 more
15:56:15 [2020-09-22T19:56:15.737Z] 
15:56:15 [2020-09-22T19:56:15.737Z] !ENTRY org.eclipse.ease 4 0 2020-09-22 19:56:13.547
15:56:15 [2020-09-22T19:56:15.737Z] !MESSAGE Could not setup script engine
15:56:15 [2020-09-22T19:56:15.737Z] !STACK 0
15:56:15 [2020-09-22T19:56:15.737Z] org.eclipse.ease.ScriptEngineException: Failed to start Python process. Please check the setting for the Python interpreter in Preferences -> Scripting -> Python Scripting:
15:56:15 [2020-09-22T19:56:15.737Z] Cannot run program "python": error=2, No such file or directory
15:56:15 [2020-09-22T19:56:15.737Z] 	at org.eclipse.ease.lang.python.py4j.internal.Py4jScriptEngine.setupEngine(Py4jScriptEngine.java:139)
15:56:15 [2020-09-22T19:56:15.737Z] 	at org.eclipse.ease.AbstractScriptEngine.setupRun(AbstractScriptEngine.java:298)
15:56:15 [2020-09-22T19:56:15.737Z] 	at org.eclipse.ease.AbstractScriptEngine.run(AbstractScriptEngine.java:264)
15:56:15 [2020-09-22T19:56:15.737Z] 	at org.eclipse.core.internal.jobs.Worker.run(Worker.java:63)
15:56:15 [2020-09-22T19:56:15.737Z] Caused by: java.io.IOException: Cannot run program "python": error=2, No such file or directory
15:56:15 [2020-09-22T19:56:15.737Z] 	at java.base/java.lang.ProcessBuilder.start(ProcessBuilder.java:1128)
15:56:15 [2020-09-22T19:56:15.737Z] 	at java.base/java.lang.ProcessBuilder.start(ProcessBuilder.java:1071)
15:56:15 [2020-09-22T19:56:15.737Z] 	at org.eclipse.ease.lang.python.py4j.internal.Py4jScriptEngine.startPythonProcess(Py4jScriptEngine.java:179)
15:56:15 [2020-09-22T19:56:15.737Z] 	at org.eclipse.ease.lang.python.py4j.internal.Py4jScriptEngine.setupEngine(Py4jScriptEngine.java:122)
15:56:15 [2020-09-22T19:56:15.737Z] 	... 3 more
15:56:15 [2020-09-22T19:56:15.737Z] Caused by: java.io.IOException: error=2, No such file or directory
15:56:15 [2020-09-22T19:56:15.737Z] 	at java.base/java.lang.ProcessImpl.forkAndExec(Native Method)
15:56:15 [2020-09-22T19:56:15.737Z] 	at java.base/java.lang.ProcessImpl.<init>(ProcessImpl.java:340)
15:56:15 [2020-09-22T19:56:15.737Z] 	at java.base/java.lang.ProcessImpl.start(ProcessImpl.java:271)
15:56:15 [2020-09-22T19:56:15.737Z] 	at java.base/java.lang.ProcessBuilder.start(ProcessBuilder.java:1107)
15:56:15 [2020-09-22T19:56:15.737Z] 	... 6 more
15:56:23 [2020-09-22T19:56:23.825Z] 
15:56:23 [2020-09-22T19:56:23.825Z] Finished test: varargs(org.eclipse.ease.lang.python.py4j.ShellModeEngineTest)
15:56:23 [2020-09-22T19:56:23.825Z] ----------------------------------------------
15:56:23 [2020-09-22T19:56:23.825Z] ----------------------------------------------
15:56:23 [2020-09-22T19:56:23.825Z] Starting test: createJavaType(org.eclipse.ease.lang.python.py4j.ShellModeEngineTest)
15:56:23 [2020-09-22T19:56:23.825Z] 
15:56:23 [2020-09-22T19:56:23.825Z] !ENTRY org.eclipse.ease 4 0 2020-09-22 19:56:23.577
15:56:23 [2020-09-22T19:56:23.825Z] !MESSAGE Could not setup script engine
15:56:23 [2020-09-22T19:56:23.825Z] !STACK 0
15:56:23 [2020-09-22T19:56:23.825Z] org.eclipse.ease.ScriptEngineException: Failed to start Python process. Please check the setting for the Python interpreter in Preferences -> Scripting -> Python Scripting:
15:56:23 [2020-09-22T19:56:23.825Z] Cannot run program "python": error=2, No such file or directory
15:56:23 [2020-09-22T19:56:23.825Z] 	at org.eclipse.ease.lang.python.py4j.internal.Py4jScriptEngine.setupEngine(Py4jScriptEngine.java:139)
15:56:23 [2020-09-22T19:56:23.825Z] 	at org.eclipse.ease.AbstractScriptEngine.setupRun(AbstractScriptEngine.java:298)
15:56:23 [2020-09-22T19:56:23.825Z] 	at org.eclipse.ease.AbstractScriptEngine.run(AbstractScriptEngine.java:264)
15:56:23 [2020-09-22T19:56:23.825Z] 	at org.eclipse.core.internal.jobs.Worker.run(Worker.java:63)
15:56:23 [2020-09-22T19:56:23.825Z] Caused by: java.io.IOException: Cannot run program "python": error=2, No such file or directory
15:56:23 [2020-09-22T19:56:23.825Z] 	at java.base/java.lang.ProcessBuilder.start(ProcessBuilder.java:1128)
15:56:23 [2020-09-22T19:56:23.825Z] 	at java.base/java.lang.ProcessBuilder.start(ProcessBuilder.java:1071)
15:56:23 [2020-09-22T19:56:23.825Z] 	at org.eclipse.ease.lang.python.py4j.internal.Py4jScriptEngine.startPythonProcess(Py4jScriptEngine.java:179)
15:56:23 [2020-09-22T19:56:23.825Z] 	at org.eclipse.ease.lang.python.py4j.internal.Py4jScriptEngine.setupEngine(Py4jScriptEngine.java:122)
15:56:23 [2020-09-22T19:56:23.825Z] 	... 3 more
15:56:23 [2020-09-22T19:56:23.825Z] Caused by: java.io.IOException: error=2, No such file or directory
15:56:23 [2020-09-22T19:56:23.825Z] 	at java.base/java.lang.ProcessImpl.forkAndExec(Native Method)
15:56:23 [2020-09-22T19:56:23.825Z] 	at java.base/java.lang.ProcessImpl.<init>(ProcessImpl.java:340)
15:56:23 [2020-09-22T19:56:23.825Z] 	at java.base/java.lang.ProcessImpl.start(ProcessImpl.java:271)
15:56:23 [2020-09-22T19:56:23.825Z] 	at java.base/java.lang.ProcessBuilder.start(ProcessBuilder.java:1107)
15:56:23 [2020-09-22T19:56:23.825Z] 	... 6 more
15:56:23 [2020-09-22T19:56:23.825Z] 
15:56:23 [2020-09-22T19:56:23.825Z] !ENTRY org.eclipse.ease 4 0 2020-09-22 19:56:23.578
15:56:23 [2020-09-22T19:56:23.825Z] !MESSAGE Could not setup script engine
15:56:23 [2020-09-22T19:56:23.825Z] !STACK 0
15:56:23 [2020-09-22T19:56:23.825Z] org.eclipse.ease.ScriptEngineException: Failed to start Python process. Please check the setting for the Python interpreter in Preferences -> Scripting -> Python Scripting:
15:56:23 [2020-09-22T19:56:23.825Z] Cannot run program "python": error=2, No such file or directory
15:56:23 [2020-09-22T19:56:23.825Z] 	at org.eclipse.ease.lang.python.py4j.internal.Py4jScriptEngine.setupEngine(Py4jScriptEngine.java:139)
15:56:23 [2020-09-22T19:56:23.825Z] 	at org.eclipse.ease.AbstractScriptEngine.setupRun(AbstractScriptEngine.java:298)
15:56:23 [2020-09-22T19:56:23.825Z] 	at org.eclipse.ease.AbstractScriptEngine.run(AbstractScriptEngine.java:264)
15:56:23 [2020-09-22T19:56:23.825Z] 	at org.eclipse.core.internal.jobs.Worker.run(Worker.java:63)
15:56:23 [2020-09-22T19:56:23.825Z] Caused by: java.io.IOException: Cannot run program "python": error=2, No such file or directory
15:56:23 [2020-09-22T19:56:23.825Z] 	at java.base/java.lang.ProcessBuilder.start(ProcessBuilder.java:1128)
15:56:23 [2020-09-22T19:56:23.825Z] 	at java.base/java.lang.ProcessBuilder.start(ProcessBuilder.java:1071)
15:56:23 [2020-09-22T19:56:23.825Z] 	at org.eclipse.ease.lang.python.py4j.internal.Py4jScriptEngine.startPythonProcess(Py4jScriptEngine.java:179)
15:56:23 [2020-09-22T19:56:23.825Z] 	at org.eclipse.ease.lang.python.py4j.internal.Py4jScriptEngine.setupEngine(Py4jScriptEngine.java:122)
15:56:23 [2020-09-22T19:56:23.825Z] 	... 3 more
15:56:23 [2020-09-22T19:56:23.825Z] Caused by: java.io.IOException: error=2, No such file or directory
15:56:23 [2020-09-22T19:56:23.825Z] 	at java.base/java.lang.ProcessImpl.forkAndExec(Native Method)
15:56:23 [2020-09-22T19:56:23.825Z] 	at java.base/java.lang.ProcessImpl.<init>(ProcessImpl.java:340)
15:56:23 [2020-09-22T19:56:23.825Z] 	at java.base/java.lang.ProcessImpl.start(ProcessImpl.java:271)
15:56:23 [2020-09-22T19:56:23.825Z] 	at java.base/java.lang.ProcessBuilder.start(ProcessBuilder.java:1107)
15:56:23 [2020-09-22T19:56:23.825Z] 	... 6 more
15:56:33 [2020-09-22T19:56:33.771Z] 
15:56:33 [2020-09-22T19:56:33.771Z] Finished test: createJavaType(org.eclipse.ease.lang.python.py4j.ShellModeEngineTest)
15:56:33 [2020-09-22T19:56:33.771Z] ----------------------------------------------
15:56:33 [2020-09-22T19:56:33.771Z] ----------------------------------------------
15:56:33 [2020-09-22T19:56:33.771Z] Starting test: javaFloatArray(org.eclipse.ease.lang.python.py4j.ShellModeEngineTest)
15:56:33 [2020-09-22T19:56:33.771Z] 
15:56:33 [2020-09-22T19:56:33.771Z] !ENTRY org.eclipse.ease 4 0 2020-09-22 19:56:33.600
15:56:33 [2020-09-22T19:56:33.771Z] !MESSAGE Could not setup script engine
15:56:33 [2020-09-22T19:56:33.771Z] !STACK 0
15:56:33 [2020-09-22T19:56:33.771Z] org.eclipse.ease.ScriptEngineException: Failed to start Python process. Please check the setting for the Python interpreter in Preferences -> Scripting -> Python Scripting:
15:56:33 [2020-09-22T19:56:33.771Z] Cannot run program "python": error=2, No such file or directory
15:56:33 [2020-09-22T19:56:33.771Z] 	at org.eclipse.ease.lang.python.py4j.internal.Py4jScriptEngine.setupEngine(Py4jScriptEngine.java:139)
15:56:33 [2020-09-22T19:56:33.771Z] 	at org.eclipse.ease.AbstractScriptEngine.setupRun(AbstractScriptEngine.java:298)
15:56:33 [2020-09-22T19:56:33.771Z] 	at org.eclipse.ease.AbstractScriptEngine.run(AbstractScriptEngine.java:264)
15:56:33 [2020-09-22T19:56:33.771Z] 	at org.eclipse.core.internal.jobs.Worker.run(Worker.java:63)
15:56:33 [2020-09-22T19:56:33.771Z] Caused by: java.io.IOException: Cannot run program "python": error=2, No such file or directory
15:56:33 [2020-09-22T19:56:33.771Z] 	at java.base/java.lang.ProcessBuilder.start(ProcessBuilder.java:1128)
15:56:33 [2020-09-22T19:56:33.771Z] 	at java.base/java.lang.ProcessBuilder.start(ProcessBuilder.java:1071)
15:56:33 [2020-09-22T19:56:33.771Z] 	at org.eclipse.ease.lang.python.py4j.internal.Py4jScriptEngine.startPythonProcess(Py4jScriptEngine.java:179)
15:56:33 [2020-09-22T19:56:33.771Z] 	at org.eclipse.ease.lang.python.py4j.internal.Py4jScriptEngine.setupEngine(Py4jScriptEngine.java:122)
15:56:33 [2020-09-22T19:56:33.771Z] 	... 3 more
15:56:33 [2020-09-22T19:56:33.771Z] Caused by: java.io.IOException: error=2, No such file or directory
15:56:33 [2020-09-22T19:56:33.771Z] 	at java.base/java.lang.ProcessImpl.forkAndExec(Native Method)
15:56:33 [2020-09-22T19:56:33.771Z] 	at java.base/java.lang.ProcessImpl.<init>(ProcessImpl.java:340)
15:56:33 [2020-09-22T19:56:33.771Z] 	at java.base/java.lang.ProcessImpl.start(ProcessImpl.java:271)
15:56:33 [2020-09-22T19:56:33.771Z] 	at java.base/java.lang.ProcessBuilder.start(ProcessBuilder.java:1107)
15:56:33 [2020-09-22T19:56:33.771Z] 	... 6 more
15:57:05 [2020-09-22T19:57:05.795Z] 
15:57:05 [2020-09-22T19:57:05.795Z] Finished test: javaFloatArray(org.eclipse.ease.lang.python.py4j.ShellModeEngineTest)
15:57:05 [2020-09-22T19:57:05.795Z] ----------------------------------------------
15:57:05 [2020-09-22T19:57:05.795Z] ----------------------------------------------
15:57:05 [2020-09-22T19:57:05.795Z] Starting test: implementJavaInterface(org.eclipse.ease.lang.python.py4j.ShellModeEngineTest)
15:57:05 [2020-09-22T19:57:05.795Z] 
15:57:05 [2020-09-22T19:57:05.795Z] !ENTRY org.eclipse.ease 4 0 2020-09-22 19:57:03.604
15:57:05 [2020-09-22T19:57:05.795Z] !MESSAGE Could not setup script engine
15:57:05 [2020-09-22T19:57:05.795Z] !STACK 0
15:57:05 [2020-09-22T19:57:05.795Z] org.eclipse.ease.ScriptEngineException: Failed to start Python process. Please check the setting for the Python interpreter in Preferences -> Scripting -> Python Scripting:
15:57:05 [2020-09-22T19:57:05.795Z] Cannot run program "python": error=2, No such file or directory
15:57:05 [2020-09-22T19:57:05.795Z] 	at org.eclipse.ease.lang.python.py4j.internal.Py4jScriptEngine.setupEngine(Py4jScriptEngine.java:139)
15:57:05 [2020-09-22T19:57:05.795Z] 	at org.eclipse.ease.AbstractScriptEngine.setupRun(AbstractScriptEngine.java:298)
15:57:05 [2020-09-22T19:57:05.795Z] 	at org.eclipse.ease.AbstractScriptEngine.run(AbstractScriptEngine.java:264)
15:57:05 [2020-09-22T19:57:05.795Z] 	at org.eclipse.core.internal.jobs.Worker.run(Worker.java:63)
15:57:05 [2020-09-22T19:57:05.795Z] Caused by: java.io.IOException: Cannot run program "python": error=2, No such file or directory
15:57:05 [2020-09-22T19:57:05.795Z] 	at java.base/java.lang.ProcessBuilder.start(ProcessBuilder.java:1128)
15:57:05 [2020-09-22T19:57:05.795Z] 	at java.base/java.lang.ProcessBuilder.start(ProcessBuilder.java:1071)
15:57:05 [2020-09-22T19:57:05.795Z] 	at org.eclipse.ease.lang.python.py4j.internal.Py4jScriptEngine.startPythonProcess(Py4jScriptEngine.java:179)
15:57:05 [2020-09-22T19:57:05.795Z] 	at org.eclipse.ease.lang.python.py4j.internal.Py4jScriptEngine.setupEngine(Py4jScriptEngine.java:122)
15:57:05 [2020-09-22T19:57:05.795Z] 	... 3 more
15:57:05 [2020-09-22T19:57:05.795Z] Caused by: java.io.IOException: error=2, No such file or directory
15:57:05 [2020-09-22T19:57:05.795Z] 	at java.base/java.lang.ProcessImpl.forkAndExec(Native Method)
15:57:05 [2020-09-22T19:57:05.795Z] 	at java.base/java.lang.ProcessImpl.<init>(ProcessImpl.java:340)
15:57:05 [2020-09-22T19:57:05.795Z] 	at java.base/java.lang.ProcessImpl.start(ProcessImpl.java:271)
15:57:05 [2020-09-22T19:57:05.795Z] 	at java.base/java.lang.ProcessBuilder.start(ProcessBuilder.java:1107)
15:57:05 [2020-09-22T19:57:05.795Z] 	... 6 more
15:57:05 [2020-09-22T19:57:05.795Z] 
15:57:05 [2020-09-22T19:57:05.795Z] !ENTRY org.eclipse.ease 4 0 2020-09-22 19:57:03.605
15:57:05 [2020-09-22T19:57:05.795Z] !MESSAGE Could not setup script engine
15:57:05 [2020-09-22T19:57:05.795Z] !STACK 0
15:57:05 [2020-09-22T19:57:05.795Z] org.eclipse.ease.ScriptEngineException: Failed to start Python process. Please check the setting for the Python interpreter in Preferences -> Scripting -> Python Scripting:
15:57:05 [2020-09-22T19:57:05.795Z] Cannot run program "python": error=2, No such file or directory
15:57:05 [2020-09-22T19:57:05.795Z] 	at org.eclipse.ease.lang.python.py4j.internal.Py4jScriptEngine.setupEngine(Py4jScriptEngine.java:139)
15:57:05 [2020-09-22T19:57:05.795Z] 	at org.eclipse.ease.AbstractScriptEngine.setupRun(AbstractScriptEngine.java:298)
15:57:05 [2020-09-22T19:57:05.795Z] 	at org.eclipse.ease.AbstractScriptEngine.run(AbstractScriptEngine.java:264)
15:57:05 [2020-09-22T19:57:05.795Z] 	at org.eclipse.core.internal.jobs.Worker.run(Worker.java:63)
15:57:05 [2020-09-22T19:57:05.795Z] Caused by: java.io.IOException: Cannot run program "python": error=2, No such file or directory
15:57:05 [2020-09-22T19:57:05.795Z] 	at java.base/java.lang.ProcessBuilder.start(ProcessBuilder.java:1128)
15:57:05 [2020-09-22T19:57:05.795Z] 	at java.base/java.lang.ProcessBuilder.start(ProcessBuilder.java:1071)
15:57:05 [2020-09-22T19:57:05.795Z] 	at org.eclipse.ease.lang.python.py4j.internal.Py4jScriptEngine.startPythonProcess(Py4jScriptEngine.java:179)
15:57:05 [2020-09-22T19:57:05.795Z] 	at org.eclipse.ease.lang.python.py4j.internal.Py4jScriptEngine.setupEngine(Py4jScriptEngine.java:122)
15:57:05 [2020-09-22T19:57:05.795Z] 	... 3 more
15:57:05 [2020-09-22T19:57:05.795Z] Caused by: java.io.IOException: error=2, No such file or directory
15:57:05 [2020-09-22T19:57:05.795Z] 	at java.base/java.lang.ProcessImpl.forkAndExec(Native Method)
15:57:05 [2020-09-22T19:57:05.795Z] 	at java.base/java.lang.ProcessImpl.<init>(ProcessImpl.java:340)
15:57:05 [2020-09-22T19:57:05.795Z] 	at java.base/java.lang.ProcessImpl.start(ProcessImpl.java:271)
15:57:05 [2020-09-22T19:57:05.795Z] 	at java.base/java.lang.ProcessBuilder.start(ProcessBuilder.java:1107)
15:57:05 [2020-09-22T19:57:05.795Z] 	... 6 more
15:57:37 [2020-09-22T19:57:37.816Z] 
15:57:37 [2020-09-22T19:57:37.816Z] Finished test: implementJavaInterface(org.eclipse.ease.lang.python.py4j.ShellModeEngineTest)
15:57:37 [2020-09-22T19:57:37.816Z] ----------------------------------------------
15:57:37 [2020-09-22T19:57:37.816Z] ----------------------------------------------
15:57:37 [2020-09-22T19:57:37.816Z] Starting test: pythonDict(org.eclipse.ease.lang.python.py4j.ShellModeEngineTest)
15:57:37 [2020-09-22T19:57:37.816Z] 
15:57:37 [2020-09-22T19:57:37.816Z] !ENTRY org.eclipse.ease 4 0 2020-09-22 19:57:33.608
15:57:37 [2020-09-22T19:57:37.816Z] !MESSAGE Could not setup script engine
15:57:37 [2020-09-22T19:57:37.816Z] !STACK 0
15:57:37 [2020-09-22T19:57:37.816Z] org.eclipse.ease.ScriptEngineException: Failed to start Python process. Please check the setting for the Python interpreter in Preferences -> Scripting -> Python Scripting:
15:57:37 [2020-09-22T19:57:37.816Z] Cannot run program "python": error=2, No such file or directory
15:57:37 [2020-09-22T19:57:37.816Z] 	at org.eclipse.ease.lang.python.py4j.internal.Py4jScriptEngine.setupEngine(Py4jScriptEngine.java:139)
15:57:37 [2020-09-22T19:57:37.816Z] 	at org.eclipse.ease.AbstractScriptEngine.setupRun(AbstractScriptEngine.java:298)
15:57:37 [2020-09-22T19:57:37.816Z] 	at org.eclipse.ease.AbstractScriptEngine.run(AbstractScriptEngine.java:264)
15:57:37 [2020-09-22T19:57:37.817Z] 	at org.eclipse.core.internal.jobs.Worker.run(Worker.java:63)
15:57:37 [2020-09-22T19:57:37.817Z] Caused by: java.io.IOException: Cannot run program "python": error=2, No such file or directory
15:57:37 [2020-09-22T19:57:37.817Z] 	at java.base/java.lang.ProcessBuilder.start(ProcessBuilder.java:1128)
15:57:37 [2020-09-22T19:57:37.817Z] 	at java.base/java.lang.ProcessBuilder.start(ProcessBuilder.java:1071)
15:57:37 [2020-09-22T19:57:37.817Z] 	at org.eclipse.ease.lang.python.py4j.internal.Py4jScriptEngine.startPythonProcess(Py4jScriptEngine.java:179)
15:57:37 [2020-09-22T19:57:37.817Z] 	at org.eclipse.ease.lang.python.py4j.internal.Py4jScriptEngine.setupEngine(Py4jScriptEngine.java:122)
15:57:37 [2020-09-22T19:57:37.817Z] 	... 3 more
15:57:37 [2020-09-22T19:57:37.817Z] Caused by: java.io.IOException: error=2, No such file or directory
15:57:37 [2020-09-22T19:57:37.817Z] 	at java.base/java.lang.ProcessImpl.forkAndExec(Native Method)
15:57:37 [2020-09-22T19:57:37.817Z] 	at java.base/java.lang.ProcessImpl.<init>(ProcessImpl.java:340)
15:57:37 [2020-09-22T19:57:37.817Z] 	at java.base/java.lang.ProcessImpl.start(ProcessImpl.java:271)
15:57:37 [2020-09-22T19:57:37.817Z] 	at java.base/java.lang.ProcessBuilder.start(ProcessBuilder.java:1107)
15:57:37 [2020-09-22T19:57:37.817Z] 	... 6 more
15:57:37 [2020-09-22T19:57:37.817Z] 
15:57:37 [2020-09-22T19:57:37.817Z] !ENTRY org.eclipse.ease 4 0 2020-09-22 19:57:33.609
15:57:37 [2020-09-22T19:57:37.817Z] !MESSAGE Could not setup script engine
15:57:37 [2020-09-22T19:57:37.817Z] !STACK 0
15:57:37 [2020-09-22T19:57:37.817Z] org.eclipse.ease.ScriptEngineException: Failed to start Python process. Please check the setting for the Python interpreter in Preferences -> Scripting -> Python Scripting:
15:57:37 [2020-09-22T19:57:37.817Z] Cannot run program "python": error=2, No such file or directory
15:57:37 [2020-09-22T19:57:37.817Z] 	at org.eclipse.ease.lang.python.py4j.internal.Py4jScriptEngine.setupEngine(Py4jScriptEngine.java:139)
15:57:37 [2020-09-22T19:57:37.817Z] 	at org.eclipse.ease.AbstractScriptEngine.setupRun(AbstractScriptEngine.java:298)
15:57:37 [2020-09-22T19:57:37.817Z] 	at org.eclipse.ease.AbstractScriptEngine.run(AbstractScriptEngine.java:264)
15:57:37 [2020-09-22T19:57:37.817Z] 	at org.eclipse.core.internal.jobs.Worker.run(Worker.java:63)
15:57:37 [2020-09-22T19:57:37.817Z] Caused by: java.io.IOException: Cannot run program "python": error=2, No such file or directory
15:57:37 [2020-09-22T19:57:37.817Z] 	at java.base/java.lang.ProcessBuilder.start(ProcessBuilder.java:1128)
15:57:37 [2020-09-22T19:57:37.817Z] 	at java.base/java.lang.ProcessBuilder.start(ProcessBuilder.java:1071)
15:57:37 [2020-09-22T19:57:37.817Z] 	at org.eclipse.ease.lang.python.py4j.internal.Py4jScriptEngine.startPythonProcess(Py4jScriptEngine.java:179)
15:57:37 [2020-09-22T19:57:37.817Z] 	at org.eclipse.ease.lang.python.py4j.internal.Py4jScriptEngine.setupEngine(Py4jScriptEngine.java:122)
15:57:37 [2020-09-22T19:57:37.817Z] 	... 3 more
15:57:37 [2020-09-22T19:57:37.817Z] Caused by: java.io.IOException: error=2, No such file or directory
15:57:37 [2020-09-22T19:57:37.817Z] 	at java.base/java.lang.ProcessImpl.forkAndExec(Native Method)
15:57:37 [2020-09-22T19:57:37.817Z] 	at java.base/java.lang.ProcessImpl.<init>(ProcessImpl.java:340)
15:57:37 [2020-09-22T19:57:37.817Z] 	at java.base/java.lang.ProcessImpl.start(ProcessImpl.java:271)
15:57:37 [2020-09-22T19:57:37.817Z] 	at java.base/java.lang.ProcessBuilder.start(ProcessBuilder.java:1107)
15:57:37 [2020-09-22T19:57:37.817Z] 	... 6 more
15:57:44 [2020-09-22T19:57:44.349Z] 
15:57:44 [2020-09-22T19:57:44.349Z] Finished test: pythonDict(org.eclipse.ease.lang.python.py4j.ShellModeEngineTest)
15:57:44 [2020-09-22T19:57:44.349Z] ----------------------------------------------
15:57:44 [2020-09-22T19:57:44.349Z] ----------------------------------------------
15:57:44 [2020-09-22T19:57:44.349Z] Starting test: pythonList(org.eclipse.ease.lang.python.py4j.ShellModeEngineTest)
15:57:44 [2020-09-22T19:57:44.349Z] 
15:57:44 [2020-09-22T19:57:44.349Z] !ENTRY org.eclipse.ease 4 0 2020-09-22 19:57:43.633
15:57:44 [2020-09-22T19:57:44.349Z] !MESSAGE Could not setup script engine
15:57:44 [2020-09-22T19:57:44.349Z] !STACK 0
15:57:44 [2020-09-22T19:57:44.349Z] org.eclipse.ease.ScriptEngineException: Failed to start Python process. Please check the setting for the Python interpreter in Preferences -> Scripting -> Python Scripting:
15:57:44 [2020-09-22T19:57:44.349Z] Cannot run program "python": error=2, No such file or directory
15:57:44 [2020-09-22T19:57:44.349Z] 	at org.eclipse.ease.lang.python.py4j.internal.Py4jScriptEngine.setupEngine(Py4jScriptEngine.java:139)
15:57:44 [2020-09-22T19:57:44.349Z] 	at org.eclipse.ease.AbstractScriptEngine.setupRun(AbstractScriptEngine.java:298)
15:57:44 [2020-09-22T19:57:44.349Z] 	at org.eclipse.ease.AbstractScriptEngine.run(AbstractScriptEngine.java:264)
15:57:44 [2020-09-22T19:57:44.349Z] 	at org.eclipse.core.internal.jobs.Worker.run(Worker.java:63)
15:57:44 [2020-09-22T19:57:44.349Z] Caused by: java.io.IOException: Cannot run program "python": error=2, No such file or directory
15:57:44 [2020-09-22T19:57:44.349Z] 	at java.base/java.lang.ProcessBuilder.start(ProcessBuilder.java:1128)
15:57:44 [2020-09-22T19:57:44.349Z] 	at java.base/java.lang.ProcessBuilder.start(ProcessBuilder.java:1071)
15:57:44 [2020-09-22T19:57:44.350Z] 	at org.eclipse.ease.lang.python.py4j.internal.Py4jScriptEngine.startPythonProcess(Py4jScriptEngine.java:179)
15:57:44 [2020-09-22T19:57:44.350Z] 	at org.eclipse.ease.lang.python.py4j.internal.Py4jScriptEngine.setupEngine(Py4jScriptEngine.java:122)
15:57:44 [2020-09-22T19:57:44.350Z] 	... 3 more
15:57:44 [2020-09-22T19:57:44.350Z] Caused by: java.io.IOException: error=2, No such file or directory
15:57:44 [2020-09-22T19:57:44.350Z] 	at java.base/java.lang.ProcessImpl.forkAndExec(Native Method)
15:57:44 [2020-09-22T19:57:44.350Z] 	at java.base/java.lang.ProcessImpl.<init>(ProcessImpl.java:340)
15:57:44 [2020-09-22T19:57:44.350Z] 	at java.base/java.lang.ProcessImpl.start(ProcessImpl.java:271)
15:57:44 [2020-09-22T19:57:44.350Z] 	at java.base/java.lang.ProcessBuilder.start(ProcessBuilder.java:1107)
15:57:44 [2020-09-22T19:57:44.350Z] 	... 6 more
15:57:44 [2020-09-22T19:57:44.350Z] 
15:57:44 [2020-09-22T19:57:44.350Z] !ENTRY org.eclipse.ease 4 0 2020-09-22 19:57:43.634
15:57:44 [2020-09-22T19:57:44.350Z] !MESSAGE Could not setup script engine
15:57:44 [2020-09-22T19:57:44.350Z] !STACK 0
15:57:44 [2020-09-22T19:57:44.350Z] org.eclipse.ease.ScriptEngineException: Failed to start Python process. Please check the setting for the Python interpreter in Preferences -> Scripting -> Python Scripting:
15:57:44 [2020-09-22T19:57:44.350Z] Cannot run program "python": error=2, No such file or directory
15:57:44 [2020-09-22T19:57:44.350Z] 	at org.eclipse.ease.lang.python.py4j.internal.Py4jScriptEngine.setupEngine(Py4jScriptEngine.java:139)
15:57:44 [2020-09-22T19:57:44.350Z] 	at org.eclipse.ease.AbstractScriptEngine.setupRun(AbstractScriptEngine.java:298)
15:57:44 [2020-09-22T19:57:44.350Z] 	at org.eclipse.ease.AbstractScriptEngine.run(AbstractScriptEngine.java:264)
15:57:44 [2020-09-22T19:57:44.350Z] 	at org.eclipse.core.internal.jobs.Worker.run(Worker.java:63)
15:57:44 [2020-09-22T19:57:44.350Z] Caused by: java.io.IOException: Cannot run program "python": error=2, No such file or directory
15:57:44 [2020-09-22T19:57:44.350Z] 	at java.base/java.lang.ProcessBuilder.start(ProcessBuilder.java:1128)
15:57:44 [2020-09-22T19:57:44.350Z] 	at java.base/java.lang.ProcessBuilder.start(ProcessBuilder.java:1071)
15:57:44 [2020-09-22T19:57:44.350Z] 	at org.eclipse.ease.lang.python.py4j.internal.Py4jScriptEngine.startPythonProcess(Py4jScriptEngine.java:179)
15:57:44 [2020-09-22T19:57:44.350Z] 	at org.eclipse.ease.lang.python.py4j.internal.Py4jScriptEngine.setupEngine(Py4jScriptEngine.java:122)
15:57:44 [2020-09-22T19:57:44.350Z] 	... 3 more
15:57:44 [2020-09-22T19:57:44.350Z] Caused by: java.io.IOException: error=2, No such file or directory
15:57:44 [2020-09-22T19:57:44.350Z] 	at java.base/java.lang.ProcessImpl.forkAndExec(Native Method)
15:57:44 [2020-09-22T19:57:44.350Z] 	at java.base/java.lang.ProcessImpl.<init>(ProcessImpl.java:340)
15:57:44 [2020-09-22T19:57:44.350Z] 	at java.base/java.lang.ProcessImpl.start(ProcessImpl.java:271)
15:57:44 [2020-09-22T19:57:44.350Z] 	at java.base/java.lang.ProcessBuilder.start(ProcessBuilder.java:1107)
15:57:44 [2020-09-22T19:57:44.350Z] 	... 6 more
15:57:54 [2020-09-22T19:57:54.292Z] 
15:57:54 [2020-09-22T19:57:54.292Z] Finished test: pythonList(org.eclipse.ease.lang.python.py4j.ShellModeEngineTest)
15:57:54 [2020-09-22T19:57:54.292Z] ----------------------------------------------
15:57:54 [2020-09-22T19:57:54.292Z] ----------------------------------------------
15:57:54 [2020-09-22T19:57:54.292Z] Starting test: testMultiple(org.eclipse.ease.lang.python.py4j.ShellModeEngineTest)
15:57:54 [2020-09-22T19:57:54.292Z] 
15:57:54 [2020-09-22T19:57:54.292Z] !ENTRY org.eclipse.ease 4 0 2020-09-22 19:57:53.657
15:57:54 [2020-09-22T19:57:54.292Z] !MESSAGE Could not setup script engine
15:57:54 [2020-09-22T19:57:54.292Z] !STACK 0
15:57:54 [2020-09-22T19:57:54.292Z] org.eclipse.ease.ScriptEngineException: Failed to start Python process. Please check the setting for the Python interpreter in Preferences -> Scripting -> Python Scripting:
15:57:54 [2020-09-22T19:57:54.292Z] Cannot run program "python": error=2, No such file or directory
15:57:54 [2020-09-22T19:57:54.292Z] 	at org.eclipse.ease.lang.python.py4j.internal.Py4jScriptEngine.setupEngine(Py4jScriptEngine.java:139)
15:57:54 [2020-09-22T19:57:54.292Z] 	at org.eclipse.ease.AbstractScriptEngine.setupRun(AbstractScriptEngine.java:298)
15:57:54 [2020-09-22T19:57:54.292Z] 	at org.eclipse.ease.AbstractScriptEngine.run(AbstractScriptEngine.java:264)
15:57:54 [2020-09-22T19:57:54.292Z] 	at org.eclipse.core.internal.jobs.Worker.run(Worker.java:63)
15:57:54 [2020-09-22T19:57:54.292Z] Caused by: java.io.IOException: Cannot run program "python": error=2, No such file or directory
15:57:54 [2020-09-22T19:57:54.292Z] 	at java.base/java.lang.ProcessBuilder.start(ProcessBuilder.java:1128)
15:57:54 [2020-09-22T19:57:54.292Z] 	at java.base/java.lang.ProcessBuilder.start(ProcessBuilder.java:1071)
15:57:54 [2020-09-22T19:57:54.292Z] 	at org.eclipse.ease.lang.python.py4j.internal.Py4jScriptEngine.startPythonProcess(Py4jScriptEngine.java:179)
15:57:54 [2020-09-22T19:57:54.292Z] 	at org.eclipse.ease.lang.python.py4j.internal.Py4jScriptEngine.setupEngine(Py4jScriptEngine.java:122)
15:57:54 [2020-09-22T19:57:54.292Z] 	... 3 more
15:57:54 [2020-09-22T19:57:54.292Z] Caused by: java.io.IOException: error=2, No such file or directory
15:57:54 [2020-09-22T19:57:54.292Z] 	at java.base/java.lang.ProcessImpl.forkAndExec(Native Method)
15:57:54 [2020-09-22T19:57:54.292Z] 	at java.base/java.lang.ProcessImpl.<init>(ProcessImpl.java:340)
15:57:54 [2020-09-22T19:57:54.292Z] 	at java.base/java.lang.ProcessImpl.start(ProcessImpl.java:271)
15:57:54 [2020-09-22T19:57:54.292Z] 	at java.base/java.lang.ProcessBuilder.start(ProcessBuilder.java:1107)
15:57:54 [2020-09-22T19:57:54.292Z] 	... 6 more
15:57:54 [2020-09-22T19:57:54.292Z] 
15:57:54 [2020-09-22T19:57:54.292Z] !ENTRY org.eclipse.ease 4 0 2020-09-22 19:57:53.658
15:57:54 [2020-09-22T19:57:54.292Z] !MESSAGE Could not setup script engine
15:57:54 [2020-09-22T19:57:54.292Z] !STACK 0
15:57:54 [2020-09-22T19:57:54.292Z] org.eclipse.ease.ScriptEngineException: Failed to start Python process. Please check the setting for the Python interpreter in Preferences -> Scripting -> Python Scripting:
15:57:54 [2020-09-22T19:57:54.292Z] Cannot run program "python": error=2, No such file or directory
15:57:54 [2020-09-22T19:57:54.292Z] 	at org.eclipse.ease.lang.python.py4j.internal.Py4jScriptEngine.setupEngine(Py4jScriptEngine.java:139)
15:57:54 [2020-09-22T19:57:54.292Z] 	at org.eclipse.ease.AbstractScriptEngine.setupRun(AbstractScriptEngine.java:298)
15:57:54 [2020-09-22T19:57:54.292Z] 	at org.eclipse.ease.AbstractScriptEngine.run(AbstractScriptEngine.java:264)
15:57:54 [2020-09-22T19:57:54.292Z] 	at org.eclipse.core.internal.jobs.Worker.run(Worker.java:63)
15:57:54 [2020-09-22T19:57:54.292Z] Caused by: java.io.IOException: Cannot run program "python": error=2, No such file or directory
15:57:54 [2020-09-22T19:57:54.292Z] 	at java.base/java.lang.ProcessBuilder.start(ProcessBuilder.java:1128)
15:57:54 [2020-09-22T19:57:54.292Z] 	at java.base/java.lang.ProcessBuilder.start(ProcessBuilder.java:1071)
15:57:54 [2020-09-22T19:57:54.292Z] 	at org.eclipse.ease.lang.python.py4j.internal.Py4jScriptEngine.startPythonProcess(Py4jScriptEngine.java:179)
15:57:54 [2020-09-22T19:57:54.292Z] 	at org.eclipse.ease.lang.python.py4j.internal.Py4jScriptEngine.setupEngine(Py4jScriptEngine.java:122)
15:57:54 [2020-09-22T19:57:54.292Z] 	... 3 more
15:57:54 [2020-09-22T19:57:54.292Z] Caused by: java.io.IOException: error=2, No such file or directory
15:57:54 [2020-09-22T19:57:54.292Z] 	at java.base/java.lang.ProcessImpl.forkAndExec(Native Method)
15:57:54 [2020-09-22T19:57:54.292Z] 	at java.base/java.lang.ProcessImpl.<init>(ProcessImpl.java:340)
15:57:54 [2020-09-22T19:57:54.292Z] 	at java.base/java.lang.ProcessImpl.start(ProcessImpl.java:271)
15:57:54 [2020-09-22T19:57:54.292Z] 	at java.base/java.lang.ProcessBuilder.start(ProcessBuilder.java:1107)
15:57:54 [2020-09-22T19:57:54.292Z] 	... 6 more
15:58:04 [2020-09-22T19:58:04.235Z] 
15:58:04 [2020-09-22T19:58:04.235Z] Finished test: testMultiple(org.eclipse.ease.lang.python.py4j.ShellModeEngineTest)
15:58:04 [2020-09-22T19:58:04.235Z] ----------------------------------------------
15:58:04 [2020-09-22T19:58:04.235Z] ----------------------------------------------
15:58:04 [2020-09-22T19:58:04.235Z] Starting test: javaLongArray(org.eclipse.ease.lang.python.py4j.ShellModeEngineTest)
15:58:04 [2020-09-22T19:58:04.235Z] 
15:58:04 [2020-09-22T19:58:04.235Z] !ENTRY org.eclipse.ease 4 0 2020-09-22 19:58:03.684
15:58:04 [2020-09-22T19:58:04.235Z] !MESSAGE Could not setup script engine
15:58:04 [2020-09-22T19:58:04.235Z] !STACK 0
15:58:04 [2020-09-22T19:58:04.235Z] org.eclipse.ease.ScriptEngineException: Failed to start Python process. Please check the setting for the Python interpreter in Preferences -> Scripting -> Python Scripting:
15:58:04 [2020-09-22T19:58:04.235Z] Cannot run program "python": error=2, No such file or directory
15:58:04 [2020-09-22T19:58:04.235Z] 	at org.eclipse.ease.lang.python.py4j.internal.Py4jScriptEngine.setupEngine(Py4jScriptEngine.java:139)
15:58:04 [2020-09-22T19:58:04.235Z] 	at org.eclipse.ease.AbstractScriptEngine.setupRun(AbstractScriptEngine.java:298)
15:58:04 [2020-09-22T19:58:04.235Z] 	at org.eclipse.ease.AbstractScriptEngine.run(AbstractScriptEngine.java:264)
15:58:04 [2020-09-22T19:58:04.235Z] 	at org.eclipse.core.internal.jobs.Worker.run(Worker.java:63)
15:58:04 [2020-09-22T19:58:04.235Z] Caused by: java.io.IOException: Cannot run program "python": error=2, No such file or directory
15:58:04 [2020-09-22T19:58:04.235Z] 	at java.base/java.lang.ProcessBuilder.start(ProcessBuilder.java:1128)
15:58:04 [2020-09-22T19:58:04.235Z] 	at java.base/java.lang.ProcessBuilder.start(ProcessBuilder.java:1071)
15:58:04 [2020-09-22T19:58:04.235Z] 	at org.eclipse.ease.lang.python.py4j.internal.Py4jScriptEngine.startPythonProcess(Py4jScriptEngine.java:179)
15:58:04 [2020-09-22T19:58:04.235Z] 	at org.eclipse.ease.lang.python.py4j.internal.Py4jScriptEngine.setupEngine(Py4jScriptEngine.java:122)
15:58:04 [2020-09-22T19:58:04.235Z] 	... 3 more
15:58:04 [2020-09-22T19:58:04.235Z] Caused by: java.io.IOException: error=2, No such file or directory
15:58:04 [2020-09-22T19:58:04.235Z] 	at java.base/java.lang.ProcessImpl.forkAndExec(Native Method)
15:58:04 [2020-09-22T19:58:04.235Z] 	at java.base/java.lang.ProcessImpl.<init>(ProcessImpl.java:340)
15:58:04 [2020-09-22T19:58:04.235Z] 	at java.base/java.lang.ProcessImpl.start(ProcessImpl.java:271)
15:58:04 [2020-09-22T19:58:04.235Z] 	at java.base/java.lang.ProcessBuilder.start(ProcessBuilder.java:1107)
15:58:04 [2020-09-22T19:58:04.235Z] 	... 6 more
15:58:04 [2020-09-22T19:58:04.235Z] 
15:58:04 [2020-09-22T19:58:04.235Z] !ENTRY org.eclipse.ease 4 0 2020-09-22 19:58:03.685
15:58:04 [2020-09-22T19:58:04.235Z] !MESSAGE Could not setup script engine
15:58:04 [2020-09-22T19:58:04.235Z] !STACK 0
15:58:04 [2020-09-22T19:58:04.235Z] org.eclipse.ease.ScriptEngineException: Failed to start Python process. Please check the setting for the Python interpreter in Preferences -> Scripting -> Python Scripting:
15:58:04 [2020-09-22T19:58:04.235Z] Cannot run program "python": error=2, No such file or directory
15:58:04 [2020-09-22T19:58:04.235Z] 	at org.eclipse.ease.lang.python.py4j.internal.Py4jScriptEngine.setupEngine(Py4jScriptEngine.java:139)
15:58:04 [2020-09-22T19:58:04.235Z] 	at org.eclipse.ease.AbstractScriptEngine.setupRun(AbstractScriptEngine.java:298)
15:58:04 [2020-09-22T19:58:04.235Z] 	at org.eclipse.ease.AbstractScriptEngine.run(AbstractScriptEngine.java:264)
15:58:04 [2020-09-22T19:58:04.235Z] 	at org.eclipse.core.internal.jobs.Worker.run(Worker.java:63)
15:58:04 [2020-09-22T19:58:04.235Z] Caused by: java.io.IOException: Cannot run program "python": error=2, No such file or directory
15:58:04 [2020-09-22T19:58:04.235Z] 	at java.base/java.lang.ProcessBuilder.start(ProcessBuilder.java:1128)
15:58:04 [2020-09-22T19:58:04.235Z] 	at java.base/java.lang.ProcessBuilder.start(ProcessBuilder.java:1071)
15:58:04 [2020-09-22T19:58:04.235Z] 	at org.eclipse.ease.lang.python.py4j.internal.Py4jScriptEngine.startPythonProcess(Py4jScriptEngine.java:179)
15:58:04 [2020-09-22T19:58:04.235Z] 	at org.eclipse.ease.lang.python.py4j.internal.Py4jScriptEngine.setupEngine(Py4jScriptEngine.java:122)
15:58:04 [2020-09-22T19:58:04.235Z] 	... 3 more
15:58:04 [2020-09-22T19:58:04.235Z] Caused by: java.io.IOException: error=2, No such file or directory
15:58:04 [2020-09-22T19:58:04.236Z] 	at java.base/java.lang.ProcessImpl.forkAndExec(Native Method)
15:58:04 [2020-09-22T19:58:04.236Z] 	at java.base/java.lang.ProcessImpl.<init>(ProcessImpl.java:340)
15:58:04 [2020-09-22T19:58:04.236Z] 	at java.base/java.lang.ProcessImpl.start(ProcessImpl.java:271)
15:58:04 [2020-09-22T19:58:04.236Z] 	at java.base/java.lang.ProcessBuilder.start(ProcessBuilder.java:1107)
15:58:04 [2020-09-22T19:58:04.236Z] 	... 6 more
15:58:14 [2020-09-22T19:58:14.175Z] 
15:58:14 [2020-09-22T19:58:14.175Z] Finished test: javaLongArray(org.eclipse.ease.lang.python.py4j.ShellModeEngineTest)
15:58:14 [2020-09-22T19:58:14.175Z] ----------------------------------------------
15:58:14 [2020-09-22T19:58:14.175Z] ----------------------------------------------
15:58:14 [2020-09-22T19:58:14.175Z] Starting test: createPythonObject(org.eclipse.ease.lang.python.py4j.ShellModeEngineTest)
15:58:14 [2020-09-22T19:58:14.175Z] 
15:58:14 [2020-09-22T19:58:14.175Z] !ENTRY org.eclipse.ease 4 0 2020-09-22 19:58:13.706
15:58:14 [2020-09-22T19:58:14.175Z] !MESSAGE Could not setup script engine
15:58:14 [2020-09-22T19:58:14.175Z] !STACK 0
15:58:14 [2020-09-22T19:58:14.175Z] org.eclipse.ease.ScriptEngineException: Failed to start Python process. Please check the setting for the Python interpreter in Preferences -> Scripting -> Python Scripting:
15:58:14 [2020-09-22T19:58:14.175Z] Cannot run program "python": error=2, No such file or directory
15:58:14 [2020-09-22T19:58:14.175Z] 	at org.eclipse.ease.lang.python.py4j.internal.Py4jScriptEngine.setupEngine(Py4jScriptEngine.java:139)
15:58:14 [2020-09-22T19:58:14.175Z] 	at org.eclipse.ease.AbstractScriptEngine.setupRun(AbstractScriptEngine.java:298)
15:58:14 [2020-09-22T19:58:14.175Z] 	at org.eclipse.ease.AbstractScriptEngine.run(AbstractScriptEngine.java:264)
15:58:14 [2020-09-22T19:58:14.175Z] 	at org.eclipse.core.internal.jobs.Worker.run(Worker.java:63)
15:58:14 [2020-09-22T19:58:14.175Z] Caused by: java.io.IOException: Cannot run program "python": error=2, No such file or directory
15:58:14 [2020-09-22T19:58:14.175Z] 	at java.base/java.lang.ProcessBuilder.start(ProcessBuilder.java:1128)
15:58:14 [2020-09-22T19:58:14.175Z] 	at java.base/java.lang.ProcessBuilder.start(ProcessBuilder.java:1071)
15:58:14 [2020-09-22T19:58:14.175Z] 	at org.eclipse.ease.lang.python.py4j.internal.Py4jScriptEngine.startPythonProcess(Py4jScriptEngine.java:179)
15:58:14 [2020-09-22T19:58:14.175Z] 	at org.eclipse.ease.lang.python.py4j.internal.Py4jScriptEngine.setupEngine(Py4jScriptEngine.java:122)
15:58:14 [2020-09-22T19:58:14.175Z] 	... 3 more
15:58:14 [2020-09-22T19:58:14.175Z] Caused by: java.io.IOException: error=2, No such file or directory
15:58:14 [2020-09-22T19:58:14.175Z] 	at java.base/java.lang.ProcessImpl.forkAndExec(Native Method)
15:58:14 [2020-09-22T19:58:14.175Z] 	at java.base/java.lang.ProcessImpl.<init>(ProcessImpl.java:340)
15:58:14 [2020-09-22T19:58:14.176Z] 	at java.base/java.lang.ProcessImpl.start(ProcessImpl.java:271)
15:58:14 [2020-09-22T19:58:14.176Z] 	at java.base/java.lang.ProcessBuilder.start(ProcessBuilder.java:1107)
15:58:14 [2020-09-22T19:58:14.176Z] 	... 6 more
15:58:14 [2020-09-22T19:58:14.176Z] 
15:58:14 [2020-09-22T19:58:14.176Z] !ENTRY org.eclipse.ease 4 0 2020-09-22 19:58:13.707
15:58:14 [2020-09-22T19:58:14.176Z] !MESSAGE Could not setup script engine
15:58:14 [2020-09-22T19:58:14.176Z] !STACK 0
15:58:14 [2020-09-22T19:58:14.176Z] org.eclipse.ease.ScriptEngineException: Failed to start Python process. Please check the setting for the Python interpreter in Preferences -> Scripting -> Python Scripting:
15:58:14 [2020-09-22T19:58:14.176Z] Cannot run program "python": error=2, No such file or directory
15:58:14 [2020-09-22T19:58:14.176Z] 	at org.eclipse.ease.lang.python.py4j.internal.Py4jScriptEngine.setupEngine(Py4jScriptEngine.java:139)
15:58:14 [2020-09-22T19:58:14.176Z] 	at org.eclipse.ease.AbstractScriptEngine.setupRun(AbstractScriptEngine.java:298)
15:58:14 [2020-09-22T19:58:14.176Z] 	at org.eclipse.ease.AbstractScriptEngine.run(AbstractScriptEngine.java:264)
15:58:14 [2020-09-22T19:58:14.176Z] 	at org.eclipse.core.internal.jobs.Worker.run(Worker.java:63)
15:58:14 [2020-09-22T19:58:14.176Z] Caused by: java.io.IOException: Cannot run program "python": error=2, No such file or directory
15:58:14 [2020-09-22T19:58:14.176Z] 	at java.base/java.lang.ProcessBuilder.start(ProcessBuilder.java:1128)
15:58:14 [2020-09-22T19:58:14.176Z] 	at java.base/java.lang.ProcessBuilder.start(ProcessBuilder.java:1071)
15:58:14 [2020-09-22T19:58:14.176Z] 	at org.eclipse.ease.lang.python.py4j.internal.Py4jScriptEngine.startPythonProcess(Py4jScriptEngine.java:179)
15:58:14 [2020-09-22T19:58:14.176Z] 	at org.eclipse.ease.lang.python.py4j.internal.Py4jScriptEngine.setupEngine(Py4jScriptEngine.java:122)
15:58:14 [2020-09-22T19:58:14.176Z] 	... 3 more
15:58:14 [2020-09-22T19:58:14.176Z] Caused by: java.io.IOException: error=2, No such file or directory
15:58:14 [2020-09-22T19:58:14.176Z] 	at java.base/java.lang.ProcessImpl.forkAndExec(Native Method)
15:58:14 [2020-09-22T19:58:14.176Z] 	at java.base/java.lang.ProcessImpl.<init>(ProcessImpl.java:340)
15:58:14 [2020-09-22T19:58:14.176Z] 	at java.base/java.lang.ProcessImpl.start(ProcessImpl.java:271)
15:58:14 [2020-09-22T19:58:14.176Z] 	at java.base/java.lang.ProcessBuilder.start(ProcessBuilder.java:1107)
15:58:14 [2020-09-22T19:58:14.176Z] 	... 6 more
15:58:24 [2020-09-22T19:58:24.120Z] 
15:58:24 [2020-09-22T19:58:24.120Z] Finished test: createPythonObject(org.eclipse.ease.lang.python.py4j.ShellModeEngineTest)
15:58:24 [2020-09-22T19:58:24.120Z] ----------------------------------------------
15:58:24 [2020-09-22T19:58:24.120Z] ----------------------------------------------
15:58:24 [2020-09-22T19:58:24.120Z] Starting test: pythonInteger(org.eclipse.ease.lang.python.py4j.ShellModeEngineTest)
15:58:24 [2020-09-22T19:58:24.120Z] 
15:58:24 [2020-09-22T19:58:24.120Z] !ENTRY org.eclipse.ease 4 0 2020-09-22 19:58:23.730
15:58:24 [2020-09-22T19:58:24.120Z] !MESSAGE Could not setup script engine
15:58:24 [2020-09-22T19:58:24.120Z] !STACK 0
15:58:24 [2020-09-22T19:58:24.120Z] org.eclipse.ease.ScriptEngineException: Failed to start Python process. Please check the setting for the Python interpreter in Preferences -> Scripting -> Python Scripting:
15:58:24 [2020-09-22T19:58:24.120Z] Cannot run program "python": error=2, No such file or directory
15:58:24 [2020-09-22T19:58:24.120Z] 	at org.eclipse.ease.lang.python.py4j.internal.Py4jScriptEngine.setupEngine(Py4jScriptEngine.java:139)
15:58:24 [2020-09-22T19:58:24.120Z] 	at org.eclipse.ease.AbstractScriptEngine.setupRun(AbstractScriptEngine.java:298)
15:58:24 [2020-09-22T19:58:24.120Z] 	at org.eclipse.ease.AbstractScriptEngine.run(AbstractScriptEngine.java:264)
15:58:24 [2020-09-22T19:58:24.120Z] 	at org.eclipse.core.internal.jobs.Worker.run(Worker.java:63)
15:58:24 [2020-09-22T19:58:24.120Z] Caused by: java.io.IOException: Cannot run program "python": error=2, No such file or directory
15:58:24 [2020-09-22T19:58:24.120Z] 	at java.base/java.lang.ProcessBuilder.start(ProcessBuilder.java:1128)
15:58:24 [2020-09-22T19:58:24.120Z] 	at java.base/java.lang.ProcessBuilder.start(ProcessBuilder.java:1071)
15:58:24 [2020-09-22T19:58:24.120Z] 	at org.eclipse.ease.lang.python.py4j.internal.Py4jScriptEngine.startPythonProcess(Py4jScriptEngine.java:179)
15:58:24 [2020-09-22T19:58:24.120Z] 	at org.eclipse.ease.lang.python.py4j.internal.Py4jScriptEngine.setupEngine(Py4jScriptEngine.java:122)
15:58:24 [2020-09-22T19:58:24.120Z] 	... 3 more
15:58:24 [2020-09-22T19:58:24.120Z] Caused by: java.io.IOException: error=2, No such file or directory
15:58:24 [2020-09-22T19:58:24.120Z] 	at java.base/java.lang.ProcessImpl.forkAndExec(Native Method)
15:58:24 [2020-09-22T19:58:24.120Z] 	at java.base/java.lang.ProcessImpl.<init>(ProcessImpl.java:340)
15:58:24 [2020-09-22T19:58:24.121Z] 	at java.base/java.lang.ProcessImpl.start(ProcessImpl.java:271)
15:58:24 [2020-09-22T19:58:24.121Z] 	at java.base/java.lang.ProcessBuilder.start(ProcessBuilder.java:1107)
15:58:24 [2020-09-22T19:58:24.121Z] 	... 6 more
15:58:24 [2020-09-22T19:58:24.121Z] 
15:58:24 [2020-09-22T19:58:24.121Z] !ENTRY org.eclipse.ease 4 0 2020-09-22 19:58:23.732
15:58:24 [2020-09-22T19:58:24.121Z] !MESSAGE Could not setup script engine
15:58:24 [2020-09-22T19:58:24.121Z] !STACK 0
15:58:24 [2020-09-22T19:58:24.121Z] org.eclipse.ease.ScriptEngineException: Failed to start Python process. Please check the setting for the Python interpreter in Preferences -> Scripting -> Python Scripting:
15:58:24 [2020-09-22T19:58:24.121Z] Cannot run program "python": error=2, No such file or directory
15:58:24 [2020-09-22T19:58:24.121Z] 	at org.eclipse.ease.lang.python.py4j.internal.Py4jScriptEngine.setupEngine(Py4jScriptEngine.java:139)
15:58:24 [2020-09-22T19:58:24.121Z] 	at org.eclipse.ease.AbstractScriptEngine.setupRun(AbstractScriptEngine.java:298)
15:58:24 [2020-09-22T19:58:24.121Z] 	at org.eclipse.ease.AbstractScriptEngine.run(AbstractScriptEngine.java:264)
15:58:24 [2020-09-22T19:58:24.121Z] 	at org.eclipse.core.internal.jobs.Worker.run(Worker.java:63)
15:58:24 [2020-09-22T19:58:24.121Z] Caused by: java.io.IOException: Cannot run program "python": error=2, No such file or directory
15:58:24 [2020-09-22T19:58:24.121Z] 	at java.base/java.lang.ProcessBuilder.start(ProcessBuilder.java:1128)
15:58:24 [2020-09-22T19:58:24.121Z] 	at java.base/java.lang.ProcessBuilder.start(ProcessBuilder.java:1071)
15:58:24 [2020-09-22T19:58:24.121Z] 	at org.eclipse.ease.lang.python.py4j.internal.Py4jScriptEngine.startPythonProcess(Py4jScriptEngine.java:179)
15:58:24 [2020-09-22T19:58:24.121Z] 	at org.eclipse.ease.lang.python.py4j.internal.Py4jScriptEngine.setupEngine(Py4jScriptEngine.java:122)
15:58:24 [2020-09-22T19:58:24.121Z] 	... 3 more
15:58:24 [2020-09-22T19:58:24.121Z] Caused by: java.io.IOException: error=2, No such file or directory
15:58:24 [2020-09-22T19:58:24.121Z] 	at java.base/java.lang.ProcessImpl.forkAndExec(Native Method)
15:58:24 [2020-09-22T19:58:24.121Z] 	at java.base/java.lang.ProcessImpl.<init>(ProcessImpl.java:340)
15:58:24 [2020-09-22T19:58:24.121Z] 	at java.base/java.lang.ProcessImpl.start(ProcessImpl.java:271)
15:58:24 [2020-09-22T19:58:24.121Z] 	at java.base/java.lang.ProcessBuilder.start(ProcessBuilder.java:1107)
15:58:24 [2020-09-22T19:58:24.121Z] 	... 6 more
15:58:34 [2020-09-22T19:58:34.060Z] 
15:58:34 [2020-09-22T19:58:34.060Z] Finished test: pythonInteger(org.eclipse.ease.lang.python.py4j.ShellModeEngineTest)
15:58:34 [2020-09-22T19:58:34.060Z] ----------------------------------------------
15:58:34 [2020-09-22T19:58:34.060Z] Tests run: 61, Failures: 55, Errors: 2, Skipped: 4, Time elapsed: 340.71 s <<< FAILURE! - in org.eclipse.ease.lang.python.py4j.ShellModeEngineTest
15:58:34 [2020-09-22T19:58:34.060Z] invalidSyntax(org.eclipse.ease.lang.python.py4j.ShellModeEngineTest)  Time elapsed: 10.03 s  <<< FAILURE!
15:58:34 [2020-09-22T19:58:34.060Z] java.lang.AssertionError: 
15:58:34 [2020-09-22T19:58:34.060Z] 
15:58:34 [2020-09-22T19:58:34.060Z] Expected: a string containing "SyntaxError"
15:58:34 [2020-09-22T19:58:34.060Z]      but: was ""
15:58:34 [2020-09-22T19:58:34.060Z] 	at org.eclipse.ease.lang.python.py4j.ShellModeEngineTest.invalidSyntax(ShellModeEngineTest.java:110)
15:58:34 [2020-09-22T19:58:34.060Z] 
15:58:34 [2020-09-22T19:58:34.060Z] invalidSyntax(org.eclipse.ease.lang.python.py4j.ShellModeEngineTest)  Time elapsed: 10.03 s  <<< FAILURE!
15:58:34 [2020-09-22T19:58:34.060Z] java.lang.AssertionError
15:58:34 [2020-09-22T19:58:34.060Z] 
15:58:34 [2020-09-22T19:58:34.060Z] print_(org.eclipse.ease.lang.python.py4j.ShellModeEngineTest) skipped
15:58:34 [2020-09-22T19:58:34.060Z] optionalModuleParameters(org.eclipse.ease.lang.python.py4j.ShellModeEngineTest)  Time elapsed: 10.026 s  <<< FAILURE!
15:58:34 [2020-09-22T19:58:34.060Z] java.lang.AssertionError: expected null, but was:<org.eclipse.ease.ScriptExecutionException: Engine got terminated>
15:58:34 [2020-09-22T19:58:34.060Z] 	at org.eclipse.ease.lang.python.py4j.ShellModeEngineTest.optionalModuleParameters(ShellModeEngineTest.java:52)
15:58:34 [2020-09-22T19:58:34.060Z] 
15:58:34 [2020-09-22T19:58:34.060Z] optionalModuleParameters(org.eclipse.ease.lang.python.py4j.ShellModeEngineTest)  Time elapsed: 10.026 s  <<< FAILURE!
15:58:34 [2020-09-22T19:58:34.060Z] java.lang.AssertionError
15:58:34 [2020-09-22T19:58:34.060Z] 
15:58:34 [2020-09-22T19:58:34.060Z] print_TextNoNewline(org.eclipse.ease.lang.python.py4j.ShellModeEngineTest) skipped
15:58:34 [2020-09-22T19:58:34.061Z] getScriptEngine(org.eclipse.ease.lang.python.py4j.ShellModeEngineTest)  Time elapsed: 10.023 s  <<< FAILURE!
15:58:34 [2020-09-22T19:58:34.061Z] java.lang.AssertionError: expected null, but was:<org.eclipse.ease.ScriptExecutionException: Engine got terminated>
15:58:34 [2020-09-22T19:58:34.061Z] 	at org.eclipse.ease.lang.python.py4j.ShellModeEngineTest.getScriptEngine(ShellModeEngineTest.java:58)
15:58:34 [2020-09-22T19:58:34.061Z] 
15:58:34 [2020-09-22T19:58:34.061Z] getScriptEngine(org.eclipse.ease.lang.python.py4j.ShellModeEngineTest)  Time elapsed: 10.023 s  <<< FAILURE!
15:58:34 [2020-09-22T19:58:34.061Z] java.lang.AssertionError
15:58:34 [2020-09-22T19:58:34.061Z] 
15:58:34 [2020-09-22T19:58:34.061Z] print_Text(org.eclipse.ease.lang.python.py4j.ShellModeEngineTest) skipped
15:58:34 [2020-09-22T19:58:34.061Z] callModuleCode(org.eclipse.ease.lang.python.py4j.ShellModeEngineTest)  Time elapsed: 10.029 s  <<< FAILURE!
15:58:34 [2020-09-22T19:58:34.061Z] java.lang.AssertionError: expected null, but was:<org.eclipse.ease.ScriptExecutionException: Engine got terminated>
15:58:34 [2020-09-22T19:58:34.061Z] 	at org.eclipse.ease.lang.python.py4j.ShellModeEngineTest.callModuleCode(ShellModeEngineTest.java:46)
15:58:34 [2020-09-22T19:58:34.061Z] 
15:58:34 [2020-09-22T19:58:34.061Z] callModuleCode(org.eclipse.ease.lang.python.py4j.ShellModeEngineTest)  Time elapsed: 10.029 s  <<< FAILURE!
15:58:34 [2020-09-22T19:58:34.061Z] java.lang.AssertionError
15:58:34 [2020-09-22T19:58:34.061Z] 
15:58:34 [2020-09-22T19:58:34.061Z] print_NoNewline(org.eclipse.ease.lang.python.py4j.ShellModeEngineTest) skipped
15:58:34 [2020-09-22T19:58:34.061Z] incompleteStatement(org.eclipse.ease.lang.python.py4j.ShellModeEngineTest)  Time elapsed: 10.025 s  <<< FAILURE!
15:58:34 [2020-09-22T19:58:34.061Z] java.lang.AssertionError: expected null, but was:<org.eclipse.ease.ScriptExecutionException: Engine got terminated>
15:58:34 [2020-09-22T19:58:34.061Z] 	at org.eclipse.ease.lang.python.py4j.ShellModeEngineTest.incompleteStatement(ShellModeEngineTest.java:92)
15:58:34 [2020-09-22T19:58:34.061Z] 
15:58:34 [2020-09-22T19:58:34.061Z] incompleteStatement(org.eclipse.ease.lang.python.py4j.ShellModeEngineTest)  Time elapsed: 10.025 s  <<< FAILURE!
15:58:34 [2020-09-22T19:58:34.061Z] java.lang.AssertionError
15:58:34 [2020-09-22T19:58:34.061Z] 
15:58:34 [2020-09-22T19:58:34.061Z] multiLineStatement(org.eclipse.ease.lang.python.py4j.ShellModeEngineTest)  Time elapsed: 10.021 s  <<< FAILURE!
15:58:34 [2020-09-22T19:58:34.061Z] java.lang.AssertionError: expected null, but was:<org.eclipse.ease.ScriptExecutionException: Engine got terminated>
15:58:34 [2020-09-22T19:58:34.061Z] 	at org.eclipse.ease.lang.python.py4j.ShellModeEngineTest.multiLineStatement(ShellModeEngineTest.java:97)
15:58:34 [2020-09-22T19:58:34.061Z] 
15:58:34 [2020-09-22T19:58:34.061Z] multiLineStatement(org.eclipse.ease.lang.python.py4j.ShellModeEngineTest)  Time elapsed: 10.022 s  <<< FAILURE!
15:58:34 [2020-09-22T19:58:34.061Z] java.lang.AssertionError
15:58:34 [2020-09-22T19:58:34.061Z] 
15:58:34 [2020-09-22T19:58:34.061Z] runtimeError(org.eclipse.ease.lang.python.py4j.ShellModeEngineTest)  Time elapsed: 10.026 s  <<< FAILURE!
15:58:34 [2020-09-22T19:58:34.061Z] java.lang.AssertionError: 
15:58:34 [2020-09-22T19:58:34.061Z] 
15:58:34 [2020-09-22T19:58:34.061Z] Expected: a string containing "NameError"
15:58:34 [2020-09-22T19:58:34.061Z]      but: was ""
15:58:34 [2020-09-22T19:58:34.061Z] 	at org.eclipse.ease.lang.python.py4j.ShellModeEngineTest.runtimeError(ShellModeEngineTest.java:118)
15:58:34 [2020-09-22T19:58:34.061Z] 
15:58:34 [2020-09-22T19:58:34.061Z] runtimeError(org.eclipse.ease.lang.python.py4j.ShellModeEngineTest)  Time elapsed: 10.026 s  <<< FAILURE!
15:58:34 [2020-09-22T19:58:34.061Z] java.lang.AssertionError
15:58:34 [2020-09-22T19:58:34.061Z] 
15:58:34 [2020-09-22T19:58:34.061Z] javaIntArray(org.eclipse.ease.lang.python.py4j.ShellModeEngineTest)  Time elapsed: 10.028 s  <<< FAILURE!
15:58:34 [2020-09-22T19:58:34.061Z] java.lang.AssertionError: expected null, but was:<org.eclipse.ease.ScriptExecutionException: Engine got terminated>
15:58:34 [2020-09-22T19:58:34.061Z] 	at org.eclipse.ease.lang.python.py4j.ShellModeEngineTest.executeCode(ShellModeEngineTest.java:38)
15:58:34 [2020-09-22T19:58:34.061Z] 
15:58:34 [2020-09-22T19:58:34.061Z] javaIntArray(org.eclipse.ease.lang.python.py4j.ShellModeEngineTest)  Time elapsed: 10.028 s  <<< FAILURE!
15:58:34 [2020-09-22T19:58:34.061Z] java.lang.AssertionError
15:58:34 [2020-09-22T19:58:34.061Z] 
15:58:34 [2020-09-22T19:58:34.061Z] javaDoubleArray(org.eclipse.ease.lang.python.py4j.ShellModeEngineTest)  Time elapsed: 10.021 s  <<< FAILURE!
15:58:34 [2020-09-22T19:58:34.061Z] java.lang.AssertionError: expected null, but was:<org.eclipse.ease.ScriptExecutionException: Engine got terminated>
15:58:34 [2020-09-22T19:58:34.061Z] 	at org.eclipse.ease.lang.python.py4j.ShellModeEngineTest.executeCode(ShellModeEngineTest.java:38)
15:58:34 [2020-09-22T19:58:34.061Z] 
15:58:34 [2020-09-22T19:58:34.061Z] javaDoubleArray(org.eclipse.ease.lang.python.py4j.ShellModeEngineTest)  Time elapsed: 10.021 s  <<< FAILURE!
15:58:34 [2020-09-22T19:58:34.061Z] java.lang.AssertionError
15:58:34 [2020-09-22T19:58:34.061Z] 
15:58:34 [2020-09-22T19:58:34.061Z] pythonSet(org.eclipse.ease.lang.python.py4j.ShellModeEngineTest)  Time elapsed: 10.025 s  <<< FAILURE!
15:58:34 [2020-09-22T19:58:34.061Z] java.lang.AssertionError: expected null, but was:<org.eclipse.ease.ScriptExecutionException: Engine got terminated>
15:58:34 [2020-09-22T19:58:34.061Z] 	at org.eclipse.ease.lang.python.py4j.ShellModeEngineTest.executeCode(ShellModeEngineTest.java:38)
15:58:34 [2020-09-22T19:58:34.061Z] 
15:58:34 [2020-09-22T19:58:34.061Z] pythonSet(org.eclipse.ease.lang.python.py4j.ShellModeEngineTest)  Time elapsed: 10.025 s  <<< FAILURE!
15:58:34 [2020-09-22T19:58:34.061Z] java.lang.AssertionError
15:58:34 [2020-09-22T19:58:34.061Z] 
15:58:34 [2020-09-22T19:58:34.061Z] javaStringArray(org.eclipse.ease.lang.python.py4j.ShellModeEngineTest)  Time elapsed: 10.023 s  <<< FAILURE!
15:58:34 [2020-09-22T19:58:34.061Z] java.lang.AssertionError: expected null, but was:<org.eclipse.ease.ScriptExecutionException: Engine got terminated>
15:58:34 [2020-09-22T19:58:34.061Z] 	at org.eclipse.ease.lang.python.py4j.ShellModeEngineTest.executeCode(ShellModeEngineTest.java:38)
15:58:34 [2020-09-22T19:58:34.061Z] 
15:58:34 [2020-09-22T19:58:34.061Z] javaStringArray(org.eclipse.ease.lang.python.py4j.ShellModeEngineTest)  Time elapsed: 10.023 s  <<< FAILURE!
15:58:34 [2020-09-22T19:58:34.061Z] java.lang.AssertionError
15:58:34 [2020-09-22T19:58:34.061Z] 
15:58:34 [2020-09-22T19:58:34.061Z] javaShortArray(org.eclipse.ease.lang.python.py4j.ShellModeEngineTest)  Time elapsed: 10.023 s  <<< FAILURE!
15:58:34 [2020-09-22T19:58:34.061Z] java.lang.AssertionError: expected null, but was:<org.eclipse.ease.ScriptExecutionException: Engine got terminated>
15:58:34 [2020-09-22T19:58:34.061Z] 	at org.eclipse.ease.lang.python.py4j.ShellModeEngineTest.executeCode(ShellModeEngineTest.java:38)
15:58:34 [2020-09-22T19:58:34.061Z] 
15:58:34 [2020-09-22T19:58:34.061Z] javaShortArray(org.eclipse.ease.lang.python.py4j.ShellModeEngineTest)  Time elapsed: 10.023 s  <<< FAILURE!
15:58:34 [2020-09-22T19:58:34.061Z] java.lang.AssertionError
15:58:34 [2020-09-22T19:58:34.061Z] 
15:58:34 [2020-09-22T19:58:34.061Z] javaBooleanArray(org.eclipse.ease.lang.python.py4j.ShellModeEngineTest)  Time elapsed: 10.028 s  <<< FAILURE!
15:58:34 [2020-09-22T19:58:34.061Z] java.lang.AssertionError
15:58:34 [2020-09-22T19:58:34.061Z] 
15:58:34 [2020-09-22T19:58:34.061Z] javaObjectArray(org.eclipse.ease.lang.python.py4j.ShellModeEngineTest)  Time elapsed: 10.023 s  <<< FAILURE!
15:58:34 [2020-09-22T19:58:34.061Z] java.lang.AssertionError: expected null, but was:<org.eclipse.ease.ScriptExecutionException: Engine got terminated>
15:58:34 [2020-09-22T19:58:34.061Z] 	at org.eclipse.ease.lang.python.py4j.ShellModeEngineTest.executeCode(ShellModeEngineTest.java:38)
15:58:34 [2020-09-22T19:58:34.061Z] 
15:58:34 [2020-09-22T19:58:34.061Z] javaObjectArray(org.eclipse.ease.lang.python.py4j.ShellModeEngineTest)  Time elapsed: 10.023 s  <<< FAILURE!
15:58:34 [2020-09-22T19:58:34.061Z] java.lang.AssertionError
15:58:34 [2020-09-22T19:58:34.061Z] 
15:58:34 [2020-09-22T19:58:34.061Z] javaIntegerArray(org.eclipse.ease.lang.python.py4j.ShellModeEngineTest)  Time elapsed: 10.023 s  <<< FAILURE!
15:58:34 [2020-09-22T19:58:34.061Z] java.lang.AssertionError: expected null, but was:<org.eclipse.ease.ScriptExecutionException: Engine got terminated>
15:58:34 [2020-09-22T19:58:34.061Z] 	at org.eclipse.ease.lang.python.py4j.ShellModeEngineTest.executeCode(ShellModeEngineTest.java:38)
15:58:34 [2020-09-22T19:58:34.061Z] 
15:58:34 [2020-09-22T19:58:34.061Z] javaIntegerArray(org.eclipse.ease.lang.python.py4j.ShellModeEngineTest)  Time elapsed: 10.023 s  <<< FAILURE!
15:58:34 [2020-09-22T19:58:34.061Z] java.lang.AssertionError
15:58:34 [2020-09-22T19:58:34.061Z] 
15:58:34 [2020-09-22T19:58:34.062Z] javaInteger(org.eclipse.ease.lang.python.py4j.ShellModeEngineTest)  Time elapsed: 10.028 s  <<< FAILURE!
15:58:34 [2020-09-22T19:58:34.062Z] java.lang.AssertionError: expected null, but was:<org.eclipse.ease.ScriptExecutionException: Engine got terminated>
15:58:34 [2020-09-22T19:58:34.062Z] 	at org.eclipse.ease.lang.python.py4j.ShellModeEngineTest.executeCode(ShellModeEngineTest.java:38)
15:58:34 [2020-09-22T19:58:34.062Z] 
15:58:34 [2020-09-22T19:58:34.062Z] javaInteger(org.eclipse.ease.lang.python.py4j.ShellModeEngineTest)  Time elapsed: 10.028 s  <<< FAILURE!
15:58:34 [2020-09-22T19:58:34.062Z] java.lang.AssertionError
15:58:34 [2020-09-22T19:58:34.062Z] 
15:58:34 [2020-09-22T19:58:34.062Z] javaString(org.eclipse.ease.lang.python.py4j.ShellModeEngineTest)  Time elapsed: 10.022 s  <<< FAILURE!
15:58:34 [2020-09-22T19:58:34.062Z] java.lang.AssertionError: expected null, but was:<org.eclipse.ease.ScriptExecutionException: Engine got terminated>
15:58:34 [2020-09-22T19:58:34.062Z] 	at org.eclipse.ease.lang.python.py4j.ShellModeEngineTest.executeCode(ShellModeEngineTest.java:38)
15:58:34 [2020-09-22T19:58:34.062Z] 
15:58:34 [2020-09-22T19:58:34.062Z] javaString(org.eclipse.ease.lang.python.py4j.ShellModeEngineTest)  Time elapsed: 10.022 s  <<< FAILURE!
15:58:34 [2020-09-22T19:58:34.062Z] java.lang.AssertionError
15:58:34 [2020-09-22T19:58:34.062Z] 
15:58:34 [2020-09-22T19:58:34.062Z] javaByteArray(org.eclipse.ease.lang.python.py4j.ShellModeEngineTest)  Time elapsed: 10.022 s  <<< FAILURE!
15:58:34 [2020-09-22T19:58:34.062Z] java.lang.AssertionError: expected null, but was:<org.eclipse.ease.ScriptExecutionException: Engine got terminated>
15:58:34 [2020-09-22T19:58:34.062Z] 	at org.eclipse.ease.lang.python.py4j.ShellModeEngineTest.executeCode(ShellModeEngineTest.java:38)
15:58:34 [2020-09-22T19:58:34.062Z] 
15:58:34 [2020-09-22T19:58:34.062Z] javaByteArray(org.eclipse.ease.lang.python.py4j.ShellModeEngineTest)  Time elapsed: 10.022 s  <<< FAILURE!
15:58:34 [2020-09-22T19:58:34.062Z] java.lang.AssertionError
15:58:34 [2020-09-22T19:58:34.062Z] 
15:58:34 [2020-09-22T19:58:34.062Z] createEclipseClass(org.eclipse.ease.lang.python.py4j.ShellModeEngineTest)  Time elapsed: 10.026 s  <<< FAILURE!
15:58:34 [2020-09-22T19:58:34.062Z] java.lang.AssertionError: expected null, but was:<org.eclipse.ease.ScriptExecutionException: Engine got terminated>
15:58:34 [2020-09-22T19:58:34.062Z] 	at org.eclipse.ease.lang.python.py4j.ShellModeEngineTest.executeCode(ShellModeEngineTest.java:38)
15:58:34 [2020-09-22T19:58:34.062Z] 
15:58:34 [2020-09-22T19:58:34.062Z] createEclipseClass(org.eclipse.ease.lang.python.py4j.ShellModeEngineTest)  Time elapsed: 10.026 s  <<< FAILURE!
15:58:34 [2020-09-22T19:58:34.062Z] java.lang.AssertionError
15:58:34 [2020-09-22T19:58:34.062Z] 
15:58:34 [2020-09-22T19:58:34.062Z] pythonString(org.eclipse.ease.lang.python.py4j.ShellModeEngineTest)  Time elapsed: 10.027 s  <<< FAILURE!
15:58:34 [2020-09-22T19:58:34.062Z] java.lang.AssertionError: expected null, but was:<org.eclipse.ease.ScriptExecutionException: Engine got terminated>
15:58:34 [2020-09-22T19:58:34.062Z] 	at org.eclipse.ease.lang.python.py4j.ShellModeEngineTest.executeCode(ShellModeEngineTest.java:38)
15:58:34 [2020-09-22T19:58:34.062Z] 
15:58:34 [2020-09-22T19:58:34.062Z] pythonString(org.eclipse.ease.lang.python.py4j.ShellModeEngineTest)  Time elapsed: 10.027 s  <<< FAILURE!
15:58:34 [2020-09-22T19:58:34.062Z] java.lang.AssertionError
15:58:34 [2020-09-22T19:58:34.062Z] 
15:58:34 [2020-09-22T19:58:34.062Z] varargs(org.eclipse.ease.lang.python.py4j.ShellModeEngineTest)  Time elapsed: 10.027 s  <<< FAILURE!
15:58:34 [2020-09-22T19:58:34.062Z] java.lang.AssertionError: expected null, but was:<org.eclipse.ease.ScriptExecutionException: Engine got terminated>
15:58:34 [2020-09-22T19:58:34.062Z] 	at org.eclipse.ease.lang.python.py4j.ShellModeEngineTest.executeCode(ShellModeEngineTest.java:38)
15:58:34 [2020-09-22T19:58:34.062Z] 
15:58:34 [2020-09-22T19:58:34.062Z] varargs(org.eclipse.ease.lang.python.py4j.ShellModeEngineTest)  Time elapsed: 10.027 s  <<< FAILURE!
15:58:34 [2020-09-22T19:58:34.062Z] java.lang.AssertionError
15:58:34 [2020-09-22T19:58:34.062Z] 
15:58:34 [2020-09-22T19:58:34.062Z] createJavaType(org.eclipse.ease.lang.python.py4j.ShellModeEngineTest)  Time elapsed: 10.026 s  <<< FAILURE!
15:58:34 [2020-09-22T19:58:34.062Z] java.lang.AssertionError: expected null, but was:<org.eclipse.ease.ScriptExecutionException: Engine got terminated>
15:58:34 [2020-09-22T19:58:34.062Z] 	at org.eclipse.ease.lang.python.py4j.ShellModeEngineTest.executeCode(ShellModeEngineTest.java:38)
15:58:34 [2020-09-22T19:58:34.062Z] 
15:58:34 [2020-09-22T19:58:34.062Z] createJavaType(org.eclipse.ease.lang.python.py4j.ShellModeEngineTest)  Time elapsed: 10.026 s  <<< FAILURE!
15:58:34 [2020-09-22T19:58:34.062Z] java.lang.AssertionError
15:58:34 [2020-09-22T19:58:34.062Z] 
15:58:34 [2020-09-22T19:58:34.062Z] javaFloatArray(org.eclipse.ease.lang.python.py4j.ShellModeEngineTest)  Time elapsed: 30.003 s  <<< ERROR!
15:58:34 [2020-09-22T19:58:34.062Z] org.junit.runners.model.TestTimedOutException: test timed out after 30000 milliseconds
15:58:34 [2020-09-22T19:58:34.062Z] 	at org.eclipse.ease.lang.python.py4j.ShellModeEngineTest.executeCode(ShellModeEngineTest.java:36)
15:58:34 [2020-09-22T19:58:34.062Z] 
15:58:34 [2020-09-22T19:58:34.062Z] implementJavaInterface(org.eclipse.ease.lang.python.py4j.ShellModeEngineTest)  Time elapsed: 30.002 s  <<< ERROR!
15:58:34 [2020-09-22T19:58:34.062Z] org.junit.runners.model.TestTimedOutException: test timed out after 30000 milliseconds
15:58:34 [2020-09-22T19:58:34.062Z] 	at org.eclipse.ease.lang.python.py4j.ShellModeEngineTest.executeCode(ShellModeEngineTest.java:31)
15:58:34 [2020-09-22T19:58:34.062Z] 
15:58:34 [2020-09-22T19:58:34.062Z] pythonDict(org.eclipse.ease.lang.python.py4j.ShellModeEngineTest)  Time elapsed: 10.028 s  <<< FAILURE!
15:58:34 [2020-09-22T19:58:34.062Z] java.lang.AssertionError: expected null, but was:<org.eclipse.ease.ScriptExecutionException: Engine got terminated>
15:58:34 [2020-09-22T19:58:34.062Z] 	at org.eclipse.ease.lang.python.py4j.ShellModeEngineTest.executeCode(ShellModeEngineTest.java:38)
15:58:34 [2020-09-22T19:58:34.062Z] 
15:58:34 [2020-09-22T19:58:34.062Z] pythonDict(org.eclipse.ease.lang.python.py4j.ShellModeEngineTest)  Time elapsed: 10.028 s  <<< FAILURE!
15:58:34 [2020-09-22T19:58:34.062Z] java.lang.AssertionError
15:58:34 [2020-09-22T19:58:34.062Z] 
15:58:34 [2020-09-22T19:58:34.062Z] pythonList(org.eclipse.ease.lang.python.py4j.ShellModeEngineTest)  Time elapsed: 10.024 s  <<< FAILURE!
15:58:34 [2020-09-22T19:58:34.062Z] java.lang.AssertionError: expected null, but was:<org.eclipse.ease.ScriptExecutionException: Engine got terminated>
15:58:34 [2020-09-22T19:58:34.062Z] 	at org.eclipse.ease.lang.python.py4j.ShellModeEngineTest.executeCode(ShellModeEngineTest.java:38)
15:58:34 [2020-09-22T19:58:34.062Z] 
15:58:34 [2020-09-22T19:58:34.062Z] pythonList(org.eclipse.ease.lang.python.py4j.ShellModeEngineTest)  Time elapsed: 10.024 s  <<< FAILURE!
15:58:34 [2020-09-22T19:58:34.062Z] java.lang.AssertionError
15:58:34 [2020-09-22T19:58:34.062Z] 
15:58:34 [2020-09-22T19:58:34.062Z] testMultiple(org.eclipse.ease.lang.python.py4j.ShellModeEngineTest)  Time elapsed: 10.025 s  <<< FAILURE!
15:58:34 [2020-09-22T19:58:34.062Z] java.lang.AssertionError: expected null, but was:<org.eclipse.ease.ScriptExecutionException: Engine got terminated>
15:58:34 [2020-09-22T19:58:34.062Z] 	at org.eclipse.ease.lang.python.py4j.ShellModeEngineTest.executeCode(ShellModeEngineTest.java:38)
15:58:34 [2020-09-22T19:58:34.062Z] 
15:58:34 [2020-09-22T19:58:34.062Z] testMultiple(org.eclipse.ease.lang.python.py4j.ShellModeEngineTest)  Time elapsed: 10.025 s  <<< FAILURE!
15:58:34 [2020-09-22T19:58:34.062Z] java.lang.AssertionError
15:58:34 [2020-09-22T19:58:34.062Z] 
15:58:34 [2020-09-22T19:58:34.062Z] javaLongArray(org.eclipse.ease.lang.python.py4j.ShellModeEngineTest)  Time elapsed: 10.025 s  <<< FAILURE!
15:58:34 [2020-09-22T19:58:34.062Z] java.lang.AssertionError: expected null, but was:<org.eclipse.ease.ScriptExecutionException: Engine got terminated>
15:58:34 [2020-09-22T19:58:34.062Z] 
15:58:34 [2020-09-22T19:58:34.062Z] javaLongArray(org.eclipse.ease.lang.python.py4j.ShellModeEngineTest)  Time elapsed: 10.025 s  <<< FAILURE!
15:58:34 [2020-09-22T19:58:34.062Z] java.lang.AssertionError
15:58:34 [2020-09-22T19:58:34.062Z] 
15:58:34 [2020-09-22T19:58:34.062Z] createPythonObject(org.eclipse.ease.lang.python.py4j.ShellModeEngineTest)  Time elapsed: 10.024 s  <<< FAILURE!
15:58:34 [2020-09-22T19:58:34.062Z] java.lang.AssertionError: expected null, but was:<org.eclipse.ease.ScriptExecutionException: Engine got terminated>
15:58:34 [2020-09-22T19:58:34.062Z] 
15:58:34 [2020-09-22T19:58:34.063Z] createPythonObject(org.eclipse.ease.lang.python.py4j.ShellModeEngineTest)  Time elapsed: 10.024 s  <<< FAILURE!
15:58:34 [2020-09-22T19:58:34.063Z] java.lang.AssertionError
15:58:34 [2020-09-22T19:58:34.063Z] 
15:58:34 [2020-09-22T19:58:34.063Z] pythonInteger(org.eclipse.ease.lang.python.py4j.ShellModeEngineTest)  Time elapsed: 10.024 s  <<< FAILURE!
15:58:34 [2020-09-22T19:58:34.063Z] java.lang.AssertionError: expected null, but was:<org.eclipse.ease.ScriptExecutionException: Engine got terminated>
15:58:34 [2020-09-22T19:58:34.063Z] 	at org.eclipse.ease.lang.python.py4j.ShellModeEngineTest.executeCode(ShellModeEngineTest.java:38)
15:58:34 [2020-09-22T19:58:34.063Z] 
15:58:34 [2020-09-22T19:58:34.063Z] pythonInteger(org.eclipse.ease.lang.python.py4j.ShellModeEngineTest)  Time elapsed: 10.024 s  <<< FAILURE!
15:58:34 [2020-09-22T19:58:34.063Z] java.lang.AssertionError
15:58:34 [2020-09-22T19:58:34.063Z] 
15:58:34 [2020-09-22T19:58:34.063Z] Running org.eclipse.ease.lang.python.py4j.Py4JEngineTest
15:58:34 [2020-09-22T19:58:34.063Z] Tests run: 3, Failures: 0, Errors: 0, Skipped: 3, Time elapsed: 0.001 s - in org.eclipse.ease.lang.python.py4j.Py4JEngineTest
15:58:34 [2020-09-22T19:58:34.063Z] print(org.eclipse.ease.lang.python.py4j.Py4JEngineTest) skipped
15:58:34 [2020-09-22T19:58:34.063Z] mixedMode(org.eclipse.ease.lang.python.py4j.Py4JEngineTest) skipped
15:58:34 [2020-09-22T19:58:34.063Z] cleanShutdown(org.eclipse.ease.lang.python.py4j.Py4JEngineTest) skipped
15:58:34 [2020-09-22T19:58:34.063Z] Running org.eclipse.ease.lang.python.py4j.Py4jDebugTest
15:58:34 [2020-09-22T19:58:34.063Z] WARNING: An illegal reflective access operation has occurred
15:58:34 [2020-09-22T19:58:34.063Z] WARNING: Illegal reflective access by org.mockito.cglib.core.ReflectUtils$2 (file:/home/jenkins/.m2/repository/p2/osgi/bundle/org.mockito/1.9.5.v201605172210/org.mockito-1.9.5.v201605172210.jar) to method java.lang.ClassLoader.defineClass(java.lang.String,byte[],int,int,java.security.ProtectionDomain)
15:58:34 [2020-09-22T19:58:34.063Z] WARNING: Please consider reporting this to the maintainers of org.mockito.cglib.core.ReflectUtils$2
15:58:34 [2020-09-22T19:58:34.063Z] WARNING: Use --illegal-access=warn to enable warnings of further illegal reflective access operations
15:58:34 [2020-09-22T19:58:34.063Z] WARNING: All illegal access operations will be denied in a future release
15:58:34 [2020-09-22T19:58:34.063Z] 
15:58:34 [2020-09-22T19:58:34.063Z] !ENTRY org.eclipse.ease 4 0 2020-09-22 19:58:33.879
15:58:34 [2020-09-22T19:58:34.063Z] !MESSAGE Could not setup script engine
15:58:34 [2020-09-22T19:58:34.063Z] !STACK 0
15:58:34 [2020-09-22T19:58:34.063Z] org.eclipse.ease.ScriptEngineException: Failed to start Python process. Please check the setting for the Python interpreter in Preferences -> Scripting -> Python Scripting:
15:58:34 [2020-09-22T19:58:34.063Z] Cannot run program "python": error=2, No such file or directory
15:58:34 [2020-09-22T19:58:34.063Z] 	at org.eclipse.ease.lang.python.py4j.internal.Py4jScriptEngine.setupEngine(Py4jScriptEngine.java:139)
15:58:34 [2020-09-22T19:58:34.063Z] 	at org.eclipse.ease.lang.python.py4j.internal.Py4jDebuggerEngine.setupEngine(Py4jDebuggerEngine.java:55)
15:58:34 [2020-09-22T19:58:34.063Z] 	at org.eclipse.ease.AbstractScriptEngine.setupRun(AbstractScriptEngine.java:298)
15:58:34 [2020-09-22T19:58:34.063Z] 	at org.eclipse.ease.AbstractScriptEngine.run(AbstractScriptEngine.java:264)
15:58:34 [2020-09-22T19:58:34.063Z] 	at org.eclipse.core.internal.jobs.Worker.run(Worker.java:63)
15:58:34 [2020-09-22T19:58:34.063Z] Caused by: java.io.IOException: Cannot run program "python": error=2, No such file or directory
15:58:34 [2020-09-22T19:58:34.063Z] 	at java.base/java.lang.ProcessBuilder.start(ProcessBuilder.java:1128)
15:58:34 [2020-09-22T19:58:34.063Z] 	at java.base/java.lang.ProcessBuilder.start(ProcessBuilder.java:1071)
15:58:34 [2020-09-22T19:58:34.063Z] 	at org.eclipse.ease.lang.python.py4j.internal.Py4jScriptEngine.startPythonProcess(Py4jScriptEngine.java:179)
15:58:34 [2020-09-22T19:58:34.063Z] 	at org.eclipse.ease.lang.python.py4j.internal.Py4jScriptEngine.setupEngine(Py4jScriptEngine.java:122)
15:58:34 [2020-09-22T19:58:34.063Z] 	... 4 more
15:58:34 [2020-09-22T19:58:34.063Z] Caused by: java.io.IOException: error=2, No such file or directory
15:58:34 [2020-09-22T19:58:34.063Z] 	at java.base/java.lang.ProcessImpl.forkAndExec(Native Method)
15:58:34 [2020-09-22T19:58:34.063Z] 	at java.base/java.lang.ProcessImpl.<init>(ProcessImpl.java:340)
15:58:34 [2020-09-22T19:58:34.063Z] 	at java.base/java.lang.ProcessImpl.start(ProcessImpl.java:271)
15:58:34 [2020-09-22T19:58:34.063Z] 	at java.base/java.lang.ProcessBuilder.start(ProcessBuilder.java:1107)
15:58:34 [2020-09-22T19:58:34.063Z] 	... 7 more
15:58:34 [2020-09-22T19:58:34.063Z] 
15:58:34 [2020-09-22T19:58:34.063Z] !ENTRY org.eclipse.ease 4 0 2020-09-22 19:58:33.880
15:58:34 [2020-09-22T19:58:34.063Z] !MESSAGE The debug session encountered an error
15:58:34 [2020-09-22T19:58:34.063Z] !STACK 0
15:58:34 [2020-09-22T19:58:34.063Z] java.lang.NullPointerException
15:58:34 [2020-09-22T19:58:34.063Z] 	at org.eclipse.ease.debugging.model.EaseDebugTarget.cleanupOnTermination(EaseDebugTarget.java:222)
15:58:34 [2020-09-22T19:58:34.063Z] 	at org.eclipse.ease.debugging.model.EaseDebugTarget.handleEvent(EaseDebugTarget.java:208)
15:58:34 [2020-09-22T19:58:34.063Z] 	at org.eclipse.ease.debugging.dispatcher.EventDispatchJob.handleEvent(EventDispatchJob.java:133)
15:58:34 [2020-09-22T19:58:34.063Z] 	at org.eclipse.ease.debugging.dispatcher.EventDispatchJob.run(EventDispatchJob.java:111)
15:58:34 [2020-09-22T19:58:34.063Z] 	at org.eclipse.core.internal.jobs.Worker.run(Worker.java:63)
15:58:34 [2020-09-22T19:58:34.063Z] 
15:58:34 [2020-09-22T19:58:34.063Z] !ENTRY org.eclipse.core.jobs 4 2 2020-09-22 19:58:33.907
15:58:34 [2020-09-22T19:58:34.063Z] !MESSAGE An internal error occurred during: "org.eclipse.ease.lang.python.py4j.internal.Py4jDebugger@6579c3d9 event dispatcher".
15:58:34 [2020-09-22T19:58:34.063Z] !STACK 0
15:58:34 [2020-09-22T19:58:34.063Z] java.lang.UnsatisfiedLinkError: Could not load SWT library. Reasons: 
15:58:34 [2020-09-22T19:58:34.063Z] 	no swt-pi4-gtk-4934r6 in java.library.path: [/usr/java/packages/lib, /usr/lib64, /lib64, /lib, /usr/lib]
15:58:34 [2020-09-22T19:58:34.063Z] 	no swt-pi4-gtk in java.library.path: [/usr/java/packages/lib, /usr/lib64, /lib64, /lib, /usr/lib]
15:58:34 [2020-09-22T19:58:34.063Z] 	Can't load library: /home/jenkins/.swt/lib/linux/x86_64/libswt-pi4-gtk-4934r6.so
15:58:34 [2020-09-22T19:58:34.063Z] 	Can't load library: /home/jenkins/.swt/lib/linux/x86_64/libswt-pi4-gtk.so
15:58:34 [2020-09-22T19:58:34.063Z] 
15:58:34 [2020-09-22T19:58:34.063Z] 	at org.eclipse.swt.internal.Library.loadLibrary(Library.java:342)
15:58:34 [2020-09-22T19:58:34.063Z] 	at org.eclipse.swt.internal.Library.loadLibrary(Library.java:256)
15:58:34 [2020-09-22T19:58:34.063Z] 	at org.eclipse.swt.internal.gtk.OS.<clinit>(OS.java:90)
15:58:34 [2020-09-22T19:58:34.063Z] 	at org.eclipse.swt.internal.Converter.wcsToMbcs(Converter.java:209)
15:58:34 [2020-09-22T19:58:34.063Z] 	at org.eclipse.swt.internal.Converter.wcsToMbcs(Converter.java:155)
15:58:34 [2020-09-22T19:58:34.063Z] 	at org.eclipse.swt.widgets.Display.<clinit>(Display.java:164)
15:58:34 [2020-09-22T19:58:34.063Z] 	at org.eclipse.ease.debugging.dispatcher.EventDispatchJob.run(EventDispatchJob.java:119)
15:58:34 [2020-09-22T19:58:34.063Z] 	at org.eclipse.core.internal.jobs.Worker.run(Worker.java:63)
15:58:42 [2020-09-22T19:58:42.145Z] 
15:58:42 [2020-09-22T19:58:42.145Z] !ENTRY org.eclipse.ease 4 0 2020-09-22 19:58:40.874
15:58:42 [2020-09-22T19:58:42.145Z] !MESSAGE Could not setup script engine
15:58:42 [2020-09-22T19:58:42.145Z] !STACK 0
15:58:42 [2020-09-22T19:58:42.145Z] org.eclipse.ease.ScriptEngineException: Failed to start Python process. Please check the setting for the Python interpreter in Preferences -> Scripting -> Python Scripting:
15:58:42 [2020-09-22T19:58:42.145Z] Cannot run program "python": error=2, No such file or directory
15:58:42 [2020-09-22T19:58:42.145Z] 	at org.eclipse.ease.lang.python.py4j.internal.Py4jScriptEngine.setupEngine(Py4jScriptEngine.java:139)
15:58:42 [2020-09-22T19:58:42.145Z] 	at org.eclipse.ease.lang.python.py4j.internal.Py4jDebuggerEngine.setupEngine(Py4jDebuggerEngine.java:55)
15:58:42 [2020-09-22T19:58:42.145Z] 	at org.eclipse.ease.AbstractScriptEngine.setupRun(AbstractScriptEngine.java:298)
15:58:42 [2020-09-22T19:58:42.145Z] 	at org.eclipse.ease.AbstractScriptEngine.run(AbstractScriptEngine.java:264)
15:58:42 [2020-09-22T19:58:42.145Z] 	at org.eclipse.core.internal.jobs.Worker.run(Worker.java:63)
15:58:42 [2020-09-22T19:58:42.145Z] Caused by: java.io.IOException: Cannot run program "python": error=2, No such file or directory
15:58:42 [2020-09-22T19:58:42.145Z] 	at java.base/java.lang.ProcessBuilder.start(ProcessBuilder.java:1128)
15:58:42 [2020-09-22T19:58:42.145Z] 	at java.base/java.lang.ProcessBuilder.start(ProcessBuilder.java:1071)
15:58:42 [2020-09-22T19:58:42.145Z] 	at org.eclipse.ease.lang.python.py4j.internal.Py4jScriptEngine.startPythonProcess(Py4jScriptEngine.java:179)
15:58:42 [2020-09-22T19:58:42.145Z] 	at org.eclipse.ease.lang.python.py4j.internal.Py4jScriptEngine.setupEngine(Py4jScriptEngine.java:122)
15:58:42 [2020-09-22T19:58:42.145Z] 	... 4 more
15:58:42 [2020-09-22T19:58:42.145Z] Caused by: java.io.IOException: error=2, No such file or directory
15:58:42 [2020-09-22T19:58:42.145Z] 	at java.base/java.lang.ProcessImpl.forkAndExec(Native Method)
15:58:42 [2020-09-22T19:58:42.145Z] 	at java.base/java.lang.ProcessImpl.<init>(ProcessImpl.java:340)
15:58:42 [2020-09-22T19:58:42.145Z] 	at java.base/java.lang.ProcessImpl.start(ProcessImpl.java:271)
15:58:42 [2020-09-22T19:58:42.145Z] 	at java.base/java.lang.ProcessBuilder.start(ProcessBuilder.java:1107)
15:58:42 [2020-09-22T19:58:42.145Z] 	... 7 more
15:58:42 [2020-09-22T19:58:42.145Z] 
15:58:42 [2020-09-22T19:58:42.145Z] !ENTRY org.eclipse.ease 4 0 2020-09-22 19:58:40.875
15:58:42 [2020-09-22T19:58:42.145Z] !MESSAGE Could not setup script engine
15:58:42 [2020-09-22T19:58:42.145Z] !STACK 0
15:58:42 [2020-09-22T19:58:42.145Z] org.eclipse.ease.ScriptEngineException: Failed to start Python process. Please check the setting for the Python interpreter in Preferences -> Scripting -> Python Scripting:
15:58:42 [2020-09-22T19:58:42.145Z] Cannot run program "python": error=2, No such file or directory
15:58:42 [2020-09-22T19:58:42.145Z] 	at org.eclipse.ease.lang.python.py4j.internal.Py4jScriptEngine.setupEngine(Py4jScriptEngine.java:139)
15:58:42 [2020-09-22T19:58:42.145Z] 	at org.eclipse.ease.lang.python.py4j.internal.Py4jDebuggerEngine.setupEngine(Py4jDebuggerEngine.java:55)
15:58:42 [2020-09-22T19:58:42.145Z] 	at org.eclipse.ease.AbstractScriptEngine.setupRun(AbstractScriptEngine.java:298)
15:58:42 [2020-09-22T19:58:42.145Z] 	at org.eclipse.ease.AbstractScriptEngine.run(AbstractScriptEngine.java:264)
15:58:42 [2020-09-22T19:58:42.145Z] 	at org.eclipse.core.internal.jobs.Worker.run(Worker.java:63)
15:58:42 [2020-09-22T19:58:42.145Z] Caused by: java.io.IOException: Cannot run program "python": error=2, No such file or directory
15:58:42 [2020-09-22T19:58:42.145Z] 	at java.base/java.lang.ProcessBuilder.start(ProcessBuilder.java:1128)
15:58:42 [2020-09-22T19:58:42.145Z] 	at java.base/java.lang.ProcessBuilder.start(ProcessBuilder.java:1071)
15:58:42 [2020-09-22T19:58:42.145Z] 	at org.eclipse.ease.lang.python.py4j.internal.Py4jScriptEngine.startPythonProcess(Py4jScriptEngine.java:179)
15:58:42 [2020-09-22T19:58:42.146Z] 	at org.eclipse.ease.lang.python.py4j.internal.Py4jScriptEngine.setupEngine(Py4jScriptEngine.java:122)
15:58:42 [2020-09-22T19:58:42.146Z] 	... 4 more
15:58:42 [2020-09-22T19:58:42.146Z] Caused by: java.io.IOException: error=2, No such file or directory
15:58:42 [2020-09-22T19:58:42.146Z] 	at java.base/java.lang.ProcessImpl.forkAndExec(Native Method)
15:58:42 [2020-09-22T19:58:42.146Z] 	at java.base/java.lang.ProcessImpl.<init>(ProcessImpl.java:340)
15:58:42 [2020-09-22T19:58:42.146Z] 	at java.base/java.lang.ProcessImpl.start(ProcessImpl.java:271)
15:58:42 [2020-09-22T19:58:42.146Z] 	at java.base/java.lang.ProcessBuilder.start(ProcessBuilder.java:1107)
15:58:42 [2020-09-22T19:58:42.146Z] 	... 7 more
16:42:49 [2020-09-22T20:42:49.879Z] Cancelling nested steps due to timeout
16:42:49 [2020-09-22T20:42:49.883Z] Sending interrupt signal to process
16:43:04 [2020-09-22T20:43:04.605Z] [INFO] ------------------------------------------------------------------------
16:43:04 [2020-09-22T20:43:04.605Z] [INFO] Reactor Summary:
16:43:04 [2020-09-22T20:43:04.605Z] [INFO] 
16:43:04 [2020-09-22T20:43:04.605Z] [INFO] org.eclipse.ease.releng 0.8.0-SNAPSHOT ............. SUCCESS [  6.386 s]
16:43:04 [2020-09-22T20:43:04.605Z] [INFO] org.eclipse.ease.classloader 0.8.0-SNAPSHOT ........ SUCCESS [  9.157 s]
16:43:04 [2020-09-22T20:43:04.605Z] [INFO] org.eclipse.ease 0.8.0-SNAPSHOT .................... SUCCESS [  3.557 s]
16:43:04 [2020-09-22T20:43:04.605Z] [INFO] org.eclipse.ease.ui 0.8.0-SNAPSHOT ................. SUCCESS [  3.818 s]
16:43:04 [2020-09-22T20:43:04.605Z] [INFO] org.eclipse.ease.ui.completions.java 0.8.0-SNAPSHOT  SUCCESS [  2.588 s]
16:43:04 [2020-09-22T20:43:04.605Z] [INFO] org.eclipse.ease.ui.scripts 0.8.0-SNAPSHOT ......... SUCCESS [  3.422 s]
16:43:04 [2020-09-22T20:43:04.605Z] [INFO] org.eclipse.ease.lang.javascript 0.8.0-SNAPSHOT .... SUCCESS [  1.977 s]
16:43:04 [2020-09-22T20:43:04.605Z] [INFO] org.eclipse.ease.lang.scriptarchive 0.8.0-SNAPSHOT . SUCCESS [  2.089 s]
16:43:04 [2020-09-22T20:43:04.605Z] [INFO] org.eclipse.ease.lang.python 0.8.0-SNAPSHOT ........ SUCCESS [  2.213 s]
16:43:04 [2020-09-22T20:43:04.605Z] [INFO] org.eclipse.ease.lang.python.py4j 0.8.0-SNAPSHOT ... SUCCESS [  2.234 s]
16:43:04 [2020-09-22T20:43:04.605Z] [INFO] org.eclipse.ease.lang.groovy 0.8.0-SNAPSHOT ........ SUCCESS [  1.798 s]
16:43:04 [2020-09-22T20:43:04.605Z] [INFO] org.eclipse.ease.lang.groovy.interpreter 0.8.0-SNAPSHOT SUCCESS [  1.902 s]
16:43:04 [2020-09-22T20:43:04.605Z] [INFO] org.eclipse.ease.lang.unittest 0.8.0-SNAPSHOT ...... SUCCESS [  7.703 s]
16:43:04 [2020-09-22T20:43:04.605Z] [INFO] org.eclipse.ease.lang.unittest.ui 0.8.0-SNAPSHOT ... SUCCESS [  4.051 s]
16:43:04 [2020-09-22T20:43:04.605Z] [INFO] org.eclipse.ease.lang.ruby 0.8.0-SNAPSHOT .......... SUCCESS [  2.109 s]
16:43:04 [2020-09-22T20:43:04.605Z] [INFO] org.eclipse.ease.lang.ruby.jruby 0.8.0-SNAPSHOT .... SUCCESS [  2.117 s]
16:43:04 [2020-09-22T20:43:04.605Z] [INFO] org.eclipse.ease.lang.javascript.nashorn 0.8.0-SNAPSHOT SUCCESS [  1.981 s]
16:43:04 [2020-09-22T20:43:04.605Z] [INFO] org.eclipse.ease.lang.javascript.rhino 0.8.0-SNAPSHOT SUCCESS [  2.419 s]
16:43:04 [2020-09-22T20:43:04.605Z] [INFO] org.eclipse.ease.lang.python.jython 0.8.0-SNAPSHOT . SUCCESS [  2.125 s]
16:43:04 [2020-09-22T20:43:04.605Z] [INFO] org.eclipse.ease.lang.javascript.ui 0.8.0-SNAPSHOT . SUCCESS [  1.990 s]
16:43:04 [2020-09-22T20:43:04.605Z] [INFO] org.eclipse.ease.lang.jvm.compiled 0.8.0-SNAPSHOT .. SUCCESS [  1.987 s]
16:43:04 [2020-09-22T20:43:04.605Z] [INFO] org.eclipse.ease.lang.scriptarchive.ui 0.8.0-SNAPSHOT SUCCESS [  2.012 s]
16:43:04 [2020-09-22T20:43:04.605Z] [INFO] org.eclipse.ease.help 0.8.0-SNAPSHOT ............... SUCCESS [ 11.966 s]
16:43:04 [2020-09-22T20:43:04.605Z] [INFO] org.eclipse.ease.feature 0.8.0-SNAPSHOT ............ SUCCESS [  0.217 s]
16:43:04 [2020-09-22T20:43:04.605Z] [INFO] org.eclipse.ease.ui.feature 0.8.0-SNAPSHOT ......... SUCCESS [  0.294 s]
16:43:04 [2020-09-22T20:43:04.605Z] [INFO] org.eclipse.ease.lang.javascript.feature 0.8.0-SNAPSHOT SUCCESS [  0.201 s]
16:43:04 [2020-09-22T20:43:04.605Z] [INFO] org.eclipse.ease.lang.python.feature 0.8.0-SNAPSHOT  SUCCESS [  0.229 s]
16:43:04 [2020-09-22T20:43:04.605Z] [INFO] org.eclipse.ease.python.jython.feature 0.8.0-SNAPSHOT SUCCESS [  0.248 s]
16:43:04 [2020-09-22T20:43:04.605Z] [INFO] org.eclipse.ease.lang.python.py4j.feature 0.8.0-SNAPSHOT SUCCESS [  0.233 s]
16:43:04 [2020-09-22T20:43:04.605Z] [INFO] org.eclipse.ease.lang.jvm.feature 0.8.0-SNAPSHOT ... SUCCESS [  0.207 s]
16:43:04 [2020-09-22T20:43:04.605Z] [INFO] org.eclipse.ease.lang.groovy.feature 0.8.0-SNAPSHOT  SUCCESS [  0.270 s]
16:43:04 [2020-09-22T20:43:04.605Z] [INFO] org.eclipse.ease.lang.ruby.feature 0.8.0-SNAPSHOT .. SUCCESS [  0.203 s]
16:43:04 [2020-09-22T20:43:04.605Z] [INFO] org.eclipse.ease.lang.scriptarchive.feature 0.8.0-SNAPSHOT SUCCESS [  0.206 s]
16:43:04 [2020-09-22T20:43:04.605Z] [INFO] org.eclipse.ease.lang.unittest.feature 0.8.0-SNAPSHOT SUCCESS [  0.206 s]
16:43:04 [2020-09-22T20:43:04.605Z] [INFO] org.eclipse.ease.releng.target 0.8.0-SNAPSHOT ...... SUCCESS [  0.102 s]
16:43:04 [2020-09-22T20:43:04.605Z] [INFO] org.eclipse.ease.releng.p2 0.8.0-SNAPSHOT .......... SUCCESS [  3.399 s]
16:43:04 [2020-09-22T20:43:04.605Z] [INFO] org.eclipse.ease.testhelper 0.8.0-SNAPSHOT ......... SUCCESS [  1.994 s]
16:43:04 [2020-09-22T20:43:04.605Z] [INFO] org.eclipse.ease.test 0.8.0-SNAPSHOT ............... SUCCESS [ 14.649 s]
16:43:04 [2020-09-22T20:43:04.605Z] [INFO] org.eclipse.ease.lang.javascript.nashorn.test 0.8.0-SNAPSHOT SUCCESS [  4.863 s]
16:43:04 [2020-09-22T20:43:04.605Z] [INFO] org.eclipse.ease.lang.javascript.rhino.test 0.8.0-SNAPSHOT SUCCESS [ 16.380 s]
16:43:04 [2020-09-22T20:43:04.605Z] [INFO] org.eclipse.ease.lang.javascript.test 0.8.0-SNAPSHOT SUCCESS [  4.330 s]
16:43:04 [2020-09-22T20:43:04.605Z] [INFO] org.eclipse.ease.lang.python.test 0.8.0-SNAPSHOT ... SUCCESS [  3.875 s]
16:43:04 [2020-09-22T20:43:04.605Z] [INFO] org.eclipse.ease.lang.python.jython.test 0.8.0-SNAPSHOT SUCCESS [ 17.169 s]
16:43:04 [2020-09-22T20:43:04.606Z] [INFO] org.eclipse.ease.lang.python.py4j.test 0.8.0-SNAPSHOT FAILURE [54:41 min]
16:43:04 [2020-09-22T20:43:04.606Z] [INFO] org.eclipse.ease.lang.scriptarchive.test 0.8.0-SNAPSHOT SKIPPED
16:43:04 [2020-09-22T20:43:04.606Z] [INFO] org.eclipse.ease.lang.unittest.test 0.8.0-SNAPSHOT . SKIPPED
16:43:04 [2020-09-22T20:43:04.606Z] [INFO] org.eclipse.ease.ui.test 0.8.0-SNAPSHOT ............ SKIPPED
16:43:04 [2020-09-22T20:43:04.606Z] [INFO] EASE (Incubation) 0.4.0-SNAPSHOT ................... SKIPPED
16:43:04 [2020-09-22T20:43:04.606Z] [INFO] ------------------------------------------------------------------------
16:43:04 [2020-09-22T20:43:04.606Z] [INFO] BUILD FAILURE
16:43:04 [2020-09-22T20:43:04.606Z] [INFO] ------------------------------------------------------------------------
16:43:04 [2020-09-22T20:43:04.606Z] [INFO] Total time:  59:49 min
16:43:04 [2020-09-22T20:43:04.606Z] [INFO] Finished at: 2020-09-22T20:42:50Z
16:43:04 [2020-09-22T20:43:04.606Z] [INFO] ------------------------------------------------------------------------
16:43:04 [2020-09-22T20:43:04.606Z] [INFO] [jenkins-event-spy] Generated /home/jenkins/agent/workspace/ease.verify.core.gerrit@tmp/withMaven9e89db1f/maven-spy-20200922-194300-51713696234991566432548.log
16:43:04 [2020-09-22T20:43:04.606Z] [ERROR] Failed to execute goal org.eclipse.tycho:tycho-surefire-plugin:1.5.0:test (default-test) on project org.eclipse.ease.lang.python.py4j.test: An unexpected error occured while launching the test runtime (return code 143). See log /home/jenkins/agent/workspace/ease.verify.core.gerrit/tests/org.eclipse.ease.lang.python.py4j.test/target/work/data/.metadata/.log for details. -> [Help 1]
16:43:04 [2020-09-22T20:43:04.606Z] org.apache.maven.lifecycle.LifecycleExecutionException: Failed to execute goal org.eclipse.tycho:tycho-surefire-plugin:1.5.0:test (default-test) on project org.eclipse.ease.lang.python.py4j.test: An unexpected error occured while launching the test runtime (return code 143). See log /home/jenkins/agent/workspace/ease.verify.core.gerrit/tests/org.eclipse.ease.lang.python.py4j.test/target/work/data/.metadata/.log for details.
16:43:04 [2020-09-22T20:43:04.606Z]     at org.apache.maven.lifecycle.internal.MojoExecutor.execute (MojoExecutor.java:215)
16:43:04 [2020-09-22T20:43:04.606Z]     at org.apache.maven.lifecycle.internal.MojoExecutor.execute (MojoExecutor.java:156)
16:43:04 [2020-09-22T20:43:04.606Z]     at org.apache.maven.lifecycle.internal.MojoExecutor.execute (MojoExecutor.java:148)
16:43:04 [2020-09-22T20:43:04.606Z]     at org.apache.maven.lifecycle.internal.LifecycleModuleBuilder.buildProject (LifecycleModuleBuilder.java:117)
16:43:04 [2020-09-22T20:43:04.606Z]     at org.apache.maven.lifecycle.internal.LifecycleModuleBuilder.buildProject (LifecycleModuleBuilder.java:81)
16:43:04 [2020-09-22T20:43:04.606Z]     at org.apache.maven.lifecycle.internal.builder.singlethreaded.SingleThreadedBuilder.build (SingleThreadedBuilder.java:56)
16:43:04 [2020-09-22T20:43:04.606Z]     at org.apache.maven.lifecycle.internal.LifecycleStarter.execute (LifecycleStarter.java:128)
16:43:04 [2020-09-22T20:43:04.606Z]     at org.apache.maven.DefaultMaven.doExecute (DefaultMaven.java:305)
16:43:04 [2020-09-22T20:43:04.606Z]     at org.apache.maven.DefaultMaven.doExecute (DefaultMaven.java:192)
16:43:04 [2020-09-22T20:43:04.606Z]     at org.apache.maven.DefaultMaven.execute (DefaultMaven.java:105)
16:43:04 [2020-09-22T20:43:04.606Z]     at org.apache.maven.cli.MavenCli.execute (MavenCli.java:957)
16:43:04 [2020-09-22T20:43:04.606Z]     at org.apache.maven.cli.MavenCli.doMain (MavenCli.java:289)
16:43:04 [2020-09-22T20:43:04.606Z]     at org.apache.maven.cli.MavenCli.main (MavenCli.java:193)
16:43:04 [2020-09-22T20:43:04.606Z]     at jdk.internal.reflect.NativeMethodAccessorImpl.invoke0 (Native Method)
16:43:04 [2020-09-22T20:43:04.606Z]     at jdk.internal.reflect.NativeMethodAccessorImpl.invoke (NativeMethodAccessorImpl.java:62)
16:43:04 [2020-09-22T20:43:04.606Z]     at jdk.internal.reflect.DelegatingMethodAccessorImpl.invoke (DelegatingMethodAccessorImpl.java:43)
16:43:04 [2020-09-22T20:43:04.606Z]     at java.lang.reflect.Method.invoke (Method.java:566)
16:43:04 [2020-09-22T20:43:04.606Z]     at org.codehaus.plexus.classworlds.launcher.Launcher.launchEnhanced (Launcher.java:282)
16:43:04 [2020-09-22T20:43:04.606Z]     at org.codehaus.plexus.classworlds.launcher.Launcher.launch (Launcher.java:225)
16:43:04 [2020-09-22T20:43:04.606Z]     at org.codehaus.plexus.classworlds.launcher.Launcher.mainWithExitCode (Launcher.java:406)
16:43:04 [2020-09-22T20:43:04.606Z]     at org.codehaus.plexus.classworlds.launcher.Launcher.main (Launcher.java:347)
16:43:04 [2020-09-22T20:43:04.606Z] Caused by: org.apache.maven.plugin.MojoFailureException: An unexpected error occured while launching the test runtime (return code 143). See log /home/jenkins/agent/workspace/ease.verify.core.gerrit/tests/org.eclipse.ease.lang.python.py4j.test/target/work/data/.metadata/.log for details.
16:43:04 [2020-09-22T20:43:04.606Z]     at org.eclipse.tycho.surefire.TestMojo.runTest (TestMojo.java:1056)
16:43:04 [2020-09-22T20:43:04.606Z]     at org.eclipse.tycho.surefire.TestMojo.execute (TestMojo.java:702)
16:43:04 [2020-09-22T20:43:04.606Z]     at org.apache.maven.plugin.DefaultBuildPluginManager.executeMojo (DefaultBuildPluginManager.java:137)
16:43:04 [2020-09-22T20:43:04.606Z]     at org.apache.maven.lifecycle.internal.MojoExecutor.execute (MojoExecutor.java:210)
16:43:04 [2020-09-22T20:43:04.606Z]     at org.apache.maven.lifecycle.internal.MojoExecutor.execute (MojoExecutor.java:156)
16:43:04 [2020-09-22T20:43:04.606Z]     at org.apache.maven.lifecycle.internal.MojoExecutor.execute (MojoExecutor.java:148)
16:43:04 [2020-09-22T20:43:04.606Z]     at org.apache.maven.lifecycle.internal.LifecycleModuleBuilder.buildProject (LifecycleModuleBuilder.java:117)
16:43:04 [2020-09-22T20:43:04.606Z]     at org.apache.maven.lifecycle.internal.LifecycleModuleBuilder.buildProject (LifecycleModuleBuilder.java:81)
16:43:04 [2020-09-22T20:43:04.606Z]     at org.apache.maven.lifecycle.internal.builder.singlethreaded.SingleThreadedBuilder.build (SingleThreadedBuilder.java:56)
16:43:04 [2020-09-22T20:43:04.606Z]     at org.apache.maven.lifecycle.internal.LifecycleStarter.execute (LifecycleStarter.java:128)
16:43:04 [2020-09-22T20:43:04.606Z]     at org.apache.maven.DefaultMaven.doExecute (DefaultMaven.java:305)
16:43:04 [2020-09-22T20:43:04.606Z]     at org.apache.maven.DefaultMaven.doExecute (DefaultMaven.java:192)
16:43:04 [2020-09-22T20:43:04.606Z]     at org.apache.maven.DefaultMaven.execute (DefaultMaven.java:105)
16:43:04 [2020-09-22T20:43:04.606Z]     at org.apache.maven.cli.MavenCli.execute (MavenCli.java:957)
16:43:04 [2020-09-22T20:43:04.606Z]     at org.apache.maven.cli.MavenCli.doMain (MavenCli.java:289)
16:43:04 [2020-09-22T20:43:04.606Z]     at org.apache.maven.cli.MavenCli.main (MavenCli.java:193)
16:43:04 [2020-09-22T20:43:04.606Z]     at jdk.internal.reflect.NativeMethodAccessorImpl.invoke0 (Native Method)
16:43:04 [2020-09-22T20:43:04.606Z]     at jdk.internal.reflect.NativeMethodAccessorImpl.invoke (NativeMethodAccessorImpl.java:62)
16:43:04 [2020-09-22T20:43:04.606Z]     at jdk.internal.reflect.DelegatingMethodAccessorImpl.invoke (DelegatingMethodAccessorImpl.java:43)
16:43:04 [2020-09-22T20:43:04.606Z]     at java.lang.reflect.Method.invoke (Method.java:566)
16:43:04 [2020-09-22T20:43:04.606Z]     at org.codehaus.plexus.classworlds.launcher.Launcher.launchEnhanced (Launcher.java:282)
16:43:04 [2020-09-22T20:43:04.606Z]     at org.codehaus.plexus.classworlds.launcher.Launcher.launch (Launcher.java:225)
16:43:04 [2020-09-22T20:43:04.606Z]     at org.codehaus.plexus.classworlds.launcher.Launcher.mainWithExitCode (Launcher.java:406)
16:43:04 [2020-09-22T20:43:04.606Z]     at org.codehaus.plexus.classworlds.launcher.Launcher.main (Launcher.java:347)
16:43:04 [2020-09-22T20:43:04.606Z] [ERROR] 
16:43:04 [2020-09-22T20:43:04.606Z] [ERROR] 
16:43:04 [2020-09-22T20:43:04.606Z] [ERROR] For more information about the errors and possible solutions, please read the following articles:
16:43:04 [2020-09-22T20:43:04.606Z] [ERROR] [Help 1] http://cwiki.apache.org/confluence/display/MAVEN/MojoFailureException
16:43:04 [2020-09-22T20:43:04.606Z] [ERROR] 
16:43:04 [2020-09-22T20:43:04.606Z] [ERROR] After correcting the problems, you can resume the build with the command
16:43:04 [2020-09-22T20:43:04.606Z] [ERROR]   mvn <args> -rf :org.eclipse.ease.lang.python.py4j.test
16:43:04 [2020-09-22T20:43:04.610Z] script returned exit code 143
[Pipeline] }
16:43:05 [2020-09-22T20:43:05.885Z] [withMaven] Publishers: Pipeline Graph Publisher: 29 ms, Invoker Publisher: 1 ms, Junit Publisher: 1 ms, Concordion Publisher: 1 ms, Dependencies Fingerprint Publisher: 1088 ms, Findbugs Publisher: 1 ms
[Pipeline] // withMaven
[Pipeline] }
[Pipeline] // stage
[Pipeline] }
16:43:05 [2020-09-22T20:43:05.948Z] Failed in branch EASE Core
[Pipeline] // parallel
[Pipeline] }
[Pipeline] // stage
[Pipeline] }
[Pipeline] // timeout
[Pipeline] }
[Pipeline] // timestamps
[Pipeline] }
[Pipeline] // node
[Pipeline] End of Pipeline
Timeout has been exceeded
Finished: ABORTED