FailedConsole Output

Skipping 530 KB.. Full Log
pse.ease.lang.scriptarchive/target/classes
10:02:18 [2020-09-22T14:02:18.801Z] [INFO] 
10:02:18 [2020-09-22T14:02:18.801Z] [INFO] --- maven-resources-plugin:2.4.3:testResources (default-testResources) @ org.eclipse.ease.lang.scriptarchive ---
10:02:18 [2020-09-22T14:02:18.801Z] [INFO] Using 'UTF-8' encoding to copy filtered resources.
10:02:18 [2020-09-22T14:02:18.801Z] [INFO] skip non existing resourceDirectory /home/jenkins/agent/workspace/ease.verify.core.gerrit/plugins/org.eclipse.ease.lang.scriptarchive/src/test/resources
10:02:18 [2020-09-22T14:02:18.801Z] [INFO] 
10:02:18 [2020-09-22T14:02:18.801Z] [INFO] --- tycho-source-plugin:1.3.0:plugin-source (plugin-source) @ org.eclipse.ease.lang.scriptarchive ---
10:02:18 [2020-09-22T14:02:18.801Z] [INFO] Building jar: /home/jenkins/agent/workspace/ease.verify.core.gerrit/plugins/org.eclipse.ease.lang.scriptarchive/target/org.eclipse.ease.lang.scriptarchive-0.8.0-SNAPSHOT-sources.jar
10:02:18 [2020-09-22T14:02:18.801Z] [INFO] 
10:02:18 [2020-09-22T14:02:18.801Z] [INFO] --- target-platform-configuration:1.3.0:target-platform (default-target-platform) @ org.eclipse.ease.lang.scriptarchive ---
10:02:18 [2020-09-22T14:02:18.801Z] [INFO] 
10:02:18 [2020-09-22T14:02:18.801Z] [INFO] --- tycho-packaging-plugin:1.3.0:package-plugin (default-package-plugin) @ org.eclipse.ease.lang.scriptarchive ---
10:02:18 [2020-09-22T14:02:18.801Z] [INFO] Building jar: /home/jenkins/agent/workspace/ease.verify.core.gerrit/plugins/org.eclipse.ease.lang.scriptarchive/target/org.eclipse.ease.lang.scriptarchive-0.8.0-SNAPSHOT.jar
10:02:18 [2020-09-22T14:02:18.802Z] [INFO] 
10:02:18 [2020-09-22T14:02:18.802Z] [INFO] --- tycho-p2-plugin:1.3.0:p2-metadata-default (default-p2-metadata-default) @ org.eclipse.ease.lang.scriptarchive ---
10:02:18 [2020-09-22T14:02:18.802Z] [INFO] 
10:02:18 [2020-09-22T14:02:18.802Z] [INFO] --- tycho-source-feature-plugin:1.3.0:source-feature (source-feature) @ org.eclipse.ease.lang.scriptarchive ---
10:02:18 [2020-09-22T14:02:18.802Z] [INFO] 
10:02:18 [2020-09-22T14:02:18.802Z] [INFO] --- tycho-p2-plugin:1.3.0:p2-metadata (attached-p2-metadata) @ org.eclipse.ease.lang.scriptarchive ---
10:02:18 [2020-09-22T14:02:18.802Z] [INFO] 
10:02:18 [2020-09-22T14:02:18.802Z] [INFO] -----------< org.eclipse.ease:org.eclipse.ease.lang.python >------------
10:02:18 [2020-09-22T14:02:18.802Z] [INFO] Building org.eclipse.ease.lang.python 0.8.0-SNAPSHOT              [9/49]
10:02:18 [2020-09-22T14:02:18.802Z] [INFO] ---------------------------[ eclipse-plugin ]---------------------------
10:02:18 [2020-09-22T14:02:18.802Z] [INFO] 
10:02:18 [2020-09-22T14:02:18.802Z] [INFO] --- maven-clean-plugin:2.5:clean (default-clean) @ org.eclipse.ease.lang.python ---
10:02:18 [2020-09-22T14:02:18.802Z] [INFO] 
10:02:18 [2020-09-22T14:02:18.802Z] [INFO] --- tycho-packaging-plugin:1.3.0:build-qualifier (default-build-qualifier) @ org.eclipse.ease.lang.python ---
10:02:18 [2020-09-22T14:02:18.802Z] [INFO] The project's OSGi version is 0.8.0.I202006231119
10:02:18 [2020-09-22T14:02:18.802Z] [INFO] 
10:02:18 [2020-09-22T14:02:18.802Z] [INFO] --- tycho-packaging-plugin:1.3.0:validate-id (default-validate-id) @ org.eclipse.ease.lang.python ---
10:02:18 [2020-09-22T14:02:18.802Z] [INFO] 
10:02:18 [2020-09-22T14:02:18.802Z] [INFO] --- tycho-packaging-plugin:1.3.0:validate-version (default-validate-version) @ org.eclipse.ease.lang.python ---
10:02:18 [2020-09-22T14:02:18.802Z] [INFO] 
10:02:18 [2020-09-22T14:02:18.802Z] [INFO] >>> maven-javadoc-plugin:2.9.1:javadoc (build-docs) > generate-sources @ org.eclipse.ease.lang.python >>>
10:02:18 [2020-09-22T14:02:18.802Z] [INFO] 
10:02:18 [2020-09-22T14:02:18.802Z] [INFO] --- tycho-packaging-plugin:1.3.0:build-qualifier (default-build-qualifier) @ org.eclipse.ease.lang.python ---
10:02:18 [2020-09-22T14:02:18.802Z] [INFO] The project's OSGi version is 0.8.0.I202006231119
10:02:18 [2020-09-22T14:02:18.802Z] [INFO] 
10:02:18 [2020-09-22T14:02:18.802Z] [INFO] --- tycho-packaging-plugin:1.3.0:validate-id (default-validate-id) @ org.eclipse.ease.lang.python ---
10:02:18 [2020-09-22T14:02:18.802Z] [INFO] 
10:02:18 [2020-09-22T14:02:18.802Z] [INFO] --- tycho-packaging-plugin:1.3.0:validate-version (default-validate-version) @ org.eclipse.ease.lang.python ---
10:02:18 [2020-09-22T14:02:18.802Z] [INFO] 
10:02:18 [2020-09-22T14:02:18.802Z] [INFO] <<< maven-javadoc-plugin:2.9.1:javadoc (build-docs) < generate-sources @ org.eclipse.ease.lang.python <<<
10:02:18 [2020-09-22T14:02:18.802Z] [INFO] 
10:02:18 [2020-09-22T14:02:18.802Z] [INFO] 
10:02:18 [2020-09-22T14:02:18.802Z] [INFO] --- maven-javadoc-plugin:2.9.1:javadoc (build-docs) @ org.eclipse.ease.lang.python ---
10:02:18 [2020-09-22T14:02:18.802Z] [ERROR] Error fetching link: http://help.eclipse.org/oxygen/topic/org.eclipse.platform.doc.isv/reference/api/package-list. Ignored it.
10:02:20 [2020-09-22T14:02:20.166Z] [INFO] 
10:02:20 [2020-09-22T14:02:20.166Z] Loading source files for package org.eclipse.ease.lang.python...
10:02:20 [2020-09-22T14:02:20.166Z] Loading source files for package org.eclipse.ease.lang.python.debug...
10:02:20 [2020-09-22T14:02:20.166Z] Loading source files for package org.eclipse.ease.lang.python.debugger...
10:02:20 [2020-09-22T14:02:20.166Z] Loading source files for package org.eclipse.ease.lang.python.debugger.actions...
10:02:20 [2020-09-22T14:02:20.166Z] Loading source files for package org.eclipse.ease.lang.python.debugger.model...
10:02:20 [2020-09-22T14:02:20.166Z] Loading source files for package org.eclipse.ease.lang.python.preferences...
10:02:20 [2020-09-22T14:02:20.166Z] Loading source files for package org.eclipse.ease.lang.python.ui.completion...
10:02:20 [2020-09-22T14:02:20.166Z] Constructing Javadoc information...
10:02:20 [2020-09-22T14:02:20.166Z] WARNING: Cannot open location "/home/jenkins/agent/workspace/ease.verify.core.gerrit/plugins/org.eclipse.ease.lang.python/target/javadoc-bundle-options/package-list"
10:02:20 [2020-09-22T14:02:20.166Z] [WARNING] Javadoc Warnings
10:02:20 [2020-09-22T14:02:20.166Z] [WARNING] Picked up JAVA_TOOL_OPTIONS: -Dmaven.ext.class.path="/home/jenkins/agent/workspace/ease.verify.core.gerrit@tmp/withMaven4f91d2e1/pipeline-maven-spy.jar" -Dorg.jenkinsci.plugins.pipeline.maven.reportsFolder="/home/jenkins/agent/workspace/ease.verify.core.gerrit@tmp/withMaven4f91d2e1"
10:02:20 [2020-09-22T14:02:20.166Z] [INFO] 
10:02:20 [2020-09-22T14:02:20.166Z] [INFO] --- build-helper-maven-plugin:1.9.1:add-resource (add_help) @ org.eclipse.ease.lang.python ---
10:02:20 [2020-09-22T14:02:20.166Z] [INFO] 
10:02:20 [2020-09-22T14:02:20.166Z] [INFO] --- maven-resources-plugin:2.4.3:resources (default-resources) @ org.eclipse.ease.lang.python ---
10:02:20 [2020-09-22T14:02:20.166Z] [INFO] Using 'UTF-8' encoding to copy filtered resources.
10:02:20 [2020-09-22T14:02:20.166Z] [INFO] skip non existing resourceDirectory /home/jenkins/agent/workspace/ease.verify.core.gerrit/plugins/org.eclipse.ease.lang.python/src/main/resources
10:02:20 [2020-09-22T14:02:20.166Z] [INFO] skip non existing resourceDirectory /home/jenkins/agent/workspace/ease.verify.core.gerrit/plugins/org.eclipse.ease.lang.python/help
10:02:20 [2020-09-22T14:02:20.166Z] [INFO] 
10:02:20 [2020-09-22T14:02:20.166Z] [INFO] --- tycho-compiler-plugin:1.3.0:compile (default-compile) @ org.eclipse.ease.lang.python ---
10:02:20 [2020-09-22T14:02:20.166Z] [INFO] Compiling 24 source files to /home/jenkins/agent/workspace/ease.verify.core.gerrit/plugins/org.eclipse.ease.lang.python/target/classes
10:02:20 [2020-09-22T14:02:20.166Z] [INFO] 
10:02:20 [2020-09-22T14:02:20.166Z] [INFO] --- maven-resources-plugin:2.4.3:testResources (default-testResources) @ org.eclipse.ease.lang.python ---
10:02:20 [2020-09-22T14:02:20.167Z] [INFO] Using 'UTF-8' encoding to copy filtered resources.
10:02:20 [2020-09-22T14:02:20.167Z] [INFO] skip non existing resourceDirectory /home/jenkins/agent/workspace/ease.verify.core.gerrit/plugins/org.eclipse.ease.lang.python/src/test/resources
10:02:20 [2020-09-22T14:02:20.167Z] [INFO] 
10:02:20 [2020-09-22T14:02:20.167Z] [INFO] --- tycho-source-plugin:1.3.0:plugin-source (plugin-source) @ org.eclipse.ease.lang.python ---
10:02:20 [2020-09-22T14:02:20.167Z] [INFO] Building jar: /home/jenkins/agent/workspace/ease.verify.core.gerrit/plugins/org.eclipse.ease.lang.python/target/org.eclipse.ease.lang.python-0.8.0-SNAPSHOT-sources.jar
10:02:20 [2020-09-22T14:02:20.167Z] [INFO] 
10:02:20 [2020-09-22T14:02:20.167Z] [INFO] --- target-platform-configuration:1.3.0:target-platform (default-target-platform) @ org.eclipse.ease.lang.python ---
10:02:20 [2020-09-22T14:02:20.167Z] [INFO] 
10:02:20 [2020-09-22T14:02:20.167Z] [INFO] --- tycho-packaging-plugin:1.3.0:package-plugin (default-package-plugin) @ org.eclipse.ease.lang.python ---
10:02:20 [2020-09-22T14:02:20.167Z] [INFO] Building jar: /home/jenkins/agent/workspace/ease.verify.core.gerrit/plugins/org.eclipse.ease.lang.python/target/org.eclipse.ease.lang.python-0.8.0-SNAPSHOT.jar
10:02:20 [2020-09-22T14:02:20.167Z] [INFO] 
10:02:20 [2020-09-22T14:02:20.167Z] [INFO] --- tycho-p2-plugin:1.3.0:p2-metadata-default (default-p2-metadata-default) @ org.eclipse.ease.lang.python ---
10:02:20 [2020-09-22T14:02:20.167Z] [INFO] 
10:02:20 [2020-09-22T14:02:20.167Z] [INFO] --- tycho-source-feature-plugin:1.3.0:source-feature (source-feature) @ org.eclipse.ease.lang.python ---
10:02:20 [2020-09-22T14:02:20.167Z] [INFO] 
10:02:20 [2020-09-22T14:02:20.167Z] [INFO] --- tycho-p2-plugin:1.3.0:p2-metadata (attached-p2-metadata) @ org.eclipse.ease.lang.python ---
10:02:20 [2020-09-22T14:02:20.167Z] [INFO] 
10:02:20 [2020-09-22T14:02:20.167Z] [INFO] ---------< org.eclipse.ease:org.eclipse.ease.lang.python.py4j >---------
10:02:20 [2020-09-22T14:02:20.167Z] [INFO] Building org.eclipse.ease.lang.python.py4j 0.8.0-SNAPSHOT        [10/49]
10:02:20 [2020-09-22T14:02:20.167Z] [INFO] ---------------------------[ eclipse-plugin ]---------------------------
10:02:20 [2020-09-22T14:02:20.167Z] [INFO] 
10:02:20 [2020-09-22T14:02:20.167Z] [INFO] --- maven-clean-plugin:2.5:clean (default-clean) @ org.eclipse.ease.lang.python.py4j ---
10:02:20 [2020-09-22T14:02:20.167Z] [INFO] 
10:02:20 [2020-09-22T14:02:20.167Z] [INFO] --- tycho-packaging-plugin:1.3.0:build-qualifier (default-build-qualifier) @ org.eclipse.ease.lang.python.py4j ---
10:02:20 [2020-09-22T14:02:20.424Z] [INFO] The project's OSGi version is 0.8.0.I202008271105
10:02:20 [2020-09-22T14:02:20.424Z] [INFO] 
10:02:20 [2020-09-22T14:02:20.424Z] [INFO] --- tycho-packaging-plugin:1.3.0:validate-id (default-validate-id) @ org.eclipse.ease.lang.python.py4j ---
10:02:20 [2020-09-22T14:02:20.424Z] [INFO] 
10:02:20 [2020-09-22T14:02:20.424Z] [INFO] --- tycho-packaging-plugin:1.3.0:validate-version (default-validate-version) @ org.eclipse.ease.lang.python.py4j ---
10:02:20 [2020-09-22T14:02:20.424Z] [INFO] 
10:02:20 [2020-09-22T14:02:20.424Z] [INFO] >>> maven-javadoc-plugin:2.9.1:javadoc (build-docs) > generate-sources @ org.eclipse.ease.lang.python.py4j >>>
10:02:20 [2020-09-22T14:02:20.424Z] [INFO] 
10:02:20 [2020-09-22T14:02:20.424Z] [INFO] --- tycho-packaging-plugin:1.3.0:build-qualifier (default-build-qualifier) @ org.eclipse.ease.lang.python.py4j ---
10:02:20 [2020-09-22T14:02:20.424Z] [INFO] The project's OSGi version is 0.8.0.I202008271105
10:02:20 [2020-09-22T14:02:20.424Z] [INFO] 
10:02:20 [2020-09-22T14:02:20.424Z] [INFO] --- tycho-packaging-plugin:1.3.0:validate-id (default-validate-id) @ org.eclipse.ease.lang.python.py4j ---
10:02:20 [2020-09-22T14:02:20.425Z] [INFO] 
10:02:20 [2020-09-22T14:02:20.425Z] [INFO] --- tycho-packaging-plugin:1.3.0:validate-version (default-validate-version) @ org.eclipse.ease.lang.python.py4j ---
10:02:20 [2020-09-22T14:02:20.425Z] [INFO] 
10:02:20 [2020-09-22T14:02:20.425Z] [INFO] <<< maven-javadoc-plugin:2.9.1:javadoc (build-docs) < generate-sources @ org.eclipse.ease.lang.python.py4j <<<
10:02:20 [2020-09-22T14:02:20.425Z] [INFO] 
10:02:20 [2020-09-22T14:02:20.425Z] [INFO] 
10:02:20 [2020-09-22T14:02:20.425Z] [INFO] --- maven-javadoc-plugin:2.9.1:javadoc (build-docs) @ org.eclipse.ease.lang.python.py4j ---
10:02:20 [2020-09-22T14:02:20.425Z] [ERROR] Error fetching link: http://help.eclipse.org/oxygen/topic/org.eclipse.platform.doc.isv/reference/api/package-list. Ignored it.
10:02:21 [2020-09-22T14:02:21.801Z] [INFO] 
10:02:21 [2020-09-22T14:02:21.801Z] Loading source files for package org.eclipse.ease.lang.python.py4j.internal...
10:02:21 [2020-09-22T14:02:21.801Z] Loading source files for package org.eclipse.ease.lang.python.py4j.internal.ui...
10:02:21 [2020-09-22T14:02:21.801Z] Constructing Javadoc information...
10:02:21 [2020-09-22T14:02:21.801Z] WARNING: Cannot open location "/home/jenkins/agent/workspace/ease.verify.core.gerrit/plugins/org.eclipse.ease.lang.python.py4j/target/javadoc-bundle-options/package-list"
10:02:21 [2020-09-22T14:02:21.801Z] [WARNING] Javadoc Warnings
10:02:21 [2020-09-22T14:02:21.801Z] [WARNING] Picked up JAVA_TOOL_OPTIONS: -Dmaven.ext.class.path="/home/jenkins/agent/workspace/ease.verify.core.gerrit@tmp/withMaven4f91d2e1/pipeline-maven-spy.jar" -Dorg.jenkinsci.plugins.pipeline.maven.reportsFolder="/home/jenkins/agent/workspace/ease.verify.core.gerrit@tmp/withMaven4f91d2e1"
10:02:21 [2020-09-22T14:02:21.801Z] [INFO] 
10:02:21 [2020-09-22T14:02:21.801Z] [INFO] --- build-helper-maven-plugin:1.9.1:add-resource (add_help) @ org.eclipse.ease.lang.python.py4j ---
10:02:21 [2020-09-22T14:02:21.801Z] [INFO] 
10:02:21 [2020-09-22T14:02:21.801Z] [INFO] --- maven-resources-plugin:2.4.3:resources (default-resources) @ org.eclipse.ease.lang.python.py4j ---
10:02:21 [2020-09-22T14:02:21.801Z] [INFO] Using 'UTF-8' encoding to copy filtered resources.
10:02:21 [2020-09-22T14:02:21.801Z] [INFO] skip non existing resourceDirectory /home/jenkins/agent/workspace/ease.verify.core.gerrit/plugins/org.eclipse.ease.lang.python.py4j/src/main/resources
10:02:21 [2020-09-22T14:02:21.801Z] [INFO] Copying 2 resources to help
10:02:21 [2020-09-22T14:02:21.801Z] [INFO] 
10:02:21 [2020-09-22T14:02:21.801Z] [INFO] --- tycho-compiler-plugin:1.3.0:compile (default-compile) @ org.eclipse.ease.lang.python.py4j ---
10:02:21 [2020-09-22T14:02:21.801Z] [INFO] Compiling 11 source files to /home/jenkins/agent/workspace/ease.verify.core.gerrit/plugins/org.eclipse.ease.lang.python.py4j/target/classes
10:02:21 [2020-09-22T14:02:21.801Z] [INFO] 
10:02:21 [2020-09-22T14:02:21.801Z] [INFO] --- maven-resources-plugin:2.4.3:testResources (default-testResources) @ org.eclipse.ease.lang.python.py4j ---
10:02:21 [2020-09-22T14:02:21.801Z] [INFO] Using 'UTF-8' encoding to copy filtered resources.
10:02:21 [2020-09-22T14:02:21.801Z] [INFO] skip non existing resourceDirectory /home/jenkins/agent/workspace/ease.verify.core.gerrit/plugins/org.eclipse.ease.lang.python.py4j/src/test/resources
10:02:21 [2020-09-22T14:02:21.802Z] [INFO] 
10:02:21 [2020-09-22T14:02:21.802Z] [INFO] --- tycho-source-plugin:1.3.0:plugin-source (plugin-source) @ org.eclipse.ease.lang.python.py4j ---
10:02:21 [2020-09-22T14:02:21.802Z] [INFO] Building jar: /home/jenkins/agent/workspace/ease.verify.core.gerrit/plugins/org.eclipse.ease.lang.python.py4j/target/org.eclipse.ease.lang.python.py4j-0.8.0-SNAPSHOT-sources.jar
10:02:21 [2020-09-22T14:02:21.802Z] [INFO] 
10:02:21 [2020-09-22T14:02:21.802Z] [INFO] --- target-platform-configuration:1.3.0:target-platform (default-target-platform) @ org.eclipse.ease.lang.python.py4j ---
10:02:21 [2020-09-22T14:02:21.802Z] [INFO] 
10:02:21 [2020-09-22T14:02:21.802Z] [INFO] --- tycho-packaging-plugin:1.3.0:package-plugin (default-package-plugin) @ org.eclipse.ease.lang.python.py4j ---
10:02:21 [2020-09-22T14:02:21.802Z] [INFO] Building jar: /home/jenkins/agent/workspace/ease.verify.core.gerrit/plugins/org.eclipse.ease.lang.python.py4j/target/org.eclipse.ease.lang.python.py4j-0.8.0-SNAPSHOT.jar
10:02:21 [2020-09-22T14:02:21.802Z] [INFO] 
10:02:21 [2020-09-22T14:02:21.802Z] [INFO] --- tycho-p2-plugin:1.3.0:p2-metadata-default (default-p2-metadata-default) @ org.eclipse.ease.lang.python.py4j ---
10:02:21 [2020-09-22T14:02:21.802Z] [INFO] 
10:02:21 [2020-09-22T14:02:21.802Z] [INFO] --- tycho-source-feature-plugin:1.3.0:source-feature (source-feature) @ org.eclipse.ease.lang.python.py4j ---
10:02:21 [2020-09-22T14:02:21.802Z] [INFO] 
10:02:21 [2020-09-22T14:02:21.802Z] [INFO] --- tycho-p2-plugin:1.3.0:p2-metadata (attached-p2-metadata) @ org.eclipse.ease.lang.python.py4j ---
10:02:21 [2020-09-22T14:02:21.802Z] [INFO] 
10:02:21 [2020-09-22T14:02:21.802Z] [INFO] -----------< org.eclipse.ease:org.eclipse.ease.lang.groovy >------------
10:02:21 [2020-09-22T14:02:21.802Z] [INFO] Building org.eclipse.ease.lang.groovy 0.8.0-SNAPSHOT             [11/49]
10:02:21 [2020-09-22T14:02:21.802Z] [INFO] ---------------------------[ eclipse-plugin ]---------------------------
10:02:21 [2020-09-22T14:02:21.802Z] [INFO] 
10:02:21 [2020-09-22T14:02:21.802Z] [INFO] --- maven-clean-plugin:2.5:clean (default-clean) @ org.eclipse.ease.lang.groovy ---
10:02:21 [2020-09-22T14:02:21.802Z] [INFO] 
10:02:21 [2020-09-22T14:02:21.802Z] [INFO] --- tycho-packaging-plugin:1.3.0:build-qualifier (default-build-qualifier) @ org.eclipse.ease.lang.groovy ---
10:02:21 [2020-09-22T14:02:21.802Z] [INFO] The project's OSGi version is 0.8.0.I201910171213
10:02:21 [2020-09-22T14:02:21.802Z] [INFO] 
10:02:21 [2020-09-22T14:02:21.802Z] [INFO] --- tycho-packaging-plugin:1.3.0:validate-id (default-validate-id) @ org.eclipse.ease.lang.groovy ---
10:02:21 [2020-09-22T14:02:21.802Z] [INFO] 
10:02:21 [2020-09-22T14:02:21.802Z] [INFO] --- tycho-packaging-plugin:1.3.0:validate-version (default-validate-version) @ org.eclipse.ease.lang.groovy ---
10:02:21 [2020-09-22T14:02:21.802Z] [INFO] 
10:02:21 [2020-09-22T14:02:21.802Z] [INFO] >>> maven-javadoc-plugin:2.9.1:javadoc (build-docs) > generate-sources @ org.eclipse.ease.lang.groovy >>>
10:02:21 [2020-09-22T14:02:21.802Z] [INFO] 
10:02:21 [2020-09-22T14:02:21.802Z] [INFO] --- tycho-packaging-plugin:1.3.0:build-qualifier (default-build-qualifier) @ org.eclipse.ease.lang.groovy ---
10:02:21 [2020-09-22T14:02:21.802Z] [INFO] The project's OSGi version is 0.8.0.I201910171213
10:02:21 [2020-09-22T14:02:21.802Z] [INFO] 
10:02:21 [2020-09-22T14:02:21.802Z] [INFO] --- tycho-packaging-plugin:1.3.0:validate-id (default-validate-id) @ org.eclipse.ease.lang.groovy ---
10:02:21 [2020-09-22T14:02:21.802Z] [INFO] 
10:02:21 [2020-09-22T14:02:21.802Z] [INFO] --- tycho-packaging-plugin:1.3.0:validate-version (default-validate-version) @ org.eclipse.ease.lang.groovy ---
10:02:21 [2020-09-22T14:02:21.802Z] [INFO] 
10:02:21 [2020-09-22T14:02:21.802Z] [INFO] <<< maven-javadoc-plugin:2.9.1:javadoc (build-docs) < generate-sources @ org.eclipse.ease.lang.groovy <<<
10:02:21 [2020-09-22T14:02:21.802Z] [INFO] 
10:02:21 [2020-09-22T14:02:21.802Z] [INFO] 
10:02:21 [2020-09-22T14:02:21.802Z] [INFO] --- maven-javadoc-plugin:2.9.1:javadoc (build-docs) @ org.eclipse.ease.lang.groovy ---
10:02:21 [2020-09-22T14:02:21.802Z] [ERROR] Error fetching link: http://help.eclipse.org/oxygen/topic/org.eclipse.platform.doc.isv/reference/api/package-list. Ignored it.
10:02:23 [2020-09-22T14:02:23.166Z] [INFO] 
10:02:23 [2020-09-22T14:02:23.166Z] Loading source files for package org.eclipse.ease.lang.groovy...
10:02:23 [2020-09-22T14:02:23.166Z] Constructing Javadoc information...
10:02:23 [2020-09-22T14:02:23.166Z] WARNING: Cannot open location "/home/jenkins/agent/workspace/ease.verify.core.gerrit/plugins/org.eclipse.ease.lang.groovy/target/javadoc-bundle-options/package-list"
10:02:23 [2020-09-22T14:02:23.166Z] [WARNING] Javadoc Warnings
10:02:23 [2020-09-22T14:02:23.166Z] [WARNING] Picked up JAVA_TOOL_OPTIONS: -Dmaven.ext.class.path="/home/jenkins/agent/workspace/ease.verify.core.gerrit@tmp/withMaven4f91d2e1/pipeline-maven-spy.jar" -Dorg.jenkinsci.plugins.pipeline.maven.reportsFolder="/home/jenkins/agent/workspace/ease.verify.core.gerrit@tmp/withMaven4f91d2e1"
10:02:23 [2020-09-22T14:02:23.166Z] [INFO] 
10:02:23 [2020-09-22T14:02:23.166Z] [INFO] --- build-helper-maven-plugin:1.9.1:add-resource (add_help) @ org.eclipse.ease.lang.groovy ---
10:02:23 [2020-09-22T14:02:23.167Z] [INFO] 
10:02:23 [2020-09-22T14:02:23.167Z] [INFO] --- maven-resources-plugin:2.4.3:resources (default-resources) @ org.eclipse.ease.lang.groovy ---
10:02:23 [2020-09-22T14:02:23.167Z] [INFO] Using 'UTF-8' encoding to copy filtered resources.
10:02:23 [2020-09-22T14:02:23.167Z] [INFO] skip non existing resourceDirectory /home/jenkins/agent/workspace/ease.verify.core.gerrit/plugins/org.eclipse.ease.lang.groovy/src/main/resources
10:02:23 [2020-09-22T14:02:23.167Z] [INFO] skip non existing resourceDirectory /home/jenkins/agent/workspace/ease.verify.core.gerrit/plugins/org.eclipse.ease.lang.groovy/help
10:02:23 [2020-09-22T14:02:23.167Z] [INFO] 
10:02:23 [2020-09-22T14:02:23.167Z] [INFO] --- tycho-compiler-plugin:1.3.0:compile (default-compile) @ org.eclipse.ease.lang.groovy ---
10:02:23 [2020-09-22T14:02:23.167Z] [INFO] Compiling 4 source files to /home/jenkins/agent/workspace/ease.verify.core.gerrit/plugins/org.eclipse.ease.lang.groovy/target/classes
10:02:23 [2020-09-22T14:02:23.167Z] [INFO] 
10:02:23 [2020-09-22T14:02:23.167Z] [INFO] --- maven-resources-plugin:2.4.3:testResources (default-testResources) @ org.eclipse.ease.lang.groovy ---
10:02:23 [2020-09-22T14:02:23.167Z] [INFO] Using 'UTF-8' encoding to copy filtered resources.
10:02:23 [2020-09-22T14:02:23.167Z] [INFO] skip non existing resourceDirectory /home/jenkins/agent/workspace/ease.verify.core.gerrit/plugins/org.eclipse.ease.lang.groovy/src/test/resources
10:02:23 [2020-09-22T14:02:23.167Z] [INFO] 
10:02:23 [2020-09-22T14:02:23.167Z] [INFO] --- tycho-source-plugin:1.3.0:plugin-source (plugin-source) @ org.eclipse.ease.lang.groovy ---
10:02:23 [2020-09-22T14:02:23.167Z] [INFO] Building jar: /home/jenkins/agent/workspace/ease.verify.core.gerrit/plugins/org.eclipse.ease.lang.groovy/target/org.eclipse.ease.lang.groovy-0.8.0-SNAPSHOT-sources.jar
10:02:23 [2020-09-22T14:02:23.167Z] [INFO] 
10:02:23 [2020-09-22T14:02:23.167Z] [INFO] --- target-platform-configuration:1.3.0:target-platform (default-target-platform) @ org.eclipse.ease.lang.groovy ---
10:02:23 [2020-09-22T14:02:23.167Z] [INFO] 
10:02:23 [2020-09-22T14:02:23.167Z] [INFO] --- tycho-packaging-plugin:1.3.0:package-plugin (default-package-plugin) @ org.eclipse.ease.lang.groovy ---
10:02:23 [2020-09-22T14:02:23.167Z] [INFO] Building jar: /home/jenkins/agent/workspace/ease.verify.core.gerrit/plugins/org.eclipse.ease.lang.groovy/target/org.eclipse.ease.lang.groovy-0.8.0-SNAPSHOT.jar
10:02:23 [2020-09-22T14:02:23.167Z] [INFO] 
10:02:23 [2020-09-22T14:02:23.167Z] [INFO] --- tycho-p2-plugin:1.3.0:p2-metadata-default (default-p2-metadata-default) @ org.eclipse.ease.lang.groovy ---
10:02:23 [2020-09-22T14:02:23.167Z] [INFO] 
10:02:23 [2020-09-22T14:02:23.167Z] [INFO] --- tycho-source-feature-plugin:1.3.0:source-feature (source-feature) @ org.eclipse.ease.lang.groovy ---
10:02:23 [2020-09-22T14:02:23.167Z] [INFO] 
10:02:23 [2020-09-22T14:02:23.167Z] [INFO] --- tycho-p2-plugin:1.3.0:p2-metadata (attached-p2-metadata) @ org.eclipse.ease.lang.groovy ---
10:02:23 [2020-09-22T14:02:23.167Z] [INFO] 
10:02:23 [2020-09-22T14:02:23.167Z] [INFO] -----< org.eclipse.ease:org.eclipse.ease.lang.groovy.interpreter >------
10:02:23 [2020-09-22T14:02:23.167Z] [INFO] Building org.eclipse.ease.lang.groovy.interpreter 0.8.0-SNAPSHOT [12/49]
10:02:23 [2020-09-22T14:02:23.167Z] [INFO] ---------------------------[ eclipse-plugin ]---------------------------
10:02:23 [2020-09-22T14:02:23.167Z] [INFO] 
10:02:23 [2020-09-22T14:02:23.167Z] [INFO] --- maven-clean-plugin:2.5:clean (default-clean) @ org.eclipse.ease.lang.groovy.interpreter ---
10:02:23 [2020-09-22T14:02:23.167Z] [INFO] 
10:02:23 [2020-09-22T14:02:23.167Z] [INFO] --- tycho-packaging-plugin:1.3.0:build-qualifier (default-build-qualifier) @ org.eclipse.ease.lang.groovy.interpreter ---
10:02:23 [2020-09-22T14:02:23.167Z] [INFO] The project's OSGi version is 0.8.0.I202002270716
10:02:23 [2020-09-22T14:02:23.167Z] [INFO] 
10:02:23 [2020-09-22T14:02:23.167Z] [INFO] --- tycho-packaging-plugin:1.3.0:validate-id (default-validate-id) @ org.eclipse.ease.lang.groovy.interpreter ---
10:02:23 [2020-09-22T14:02:23.167Z] [INFO] 
10:02:23 [2020-09-22T14:02:23.167Z] [INFO] --- tycho-packaging-plugin:1.3.0:validate-version (default-validate-version) @ org.eclipse.ease.lang.groovy.interpreter ---
10:02:23 [2020-09-22T14:02:23.167Z] [INFO] 
10:02:23 [2020-09-22T14:02:23.167Z] [INFO] >>> maven-javadoc-plugin:2.9.1:javadoc (build-docs) > generate-sources @ org.eclipse.ease.lang.groovy.interpreter >>>
10:02:23 [2020-09-22T14:02:23.167Z] [INFO] 
10:02:23 [2020-09-22T14:02:23.167Z] [INFO] --- tycho-packaging-plugin:1.3.0:build-qualifier (default-build-qualifier) @ org.eclipse.ease.lang.groovy.interpreter ---
10:02:23 [2020-09-22T14:02:23.167Z] [INFO] The project's OSGi version is 0.8.0.I202002270716
10:02:23 [2020-09-22T14:02:23.167Z] [INFO] 
10:02:23 [2020-09-22T14:02:23.167Z] [INFO] --- tycho-packaging-plugin:1.3.0:validate-id (default-validate-id) @ org.eclipse.ease.lang.groovy.interpreter ---
10:02:23 [2020-09-22T14:02:23.167Z] [INFO] 
10:02:23 [2020-09-22T14:02:23.167Z] [INFO] --- tycho-packaging-plugin:1.3.0:validate-version (default-validate-version) @ org.eclipse.ease.lang.groovy.interpreter ---
10:02:23 [2020-09-22T14:02:23.167Z] [INFO] 
10:02:23 [2020-09-22T14:02:23.167Z] [INFO] <<< maven-javadoc-plugin:2.9.1:javadoc (build-docs) < generate-sources @ org.eclipse.ease.lang.groovy.interpreter <<<
10:02:23 [2020-09-22T14:02:23.167Z] [INFO] 
10:02:23 [2020-09-22T14:02:23.167Z] [INFO] 
10:02:23 [2020-09-22T14:02:23.167Z] [INFO] --- maven-javadoc-plugin:2.9.1:javadoc (build-docs) @ org.eclipse.ease.lang.groovy.interpreter ---
10:02:23 [2020-09-22T14:02:23.167Z] [ERROR] Error fetching link: http://help.eclipse.org/oxygen/topic/org.eclipse.platform.doc.isv/reference/api/package-list. Ignored it.
10:02:24 [2020-09-22T14:02:24.532Z] [INFO] 
10:02:24 [2020-09-22T14:02:24.532Z] Loading source files for package org.eclipse.ease.lang.groovy.interpreter...
10:02:24 [2020-09-22T14:02:24.532Z] Constructing Javadoc information...
10:02:24 [2020-09-22T14:02:24.532Z] WARNING: Cannot open location "/home/jenkins/agent/workspace/ease.verify.core.gerrit/plugins/org.eclipse.ease.lang.groovy.interpreter/target/javadoc-bundle-options/package-list"
10:02:24 [2020-09-22T14:02:24.532Z] [WARNING] Javadoc Warnings
10:02:24 [2020-09-22T14:02:24.532Z] [WARNING] Picked up JAVA_TOOL_OPTIONS: -Dmaven.ext.class.path="/home/jenkins/agent/workspace/ease.verify.core.gerrit@tmp/withMaven4f91d2e1/pipeline-maven-spy.jar" -Dorg.jenkinsci.plugins.pipeline.maven.reportsFolder="/home/jenkins/agent/workspace/ease.verify.core.gerrit@tmp/withMaven4f91d2e1"
10:02:24 [2020-09-22T14:02:24.532Z] [INFO] 
10:02:24 [2020-09-22T14:02:24.532Z] [INFO] --- build-helper-maven-plugin:1.9.1:add-resource (add_help) @ org.eclipse.ease.lang.groovy.interpreter ---
10:02:24 [2020-09-22T14:02:24.532Z] [INFO] 
10:02:24 [2020-09-22T14:02:24.532Z] [INFO] --- maven-resources-plugin:2.4.3:resources (default-resources) @ org.eclipse.ease.lang.groovy.interpreter ---
10:02:24 [2020-09-22T14:02:24.532Z] [INFO] Using 'UTF-8' encoding to copy filtered resources.
10:02:24 [2020-09-22T14:02:24.532Z] [INFO] skip non existing resourceDirectory /home/jenkins/agent/workspace/ease.verify.core.gerrit/plugins/org.eclipse.ease.lang.groovy.interpreter/src/main/resources
10:02:24 [2020-09-22T14:02:24.532Z] [INFO] skip non existing resourceDirectory /home/jenkins/agent/workspace/ease.verify.core.gerrit/plugins/org.eclipse.ease.lang.groovy.interpreter/help
10:02:24 [2020-09-22T14:02:24.532Z] [INFO] 
10:02:24 [2020-09-22T14:02:24.533Z] [INFO] --- tycho-compiler-plugin:1.3.0:compile (default-compile) @ org.eclipse.ease.lang.groovy.interpreter ---
10:02:24 [2020-09-22T14:02:24.533Z] [INFO] Compiling 3 source files to /home/jenkins/agent/workspace/ease.verify.core.gerrit/plugins/org.eclipse.ease.lang.groovy.interpreter/target/classes
10:02:24 [2020-09-22T14:02:24.533Z] [INFO] 
10:02:24 [2020-09-22T14:02:24.533Z] [INFO] --- maven-resources-plugin:2.4.3:testResources (default-testResources) @ org.eclipse.ease.lang.groovy.interpreter ---
10:02:24 [2020-09-22T14:02:24.533Z] [INFO] Using 'UTF-8' encoding to copy filtered resources.
10:02:24 [2020-09-22T14:02:24.533Z] [INFO] skip non existing resourceDirectory /home/jenkins/agent/workspace/ease.verify.core.gerrit/plugins/org.eclipse.ease.lang.groovy.interpreter/src/test/resources
10:02:24 [2020-09-22T14:02:24.533Z] [INFO] 
10:02:24 [2020-09-22T14:02:24.533Z] [INFO] --- tycho-source-plugin:1.3.0:plugin-source (plugin-source) @ org.eclipse.ease.lang.groovy.interpreter ---
10:02:24 [2020-09-22T14:02:24.533Z] [INFO] Building jar: /home/jenkins/agent/workspace/ease.verify.core.gerrit/plugins/org.eclipse.ease.lang.groovy.interpreter/target/org.eclipse.ease.lang.groovy.interpreter-0.8.0-SNAPSHOT-sources.jar
10:02:24 [2020-09-22T14:02:24.533Z] [INFO] 
10:02:24 [2020-09-22T14:02:24.533Z] [INFO] --- target-platform-configuration:1.3.0:target-platform (default-target-platform) @ org.eclipse.ease.lang.groovy.interpreter ---
10:02:24 [2020-09-22T14:02:24.533Z] [INFO] 
10:02:24 [2020-09-22T14:02:24.533Z] [INFO] --- tycho-packaging-plugin:1.3.0:package-plugin (default-package-plugin) @ org.eclipse.ease.lang.groovy.interpreter ---
10:02:24 [2020-09-22T14:02:24.533Z] [INFO] Building jar: /home/jenkins/agent/workspace/ease.verify.core.gerrit/plugins/org.eclipse.ease.lang.groovy.interpreter/target/org.eclipse.ease.lang.groovy.interpreter-0.8.0-SNAPSHOT.jar
10:02:24 [2020-09-22T14:02:24.533Z] [INFO] 
10:02:24 [2020-09-22T14:02:24.533Z] [INFO] --- tycho-p2-plugin:1.3.0:p2-metadata-default (default-p2-metadata-default) @ org.eclipse.ease.lang.groovy.interpreter ---
10:02:24 [2020-09-22T14:02:24.533Z] [INFO] 
10:02:24 [2020-09-22T14:02:24.533Z] [INFO] --- tycho-source-feature-plugin:1.3.0:source-feature (source-feature) @ org.eclipse.ease.lang.groovy.interpreter ---
10:02:24 [2020-09-22T14:02:24.533Z] [INFO] 
10:02:24 [2020-09-22T14:02:24.533Z] [INFO] --- tycho-p2-plugin:1.3.0:p2-metadata (attached-p2-metadata) @ org.eclipse.ease.lang.groovy.interpreter ---
10:02:24 [2020-09-22T14:02:24.788Z] [INFO] 
10:02:24 [2020-09-22T14:02:24.788Z] [INFO] ----------< org.eclipse.ease:org.eclipse.ease.lang.unittest >-----------
10:02:24 [2020-09-22T14:02:24.788Z] [INFO] Building org.eclipse.ease.lang.unittest 0.8.0-SNAPSHOT           [13/49]
10:02:24 [2020-09-22T14:02:24.788Z] [INFO] ---------------------------[ eclipse-plugin ]---------------------------
10:02:24 [2020-09-22T14:02:24.788Z] [INFO] 
10:02:24 [2020-09-22T14:02:24.788Z] [INFO] --- maven-clean-plugin:2.5:clean (default-clean) @ org.eclipse.ease.lang.unittest ---
10:02:24 [2020-09-22T14:02:24.788Z] [INFO] 
10:02:24 [2020-09-22T14:02:24.788Z] [INFO] --- tycho-packaging-plugin:1.3.0:build-qualifier (default-build-qualifier) @ org.eclipse.ease.lang.unittest ---
10:02:24 [2020-09-22T14:02:24.788Z] [INFO] The project's OSGi version is 0.8.0.I202006021412
10:02:24 [2020-09-22T14:02:24.788Z] [INFO] 
10:02:24 [2020-09-22T14:02:24.788Z] [INFO] --- tycho-packaging-plugin:1.3.0:validate-id (default-validate-id) @ org.eclipse.ease.lang.unittest ---
10:02:24 [2020-09-22T14:02:24.788Z] [INFO] 
10:02:24 [2020-09-22T14:02:24.788Z] [INFO] --- tycho-packaging-plugin:1.3.0:validate-version (default-validate-version) @ org.eclipse.ease.lang.unittest ---
10:02:24 [2020-09-22T14:02:24.788Z] [INFO] 
10:02:24 [2020-09-22T14:02:24.788Z] [INFO] >>> maven-javadoc-plugin:2.9.1:javadoc (build-docs) > generate-sources @ org.eclipse.ease.lang.unittest >>>
10:02:24 [2020-09-22T14:02:24.788Z] [INFO] 
10:02:24 [2020-09-22T14:02:24.788Z] [INFO] --- tycho-packaging-plugin:1.3.0:build-qualifier (default-build-qualifier) @ org.eclipse.ease.lang.unittest ---
10:02:24 [2020-09-22T14:02:24.789Z] [INFO] The project's OSGi version is 0.8.0.I202006021412
10:02:24 [2020-09-22T14:02:24.789Z] [INFO] 
10:02:24 [2020-09-22T14:02:24.789Z] [INFO] --- tycho-packaging-plugin:1.3.0:validate-id (default-validate-id) @ org.eclipse.ease.lang.unittest ---
10:02:24 [2020-09-22T14:02:24.789Z] [INFO] 
10:02:24 [2020-09-22T14:02:24.789Z] [INFO] --- tycho-packaging-plugin:1.3.0:validate-version (default-validate-version) @ org.eclipse.ease.lang.unittest ---
10:02:24 [2020-09-22T14:02:24.789Z] [INFO] 
10:02:24 [2020-09-22T14:02:24.789Z] [INFO] <<< maven-javadoc-plugin:2.9.1:javadoc (build-docs) < generate-sources @ org.eclipse.ease.lang.unittest <<<
10:02:24 [2020-09-22T14:02:24.789Z] [INFO] 
10:02:24 [2020-09-22T14:02:24.789Z] [INFO] 
10:02:24 [2020-09-22T14:02:24.789Z] [INFO] --- maven-javadoc-plugin:2.9.1:javadoc (build-docs) @ org.eclipse.ease.lang.unittest ---
10:02:24 [2020-09-22T14:02:24.789Z] [ERROR] Error fetching link: http://help.eclipse.org/oxygen/topic/org.eclipse.platform.doc.isv/reference/api/package-list. Ignored it.
10:02:26 [2020-09-22T14:02:26.151Z] [INFO] 
10:02:26 [2020-09-22T14:02:26.151Z] Loading source files for package org.eclipse.ease.lang.unittest...
10:02:26 [2020-09-22T14:02:26.151Z] Loading source files for package org.eclipse.ease.lang.unittest.execution...
10:02:26 [2020-09-22T14:02:26.151Z] Loading source files for package org.eclipse.ease.lang.unittest.reporters...
10:02:26 [2020-09-22T14:02:26.151Z] Loading source files for package org.eclipse.ease.lang.unittest.definition...
10:02:26 [2020-09-22T14:02:26.151Z] Loading source files for package org.eclipse.ease.lang.unittest.definition.impl...
10:02:26 [2020-09-22T14:02:26.151Z] Loading source files for package org.eclipse.ease.lang.unittest.definition.util...
10:02:26 [2020-09-22T14:02:26.151Z] Loading source files for package org.eclipse.ease.lang.unittest.runtime...
10:02:26 [2020-09-22T14:02:26.151Z] Loading source files for package org.eclipse.ease.lang.unittest.runtime.impl...
10:02:26 [2020-09-22T14:02:26.151Z] Loading source files for package org.eclipse.ease.lang.unittest.runtime.util...
10:02:26 [2020-09-22T14:02:26.151Z] Constructing Javadoc information...
10:02:26 [2020-09-22T14:02:26.151Z] WARNING: Cannot open location "/home/jenkins/agent/workspace/ease.verify.core.gerrit/plugins/org.eclipse.ease.lang.unittest/target/javadoc-bundle-options/package-list"
10:02:26 [2020-09-22T14:02:26.151Z] [WARNING] Javadoc Warnings
10:02:26 [2020-09-22T14:02:26.152Z] [WARNING] Picked up JAVA_TOOL_OPTIONS: -Dmaven.ext.class.path="/home/jenkins/agent/workspace/ease.verify.core.gerrit@tmp/withMaven4f91d2e1/pipeline-maven-spy.jar" -Dorg.jenkinsci.plugins.pipeline.maven.reportsFolder="/home/jenkins/agent/workspace/ease.verify.core.gerrit@tmp/withMaven4f91d2e1"
10:02:26 [2020-09-22T14:02:26.152Z] [INFO] 
10:02:26 [2020-09-22T14:02:26.152Z] [INFO] --- build-helper-maven-plugin:1.9.1:add-resource (add_help) @ org.eclipse.ease.lang.unittest ---
10:02:26 [2020-09-22T14:02:26.152Z] [INFO] 
10:02:26 [2020-09-22T14:02:26.152Z] [INFO] --- maven-resources-plugin:2.4.3:resources (default-resources) @ org.eclipse.ease.lang.unittest ---
10:02:26 [2020-09-22T14:02:26.152Z] [INFO] Using 'UTF-8' encoding to copy filtered resources.
10:02:26 [2020-09-22T14:02:26.152Z] [INFO] skip non existing resourceDirectory /home/jenkins/agent/workspace/ease.verify.core.gerrit/plugins/org.eclipse.ease.lang.unittest/src/main/resources
10:02:26 [2020-09-22T14:02:26.152Z] [INFO] Copying 2 resources to help
10:02:26 [2020-09-22T14:02:26.152Z] [INFO] 
10:02:26 [2020-09-22T14:02:26.152Z] [INFO] --- tycho-compiler-plugin:1.3.0:compile (default-compile) @ org.eclipse.ease.lang.unittest ---
10:02:26 [2020-09-22T14:02:26.152Z] [INFO] Compiling 57 source files to /home/jenkins/agent/workspace/ease.verify.core.gerrit/plugins/org.eclipse.ease.lang.unittest/target/classes
10:02:26 [2020-09-22T14:02:26.407Z] [INFO] 
10:02:26 [2020-09-22T14:02:26.407Z] [INFO] --- maven-resources-plugin:2.4.3:testResources (default-testResources) @ org.eclipse.ease.lang.unittest ---
10:02:26 [2020-09-22T14:02:26.407Z] [INFO] Using 'UTF-8' encoding to copy filtered resources.
10:02:26 [2020-09-22T14:02:26.407Z] [INFO] skip non existing resourceDirectory /home/jenkins/agent/workspace/ease.verify.core.gerrit/plugins/org.eclipse.ease.lang.unittest/src/test/resources
10:02:26 [2020-09-22T14:02:26.407Z] [INFO] 
10:02:26 [2020-09-22T14:02:26.407Z] [INFO] --- tycho-source-plugin:1.3.0:plugin-source (plugin-source) @ org.eclipse.ease.lang.unittest ---
10:02:26 [2020-09-22T14:02:26.408Z] [INFO] Building jar: /home/jenkins/agent/workspace/ease.verify.core.gerrit/plugins/org.eclipse.ease.lang.unittest/target/org.eclipse.ease.lang.unittest-0.8.0-SNAPSHOT-sources.jar
10:02:26 [2020-09-22T14:02:26.408Z] [INFO] 
10:02:26 [2020-09-22T14:02:26.408Z] [INFO] --- target-platform-configuration:1.3.0:target-platform (default-target-platform) @ org.eclipse.ease.lang.unittest ---
10:02:26 [2020-09-22T14:02:26.408Z] [INFO] 
10:02:26 [2020-09-22T14:02:26.408Z] [INFO] --- tycho-packaging-plugin:1.3.0:package-plugin (default-package-plugin) @ org.eclipse.ease.lang.unittest ---
10:02:26 [2020-09-22T14:02:26.408Z] [INFO] Building jar: /home/jenkins/agent/workspace/ease.verify.core.gerrit/plugins/org.eclipse.ease.lang.unittest/target/org.eclipse.ease.lang.unittest-0.8.0-SNAPSHOT.jar
10:02:26 [2020-09-22T14:02:26.408Z] [INFO] 
10:02:26 [2020-09-22T14:02:26.408Z] [INFO] --- tycho-p2-plugin:1.3.0:p2-metadata-default (default-p2-metadata-default) @ org.eclipse.ease.lang.unittest ---
10:02:26 [2020-09-22T14:02:26.408Z] [INFO] 
10:02:26 [2020-09-22T14:02:26.408Z] [INFO] --- tycho-source-feature-plugin:1.3.0:source-feature (source-feature) @ org.eclipse.ease.lang.unittest ---
10:02:26 [2020-09-22T14:02:26.408Z] [INFO] 
10:02:26 [2020-09-22T14:02:26.408Z] [INFO] --- tycho-p2-plugin:1.3.0:p2-metadata (attached-p2-metadata) @ org.eclipse.ease.lang.unittest ---
10:02:26 [2020-09-22T14:02:26.664Z] [INFO] 
10:02:26 [2020-09-22T14:02:26.664Z] [INFO] ---------< org.eclipse.ease:org.eclipse.ease.lang.unittest.ui >---------
10:02:26 [2020-09-22T14:02:26.664Z] [INFO] Building org.eclipse.ease.lang.unittest.ui 0.8.0-SNAPSHOT        [14/49]
10:02:26 [2020-09-22T14:02:26.664Z] [INFO] ---------------------------[ eclipse-plugin ]---------------------------
10:02:26 [2020-09-22T14:02:26.664Z] [INFO] 
10:02:26 [2020-09-22T14:02:26.664Z] [INFO] --- maven-clean-plugin:2.5:clean (default-clean) @ org.eclipse.ease.lang.unittest.ui ---
10:02:26 [2020-09-22T14:02:26.664Z] [INFO] 
10:02:26 [2020-09-22T14:02:26.664Z] [INFO] --- tycho-packaging-plugin:1.3.0:build-qualifier (default-build-qualifier) @ org.eclipse.ease.lang.unittest.ui ---
10:02:26 [2020-09-22T14:02:26.664Z] [INFO] The project's OSGi version is 0.8.0.I202003160826
10:02:26 [2020-09-22T14:02:26.664Z] [INFO] 
10:02:26 [2020-09-22T14:02:26.664Z] [INFO] --- tycho-packaging-plugin:1.3.0:validate-id (default-validate-id) @ org.eclipse.ease.lang.unittest.ui ---
10:02:26 [2020-09-22T14:02:26.664Z] [INFO] 
10:02:26 [2020-09-22T14:02:26.664Z] [INFO] --- tycho-packaging-plugin:1.3.0:validate-version (default-validate-version) @ org.eclipse.ease.lang.unittest.ui ---
10:02:26 [2020-09-22T14:02:26.664Z] [INFO] 
10:02:26 [2020-09-22T14:02:26.664Z] [INFO] >>> maven-javadoc-plugin:2.9.1:javadoc (build-docs) > generate-sources @ org.eclipse.ease.lang.unittest.ui >>>
10:02:26 [2020-09-22T14:02:26.664Z] [INFO] 
10:02:26 [2020-09-22T14:02:26.664Z] [INFO] --- tycho-packaging-plugin:1.3.0:build-qualifier (default-build-qualifier) @ org.eclipse.ease.lang.unittest.ui ---
10:02:26 [2020-09-22T14:02:26.664Z] [INFO] The project's OSGi version is 0.8.0.I202003160826
10:02:26 [2020-09-22T14:02:26.664Z] [INFO] 
10:02:26 [2020-09-22T14:02:26.664Z] [INFO] --- tycho-packaging-plugin:1.3.0:validate-id (default-validate-id) @ org.eclipse.ease.lang.unittest.ui ---
10:02:26 [2020-09-22T14:02:26.664Z] [INFO] 
10:02:26 [2020-09-22T14:02:26.664Z] [INFO] --- tycho-packaging-plugin:1.3.0:validate-version (default-validate-version) @ org.eclipse.ease.lang.unittest.ui ---
10:02:26 [2020-09-22T14:02:26.664Z] [INFO] 
10:02:26 [2020-09-22T14:02:26.664Z] [INFO] <<< maven-javadoc-plugin:2.9.1:javadoc (build-docs) < generate-sources @ org.eclipse.ease.lang.unittest.ui <<<
10:02:26 [2020-09-22T14:02:26.664Z] [INFO] 
10:02:26 [2020-09-22T14:02:26.664Z] [INFO] 
10:02:26 [2020-09-22T14:02:26.664Z] [INFO] --- maven-javadoc-plugin:2.9.1:javadoc (build-docs) @ org.eclipse.ease.lang.unittest.ui ---
10:02:26 [2020-09-22T14:02:26.664Z] [ERROR] Error fetching link: http://help.eclipse.org/oxygen/topic/org.eclipse.platform.doc.isv/reference/api/package-list. Ignored it.
10:02:28 [2020-09-22T14:02:28.040Z] [INFO] 
10:02:28 [2020-09-22T14:02:28.040Z] Loading source files for package org.eclipse.ease.lang.unittest.ui...
10:02:28 [2020-09-22T14:02:28.040Z] Loading source files for package org.eclipse.ease.lang.unittest.ui.decorators...
10:02:28 [2020-09-22T14:02:28.040Z] Loading source files for package org.eclipse.ease.lang.unittest.ui.dialogs...
10:02:28 [2020-09-22T14:02:28.040Z] Loading source files for package org.eclipse.ease.lang.unittest.ui.editor...
10:02:28 [2020-09-22T14:02:28.040Z] Loading source files for package org.eclipse.ease.lang.unittest.ui.handlers...
10:02:28 [2020-09-22T14:02:28.040Z] Loading source files for package org.eclipse.ease.lang.unittest.ui.sourceprovider...
10:02:28 [2020-09-22T14:02:28.040Z] Loading source files for package org.eclipse.ease.lang.unittest.ui.views...
10:02:28 [2020-09-22T14:02:28.040Z] Loading source files for package org.eclipse.ease.lang.unittest.ui.wizards...
10:02:28 [2020-09-22T14:02:28.040Z] Loading source files for package org.eclipse.ease.lang.unittest.definition.provider...
10:02:28 [2020-09-22T14:02:28.040Z] Constructing Javadoc information...
10:02:28 [2020-09-22T14:02:28.040Z] WARNING: Cannot open location "/home/jenkins/agent/workspace/ease.verify.core.gerrit/plugins/org.eclipse.ease.lang.unittest.ui/target/javadoc-bundle-options/package-list"
10:02:28 [2020-09-22T14:02:28.040Z] [WARNING] Javadoc Warnings
10:02:28 [2020-09-22T14:02:28.040Z] [WARNING] Picked up JAVA_TOOL_OPTIONS: -Dmaven.ext.class.path="/home/jenkins/agent/workspace/ease.verify.core.gerrit@tmp/withMaven4f91d2e1/pipeline-maven-spy.jar" -Dorg.jenkinsci.plugins.pipeline.maven.reportsFolder="/home/jenkins/agent/workspace/ease.verify.core.gerrit@tmp/withMaven4f91d2e1"
10:02:28 [2020-09-22T14:02:28.040Z] [INFO] 
10:02:28 [2020-09-22T14:02:28.040Z] [INFO] --- build-helper-maven-plugin:1.9.1:add-resource (add_help) @ org.eclipse.ease.lang.unittest.ui ---
10:02:28 [2020-09-22T14:02:28.040Z] [INFO] 
10:02:28 [2020-09-22T14:02:28.041Z] [INFO] --- maven-resources-plugin:2.4.3:resources (default-resources) @ org.eclipse.ease.lang.unittest.ui ---
10:02:28 [2020-09-22T14:02:28.041Z] [INFO] Using 'UTF-8' encoding to copy filtered resources.
10:02:28 [2020-09-22T14:02:28.041Z] [INFO] skip non existing resourceDirectory /home/jenkins/agent/workspace/ease.verify.core.gerrit/plugins/org.eclipse.ease.lang.unittest.ui/src/main/resources
10:02:28 [2020-09-22T14:02:28.041Z] [INFO] skip non existing resourceDirectory /home/jenkins/agent/workspace/ease.verify.core.gerrit/plugins/org.eclipse.ease.lang.unittest.ui/help
10:02:28 [2020-09-22T14:02:28.041Z] [INFO] 
10:02:28 [2020-09-22T14:02:28.041Z] [INFO] --- tycho-compiler-plugin:1.3.0:compile (default-compile) @ org.eclipse.ease.lang.unittest.ui ---
10:02:28 [2020-09-22T14:02:28.041Z] [INFO] Compiling 40 source files to /home/jenkins/agent/workspace/ease.verify.core.gerrit/plugins/org.eclipse.ease.lang.unittest.ui/target/classes
10:02:28 [2020-09-22T14:02:28.041Z] [INFO] 
10:02:28 [2020-09-22T14:02:28.041Z] [INFO] --- maven-resources-plugin:2.4.3:testResources (default-testResources) @ org.eclipse.ease.lang.unittest.ui ---
10:02:28 [2020-09-22T14:02:28.041Z] [INFO] Using 'UTF-8' encoding to copy filtered resources.
10:02:28 [2020-09-22T14:02:28.041Z] [INFO] skip non existing resourceDirectory /home/jenkins/agent/workspace/ease.verify.core.gerrit/plugins/org.eclipse.ease.lang.unittest.ui/src/test/resources
10:02:28 [2020-09-22T14:02:28.041Z] [INFO] 
10:02:28 [2020-09-22T14:02:28.041Z] [INFO] --- tycho-source-plugin:1.3.0:plugin-source (plugin-source) @ org.eclipse.ease.lang.unittest.ui ---
10:02:28 [2020-09-22T14:02:28.041Z] [INFO] Building jar: /home/jenkins/agent/workspace/ease.verify.core.gerrit/plugins/org.eclipse.ease.lang.unittest.ui/target/org.eclipse.ease.lang.unittest.ui-0.8.0-SNAPSHOT-sources.jar
10:02:28 [2020-09-22T14:02:28.041Z] [INFO] 
10:02:28 [2020-09-22T14:02:28.041Z] [INFO] --- target-platform-configuration:1.3.0:target-platform (default-target-platform) @ org.eclipse.ease.lang.unittest.ui ---
10:02:28 [2020-09-22T14:02:28.041Z] [INFO] 
10:02:28 [2020-09-22T14:02:28.041Z] [INFO] --- tycho-packaging-plugin:1.3.0:package-plugin (default-package-plugin) @ org.eclipse.ease.lang.unittest.ui ---
10:02:28 [2020-09-22T14:02:28.041Z] [INFO] Building jar: /home/jenkins/agent/workspace/ease.verify.core.gerrit/plugins/org.eclipse.ease.lang.unittest.ui/target/org.eclipse.ease.lang.unittest.ui-0.8.0-SNAPSHOT.jar
10:02:28 [2020-09-22T14:02:28.296Z] [INFO] 
10:02:28 [2020-09-22T14:02:28.296Z] [INFO] --- tycho-p2-plugin:1.3.0:p2-metadata-default (default-p2-metadata-default) @ org.eclipse.ease.lang.unittest.ui ---
10:02:28 [2020-09-22T14:02:28.296Z] [INFO] 
10:02:28 [2020-09-22T14:02:28.296Z] [INFO] --- tycho-source-feature-plugin:1.3.0:source-feature (source-feature) @ org.eclipse.ease.lang.unittest.ui ---
10:02:28 [2020-09-22T14:02:28.296Z] [INFO] 
10:02:28 [2020-09-22T14:02:28.296Z] [INFO] --- tycho-p2-plugin:1.3.0:p2-metadata (attached-p2-metadata) @ org.eclipse.ease.lang.unittest.ui ---
10:02:28 [2020-09-22T14:02:28.297Z] [INFO] 
10:02:28 [2020-09-22T14:02:28.297Z] [INFO] ------------< org.eclipse.ease:org.eclipse.ease.lang.ruby >-------------
10:02:28 [2020-09-22T14:02:28.297Z] [INFO] Building org.eclipse.ease.lang.ruby 0.8.0-SNAPSHOT               [15/49]
10:02:28 [2020-09-22T14:02:28.297Z] [INFO] ---------------------------[ eclipse-plugin ]---------------------------
10:02:28 [2020-09-22T14:02:28.297Z] [INFO] 
10:02:28 [2020-09-22T14:02:28.297Z] [INFO] --- maven-clean-plugin:2.5:clean (default-clean) @ org.eclipse.ease.lang.ruby ---
10:02:28 [2020-09-22T14:02:28.297Z] [INFO] 
10:02:28 [2020-09-22T14:02:28.297Z] [INFO] --- tycho-packaging-plugin:1.3.0:build-qualifier (default-build-qualifier) @ org.eclipse.ease.lang.ruby ---
10:02:28 [2020-09-22T14:02:28.297Z] [INFO] The project's OSGi version is 0.8.0.I201910171213
10:02:28 [2020-09-22T14:02:28.297Z] [INFO] 
10:02:28 [2020-09-22T14:02:28.297Z] [INFO] --- tycho-packaging-plugin:1.3.0:validate-id (default-validate-id) @ org.eclipse.ease.lang.ruby ---
10:02:28 [2020-09-22T14:02:28.297Z] [INFO] 
10:02:28 [2020-09-22T14:02:28.297Z] [INFO] --- tycho-packaging-plugin:1.3.0:validate-version (default-validate-version) @ org.eclipse.ease.lang.ruby ---
10:02:28 [2020-09-22T14:02:28.297Z] [INFO] 
10:02:28 [2020-09-22T14:02:28.297Z] [INFO] >>> maven-javadoc-plugin:2.9.1:javadoc (build-docs) > generate-sources @ org.eclipse.ease.lang.ruby >>>
10:02:28 [2020-09-22T14:02:28.297Z] [INFO] 
10:02:28 [2020-09-22T14:02:28.297Z] [INFO] --- tycho-packaging-plugin:1.3.0:build-qualifier (default-build-qualifier) @ org.eclipse.ease.lang.ruby ---
10:02:28 [2020-09-22T14:02:28.297Z] [INFO] The project's OSGi version is 0.8.0.I201910171213
10:02:28 [2020-09-22T14:02:28.297Z] [INFO] 
10:02:28 [2020-09-22T14:02:28.297Z] [INFO] --- tycho-packaging-plugin:1.3.0:validate-id (default-validate-id) @ org.eclipse.ease.lang.ruby ---
10:02:28 [2020-09-22T14:02:28.297Z] [INFO] 
10:02:28 [2020-09-22T14:02:28.297Z] [INFO] --- tycho-packaging-plugin:1.3.0:validate-version (default-validate-version) @ org.eclipse.ease.lang.ruby ---
10:02:28 [2020-09-22T14:02:28.297Z] [INFO] 
10:02:28 [2020-09-22T14:02:28.297Z] [INFO] <<< maven-javadoc-plugin:2.9.1:javadoc (build-docs) < generate-sources @ org.eclipse.ease.lang.ruby <<<
10:02:28 [2020-09-22T14:02:28.297Z] [INFO] 
10:02:28 [2020-09-22T14:02:28.297Z] [INFO] 
10:02:28 [2020-09-22T14:02:28.297Z] [INFO] --- maven-javadoc-plugin:2.9.1:javadoc (build-docs) @ org.eclipse.ease.lang.ruby ---
10:02:28 [2020-09-22T14:02:28.297Z] [ERROR] Error fetching link: http://help.eclipse.org/oxygen/topic/org.eclipse.platform.doc.isv/reference/api/package-list. Ignored it.
10:02:29 [2020-09-22T14:02:29.661Z] [INFO] 
10:02:29 [2020-09-22T14:02:29.662Z] Loading source files for package org.eclipse.ease.lang.ruby...
10:02:29 [2020-09-22T14:02:29.662Z] Constructing Javadoc information...
10:02:29 [2020-09-22T14:02:29.662Z] WARNING: Cannot open location "/home/jenkins/agent/workspace/ease.verify.core.gerrit/plugins/org.eclipse.ease.lang.ruby/target/javadoc-bundle-options/package-list"
10:02:29 [2020-09-22T14:02:29.662Z] [WARNING] Javadoc Warnings
10:02:29 [2020-09-22T14:02:29.662Z] [WARNING] Picked up JAVA_TOOL_OPTIONS: -Dmaven.ext.class.path="/home/jenkins/agent/workspace/ease.verify.core.gerrit@tmp/withMaven4f91d2e1/pipeline-maven-spy.jar" -Dorg.jenkinsci.plugins.pipeline.maven.reportsFolder="/home/jenkins/agent/workspace/ease.verify.core.gerrit@tmp/withMaven4f91d2e1"
10:02:29 [2020-09-22T14:02:29.662Z] [INFO] 
10:02:29 [2020-09-22T14:02:29.662Z] [INFO] --- build-helper-maven-plugin:1.9.1:add-resource (add_help) @ org.eclipse.ease.lang.ruby ---
10:02:29 [2020-09-22T14:02:29.662Z] [INFO] 
10:02:29 [2020-09-22T14:02:29.662Z] [INFO] --- maven-resources-plugin:2.4.3:resources (default-resources) @ org.eclipse.ease.lang.ruby ---
10:02:29 [2020-09-22T14:02:29.662Z] [INFO] Using 'UTF-8' encoding to copy filtered resources.
10:02:29 [2020-09-22T14:02:29.662Z] [INFO] skip non existing resourceDirectory /home/jenkins/agent/workspace/ease.verify.core.gerrit/plugins/org.eclipse.ease.lang.ruby/src/main/resources
10:02:29 [2020-09-22T14:02:29.662Z] [INFO] skip non existing resourceDirectory /home/jenkins/agent/workspace/ease.verify.core.gerrit/plugins/org.eclipse.ease.lang.ruby/help
10:02:29 [2020-09-22T14:02:29.662Z] [INFO] 
10:02:29 [2020-09-22T14:02:29.662Z] [INFO] --- tycho-compiler-plugin:1.3.0:compile (default-compile) @ org.eclipse.ease.lang.ruby ---
10:02:29 [2020-09-22T14:02:29.662Z] [INFO] Compiling 4 source files to /home/jenkins/agent/workspace/ease.verify.core.gerrit/plugins/org.eclipse.ease.lang.ruby/target/classes
10:02:29 [2020-09-22T14:02:29.662Z] [INFO] 
10:02:29 [2020-09-22T14:02:29.662Z] [INFO] --- maven-resources-plugin:2.4.3:testResources (default-testResources) @ org.eclipse.ease.lang.ruby ---
10:02:29 [2020-09-22T14:02:29.662Z] [INFO] Using 'UTF-8' encoding to copy filtered resources.
10:02:29 [2020-09-22T14:02:29.662Z] [INFO] skip non existing resourceDirectory /home/jenkins/agent/workspace/ease.verify.core.gerrit/plugins/org.eclipse.ease.lang.ruby/src/test/resources
10:02:29 [2020-09-22T14:02:29.662Z] [INFO] 
10:02:29 [2020-09-22T14:02:29.662Z] [INFO] --- tycho-source-plugin:1.3.0:plugin-source (plugin-source) @ org.eclipse.ease.lang.ruby ---
10:02:29 [2020-09-22T14:02:29.662Z] [INFO] Building jar: /home/jenkins/agent/workspace/ease.verify.core.gerrit/plugins/org.eclipse.ease.lang.ruby/target/org.eclipse.ease.lang.ruby-0.8.0-SNAPSHOT-sources.jar
10:02:29 [2020-09-22T14:02:29.662Z] [INFO] 
10:02:29 [2020-09-22T14:02:29.662Z] [INFO] --- target-platform-configuration:1.3.0:target-platform (default-target-platform) @ org.eclipse.ease.lang.ruby ---
10:02:29 [2020-09-22T14:02:29.662Z] [INFO] 
10:02:29 [2020-09-22T14:02:29.662Z] [INFO] --- tycho-packaging-plugin:1.3.0:package-plugin (default-package-plugin) @ org.eclipse.ease.lang.ruby ---
10:02:29 [2020-09-22T14:02:29.662Z] [INFO] Building jar: /home/jenkins/agent/workspace/ease.verify.core.gerrit/plugins/org.eclipse.ease.lang.ruby/target/org.eclipse.ease.lang.ruby-0.8.0-SNAPSHOT.jar
10:02:29 [2020-09-22T14:02:29.662Z] [INFO] 
10:02:29 [2020-09-22T14:02:29.662Z] [INFO] --- tycho-p2-plugin:1.3.0:p2-metadata-default (default-p2-metadata-default) @ org.eclipse.ease.lang.ruby ---
10:02:29 [2020-09-22T14:02:29.662Z] [INFO] 
10:02:29 [2020-09-22T14:02:29.662Z] [INFO] --- tycho-source-feature-plugin:1.3.0:source-feature (source-feature) @ org.eclipse.ease.lang.ruby ---
10:02:29 [2020-09-22T14:02:29.662Z] [INFO] 
10:02:29 [2020-09-22T14:02:29.662Z] [INFO] --- tycho-p2-plugin:1.3.0:p2-metadata (attached-p2-metadata) @ org.eclipse.ease.lang.ruby ---
10:02:29 [2020-09-22T14:02:29.662Z] [INFO] 
10:02:29 [2020-09-22T14:02:29.662Z] [INFO] ---------< org.eclipse.ease:org.eclipse.ease.lang.ruby.jruby >----------
10:02:29 [2020-09-22T14:02:29.662Z] [INFO] Building org.eclipse.ease.lang.ruby.jruby 0.8.0-SNAPSHOT         [16/49]
10:02:29 [2020-09-22T14:02:29.662Z] [INFO] ---------------------------[ eclipse-plugin ]---------------------------
10:02:29 [2020-09-22T14:02:29.662Z] [INFO] 
10:02:29 [2020-09-22T14:02:29.662Z] [INFO] --- maven-clean-plugin:2.5:clean (default-clean) @ org.eclipse.ease.lang.ruby.jruby ---
10:02:29 [2020-09-22T14:02:29.662Z] [INFO] 
10:02:29 [2020-09-22T14:02:29.662Z] [INFO] --- tycho-packaging-plugin:1.3.0:build-qualifier (default-build-qualifier) @ org.eclipse.ease.lang.ruby.jruby ---
10:02:29 [2020-09-22T14:02:29.662Z] [INFO] The project's OSGi version is 0.8.0.I201910171213
10:02:29 [2020-09-22T14:02:29.662Z] [INFO] 
10:02:29 [2020-09-22T14:02:29.662Z] [INFO] --- tycho-packaging-plugin:1.3.0:validate-id (default-validate-id) @ org.eclipse.ease.lang.ruby.jruby ---
10:02:29 [2020-09-22T14:02:29.662Z] [INFO] 
10:02:29 [2020-09-22T14:02:29.662Z] [INFO] --- tycho-packaging-plugin:1.3.0:validate-version (default-validate-version) @ org.eclipse.ease.lang.ruby.jruby ---
10:02:29 [2020-09-22T14:02:29.662Z] [INFO] 
10:02:29 [2020-09-22T14:02:29.662Z] [INFO] >>> maven-javadoc-plugin:2.9.1:javadoc (build-docs) > generate-sources @ org.eclipse.ease.lang.ruby.jruby >>>
10:02:29 [2020-09-22T14:02:29.662Z] [INFO] 
10:02:29 [2020-09-22T14:02:29.662Z] [INFO] --- tycho-packaging-plugin:1.3.0:build-qualifier (default-build-qualifier) @ org.eclipse.ease.lang.ruby.jruby ---
10:02:29 [2020-09-22T14:02:29.662Z] [INFO] The project's OSGi version is 0.8.0.I201910171213
10:02:29 [2020-09-22T14:02:29.662Z] [INFO] 
10:02:29 [2020-09-22T14:02:29.662Z] [INFO] --- tycho-packaging-plugin:1.3.0:validate-id (default-validate-id) @ org.eclipse.ease.lang.ruby.jruby ---
10:02:29 [2020-09-22T14:02:29.662Z] [INFO] 
10:02:29 [2020-09-22T14:02:29.662Z] [INFO] --- tycho-packaging-plugin:1.3.0:validate-version (default-validate-version) @ org.eclipse.ease.lang.ruby.jruby ---
10:02:29 [2020-09-22T14:02:29.663Z] [INFO] 
10:02:29 [2020-09-22T14:02:29.663Z] [INFO] <<< maven-javadoc-plugin:2.9.1:javadoc (build-docs) < generate-sources @ org.eclipse.ease.lang.ruby.jruby <<<
10:02:29 [2020-09-22T14:02:29.663Z] [INFO] 
10:02:29 [2020-09-22T14:02:29.663Z] [INFO] 
10:02:29 [2020-09-22T14:02:29.663Z] [INFO] --- maven-javadoc-plugin:2.9.1:javadoc (build-docs) @ org.eclipse.ease.lang.ruby.jruby ---
10:02:29 [2020-09-22T14:02:29.663Z] [ERROR] Error fetching link: http://help.eclipse.org/oxygen/topic/org.eclipse.platform.doc.isv/reference/api/package-list. Ignored it.
10:02:31 [2020-09-22T14:02:31.026Z] [INFO] 
10:02:31 [2020-09-22T14:02:31.026Z] Loading source files for package org.eclipse.ease.lang.ruby.jruby...
10:02:31 [2020-09-22T14:02:31.026Z] Constructing Javadoc information...
10:02:31 [2020-09-22T14:02:31.026Z] WARNING: Cannot open location "/home/jenkins/agent/workspace/ease.verify.core.gerrit/plugins/org.eclipse.ease.lang.ruby.jruby/target/javadoc-bundle-options/package-list"
10:02:31 [2020-09-22T14:02:31.026Z] [WARNING] Javadoc Warnings
10:02:31 [2020-09-22T14:02:31.026Z] [WARNING] Picked up JAVA_TOOL_OPTIONS: -Dmaven.ext.class.path="/home/jenkins/agent/workspace/ease.verify.core.gerrit@tmp/withMaven4f91d2e1/pipeline-maven-spy.jar" -Dorg.jenkinsci.plugins.pipeline.maven.reportsFolder="/home/jenkins/agent/workspace/ease.verify.core.gerrit@tmp/withMaven4f91d2e1"
10:02:31 [2020-09-22T14:02:31.026Z] [INFO] 
10:02:31 [2020-09-22T14:02:31.026Z] [INFO] --- build-helper-maven-plugin:1.9.1:add-resource (add_help) @ org.eclipse.ease.lang.ruby.jruby ---
10:02:31 [2020-09-22T14:02:31.026Z] [INFO] 
10:02:31 [2020-09-22T14:02:31.026Z] [INFO] --- maven-resources-plugin:2.4.3:resources (default-resources) @ org.eclipse.ease.lang.ruby.jruby ---
10:02:31 [2020-09-22T14:02:31.026Z] [INFO] Using 'UTF-8' encoding to copy filtered resources.
10:02:31 [2020-09-22T14:02:31.026Z] [INFO] skip non existing resourceDirectory /home/jenkins/agent/workspace/ease.verify.core.gerrit/plugins/org.eclipse.ease.lang.ruby.jruby/src/main/resources
10:02:31 [2020-09-22T14:02:31.026Z] [INFO] skip non existing resourceDirectory /home/jenkins/agent/workspace/ease.verify.core.gerrit/plugins/org.eclipse.ease.lang.ruby.jruby/help
10:02:31 [2020-09-22T14:02:31.026Z] [INFO] 
10:02:31 [2020-09-22T14:02:31.026Z] [INFO] --- tycho-compiler-plugin:1.3.0:compile (default-compile) @ org.eclipse.ease.lang.ruby.jruby ---
10:02:31 [2020-09-22T14:02:31.026Z] [INFO] Compiling 2 source files to /home/jenkins/agent/workspace/ease.verify.core.gerrit/plugins/org.eclipse.ease.lang.ruby.jruby/target/classes
10:02:31 [2020-09-22T14:02:31.026Z] [INFO] 
10:02:31 [2020-09-22T14:02:31.026Z] [INFO] --- maven-resources-plugin:2.4.3:testResources (default-testResources) @ org.eclipse.ease.lang.ruby.jruby ---
10:02:31 [2020-09-22T14:02:31.026Z] [INFO] Using 'UTF-8' encoding to copy filtered resources.
10:02:31 [2020-09-22T14:02:31.026Z] [INFO] skip non existing resourceDirectory /home/jenkins/agent/workspace/ease.verify.core.gerrit/plugins/org.eclipse.ease.lang.ruby.jruby/src/test/resources
10:02:31 [2020-09-22T14:02:31.026Z] [INFO] 
10:02:31 [2020-09-22T14:02:31.026Z] [INFO] --- tycho-source-plugin:1.3.0:plugin-source (plugin-source) @ org.eclipse.ease.lang.ruby.jruby ---
10:02:31 [2020-09-22T14:02:31.026Z] [INFO] Building jar: /home/jenkins/agent/workspace/ease.verify.core.gerrit/plugins/org.eclipse.ease.lang.ruby.jruby/target/org.eclipse.ease.lang.ruby.jruby-0.8.0-SNAPSHOT-sources.jar
10:02:31 [2020-09-22T14:02:31.026Z] [INFO] 
10:02:31 [2020-09-22T14:02:31.026Z] [INFO] --- target-platform-configuration:1.3.0:target-platform (default-target-platform) @ org.eclipse.ease.lang.ruby.jruby ---
10:02:31 [2020-09-22T14:02:31.026Z] [INFO] 
10:02:31 [2020-09-22T14:02:31.026Z] [INFO] --- tycho-packaging-plugin:1.3.0:package-plugin (default-package-plugin) @ org.eclipse.ease.lang.ruby.jruby ---
10:02:31 [2020-09-22T14:02:31.026Z] [INFO] Building jar: /home/jenkins/agent/workspace/ease.verify.core.gerrit/plugins/org.eclipse.ease.lang.ruby.jruby/target/org.eclipse.ease.lang.ruby.jruby-0.8.0-SNAPSHOT.jar
10:02:31 [2020-09-22T14:02:31.026Z] [INFO] 
10:02:31 [2020-09-22T14:02:31.026Z] [INFO] --- tycho-p2-plugin:1.3.0:p2-metadata-default (default-p2-metadata-default) @ org.eclipse.ease.lang.ruby.jruby ---
10:02:31 [2020-09-22T14:02:31.026Z] [INFO] 
10:02:31 [2020-09-22T14:02:31.026Z] [INFO] --- tycho-source-feature-plugin:1.3.0:source-feature (source-feature) @ org.eclipse.ease.lang.ruby.jruby ---
10:02:31 [2020-09-22T14:02:31.026Z] [INFO] 
10:02:31 [2020-09-22T14:02:31.026Z] [INFO] --- tycho-p2-plugin:1.3.0:p2-metadata (attached-p2-metadata) @ org.eclipse.ease.lang.ruby.jruby ---
10:02:31 [2020-09-22T14:02:31.026Z] [INFO] 
10:02:31 [2020-09-22T14:02:31.026Z] [INFO] -----< org.eclipse.ease:org.eclipse.ease.lang.javascript.nashorn >------
10:02:31 [2020-09-22T14:02:31.026Z] [INFO] Building org.eclipse.ease.lang.javascript.nashorn 0.8.0-SNAPSHOT [17/49]
10:02:31 [2020-09-22T14:02:31.026Z] [INFO] ---------------------------[ eclipse-plugin ]---------------------------
10:02:31 [2020-09-22T14:02:31.026Z] [INFO] 
10:02:31 [2020-09-22T14:02:31.026Z] [INFO] --- maven-clean-plugin:2.5:clean (default-clean) @ org.eclipse.ease.lang.javascript.nashorn ---
10:02:31 [2020-09-22T14:02:31.026Z] [INFO] 
10:02:31 [2020-09-22T14:02:31.026Z] [INFO] --- tycho-packaging-plugin:1.3.0:build-qualifier (default-build-qualifier) @ org.eclipse.ease.lang.javascript.nashorn ---
10:02:31 [2020-09-22T14:02:31.026Z] [INFO] The project's OSGi version is 0.8.0.I202008070902
10:02:31 [2020-09-22T14:02:31.026Z] [INFO] 
10:02:31 [2020-09-22T14:02:31.026Z] [INFO] --- tycho-packaging-plugin:1.3.0:validate-id (default-validate-id) @ org.eclipse.ease.lang.javascript.nashorn ---
10:02:31 [2020-09-22T14:02:31.027Z] [INFO] 
10:02:31 [2020-09-22T14:02:31.027Z] [INFO] --- tycho-packaging-plugin:1.3.0:validate-version (default-validate-version) @ org.eclipse.ease.lang.javascript.nashorn ---
10:02:31 [2020-09-22T14:02:31.027Z] [INFO] 
10:02:31 [2020-09-22T14:02:31.027Z] [INFO] >>> maven-javadoc-plugin:2.9.1:javadoc (build-docs) > generate-sources @ org.eclipse.ease.lang.javascript.nashorn >>>
10:02:31 [2020-09-22T14:02:31.027Z] [INFO] 
10:02:31 [2020-09-22T14:02:31.027Z] [INFO] --- tycho-packaging-plugin:1.3.0:build-qualifier (default-build-qualifier) @ org.eclipse.ease.lang.javascript.nashorn ---
10:02:31 [2020-09-22T14:02:31.027Z] [INFO] The project's OSGi version is 0.8.0.I202008070902
10:02:31 [2020-09-22T14:02:31.027Z] [INFO] 
10:02:31 [2020-09-22T14:02:31.027Z] [INFO] --- tycho-packaging-plugin:1.3.0:validate-id (default-validate-id) @ org.eclipse.ease.lang.javascript.nashorn ---
10:02:31 [2020-09-22T14:02:31.027Z] [INFO] 
10:02:31 [2020-09-22T14:02:31.027Z] [INFO] --- tycho-packaging-plugin:1.3.0:validate-version (default-validate-version) @ org.eclipse.ease.lang.javascript.nashorn ---
10:02:31 [2020-09-22T14:02:31.027Z] [INFO] 
10:02:31 [2020-09-22T14:02:31.027Z] [INFO] <<< maven-javadoc-plugin:2.9.1:javadoc (build-docs) < generate-sources @ org.eclipse.ease.lang.javascript.nashorn <<<
10:02:31 [2020-09-22T14:02:31.027Z] [INFO] 
10:02:31 [2020-09-22T14:02:31.027Z] [INFO] 
10:02:31 [2020-09-22T14:02:31.027Z] [INFO] --- maven-javadoc-plugin:2.9.1:javadoc (build-docs) @ org.eclipse.ease.lang.javascript.nashorn ---
10:02:31 [2020-09-22T14:02:31.027Z] [ERROR] Error fetching link: http://help.eclipse.org/oxygen/topic/org.eclipse.platform.doc.isv/reference/api/package-list. Ignored it.
10:02:31 [2020-09-22T14:02:31.954Z] [INFO] 
10:02:31 [2020-09-22T14:02:31.954Z] Loading source files for package org.eclipse.ease.lang.javascript.nashorn...
10:02:31 [2020-09-22T14:02:31.954Z] Constructing Javadoc information...
10:02:31 [2020-09-22T14:02:31.954Z] WARNING: Cannot open location "/home/jenkins/agent/workspace/ease.verify.core.gerrit/plugins/org.eclipse.ease.lang.javascript.nashorn/target/javadoc-bundle-options/package-list"
10:02:31 [2020-09-22T14:02:31.954Z] [WARNING] Javadoc Warnings
10:02:31 [2020-09-22T14:02:31.954Z] [WARNING] Picked up JAVA_TOOL_OPTIONS: -Dmaven.ext.class.path="/home/jenkins/agent/workspace/ease.verify.core.gerrit@tmp/withMaven4f91d2e1/pipeline-maven-spy.jar" -Dorg.jenkinsci.plugins.pipeline.maven.reportsFolder="/home/jenkins/agent/workspace/ease.verify.core.gerrit@tmp/withMaven4f91d2e1"
10:02:31 [2020-09-22T14:02:31.954Z] [INFO] 
10:02:31 [2020-09-22T14:02:31.954Z] [INFO] --- build-helper-maven-plugin:1.9.1:add-resource (add_help) @ org.eclipse.ease.lang.javascript.nashorn ---
10:02:31 [2020-09-22T14:02:31.954Z] [INFO] 
10:02:31 [2020-09-22T14:02:31.954Z] [INFO] --- maven-resources-plugin:2.4.3:resources (default-resources) @ org.eclipse.ease.lang.javascript.nashorn ---
10:02:31 [2020-09-22T14:02:31.954Z] [INFO] Using 'UTF-8' encoding to copy filtered resources.
10:02:31 [2020-09-22T14:02:31.954Z] [INFO] skip non existing resourceDirectory /home/jenkins/agent/workspace/ease.verify.core.gerrit/plugins/org.eclipse.ease.lang.javascript.nashorn/src/main/resources
10:02:31 [2020-09-22T14:02:31.954Z] [INFO] Copying 2 resources to help
10:02:31 [2020-09-22T14:02:31.954Z] [INFO] 
10:02:31 [2020-09-22T14:02:31.954Z] [INFO] --- tycho-compiler-plugin:1.3.0:compile (default-compile) @ org.eclipse.ease.lang.javascript.nashorn ---
10:02:31 [2020-09-22T14:02:31.954Z] [INFO] Compiling 2 source files to /home/jenkins/agent/workspace/ease.verify.core.gerrit/plugins/org.eclipse.ease.lang.javascript.nashorn/target/classes
10:02:32 [2020-09-22T14:02:32.211Z] [INFO] 
10:02:32 [2020-09-22T14:02:32.211Z] [INFO] --- maven-resources-plugin:2.4.3:testResources (default-testResources) @ org.eclipse.ease.lang.javascript.nashorn ---
10:02:32 [2020-09-22T14:02:32.211Z] [INFO] Using 'UTF-8' encoding to copy filtered resources.
10:02:32 [2020-09-22T14:02:32.211Z] [INFO] skip non existing resourceDirectory /home/jenkins/agent/workspace/ease.verify.core.gerrit/plugins/org.eclipse.ease.lang.javascript.nashorn/src/test/resources
10:02:32 [2020-09-22T14:02:32.211Z] [INFO] 
10:02:32 [2020-09-22T14:02:32.211Z] [INFO] --- tycho-source-plugin:1.3.0:plugin-source (plugin-source) @ org.eclipse.ease.lang.javascript.nashorn ---
10:02:32 [2020-09-22T14:02:32.211Z] [WARNING] Bundle-Vendor header not found in /home/jenkins/agent/workspace/ease.verify.core.gerrit/plugins/org.eclipse.ease.lang.javascript.nashorn/META-INF/MANIFEST.MF, fallback to 'unknown' for source bundle
10:02:32 [2020-09-22T14:02:32.211Z] [INFO] Building jar: /home/jenkins/agent/workspace/ease.verify.core.gerrit/plugins/org.eclipse.ease.lang.javascript.nashorn/target/org.eclipse.ease.lang.javascript.nashorn-0.8.0-SNAPSHOT-sources.jar
10:02:32 [2020-09-22T14:02:32.211Z] [INFO] 
10:02:32 [2020-09-22T14:02:32.211Z] [INFO] --- target-platform-configuration:1.3.0:target-platform (default-target-platform) @ org.eclipse.ease.lang.javascript.nashorn ---
10:02:32 [2020-09-22T14:02:32.211Z] [INFO] 
10:02:32 [2020-09-22T14:02:32.211Z] [INFO] --- tycho-packaging-plugin:1.3.0:package-plugin (default-package-plugin) @ org.eclipse.ease.lang.javascript.nashorn ---
10:02:32 [2020-09-22T14:02:32.211Z] [INFO] Building jar: /home/jenkins/agent/workspace/ease.verify.core.gerrit/plugins/org.eclipse.ease.lang.javascript.nashorn/target/org.eclipse.ease.lang.javascript.nashorn-0.8.0-SNAPSHOT.jar
10:02:32 [2020-09-22T14:02:32.211Z] [INFO] 
10:02:32 [2020-09-22T14:02:32.211Z] [INFO] --- tycho-p2-plugin:1.3.0:p2-metadata-default (default-p2-metadata-default) @ org.eclipse.ease.lang.javascript.nashorn ---
10:02:32 [2020-09-22T14:02:32.211Z] [INFO] 
10:02:32 [2020-09-22T14:02:32.211Z] [INFO] --- tycho-source-feature-plugin:1.3.0:source-feature (source-feature) @ org.eclipse.ease.lang.javascript.nashorn ---
10:02:32 [2020-09-22T14:02:32.211Z] [INFO] 
10:02:32 [2020-09-22T14:02:32.211Z] [INFO] --- tycho-p2-plugin:1.3.0:p2-metadata (attached-p2-metadata) @ org.eclipse.ease.lang.javascript.nashorn ---
10:02:32 [2020-09-22T14:02:32.211Z] [INFO] 
10:02:32 [2020-09-22T14:02:32.211Z] [INFO] ------< org.eclipse.ease:org.eclipse.ease.lang.javascript.rhino >-------
10:02:32 [2020-09-22T14:02:32.211Z] [INFO] Building org.eclipse.ease.lang.javascript.rhino 0.8.0-SNAPSHOT   [18/49]
10:02:32 [2020-09-22T14:02:32.211Z] [INFO] ---------------------------[ eclipse-plugin ]---------------------------
10:02:32 [2020-09-22T14:02:32.211Z] [INFO] 
10:02:32 [2020-09-22T14:02:32.211Z] [INFO] --- maven-clean-plugin:2.5:clean (default-clean) @ org.eclipse.ease.lang.javascript.rhino ---
10:02:32 [2020-09-22T14:02:32.211Z] [INFO] 
10:02:32 [2020-09-22T14:02:32.211Z] [INFO] --- tycho-packaging-plugin:1.3.0:build-qualifier (default-build-qualifier) @ org.eclipse.ease.lang.javascript.rhino ---
10:02:32 [2020-09-22T14:02:32.211Z] [INFO] The project's OSGi version is 0.8.0.I202008070902
10:02:32 [2020-09-22T14:02:32.211Z] [INFO] 
10:02:32 [2020-09-22T14:02:32.211Z] [INFO] --- tycho-packaging-plugin:1.3.0:validate-id (default-validate-id) @ org.eclipse.ease.lang.javascript.rhino ---
10:02:32 [2020-09-22T14:02:32.211Z] [INFO] 
10:02:32 [2020-09-22T14:02:32.211Z] [INFO] --- tycho-packaging-plugin:1.3.0:validate-version (default-validate-version) @ org.eclipse.ease.lang.javascript.rhino ---
10:02:32 [2020-09-22T14:02:32.211Z] [INFO] 
10:02:32 [2020-09-22T14:02:32.211Z] [INFO] >>> maven-javadoc-plugin:2.9.1:javadoc (build-docs) > generate-sources @ org.eclipse.ease.lang.javascript.rhino >>>
10:02:32 [2020-09-22T14:02:32.211Z] [INFO] 
10:02:32 [2020-09-22T14:02:32.211Z] [INFO] --- tycho-packaging-plugin:1.3.0:build-qualifier (default-build-qualifier) @ org.eclipse.ease.lang.javascript.rhino ---
10:02:32 [2020-09-22T14:02:32.211Z] [INFO] The project's OSGi version is 0.8.0.I202008070902
10:02:32 [2020-09-22T14:02:32.211Z] [INFO] 
10:02:32 [2020-09-22T14:02:32.211Z] [INFO] --- tycho-packaging-plugin:1.3.0:validate-id (default-validate-id) @ org.eclipse.ease.lang.javascript.rhino ---
10:02:32 [2020-09-22T14:02:32.211Z] [INFO] 
10:02:32 [2020-09-22T14:02:32.211Z] [INFO] --- tycho-packaging-plugin:1.3.0:validate-version (default-validate-version) @ org.eclipse.ease.lang.javascript.rhino ---
10:02:32 [2020-09-22T14:02:32.211Z] [INFO] 
10:02:32 [2020-09-22T14:02:32.211Z] [INFO] <<< maven-javadoc-plugin:2.9.1:javadoc (build-docs) < generate-sources @ org.eclipse.ease.lang.javascript.rhino <<<
10:02:32 [2020-09-22T14:02:32.211Z] [INFO] 
10:02:32 [2020-09-22T14:02:32.211Z] [INFO] 
10:02:32 [2020-09-22T14:02:32.211Z] [INFO] --- maven-javadoc-plugin:2.9.1:javadoc (build-docs) @ org.eclipse.ease.lang.javascript.rhino ---
10:02:32 [2020-09-22T14:02:32.211Z] [ERROR] Error fetching link: http://help.eclipse.org/oxygen/topic/org.eclipse.platform.doc.isv/reference/api/package-list. Ignored it.
10:02:33 [2020-09-22T14:02:33.598Z] [INFO] 
10:02:33 [2020-09-22T14:02:33.598Z] Loading source files for package org.eclipse.ease.lang.javascript.rhino...
10:02:33 [2020-09-22T14:02:33.598Z] Loading source files for package org.eclipse.ease.lang.javascript.rhino.debugger...
10:02:33 [2020-09-22T14:02:33.598Z] Loading source files for package org.eclipse.ease.lang.javascript.rhino.debugger.actions...
10:02:33 [2020-09-22T14:02:33.598Z] Loading source files for package org.eclipse.ease.lang.javascript.rhino.debugger.editor...
10:02:33 [2020-09-22T14:02:33.598Z] Loading source files for package org.eclipse.ease.lang.javascript.rhino.debugger.model...
10:02:33 [2020-09-22T14:02:33.598Z] Constructing Javadoc information...
10:02:33 [2020-09-22T14:02:33.598Z] WARNING: Cannot open location "/home/jenkins/agent/workspace/ease.verify.core.gerrit/plugins/org.eclipse.ease.lang.javascript.rhino/target/javadoc-bundle-options/package-list"
10:02:33 [2020-09-22T14:02:33.598Z] [WARNING] Javadoc Warnings
10:02:33 [2020-09-22T14:02:33.598Z] [WARNING] Picked up JAVA_TOOL_OPTIONS: -Dmaven.ext.class.path="/home/jenkins/agent/workspace/ease.verify.core.gerrit@tmp/withMaven4f91d2e1/pipeline-maven-spy.jar" -Dorg.jenkinsci.plugins.pipeline.maven.reportsFolder="/home/jenkins/agent/workspace/ease.verify.core.gerrit@tmp/withMaven4f91d2e1"
10:02:33 [2020-09-22T14:02:33.598Z] [INFO] 
10:02:33 [2020-09-22T14:02:33.598Z] [INFO] --- build-helper-maven-plugin:1.9.1:add-resource (add_help) @ org.eclipse.ease.lang.javascript.rhino ---
10:02:33 [2020-09-22T14:02:33.598Z] [INFO] 
10:02:33 [2020-09-22T14:02:33.598Z] [INFO] --- maven-resources-plugin:2.4.3:resources (default-resources) @ org.eclipse.ease.lang.javascript.rhino ---
10:02:33 [2020-09-22T14:02:33.599Z] [INFO] Using 'UTF-8' encoding to copy filtered resources.
10:02:33 [2020-09-22T14:02:33.599Z] [INFO] skip non existing resourceDirectory /home/jenkins/agent/workspace/ease.verify.core.gerrit/plugins/org.eclipse.ease.lang.javascript.rhino/src/main/resources
10:02:33 [2020-09-22T14:02:33.599Z] [INFO] Copying 2 resources to help
10:02:33 [2020-09-22T14:02:33.599Z] [INFO] 
10:02:33 [2020-09-22T14:02:33.599Z] [INFO] --- tycho-compiler-plugin:1.3.0:compile (default-compile) @ org.eclipse.ease.lang.javascript.rhino ---
10:02:33 [2020-09-22T14:02:33.599Z] [INFO] Compiling 13 source files to /home/jenkins/agent/workspace/ease.verify.core.gerrit/plugins/org.eclipse.ease.lang.javascript.rhino/target/classes
10:02:33 [2020-09-22T14:02:33.599Z] [INFO] 
10:02:33 [2020-09-22T14:02:33.599Z] [INFO] --- maven-resources-plugin:2.4.3:testResources (default-testResources) @ org.eclipse.ease.lang.javascript.rhino ---
10:02:33 [2020-09-22T14:02:33.599Z] [INFO] Using 'UTF-8' encoding to copy filtered resources.
10:02:33 [2020-09-22T14:02:33.599Z] [INFO] skip non existing resourceDirectory /home/jenkins/agent/workspace/ease.verify.core.gerrit/plugins/org.eclipse.ease.lang.javascript.rhino/src/test/resources
10:02:33 [2020-09-22T14:02:33.599Z] [INFO] 
10:02:33 [2020-09-22T14:02:33.599Z] [INFO] --- tycho-source-plugin:1.3.0:plugin-source (plugin-source) @ org.eclipse.ease.lang.javascript.rhino ---
10:02:33 [2020-09-22T14:02:33.599Z] [INFO] Building jar: /home/jenkins/agent/workspace/ease.verify.core.gerrit/plugins/org.eclipse.ease.lang.javascript.rhino/target/org.eclipse.ease.lang.javascript.rhino-0.8.0-SNAPSHOT-sources.jar
10:02:33 [2020-09-22T14:02:33.599Z] [INFO] 
10:02:33 [2020-09-22T14:02:33.599Z] [INFO] --- target-platform-configuration:1.3.0:target-platform (default-target-platform) @ org.eclipse.ease.lang.javascript.rhino ---
10:02:33 [2020-09-22T14:02:33.599Z] [INFO] 
10:02:33 [2020-09-22T14:02:33.599Z] [INFO] --- tycho-packaging-plugin:1.3.0:package-plugin (default-package-plugin) @ org.eclipse.ease.lang.javascript.rhino ---
10:02:33 [2020-09-22T14:02:33.599Z] [INFO] Building jar: /home/jenkins/agent/workspace/ease.verify.core.gerrit/plugins/org.eclipse.ease.lang.javascript.rhino/target/org.eclipse.ease.lang.javascript.rhino-0.8.0-SNAPSHOT.jar
10:02:33 [2020-09-22T14:02:33.599Z] [INFO] 
10:02:33 [2020-09-22T14:02:33.599Z] [INFO] --- tycho-p2-plugin:1.3.0:p2-metadata-default (default-p2-metadata-default) @ org.eclipse.ease.lang.javascript.rhino ---
10:02:33 [2020-09-22T14:02:33.599Z] [INFO] 
10:02:33 [2020-09-22T14:02:33.599Z] [INFO] --- tycho-source-feature-plugin:1.3.0:source-feature (source-feature) @ org.eclipse.ease.lang.javascript.rhino ---
10:02:33 [2020-09-22T14:02:33.599Z] [INFO] 
10:02:33 [2020-09-22T14:02:33.599Z] [INFO] --- tycho-p2-plugin:1.3.0:p2-metadata (attached-p2-metadata) @ org.eclipse.ease.lang.javascript.rhino ---
10:02:33 [2020-09-22T14:02:33.599Z] [INFO] 
10:02:33 [2020-09-22T14:02:33.599Z] [INFO] --------< org.eclipse.ease:org.eclipse.ease.lang.python.jython >--------
10:02:33 [2020-09-22T14:02:33.599Z] [INFO] Building org.eclipse.ease.lang.python.jython 0.8.0-SNAPSHOT      [19/49]
10:02:33 [2020-09-22T14:02:33.599Z] [INFO] ---------------------------[ eclipse-plugin ]---------------------------
10:02:33 [2020-09-22T14:02:33.599Z] [INFO] 
10:02:33 [2020-09-22T14:02:33.599Z] [INFO] --- maven-clean-plugin:2.5:clean (default-clean) @ org.eclipse.ease.lang.python.jython ---
10:02:33 [2020-09-22T14:02:33.599Z] [INFO] 
10:02:33 [2020-09-22T14:02:33.599Z] [INFO] --- tycho-packaging-plugin:1.3.0:build-qualifier (default-build-qualifier) @ org.eclipse.ease.lang.python.jython ---
10:02:33 [2020-09-22T14:02:33.854Z] [INFO] The project's OSGi version is 0.8.0.I202008070902
10:02:33 [2020-09-22T14:02:33.854Z] [INFO] 
10:02:33 [2020-09-22T14:02:33.854Z] [INFO] --- tycho-packaging-plugin:1.3.0:validate-id (default-validate-id) @ org.eclipse.ease.lang.python.jython ---
10:02:33 [2020-09-22T14:02:33.854Z] [INFO] 
10:02:33 [2020-09-22T14:02:33.854Z] [INFO] --- tycho-packaging-plugin:1.3.0:validate-version (default-validate-version) @ org.eclipse.ease.lang.python.jython ---
10:02:33 [2020-09-22T14:02:33.854Z] [INFO] 
10:02:33 [2020-09-22T14:02:33.854Z] [INFO] >>> maven-javadoc-plugin:2.9.1:javadoc (build-docs) > generate-sources @ org.eclipse.ease.lang.python.jython >>>
10:02:33 [2020-09-22T14:02:33.854Z] [INFO] 
10:02:33 [2020-09-22T14:02:33.855Z] [INFO] --- tycho-packaging-plugin:1.3.0:build-qualifier (default-build-qualifier) @ org.eclipse.ease.lang.python.jython ---
10:02:33 [2020-09-22T14:02:33.855Z] [INFO] The project's OSGi version is 0.8.0.I202008070902
10:02:33 [2020-09-22T14:02:33.855Z] [INFO] 
10:02:33 [2020-09-22T14:02:33.855Z] [INFO] --- tycho-packaging-plugin:1.3.0:validate-id (default-validate-id) @ org.eclipse.ease.lang.python.jython ---
10:02:33 [2020-09-22T14:02:33.855Z] [INFO] 
10:02:33 [2020-09-22T14:02:33.855Z] [INFO] --- tycho-packaging-plugin:1.3.0:validate-version (default-validate-version) @ org.eclipse.ease.lang.python.jython ---
10:02:33 [2020-09-22T14:02:33.855Z] [INFO] 
10:02:33 [2020-09-22T14:02:33.855Z] [INFO] <<< maven-javadoc-plugin:2.9.1:javadoc (build-docs) < generate-sources @ org.eclipse.ease.lang.python.jython <<<
10:02:33 [2020-09-22T14:02:33.855Z] [INFO] 
10:02:33 [2020-09-22T14:02:33.855Z] [INFO] 
10:02:33 [2020-09-22T14:02:33.855Z] [INFO] --- maven-javadoc-plugin:2.9.1:javadoc (build-docs) @ org.eclipse.ease.lang.python.jython ---
10:02:33 [2020-09-22T14:02:33.855Z] [ERROR] Error fetching link: http://help.eclipse.org/oxygen/topic/org.eclipse.platform.doc.isv/reference/api/package-list. Ignored it.
10:02:35 [2020-09-22T14:02:35.219Z] [INFO] 
10:02:35 [2020-09-22T14:02:35.219Z] Loading source files for package org.eclipse.ease.lang.python.jython...
10:02:35 [2020-09-22T14:02:35.219Z] Loading source files for package org.eclipse.ease.lang.python.jython.debugger...
10:02:35 [2020-09-22T14:02:35.219Z] Loading source files for package org.eclipse.ease.lang.python.jython.preferences...
10:02:35 [2020-09-22T14:02:35.219Z] Constructing Javadoc information...
10:02:35 [2020-09-22T14:02:35.219Z] WARNING: Cannot open location "/home/jenkins/agent/workspace/ease.verify.core.gerrit/plugins/org.eclipse.ease.lang.python.jython/target/javadoc-bundle-options/package-list"
10:02:35 [2020-09-22T14:02:35.219Z] [WARNING] Javadoc Warnings
10:02:35 [2020-09-22T14:02:35.219Z] [WARNING] Picked up JAVA_TOOL_OPTIONS: -Dmaven.ext.class.path="/home/jenkins/agent/workspace/ease.verify.core.gerrit@tmp/withMaven4f91d2e1/pipeline-maven-spy.jar" -Dorg.jenkinsci.plugins.pipeline.maven.reportsFolder="/home/jenkins/agent/workspace/ease.verify.core.gerrit@tmp/withMaven4f91d2e1"
10:02:35 [2020-09-22T14:02:35.219Z] [INFO] 
10:02:35 [2020-09-22T14:02:35.219Z] [INFO] --- build-helper-maven-plugin:1.9.1:add-resource (add_help) @ org.eclipse.ease.lang.python.jython ---
10:02:35 [2020-09-22T14:02:35.219Z] [INFO] 
10:02:35 [2020-09-22T14:02:35.219Z] [INFO] --- maven-resources-plugin:2.4.3:resources (default-resources) @ org.eclipse.ease.lang.python.jython ---
10:02:35 [2020-09-22T14:02:35.219Z] [INFO] Using 'UTF-8' encoding to copy filtered resources.
10:02:35 [2020-09-22T14:02:35.219Z] [INFO] skip non existing resourceDirectory /home/jenkins/agent/workspace/ease.verify.core.gerrit/plugins/org.eclipse.ease.lang.python.jython/src/main/resources
10:02:35 [2020-09-22T14:02:35.219Z] [INFO] Copying 2 resources to help
10:02:35 [2020-09-22T14:02:35.219Z] [INFO] 
10:02:35 [2020-09-22T14:02:35.219Z] [INFO] --- tycho-compiler-plugin:1.3.0:compile (default-compile) @ org.eclipse.ease.lang.python.jython ---
10:02:35 [2020-09-22T14:02:35.219Z] [INFO] Compiling 10 source files to /home/jenkins/agent/workspace/ease.verify.core.gerrit/plugins/org.eclipse.ease.lang.python.jython/target/classes
10:02:35 [2020-09-22T14:02:35.219Z] [INFO] 
10:02:35 [2020-09-22T14:02:35.219Z] [INFO] --- maven-resources-plugin:2.4.3:testResources (default-testResources) @ org.eclipse.ease.lang.python.jython ---
10:02:35 [2020-09-22T14:02:35.219Z] [INFO] Using 'UTF-8' encoding to copy filtered resources.
10:02:35 [2020-09-22T14:02:35.219Z] [INFO] skip non existing resourceDirectory /home/jenkins/agent/workspace/ease.verify.core.gerrit/plugins/org.eclipse.ease.lang.python.jython/src/test/resources
10:02:35 [2020-09-22T14:02:35.219Z] [INFO] 
10:02:35 [2020-09-22T14:02:35.219Z] [INFO] --- tycho-source-plugin:1.3.0:plugin-source (plugin-source) @ org.eclipse.ease.lang.python.jython ---
10:02:35 [2020-09-22T14:02:35.219Z] [WARNING] Bundle-Vendor header not found in /home/jenkins/agent/workspace/ease.verify.core.gerrit/plugins/org.eclipse.ease.lang.python.jython/META-INF/MANIFEST.MF, fallback to 'unknown' for source bundle
10:02:35 [2020-09-22T14:02:35.219Z] [INFO] Building jar: /home/jenkins/agent/workspace/ease.verify.core.gerrit/plugins/org.eclipse.ease.lang.python.jython/target/org.eclipse.ease.lang.python.jython-0.8.0-SNAPSHOT-sources.jar
10:02:35 [2020-09-22T14:02:35.219Z] [INFO] 
10:02:35 [2020-09-22T14:02:35.219Z] [INFO] --- target-platform-configuration:1.3.0:target-platform (default-target-platform) @ org.eclipse.ease.lang.python.jython ---
10:02:35 [2020-09-22T14:02:35.219Z] [INFO] 
10:02:35 [2020-09-22T14:02:35.219Z] [INFO] --- tycho-packaging-plugin:1.3.0:package-plugin (default-package-plugin) @ org.eclipse.ease.lang.python.jython ---
10:02:35 [2020-09-22T14:02:35.219Z] [INFO] Building jar: /home/jenkins/agent/workspace/ease.verify.core.gerrit/plugins/org.eclipse.ease.lang.python.jython/target/org.eclipse.ease.lang.python.jython-0.8.0-SNAPSHOT.jar
10:02:35 [2020-09-22T14:02:35.219Z] [INFO] 
10:02:35 [2020-09-22T14:02:35.219Z] [INFO] --- tycho-p2-plugin:1.3.0:p2-metadata-default (default-p2-metadata-default) @ org.eclipse.ease.lang.python.jython ---
10:02:35 [2020-09-22T14:02:35.219Z] [INFO] 
10:02:35 [2020-09-22T14:02:35.219Z] [INFO] --- tycho-source-feature-plugin:1.3.0:source-feature (source-feature) @ org.eclipse.ease.lang.python.jython ---
10:02:35 [2020-09-22T14:02:35.219Z] [INFO] 
10:02:35 [2020-09-22T14:02:35.219Z] [INFO] --- tycho-p2-plugin:1.3.0:p2-metadata (attached-p2-metadata) @ org.eclipse.ease.lang.python.jython ---
10:02:35 [2020-09-22T14:02:35.219Z] [INFO] 
10:02:35 [2020-09-22T14:02:35.219Z] [INFO] --------< org.eclipse.ease:org.eclipse.ease.lang.javascript.ui >--------
10:02:35 [2020-09-22T14:02:35.219Z] [INFO] Building org.eclipse.ease.lang.javascript.ui 0.8.0-SNAPSHOT      [20/49]
10:02:35 [2020-09-22T14:02:35.219Z] [INFO] ---------------------------[ eclipse-plugin ]---------------------------
10:02:35 [2020-09-22T14:02:35.219Z] [INFO] 
10:02:35 [2020-09-22T14:02:35.219Z] [INFO] --- maven-clean-plugin:2.5:clean (default-clean) @ org.eclipse.ease.lang.javascript.ui ---
10:02:35 [2020-09-22T14:02:35.219Z] [INFO] 
10:02:35 [2020-09-22T14:02:35.219Z] [INFO] --- tycho-packaging-plugin:1.3.0:build-qualifier (default-build-qualifier) @ org.eclipse.ease.lang.javascript.ui ---
10:02:35 [2020-09-22T14:02:35.219Z] [INFO] The project's OSGi version is 0.8.0.I201910171213
10:02:35 [2020-09-22T14:02:35.219Z] [INFO] 
10:02:35 [2020-09-22T14:02:35.219Z] [INFO] --- tycho-packaging-plugin:1.3.0:validate-id (default-validate-id) @ org.eclipse.ease.lang.javascript.ui ---
10:02:35 [2020-09-22T14:02:35.219Z] [INFO] 
10:02:35 [2020-09-22T14:02:35.219Z] [INFO] --- tycho-packaging-plugin:1.3.0:validate-version (default-validate-version) @ org.eclipse.ease.lang.javascript.ui ---
10:02:35 [2020-09-22T14:02:35.219Z] [INFO] 
10:02:35 [2020-09-22T14:02:35.219Z] [INFO] >>> maven-javadoc-plugin:2.9.1:javadoc (build-docs) > generate-sources @ org.eclipse.ease.lang.javascript.ui >>>
10:02:35 [2020-09-22T14:02:35.219Z] [INFO] 
10:02:35 [2020-09-22T14:02:35.220Z] [INFO] --- tycho-packaging-plugin:1.3.0:build-qualifier (default-build-qualifier) @ org.eclipse.ease.lang.javascript.ui ---
10:02:35 [2020-09-22T14:02:35.220Z] [INFO] The project's OSGi version is 0.8.0.I201910171213
10:02:35 [2020-09-22T14:02:35.220Z] [INFO] 
10:02:35 [2020-09-22T14:02:35.220Z] [INFO] --- tycho-packaging-plugin:1.3.0:validate-id (default-validate-id) @ org.eclipse.ease.lang.javascript.ui ---
10:02:35 [2020-09-22T14:02:35.220Z] [INFO] 
10:02:35 [2020-09-22T14:02:35.220Z] [INFO] --- tycho-packaging-plugin:1.3.0:validate-version (default-validate-version) @ org.eclipse.ease.lang.javascript.ui ---
10:02:35 [2020-09-22T14:02:35.220Z] [INFO] 
10:02:35 [2020-09-22T14:02:35.220Z] [INFO] <<< maven-javadoc-plugin:2.9.1:javadoc (build-docs) < generate-sources @ org.eclipse.ease.lang.javascript.ui <<<
10:02:35 [2020-09-22T14:02:35.220Z] [INFO] 
10:02:35 [2020-09-22T14:02:35.220Z] [INFO] 
10:02:35 [2020-09-22T14:02:35.220Z] [INFO] --- maven-javadoc-plugin:2.9.1:javadoc (build-docs) @ org.eclipse.ease.lang.javascript.ui ---
10:02:35 [2020-09-22T14:02:35.475Z] [ERROR] Error fetching link: http://help.eclipse.org/oxygen/topic/org.eclipse.platform.doc.isv/reference/api/package-list. Ignored it.
10:02:36 [2020-09-22T14:02:36.842Z] [INFO] 
10:02:36 [2020-09-22T14:02:36.842Z] Loading source files for package org.eclipse.ease.lang.javascript.ui...
10:02:36 [2020-09-22T14:02:36.842Z] Loading source files for package org.eclipse.ease.lang.javascript.ui.completion...
10:02:36 [2020-09-22T14:02:36.842Z] Constructing Javadoc information...
10:02:36 [2020-09-22T14:02:36.842Z] WARNING: Cannot open location "/home/jenkins/agent/workspace/ease.verify.core.gerrit/plugins/org.eclipse.ease.lang.javascript.ui/target/javadoc-bundle-options/package-list"
10:02:36 [2020-09-22T14:02:36.842Z] [WARNING] Javadoc Warnings
10:02:36 [2020-09-22T14:02:36.842Z] [WARNING] Picked up JAVA_TOOL_OPTIONS: -Dmaven.ext.class.path="/home/jenkins/agent/workspace/ease.verify.core.gerrit@tmp/withMaven4f91d2e1/pipeline-maven-spy.jar" -Dorg.jenkinsci.plugins.pipeline.maven.reportsFolder="/home/jenkins/agent/workspace/ease.verify.core.gerrit@tmp/withMaven4f91d2e1"
10:02:36 [2020-09-22T14:02:36.842Z] [INFO] 
10:02:36 [2020-09-22T14:02:36.842Z] [INFO] --- build-helper-maven-plugin:1.9.1:add-resource (add_help) @ org.eclipse.ease.lang.javascript.ui ---
10:02:36 [2020-09-22T14:02:36.842Z] [INFO] 
10:02:36 [2020-09-22T14:02:36.842Z] [INFO] --- maven-resources-plugin:2.4.3:resources (default-resources) @ org.eclipse.ease.lang.javascript.ui ---
10:02:36 [2020-09-22T14:02:36.842Z] [INFO] Using 'UTF-8' encoding to copy filtered resources.
10:02:36 [2020-09-22T14:02:36.842Z] [INFO] skip non existing resourceDirectory /home/jenkins/agent/workspace/ease.verify.core.gerrit/plugins/org.eclipse.ease.lang.javascript.ui/src/main/resources
10:02:36 [2020-09-22T14:02:36.842Z] [INFO] skip non existing resourceDirectory /home/jenkins/agent/workspace/ease.verify.core.gerrit/plugins/org.eclipse.ease.lang.javascript.ui/help
10:02:36 [2020-09-22T14:02:36.842Z] [INFO] 
10:02:36 [2020-09-22T14:02:36.842Z] [INFO] --- tycho-compiler-plugin:1.3.0:compile (default-compile) @ org.eclipse.ease.lang.javascript.ui ---
10:02:36 [2020-09-22T14:02:36.842Z] [INFO] Compiling 5 source files to /home/jenkins/agent/workspace/ease.verify.core.gerrit/plugins/org.eclipse.ease.lang.javascript.ui/target/classes
10:02:36 [2020-09-22T14:02:36.842Z] [INFO] 
10:02:36 [2020-09-22T14:02:36.842Z] [INFO] --- maven-resources-plugin:2.4.3:testResources (default-testResources) @ org.eclipse.ease.lang.javascript.ui ---
10:02:36 [2020-09-22T14:02:36.842Z] [INFO] Using 'UTF-8' encoding to copy filtered resources.
10:02:36 [2020-09-22T14:02:36.842Z] [INFO] skip non existing resourceDirectory /home/jenkins/agent/workspace/ease.verify.core.gerrit/plugins/org.eclipse.ease.lang.javascript.ui/src/test/resources
10:02:36 [2020-09-22T14:02:36.842Z] [INFO] 
10:02:36 [2020-09-22T14:02:36.842Z] [INFO] --- tycho-source-plugin:1.3.0:plugin-source (plugin-source) @ org.eclipse.ease.lang.javascript.ui ---
10:02:36 [2020-09-22T14:02:36.842Z] [INFO] Building jar: /home/jenkins/agent/workspace/ease.verify.core.gerrit/plugins/org.eclipse.ease.lang.javascript.ui/target/org.eclipse.ease.lang.javascript.ui-0.8.0-SNAPSHOT-sources.jar
10:02:36 [2020-09-22T14:02:36.842Z] [INFO] 
10:02:36 [2020-09-22T14:02:36.842Z] [INFO] --- target-platform-configuration:1.3.0:target-platform (default-target-platform) @ org.eclipse.ease.lang.javascript.ui ---
10:02:36 [2020-09-22T14:02:36.842Z] [INFO] 
10:02:36 [2020-09-22T14:02:36.842Z] [INFO] --- tycho-packaging-plugin:1.3.0:package-plugin (default-package-plugin) @ org.eclipse.ease.lang.javascript.ui ---
10:02:36 [2020-09-22T14:02:36.842Z] [INFO] Building jar: /home/jenkins/agent/workspace/ease.verify.core.gerrit/plugins/org.eclipse.ease.lang.javascript.ui/target/org.eclipse.ease.lang.javascript.ui-0.8.0-SNAPSHOT.jar
10:02:36 [2020-09-22T14:02:36.842Z] [INFO] 
10:02:36 [2020-09-22T14:02:36.842Z] [INFO] --- tycho-p2-plugin:1.3.0:p2-metadata-default (default-p2-metadata-default) @ org.eclipse.ease.lang.javascript.ui ---
10:02:36 [2020-09-22T14:02:36.842Z] [INFO] 
10:02:36 [2020-09-22T14:02:36.842Z] [INFO] --- tycho-source-feature-plugin:1.3.0:source-feature (source-feature) @ org.eclipse.ease.lang.javascript.ui ---
10:02:36 [2020-09-22T14:02:36.842Z] [INFO] 
10:02:36 [2020-09-22T14:02:36.842Z] [INFO] --- tycho-p2-plugin:1.3.0:p2-metadata (attached-p2-metadata) @ org.eclipse.ease.lang.javascript.ui ---
10:02:36 [2020-09-22T14:02:36.842Z] [INFO] 
10:02:36 [2020-09-22T14:02:36.842Z] [INFO] --------< org.eclipse.ease:org.eclipse.ease.lang.jvm.compiled >---------
10:02:36 [2020-09-22T14:02:36.842Z] [INFO] Building org.eclipse.ease.lang.jvm.compiled 0.8.0-SNAPSHOT       [21/49]
10:02:36 [2020-09-22T14:02:36.842Z] [INFO] ---------------------------[ eclipse-plugin ]---------------------------
10:02:36 [2020-09-22T14:02:36.842Z] [INFO] 
10:02:36 [2020-09-22T14:02:36.842Z] [INFO] --- maven-clean-plugin:2.5:clean (default-clean) @ org.eclipse.ease.lang.jvm.compiled ---
10:02:36 [2020-09-22T14:02:36.842Z] [INFO] 
10:02:36 [2020-09-22T14:02:36.842Z] [INFO] --- tycho-packaging-plugin:1.3.0:build-qualifier (default-build-qualifier) @ org.eclipse.ease.lang.jvm.compiled ---
10:02:36 [2020-09-22T14:02:36.842Z] [INFO] The project's OSGi version is 0.8.0.I202009221358
10:02:36 [2020-09-22T14:02:36.842Z] [INFO] 
10:02:36 [2020-09-22T14:02:36.842Z] [INFO] --- tycho-packaging-plugin:1.3.0:validate-id (default-validate-id) @ org.eclipse.ease.lang.jvm.compiled ---
10:02:36 [2020-09-22T14:02:36.842Z] [INFO] 
10:02:36 [2020-09-22T14:02:36.843Z] [INFO] --- tycho-packaging-plugin:1.3.0:validate-version (default-validate-version) @ org.eclipse.ease.lang.jvm.compiled ---
10:02:36 [2020-09-22T14:02:36.843Z] [INFO] 
10:02:36 [2020-09-22T14:02:36.843Z] [INFO] >>> maven-javadoc-plugin:2.9.1:javadoc (build-docs) > generate-sources @ org.eclipse.ease.lang.jvm.compiled >>>
10:02:36 [2020-09-22T14:02:36.843Z] [INFO] 
10:02:36 [2020-09-22T14:02:36.843Z] [INFO] --- tycho-packaging-plugin:1.3.0:build-qualifier (default-build-qualifier) @ org.eclipse.ease.lang.jvm.compiled ---
10:02:36 [2020-09-22T14:02:36.843Z] [INFO] The project's OSGi version is 0.8.0.I202009221358
10:02:36 [2020-09-22T14:02:36.843Z] [INFO] 
10:02:36 [2020-09-22T14:02:36.843Z] [INFO] --- tycho-packaging-plugin:1.3.0:validate-id (default-validate-id) @ org.eclipse.ease.lang.jvm.compiled ---
10:02:36 [2020-09-22T14:02:36.843Z] [INFO] 
10:02:36 [2020-09-22T14:02:36.843Z] [INFO] --- tycho-packaging-plugin:1.3.0:validate-version (default-validate-version) @ org.eclipse.ease.lang.jvm.compiled ---
10:02:36 [2020-09-22T14:02:36.843Z] [INFO] 
10:02:36 [2020-09-22T14:02:36.843Z] [INFO] <<< maven-javadoc-plugin:2.9.1:javadoc (build-docs) < generate-sources @ org.eclipse.ease.lang.jvm.compiled <<<
10:02:36 [2020-09-22T14:02:36.843Z] [INFO] 
10:02:36 [2020-09-22T14:02:36.843Z] [INFO] 
10:02:36 [2020-09-22T14:02:36.843Z] [INFO] --- maven-javadoc-plugin:2.9.1:javadoc (build-docs) @ org.eclipse.ease.lang.jvm.compiled ---
10:02:36 [2020-09-22T14:02:36.843Z] [ERROR] Error fetching link: http://help.eclipse.org/oxygen/topic/org.eclipse.platform.doc.isv/reference/api/package-list. Ignored it.
10:02:37 [2020-09-22T14:02:37.404Z] [INFO] 
10:02:37 [2020-09-22T14:02:37.404Z] Loading source files for package org.eclipse.ease.lang.jvm.compiled...
10:02:37 [2020-09-22T14:02:37.404Z] Constructing Javadoc information...
10:02:37 [2020-09-22T14:02:37.404Z] 1 error
10:02:37 [2020-09-22T14:02:37.404Z] [INFO] ------------------------------------------------------------------------
10:02:37 [2020-09-22T14:02:37.404Z] [INFO] Reactor Summary:
10:02:37 [2020-09-22T14:02:37.404Z] [INFO] 
10:02:37 [2020-09-22T14:02:37.404Z] [INFO] org.eclipse.ease.releng 0.8.0-SNAPSHOT ............. SUCCESS [  3.831 s]
10:02:37 [2020-09-22T14:02:37.404Z] [INFO] org.eclipse.ease.classloader 0.8.0-SNAPSHOT ........ SUCCESS [  3.206 s]
10:02:37 [2020-09-22T14:02:37.404Z] [INFO] org.eclipse.ease 0.8.0-SNAPSHOT .................... SUCCESS [  2.462 s]
10:02:37 [2020-09-22T14:02:37.404Z] [INFO] org.eclipse.ease.ui 0.8.0-SNAPSHOT ................. SUCCESS [  2.699 s]
10:02:37 [2020-09-22T14:02:37.404Z] [INFO] org.eclipse.ease.ui.completions.java 0.8.0-SNAPSHOT  SUCCESS [  1.589 s]
10:02:37 [2020-09-22T14:02:37.404Z] [INFO] org.eclipse.ease.ui.scripts 0.8.0-SNAPSHOT ......... SUCCESS [  2.100 s]
10:02:37 [2020-09-22T14:02:37.404Z] [INFO] org.eclipse.ease.lang.javascript 0.8.0-SNAPSHOT .... SUCCESS [  1.439 s]
10:02:37 [2020-09-22T14:02:37.404Z] [INFO] org.eclipse.ease.lang.scriptarchive 0.8.0-SNAPSHOT . SUCCESS [  1.361 s]
10:02:37 [2020-09-22T14:02:37.404Z] [INFO] org.eclipse.ease.lang.python 0.8.0-SNAPSHOT ........ SUCCESS [  1.540 s]
10:02:37 [2020-09-22T14:02:37.404Z] [INFO] org.eclipse.ease.lang.python.py4j 0.8.0-SNAPSHOT ... SUCCESS [  1.481 s]
10:02:37 [2020-09-22T14:02:37.404Z] [INFO] org.eclipse.ease.lang.groovy 0.8.0-SNAPSHOT ........ SUCCESS [  1.311 s]
10:02:37 [2020-09-22T14:02:37.404Z] [INFO] org.eclipse.ease.lang.groovy.interpreter 0.8.0-SNAPSHOT SUCCESS [  1.601 s]
10:02:37 [2020-09-22T14:02:37.404Z] [INFO] org.eclipse.ease.lang.unittest 0.8.0-SNAPSHOT ...... SUCCESS [  1.876 s]
10:02:37 [2020-09-22T14:02:37.404Z] [INFO] org.eclipse.ease.lang.unittest.ui 0.8.0-SNAPSHOT ... SUCCESS [  1.697 s]
10:02:37 [2020-09-22T14:02:37.404Z] [INFO] org.eclipse.ease.lang.ruby 0.8.0-SNAPSHOT .......... SUCCESS [  1.253 s]
10:02:37 [2020-09-22T14:02:37.404Z] [INFO] org.eclipse.ease.lang.ruby.jruby 0.8.0-SNAPSHOT .... SUCCESS [  1.335 s]
10:02:37 [2020-09-22T14:02:37.404Z] [INFO] org.eclipse.ease.lang.javascript.nashorn 0.8.0-SNAPSHOT SUCCESS [  1.287 s]
10:02:37 [2020-09-22T14:02:37.404Z] [INFO] org.eclipse.ease.lang.javascript.rhino 0.8.0-SNAPSHOT SUCCESS [  1.566 s]
10:02:37 [2020-09-22T14:02:37.404Z] [INFO] org.eclipse.ease.lang.python.jython 0.8.0-SNAPSHOT . SUCCESS [  1.501 s]
10:02:37 [2020-09-22T14:02:37.404Z] [INFO] org.eclipse.ease.lang.javascript.ui 0.8.0-SNAPSHOT . SUCCESS [  1.488 s]
10:02:37 [2020-09-22T14:02:37.404Z] [INFO] org.eclipse.ease.lang.jvm.compiled 0.8.0-SNAPSHOT .. FAILURE [  0.861 s]
10:02:37 [2020-09-22T14:02:37.404Z] [INFO] org.eclipse.ease.lang.scriptarchive.ui 0.8.0-SNAPSHOT SKIPPED
10:02:37 [2020-09-22T14:02:37.404Z] [INFO] org.eclipse.ease.help 0.8.0-SNAPSHOT ............... SKIPPED
10:02:37 [2020-09-22T14:02:37.404Z] [INFO] org.eclipse.ease.feature 0.8.0-SNAPSHOT ............ SKIPPED
10:02:37 [2020-09-22T14:02:37.404Z] [INFO] org.eclipse.ease.ui.feature 0.8.0-SNAPSHOT ......... SKIPPED
10:02:37 [2020-09-22T14:02:37.404Z] [INFO] org.eclipse.ease.lang.javascript.feature 0.8.0-SNAPSHOT SKIPPED
10:02:37 [2020-09-22T14:02:37.404Z] [INFO] org.eclipse.ease.lang.python.feature 0.8.0-SNAPSHOT  SKIPPED
10:02:37 [2020-09-22T14:02:37.404Z] [INFO] org.eclipse.ease.python.jython.feature 0.8.0-SNAPSHOT SKIPPED
10:02:37 [2020-09-22T14:02:37.404Z] [INFO] org.eclipse.ease.lang.python.py4j.feature 0.8.0-SNAPSHOT SKIPPED
10:02:37 [2020-09-22T14:02:37.404Z] [INFO] org.eclipse.ease.lang.jvm.feature 0.8.0-SNAPSHOT ... SKIPPED
10:02:37 [2020-09-22T14:02:37.404Z] [INFO] org.eclipse.ease.lang.groovy.feature 0.8.0-SNAPSHOT  SKIPPED
10:02:37 [2020-09-22T14:02:37.659Z] [INFO] org.eclipse.ease.lang.ruby.feature 0.8.0-SNAPSHOT .. SKIPPED
10:02:37 [2020-09-22T14:02:37.659Z] [INFO] org.eclipse.ease.lang.scriptarchive.feature 0.8.0-SNAPSHOT SKIPPED
10:02:37 [2020-09-22T14:02:37.659Z] [INFO] org.eclipse.ease.lang.unittest.feature 0.8.0-SNAPSHOT SKIPPED
10:02:37 [2020-09-22T14:02:37.659Z] [INFO] org.eclipse.ease.releng.target 0.8.0-SNAPSHOT ...... SKIPPED
10:02:37 [2020-09-22T14:02:37.659Z] [INFO] org.eclipse.ease.releng.p2 0.8.0-SNAPSHOT .......... SKIPPED
10:02:37 [2020-09-22T14:02:37.659Z] [INFO] org.eclipse.ease.testhelper 0.8.0-SNAPSHOT ......... SKIPPED
10:02:37 [2020-09-22T14:02:37.659Z] [INFO] org.eclipse.ease.test 0.8.0-SNAPSHOT ............... SKIPPED
10:02:37 [2020-09-22T14:02:37.659Z] [INFO] org.eclipse.ease.lang.javascript.nashorn.test 0.8.0-SNAPSHOT SKIPPED
10:02:37 [2020-09-22T14:02:37.659Z] [INFO] org.eclipse.ease.lang.javascript.rhino.test 0.8.0-SNAPSHOT SKIPPED
10:02:37 [2020-09-22T14:02:37.659Z] [INFO] org.eclipse.ease.lang.javascript.test 0.8.0-SNAPSHOT SKIPPED
10:02:37 [2020-09-22T14:02:37.659Z] [INFO] org.eclipse.ease.lang.python.test 0.8.0-SNAPSHOT ... SKIPPED
10:02:37 [2020-09-22T14:02:37.659Z] [INFO] org.eclipse.ease.lang.python.jython.test 0.8.0-SNAPSHOT SKIPPED
10:02:37 [2020-09-22T14:02:37.659Z] [INFO] org.eclipse.ease.lang.python.py4j.test 0.8.0-SNAPSHOT SKIPPED
10:02:37 [2020-09-22T14:02:37.659Z] [INFO] org.eclipse.ease.lang.scriptarchive.test 0.8.0-SNAPSHOT SKIPPED
10:02:37 [2020-09-22T14:02:37.659Z] [INFO] org.eclipse.ease.lang.unittest.test 0.8.0-SNAPSHOT . SKIPPED
10:02:37 [2020-09-22T14:02:37.659Z] [INFO] org.eclipse.ease.ui.scripts.test 0.8.0-SNAPSHOT .... SKIPPED
10:02:37 [2020-09-22T14:02:37.659Z] [INFO] org.eclipse.ease.ui.test 0.8.0-SNAPSHOT ............ SKIPPED
10:02:37 [2020-09-22T14:02:37.659Z] [INFO] EASE (Incubation) 0.4.0-SNAPSHOT ................... SKIPPED
10:02:37 [2020-09-22T14:02:37.659Z] [INFO] ------------------------------------------------------------------------
10:02:37 [2020-09-22T14:02:37.659Z] [INFO] BUILD FAILURE
10:02:37 [2020-09-22T14:02:37.659Z] [INFO] ------------------------------------------------------------------------
10:02:37 [2020-09-22T14:02:37.659Z] [INFO] Total time:  03:06 min
10:02:37 [2020-09-22T14:02:37.659Z] [INFO] Finished at: 2020-09-22T14:02:37Z
10:02:37 [2020-09-22T14:02:37.660Z] [INFO] ------------------------------------------------------------------------
10:02:37 [2020-09-22T14:02:37.660Z] [INFO] [jenkins-event-spy] Generated /home/jenkins/agent/workspace/ease.verify.core.gerrit@tmp/withMaven4f91d2e1/maven-spy-20200922-135930-136686155634575595256.log
10:02:37 [2020-09-22T14:02:37.660Z] [ERROR] Failed to execute goal org.apache.maven.plugins:maven-javadoc-plugin:2.9.1:javadoc (build-docs) on project org.eclipse.ease.lang.jvm.compiled: An error has occurred in JavaDocs report generation: 
10:02:37 [2020-09-22T14:02:37.660Z] [ERROR] Exit code: 1 - Picked up JAVA_TOOL_OPTIONS: -Dmaven.ext.class.path="/home/jenkins/agent/workspace/ease.verify.core.gerrit@tmp/withMaven4f91d2e1/pipeline-maven-spy.jar" -Dorg.jenkinsci.plugins.pipeline.maven.reportsFolder="/home/jenkins/agent/workspace/ease.verify.core.gerrit@tmp/withMaven4f91d2e1" 
10:02:37 [2020-09-22T14:02:37.660Z] [ERROR] /home/jenkins/agent/workspace/ease.verify.core.gerrit/plugins/org.eclipse.ease.lang.jvm.compiled/src/org/eclipse/ease/lang/jvm/compiled/JVMCompiledScriptEngine.java:48: error: cannot access IBundleProjectDescription
10:02:37 [2020-09-22T14:02:37.660Z] [ERROR] import org.eclipse.pde.core.project.IBundleProjectDescription;
10:02:37 [2020-09-22T14:02:37.660Z] [ERROR]                                    ^
10:02:37 [2020-09-22T14:02:37.660Z] [ERROR]   bad class file: /home/jenkins/.m2/repository/p2/osgi/bundle/org.eclipse.pde.core/3.14.0.v20200817-1143/org.eclipse.pde.core-3.14.0.v20200817-1143.jar(org/eclipse/pde/core/project/IBundleProjectDescription.class)
10:02:37 [2020-09-22T14:02:37.660Z] [ERROR]     class file has wrong version 55.0, should be 52.0
10:02:37 [2020-09-22T14:02:37.660Z] [ERROR]     Please remove or make sure it appears in the correct subdirectory of the classpath.
10:02:37 [2020-09-22T14:02:37.660Z] [ERROR] 
10:02:37 [2020-09-22T14:02:37.660Z] [ERROR] Command line was: /opt/tools/java/oracle/jdk-8/1.8.0_202/jre/../bin/javadoc @options @packages
10:02:37 [2020-09-22T14:02:37.660Z] [ERROR] 
10:02:37 [2020-09-22T14:02:37.660Z] [ERROR] Refer to the generated Javadoc files in '/home/jenkins/agent/workspace/ease.verify.core.gerrit/plugins/org.eclipse.ease.lang.jvm.compiled/target/site/apidocs' dir.
10:02:37 [2020-09-22T14:02:37.660Z] [ERROR] -> [Help 1]
10:02:37 [2020-09-22T14:02:37.660Z] [ERROR] 
10:02:37 [2020-09-22T14:02:37.660Z] [ERROR] To see the full stack trace of the errors, re-run Maven with the -e switch.
10:02:37 [2020-09-22T14:02:37.660Z] [ERROR] Re-run Maven using the -X switch to enable full debug logging.
10:02:37 [2020-09-22T14:02:37.660Z] [ERROR] 
10:02:37 [2020-09-22T14:02:37.660Z] [ERROR] For more information about the errors and possible solutions, please read the following articles:
10:02:37 [2020-09-22T14:02:37.660Z] [ERROR] [Help 1] http://cwiki.apache.org/confluence/display/MAVEN/MojoExecutionException
10:02:37 [2020-09-22T14:02:37.660Z] [ERROR] 
10:02:37 [2020-09-22T14:02:37.660Z] [ERROR] After correcting the problems, you can resume the build with the command
10:02:37 [2020-09-22T14:02:37.660Z] [ERROR]   mvn <args> -rf :org.eclipse.ease.lang.jvm.compiled
[Pipeline] }
10:02:38 [2020-09-22T14:02:38.925Z] [withMaven] Publishers: Pipeline Graph Publisher: 12 ms, Dependencies Fingerprint Publisher: 258 ms
[Pipeline] // withMaven
[Pipeline] }
[Pipeline] // stage
[Pipeline] }
10:02:38 [2020-09-22T14:02:38.984Z] Failed in branch EASE Core
[Pipeline] // parallel
[Pipeline] }
[Pipeline] // stage
[Pipeline] stage
[Pipeline] { (Declarative: Post Actions)
[Pipeline] archiveArtifacts
10:02:39 [2020-09-22T14:02:39.083Z] Archiving artifacts
[Pipeline] emailext
10:02:46 [2020-09-22T14:02:46.174Z] Sending email to: christian.pontesegger@web.de
[Pipeline] }
[Pipeline] // stage
[Pipeline] }
[Pipeline] // timeout
[Pipeline] }
[Pipeline] // timestamps
[Pipeline] }
[Pipeline] // node
[Pipeline] End of Pipeline
ERROR: script returned exit code 1
Finished: FAILURE