FailedConsole Output

Skipping 531 KB.. Full Log
se.ease.lang.scriptarchive/target/classes
09:56:16 [2020-09-22T13:56:16.208Z] [INFO] 
09:56:16 [2020-09-22T13:56:16.208Z] [INFO] --- maven-resources-plugin:2.4.3:testResources (default-testResources) @ org.eclipse.ease.lang.scriptarchive ---
09:56:16 [2020-09-22T13:56:16.208Z] [INFO] Using 'UTF-8' encoding to copy filtered resources.
09:56:16 [2020-09-22T13:56:16.208Z] [INFO] skip non existing resourceDirectory /home/jenkins/agent/workspace/ease.verify.core.gerrit/plugins/org.eclipse.ease.lang.scriptarchive/src/test/resources
09:56:16 [2020-09-22T13:56:16.208Z] [INFO] 
09:56:16 [2020-09-22T13:56:16.208Z] [INFO] --- tycho-source-plugin:1.3.0:plugin-source (plugin-source) @ org.eclipse.ease.lang.scriptarchive ---
09:56:16 [2020-09-22T13:56:16.208Z] [INFO] Building jar: /home/jenkins/agent/workspace/ease.verify.core.gerrit/plugins/org.eclipse.ease.lang.scriptarchive/target/org.eclipse.ease.lang.scriptarchive-0.8.0-SNAPSHOT-sources.jar
09:56:16 [2020-09-22T13:56:16.208Z] [INFO] 
09:56:16 [2020-09-22T13:56:16.208Z] [INFO] --- target-platform-configuration:1.3.0:target-platform (default-target-platform) @ org.eclipse.ease.lang.scriptarchive ---
09:56:16 [2020-09-22T13:56:16.208Z] [INFO] 
09:56:16 [2020-09-22T13:56:16.208Z] [INFO] --- tycho-packaging-plugin:1.3.0:package-plugin (default-package-plugin) @ org.eclipse.ease.lang.scriptarchive ---
09:56:16 [2020-09-22T13:56:16.208Z] [INFO] Building jar: /home/jenkins/agent/workspace/ease.verify.core.gerrit/plugins/org.eclipse.ease.lang.scriptarchive/target/org.eclipse.ease.lang.scriptarchive-0.8.0-SNAPSHOT.jar
09:56:16 [2020-09-22T13:56:16.208Z] [INFO] 
09:56:16 [2020-09-22T13:56:16.208Z] [INFO] --- tycho-p2-plugin:1.3.0:p2-metadata-default (default-p2-metadata-default) @ org.eclipse.ease.lang.scriptarchive ---
09:56:16 [2020-09-22T13:56:16.208Z] [INFO] 
09:56:16 [2020-09-22T13:56:16.208Z] [INFO] --- tycho-source-feature-plugin:1.3.0:source-feature (source-feature) @ org.eclipse.ease.lang.scriptarchive ---
09:56:16 [2020-09-22T13:56:16.208Z] [INFO] 
09:56:16 [2020-09-22T13:56:16.208Z] [INFO] --- tycho-p2-plugin:1.3.0:p2-metadata (attached-p2-metadata) @ org.eclipse.ease.lang.scriptarchive ---
09:56:16 [2020-09-22T13:56:16.208Z] [INFO] 
09:56:16 [2020-09-22T13:56:16.208Z] [INFO] -----------< org.eclipse.ease:org.eclipse.ease.lang.python >------------
09:56:16 [2020-09-22T13:56:16.208Z] [INFO] Building org.eclipse.ease.lang.python 0.8.0-SNAPSHOT              [9/49]
09:56:16 [2020-09-22T13:56:16.208Z] [INFO] ---------------------------[ eclipse-plugin ]---------------------------
09:56:16 [2020-09-22T13:56:16.208Z] [INFO] 
09:56:16 [2020-09-22T13:56:16.208Z] [INFO] --- maven-clean-plugin:2.5:clean (default-clean) @ org.eclipse.ease.lang.python ---
09:56:16 [2020-09-22T13:56:16.208Z] [INFO] 
09:56:16 [2020-09-22T13:56:16.208Z] [INFO] --- tycho-packaging-plugin:1.3.0:build-qualifier (default-build-qualifier) @ org.eclipse.ease.lang.python ---
09:56:16 [2020-09-22T13:56:16.208Z] [INFO] The project's OSGi version is 0.8.0.I202006231119
09:56:16 [2020-09-22T13:56:16.208Z] [INFO] 
09:56:16 [2020-09-22T13:56:16.208Z] [INFO] --- tycho-packaging-plugin:1.3.0:validate-id (default-validate-id) @ org.eclipse.ease.lang.python ---
09:56:16 [2020-09-22T13:56:16.208Z] [INFO] 
09:56:16 [2020-09-22T13:56:16.208Z] [INFO] --- tycho-packaging-plugin:1.3.0:validate-version (default-validate-version) @ org.eclipse.ease.lang.python ---
09:56:16 [2020-09-22T13:56:16.208Z] [INFO] 
09:56:16 [2020-09-22T13:56:16.208Z] [INFO] >>> maven-javadoc-plugin:2.9.1:javadoc (build-docs) > generate-sources @ org.eclipse.ease.lang.python >>>
09:56:16 [2020-09-22T13:56:16.208Z] [INFO] 
09:56:16 [2020-09-22T13:56:16.208Z] [INFO] --- tycho-packaging-plugin:1.3.0:build-qualifier (default-build-qualifier) @ org.eclipse.ease.lang.python ---
09:56:16 [2020-09-22T13:56:16.208Z] [INFO] The project's OSGi version is 0.8.0.I202006231119
09:56:16 [2020-09-22T13:56:16.208Z] [INFO] 
09:56:16 [2020-09-22T13:56:16.208Z] [INFO] --- tycho-packaging-plugin:1.3.0:validate-id (default-validate-id) @ org.eclipse.ease.lang.python ---
09:56:16 [2020-09-22T13:56:16.208Z] [INFO] 
09:56:16 [2020-09-22T13:56:16.208Z] [INFO] --- tycho-packaging-plugin:1.3.0:validate-version (default-validate-version) @ org.eclipse.ease.lang.python ---
09:56:16 [2020-09-22T13:56:16.209Z] [INFO] 
09:56:16 [2020-09-22T13:56:16.209Z] [INFO] <<< maven-javadoc-plugin:2.9.1:javadoc (build-docs) < generate-sources @ org.eclipse.ease.lang.python <<<
09:56:16 [2020-09-22T13:56:16.209Z] [INFO] 
09:56:16 [2020-09-22T13:56:16.209Z] [INFO] 
09:56:16 [2020-09-22T13:56:16.209Z] [INFO] --- maven-javadoc-plugin:2.9.1:javadoc (build-docs) @ org.eclipse.ease.lang.python ---
09:56:16 [2020-09-22T13:56:16.209Z] [ERROR] Error fetching link: http://help.eclipse.org/oxygen/topic/org.eclipse.platform.doc.isv/reference/api/package-list. Ignored it.
09:56:17 [2020-09-22T13:56:17.575Z] [INFO] 
09:56:17 [2020-09-22T13:56:17.575Z] Loading source files for package org.eclipse.ease.lang.python...
09:56:17 [2020-09-22T13:56:17.575Z] Loading source files for package org.eclipse.ease.lang.python.debug...
09:56:17 [2020-09-22T13:56:17.575Z] Loading source files for package org.eclipse.ease.lang.python.debugger...
09:56:17 [2020-09-22T13:56:17.575Z] Loading source files for package org.eclipse.ease.lang.python.debugger.actions...
09:56:17 [2020-09-22T13:56:17.575Z] Loading source files for package org.eclipse.ease.lang.python.debugger.model...
09:56:17 [2020-09-22T13:56:17.575Z] Loading source files for package org.eclipse.ease.lang.python.preferences...
09:56:17 [2020-09-22T13:56:17.575Z] Loading source files for package org.eclipse.ease.lang.python.ui.completion...
09:56:17 [2020-09-22T13:56:17.575Z] Constructing Javadoc information...
09:56:17 [2020-09-22T13:56:17.575Z] WARNING: Cannot open location "/home/jenkins/agent/workspace/ease.verify.core.gerrit/plugins/org.eclipse.ease.lang.python/target/javadoc-bundle-options/package-list"
09:56:17 [2020-09-22T13:56:17.575Z] [WARNING] Javadoc Warnings
09:56:17 [2020-09-22T13:56:17.575Z] [WARNING] Picked up JAVA_TOOL_OPTIONS: -Dmaven.ext.class.path="/home/jenkins/agent/workspace/ease.verify.core.gerrit@tmp/withMaven4d46e43a/pipeline-maven-spy.jar" -Dorg.jenkinsci.plugins.pipeline.maven.reportsFolder="/home/jenkins/agent/workspace/ease.verify.core.gerrit@tmp/withMaven4d46e43a"
09:56:17 [2020-09-22T13:56:17.575Z] [INFO] 
09:56:17 [2020-09-22T13:56:17.575Z] [INFO] --- build-helper-maven-plugin:1.9.1:add-resource (add_help) @ org.eclipse.ease.lang.python ---
09:56:17 [2020-09-22T13:56:17.575Z] [INFO] 
09:56:17 [2020-09-22T13:56:17.575Z] [INFO] --- maven-resources-plugin:2.4.3:resources (default-resources) @ org.eclipse.ease.lang.python ---
09:56:17 [2020-09-22T13:56:17.575Z] [INFO] Using 'UTF-8' encoding to copy filtered resources.
09:56:17 [2020-09-22T13:56:17.575Z] [INFO] skip non existing resourceDirectory /home/jenkins/agent/workspace/ease.verify.core.gerrit/plugins/org.eclipse.ease.lang.python/src/main/resources
09:56:17 [2020-09-22T13:56:17.575Z] [INFO] skip non existing resourceDirectory /home/jenkins/agent/workspace/ease.verify.core.gerrit/plugins/org.eclipse.ease.lang.python/help
09:56:17 [2020-09-22T13:56:17.575Z] [INFO] 
09:56:17 [2020-09-22T13:56:17.575Z] [INFO] --- tycho-compiler-plugin:1.3.0:compile (default-compile) @ org.eclipse.ease.lang.python ---
09:56:17 [2020-09-22T13:56:17.575Z] [INFO] Compiling 24 source files to /home/jenkins/agent/workspace/ease.verify.core.gerrit/plugins/org.eclipse.ease.lang.python/target/classes
09:56:17 [2020-09-22T13:56:17.575Z] [INFO] 
09:56:17 [2020-09-22T13:56:17.575Z] [INFO] --- maven-resources-plugin:2.4.3:testResources (default-testResources) @ org.eclipse.ease.lang.python ---
09:56:17 [2020-09-22T13:56:17.575Z] [INFO] Using 'UTF-8' encoding to copy filtered resources.
09:56:17 [2020-09-22T13:56:17.575Z] [INFO] skip non existing resourceDirectory /home/jenkins/agent/workspace/ease.verify.core.gerrit/plugins/org.eclipse.ease.lang.python/src/test/resources
09:56:17 [2020-09-22T13:56:17.575Z] [INFO] 
09:56:17 [2020-09-22T13:56:17.575Z] [INFO] --- tycho-source-plugin:1.3.0:plugin-source (plugin-source) @ org.eclipse.ease.lang.python ---
09:56:17 [2020-09-22T13:56:17.575Z] [INFO] Building jar: /home/jenkins/agent/workspace/ease.verify.core.gerrit/plugins/org.eclipse.ease.lang.python/target/org.eclipse.ease.lang.python-0.8.0-SNAPSHOT-sources.jar
09:56:17 [2020-09-22T13:56:17.575Z] [INFO] 
09:56:17 [2020-09-22T13:56:17.575Z] [INFO] --- target-platform-configuration:1.3.0:target-platform (default-target-platform) @ org.eclipse.ease.lang.python ---
09:56:17 [2020-09-22T13:56:17.575Z] [INFO] 
09:56:17 [2020-09-22T13:56:17.576Z] [INFO] --- tycho-packaging-plugin:1.3.0:package-plugin (default-package-plugin) @ org.eclipse.ease.lang.python ---
09:56:17 [2020-09-22T13:56:17.576Z] [INFO] Building jar: /home/jenkins/agent/workspace/ease.verify.core.gerrit/plugins/org.eclipse.ease.lang.python/target/org.eclipse.ease.lang.python-0.8.0-SNAPSHOT.jar
09:56:17 [2020-09-22T13:56:17.576Z] [INFO] 
09:56:17 [2020-09-22T13:56:17.576Z] [INFO] --- tycho-p2-plugin:1.3.0:p2-metadata-default (default-p2-metadata-default) @ org.eclipse.ease.lang.python ---
09:56:17 [2020-09-22T13:56:17.576Z] [INFO] 
09:56:17 [2020-09-22T13:56:17.576Z] [INFO] --- tycho-source-feature-plugin:1.3.0:source-feature (source-feature) @ org.eclipse.ease.lang.python ---
09:56:17 [2020-09-22T13:56:17.576Z] [INFO] 
09:56:17 [2020-09-22T13:56:17.576Z] [INFO] --- tycho-p2-plugin:1.3.0:p2-metadata (attached-p2-metadata) @ org.eclipse.ease.lang.python ---
09:56:17 [2020-09-22T13:56:17.576Z] [INFO] 
09:56:17 [2020-09-22T13:56:17.576Z] [INFO] ---------< org.eclipse.ease:org.eclipse.ease.lang.python.py4j >---------
09:56:17 [2020-09-22T13:56:17.576Z] [INFO] Building org.eclipse.ease.lang.python.py4j 0.8.0-SNAPSHOT        [10/49]
09:56:17 [2020-09-22T13:56:17.576Z] [INFO] ---------------------------[ eclipse-plugin ]---------------------------
09:56:17 [2020-09-22T13:56:17.576Z] [INFO] 
09:56:17 [2020-09-22T13:56:17.576Z] [INFO] --- maven-clean-plugin:2.5:clean (default-clean) @ org.eclipse.ease.lang.python.py4j ---
09:56:17 [2020-09-22T13:56:17.576Z] [INFO] 
09:56:17 [2020-09-22T13:56:17.576Z] [INFO] --- tycho-packaging-plugin:1.3.0:build-qualifier (default-build-qualifier) @ org.eclipse.ease.lang.python.py4j ---
09:56:17 [2020-09-22T13:56:17.576Z] [INFO] The project's OSGi version is 0.8.0.I202008271105
09:56:17 [2020-09-22T13:56:17.576Z] [INFO] 
09:56:17 [2020-09-22T13:56:17.576Z] [INFO] --- tycho-packaging-plugin:1.3.0:validate-id (default-validate-id) @ org.eclipse.ease.lang.python.py4j ---
09:56:17 [2020-09-22T13:56:17.576Z] [INFO] 
09:56:17 [2020-09-22T13:56:17.576Z] [INFO] --- tycho-packaging-plugin:1.3.0:validate-version (default-validate-version) @ org.eclipse.ease.lang.python.py4j ---
09:56:17 [2020-09-22T13:56:17.576Z] [INFO] 
09:56:17 [2020-09-22T13:56:17.576Z] [INFO] >>> maven-javadoc-plugin:2.9.1:javadoc (build-docs) > generate-sources @ org.eclipse.ease.lang.python.py4j >>>
09:56:17 [2020-09-22T13:56:17.576Z] [INFO] 
09:56:17 [2020-09-22T13:56:17.576Z] [INFO] --- tycho-packaging-plugin:1.3.0:build-qualifier (default-build-qualifier) @ org.eclipse.ease.lang.python.py4j ---
09:56:17 [2020-09-22T13:56:17.832Z] [INFO] The project's OSGi version is 0.8.0.I202008271105
09:56:17 [2020-09-22T13:56:17.832Z] [INFO] 
09:56:17 [2020-09-22T13:56:17.832Z] [INFO] --- tycho-packaging-plugin:1.3.0:validate-id (default-validate-id) @ org.eclipse.ease.lang.python.py4j ---
09:56:17 [2020-09-22T13:56:17.832Z] [INFO] 
09:56:17 [2020-09-22T13:56:17.832Z] [INFO] --- tycho-packaging-plugin:1.3.0:validate-version (default-validate-version) @ org.eclipse.ease.lang.python.py4j ---
09:56:17 [2020-09-22T13:56:17.832Z] [INFO] 
09:56:17 [2020-09-22T13:56:17.832Z] [INFO] <<< maven-javadoc-plugin:2.9.1:javadoc (build-docs) < generate-sources @ org.eclipse.ease.lang.python.py4j <<<
09:56:17 [2020-09-22T13:56:17.832Z] [INFO] 
09:56:17 [2020-09-22T13:56:17.832Z] [INFO] 
09:56:17 [2020-09-22T13:56:17.832Z] [INFO] --- maven-javadoc-plugin:2.9.1:javadoc (build-docs) @ org.eclipse.ease.lang.python.py4j ---
09:56:17 [2020-09-22T13:56:17.832Z] [ERROR] Error fetching link: http://help.eclipse.org/oxygen/topic/org.eclipse.platform.doc.isv/reference/api/package-list. Ignored it.
09:56:19 [2020-09-22T13:56:19.203Z] [INFO] 
09:56:19 [2020-09-22T13:56:19.203Z] Loading source files for package org.eclipse.ease.lang.python.py4j.internal...
09:56:19 [2020-09-22T13:56:19.203Z] Loading source files for package org.eclipse.ease.lang.python.py4j.internal.ui...
09:56:19 [2020-09-22T13:56:19.203Z] Constructing Javadoc information...
09:56:19 [2020-09-22T13:56:19.203Z] WARNING: Cannot open location "/home/jenkins/agent/workspace/ease.verify.core.gerrit/plugins/org.eclipse.ease.lang.python.py4j/target/javadoc-bundle-options/package-list"
09:56:19 [2020-09-22T13:56:19.203Z] [WARNING] Javadoc Warnings
09:56:19 [2020-09-22T13:56:19.203Z] [WARNING] Picked up JAVA_TOOL_OPTIONS: -Dmaven.ext.class.path="/home/jenkins/agent/workspace/ease.verify.core.gerrit@tmp/withMaven4d46e43a/pipeline-maven-spy.jar" -Dorg.jenkinsci.plugins.pipeline.maven.reportsFolder="/home/jenkins/agent/workspace/ease.verify.core.gerrit@tmp/withMaven4d46e43a"
09:56:19 [2020-09-22T13:56:19.203Z] [INFO] 
09:56:19 [2020-09-22T13:56:19.203Z] [INFO] --- build-helper-maven-plugin:1.9.1:add-resource (add_help) @ org.eclipse.ease.lang.python.py4j ---
09:56:19 [2020-09-22T13:56:19.203Z] [INFO] 
09:56:19 [2020-09-22T13:56:19.203Z] [INFO] --- maven-resources-plugin:2.4.3:resources (default-resources) @ org.eclipse.ease.lang.python.py4j ---
09:56:19 [2020-09-22T13:56:19.203Z] [INFO] Using 'UTF-8' encoding to copy filtered resources.
09:56:19 [2020-09-22T13:56:19.203Z] [INFO] skip non existing resourceDirectory /home/jenkins/agent/workspace/ease.verify.core.gerrit/plugins/org.eclipse.ease.lang.python.py4j/src/main/resources
09:56:19 [2020-09-22T13:56:19.203Z] [INFO] Copying 2 resources to help
09:56:19 [2020-09-22T13:56:19.203Z] [INFO] 
09:56:19 [2020-09-22T13:56:19.203Z] [INFO] --- tycho-compiler-plugin:1.3.0:compile (default-compile) @ org.eclipse.ease.lang.python.py4j ---
09:56:19 [2020-09-22T13:56:19.203Z] [INFO] Compiling 11 source files to /home/jenkins/agent/workspace/ease.verify.core.gerrit/plugins/org.eclipse.ease.lang.python.py4j/target/classes
09:56:19 [2020-09-22T13:56:19.203Z] [INFO] 
09:56:19 [2020-09-22T13:56:19.203Z] [INFO] --- maven-resources-plugin:2.4.3:testResources (default-testResources) @ org.eclipse.ease.lang.python.py4j ---
09:56:19 [2020-09-22T13:56:19.203Z] [INFO] Using 'UTF-8' encoding to copy filtered resources.
09:56:19 [2020-09-22T13:56:19.203Z] [INFO] skip non existing resourceDirectory /home/jenkins/agent/workspace/ease.verify.core.gerrit/plugins/org.eclipse.ease.lang.python.py4j/src/test/resources
09:56:19 [2020-09-22T13:56:19.203Z] [INFO] 
09:56:19 [2020-09-22T13:56:19.203Z] [INFO] --- tycho-source-plugin:1.3.0:plugin-source (plugin-source) @ org.eclipse.ease.lang.python.py4j ---
09:56:19 [2020-09-22T13:56:19.203Z] [INFO] Building jar: /home/jenkins/agent/workspace/ease.verify.core.gerrit/plugins/org.eclipse.ease.lang.python.py4j/target/org.eclipse.ease.lang.python.py4j-0.8.0-SNAPSHOT-sources.jar
09:56:19 [2020-09-22T13:56:19.203Z] [INFO] 
09:56:19 [2020-09-22T13:56:19.203Z] [INFO] --- target-platform-configuration:1.3.0:target-platform (default-target-platform) @ org.eclipse.ease.lang.python.py4j ---
09:56:19 [2020-09-22T13:56:19.203Z] [INFO] 
09:56:19 [2020-09-22T13:56:19.203Z] [INFO] --- tycho-packaging-plugin:1.3.0:package-plugin (default-package-plugin) @ org.eclipse.ease.lang.python.py4j ---
09:56:19 [2020-09-22T13:56:19.203Z] [INFO] Building jar: /home/jenkins/agent/workspace/ease.verify.core.gerrit/plugins/org.eclipse.ease.lang.python.py4j/target/org.eclipse.ease.lang.python.py4j-0.8.0-SNAPSHOT.jar
09:56:19 [2020-09-22T13:56:19.203Z] [INFO] 
09:56:19 [2020-09-22T13:56:19.203Z] [INFO] --- tycho-p2-plugin:1.3.0:p2-metadata-default (default-p2-metadata-default) @ org.eclipse.ease.lang.python.py4j ---
09:56:19 [2020-09-22T13:56:19.203Z] [INFO] 
09:56:19 [2020-09-22T13:56:19.204Z] [INFO] --- tycho-source-feature-plugin:1.3.0:source-feature (source-feature) @ org.eclipse.ease.lang.python.py4j ---
09:56:19 [2020-09-22T13:56:19.204Z] [INFO] 
09:56:19 [2020-09-22T13:56:19.204Z] [INFO] --- tycho-p2-plugin:1.3.0:p2-metadata (attached-p2-metadata) @ org.eclipse.ease.lang.python.py4j ---
09:56:19 [2020-09-22T13:56:19.204Z] [INFO] 
09:56:19 [2020-09-22T13:56:19.204Z] [INFO] -----------< org.eclipse.ease:org.eclipse.ease.lang.groovy >------------
09:56:19 [2020-09-22T13:56:19.204Z] [INFO] Building org.eclipse.ease.lang.groovy 0.8.0-SNAPSHOT             [11/49]
09:56:19 [2020-09-22T13:56:19.204Z] [INFO] ---------------------------[ eclipse-plugin ]---------------------------
09:56:19 [2020-09-22T13:56:19.204Z] [INFO] 
09:56:19 [2020-09-22T13:56:19.204Z] [INFO] --- maven-clean-plugin:2.5:clean (default-clean) @ org.eclipse.ease.lang.groovy ---
09:56:19 [2020-09-22T13:56:19.204Z] [INFO] 
09:56:19 [2020-09-22T13:56:19.204Z] [INFO] --- tycho-packaging-plugin:1.3.0:build-qualifier (default-build-qualifier) @ org.eclipse.ease.lang.groovy ---
09:56:19 [2020-09-22T13:56:19.204Z] [INFO] The project's OSGi version is 0.8.0.I201910171213
09:56:19 [2020-09-22T13:56:19.204Z] [INFO] 
09:56:19 [2020-09-22T13:56:19.204Z] [INFO] --- tycho-packaging-plugin:1.3.0:validate-id (default-validate-id) @ org.eclipse.ease.lang.groovy ---
09:56:19 [2020-09-22T13:56:19.204Z] [INFO] 
09:56:19 [2020-09-22T13:56:19.204Z] [INFO] --- tycho-packaging-plugin:1.3.0:validate-version (default-validate-version) @ org.eclipse.ease.lang.groovy ---
09:56:19 [2020-09-22T13:56:19.204Z] [INFO] 
09:56:19 [2020-09-22T13:56:19.204Z] [INFO] >>> maven-javadoc-plugin:2.9.1:javadoc (build-docs) > generate-sources @ org.eclipse.ease.lang.groovy >>>
09:56:19 [2020-09-22T13:56:19.204Z] [INFO] 
09:56:19 [2020-09-22T13:56:19.204Z] [INFO] --- tycho-packaging-plugin:1.3.0:build-qualifier (default-build-qualifier) @ org.eclipse.ease.lang.groovy ---
09:56:19 [2020-09-22T13:56:19.204Z] [INFO] The project's OSGi version is 0.8.0.I201910171213
09:56:19 [2020-09-22T13:56:19.204Z] [INFO] 
09:56:19 [2020-09-22T13:56:19.204Z] [INFO] --- tycho-packaging-plugin:1.3.0:validate-id (default-validate-id) @ org.eclipse.ease.lang.groovy ---
09:56:19 [2020-09-22T13:56:19.204Z] [INFO] 
09:56:19 [2020-09-22T13:56:19.204Z] [INFO] --- tycho-packaging-plugin:1.3.0:validate-version (default-validate-version) @ org.eclipse.ease.lang.groovy ---
09:56:19 [2020-09-22T13:56:19.204Z] [INFO] 
09:56:19 [2020-09-22T13:56:19.204Z] [INFO] <<< maven-javadoc-plugin:2.9.1:javadoc (build-docs) < generate-sources @ org.eclipse.ease.lang.groovy <<<
09:56:19 [2020-09-22T13:56:19.204Z] [INFO] 
09:56:19 [2020-09-22T13:56:19.204Z] [INFO] 
09:56:19 [2020-09-22T13:56:19.204Z] [INFO] --- maven-javadoc-plugin:2.9.1:javadoc (build-docs) @ org.eclipse.ease.lang.groovy ---
09:56:19 [2020-09-22T13:56:19.204Z] [ERROR] Error fetching link: http://help.eclipse.org/oxygen/topic/org.eclipse.platform.doc.isv/reference/api/package-list. Ignored it.
09:56:20 [2020-09-22T13:56:20.567Z] [INFO] 
09:56:20 [2020-09-22T13:56:20.567Z] Loading source files for package org.eclipse.ease.lang.groovy...
09:56:20 [2020-09-22T13:56:20.567Z] Constructing Javadoc information...
09:56:20 [2020-09-22T13:56:20.567Z] WARNING: Cannot open location "/home/jenkins/agent/workspace/ease.verify.core.gerrit/plugins/org.eclipse.ease.lang.groovy/target/javadoc-bundle-options/package-list"
09:56:20 [2020-09-22T13:56:20.567Z] [WARNING] Javadoc Warnings
09:56:20 [2020-09-22T13:56:20.568Z] [WARNING] Picked up JAVA_TOOL_OPTIONS: -Dmaven.ext.class.path="/home/jenkins/agent/workspace/ease.verify.core.gerrit@tmp/withMaven4d46e43a/pipeline-maven-spy.jar" -Dorg.jenkinsci.plugins.pipeline.maven.reportsFolder="/home/jenkins/agent/workspace/ease.verify.core.gerrit@tmp/withMaven4d46e43a"
09:56:20 [2020-09-22T13:56:20.568Z] [INFO] 
09:56:20 [2020-09-22T13:56:20.568Z] [INFO] --- build-helper-maven-plugin:1.9.1:add-resource (add_help) @ org.eclipse.ease.lang.groovy ---
09:56:20 [2020-09-22T13:56:20.568Z] [INFO] 
09:56:20 [2020-09-22T13:56:20.568Z] [INFO] --- maven-resources-plugin:2.4.3:resources (default-resources) @ org.eclipse.ease.lang.groovy ---
09:56:20 [2020-09-22T13:56:20.568Z] [INFO] Using 'UTF-8' encoding to copy filtered resources.
09:56:20 [2020-09-22T13:56:20.568Z] [INFO] skip non existing resourceDirectory /home/jenkins/agent/workspace/ease.verify.core.gerrit/plugins/org.eclipse.ease.lang.groovy/src/main/resources
09:56:20 [2020-09-22T13:56:20.568Z] [INFO] skip non existing resourceDirectory /home/jenkins/agent/workspace/ease.verify.core.gerrit/plugins/org.eclipse.ease.lang.groovy/help
09:56:20 [2020-09-22T13:56:20.568Z] [INFO] 
09:56:20 [2020-09-22T13:56:20.568Z] [INFO] --- tycho-compiler-plugin:1.3.0:compile (default-compile) @ org.eclipse.ease.lang.groovy ---
09:56:20 [2020-09-22T13:56:20.568Z] [INFO] Compiling 4 source files to /home/jenkins/agent/workspace/ease.verify.core.gerrit/plugins/org.eclipse.ease.lang.groovy/target/classes
09:56:20 [2020-09-22T13:56:20.568Z] [INFO] 
09:56:20 [2020-09-22T13:56:20.568Z] [INFO] --- maven-resources-plugin:2.4.3:testResources (default-testResources) @ org.eclipse.ease.lang.groovy ---
09:56:20 [2020-09-22T13:56:20.568Z] [INFO] Using 'UTF-8' encoding to copy filtered resources.
09:56:20 [2020-09-22T13:56:20.568Z] [INFO] skip non existing resourceDirectory /home/jenkins/agent/workspace/ease.verify.core.gerrit/plugins/org.eclipse.ease.lang.groovy/src/test/resources
09:56:20 [2020-09-22T13:56:20.568Z] [INFO] 
09:56:20 [2020-09-22T13:56:20.568Z] [INFO] --- tycho-source-plugin:1.3.0:plugin-source (plugin-source) @ org.eclipse.ease.lang.groovy ---
09:56:20 [2020-09-22T13:56:20.568Z] [INFO] Building jar: /home/jenkins/agent/workspace/ease.verify.core.gerrit/plugins/org.eclipse.ease.lang.groovy/target/org.eclipse.ease.lang.groovy-0.8.0-SNAPSHOT-sources.jar
09:56:20 [2020-09-22T13:56:20.568Z] [INFO] 
09:56:20 [2020-09-22T13:56:20.568Z] [INFO] --- target-platform-configuration:1.3.0:target-platform (default-target-platform) @ org.eclipse.ease.lang.groovy ---
09:56:20 [2020-09-22T13:56:20.568Z] [INFO] 
09:56:20 [2020-09-22T13:56:20.568Z] [INFO] --- tycho-packaging-plugin:1.3.0:package-plugin (default-package-plugin) @ org.eclipse.ease.lang.groovy ---
09:56:20 [2020-09-22T13:56:20.568Z] [INFO] Building jar: /home/jenkins/agent/workspace/ease.verify.core.gerrit/plugins/org.eclipse.ease.lang.groovy/target/org.eclipse.ease.lang.groovy-0.8.0-SNAPSHOT.jar
09:56:20 [2020-09-22T13:56:20.568Z] [INFO] 
09:56:20 [2020-09-22T13:56:20.568Z] [INFO] --- tycho-p2-plugin:1.3.0:p2-metadata-default (default-p2-metadata-default) @ org.eclipse.ease.lang.groovy ---
09:56:20 [2020-09-22T13:56:20.568Z] [INFO] 
09:56:20 [2020-09-22T13:56:20.568Z] [INFO] --- tycho-source-feature-plugin:1.3.0:source-feature (source-feature) @ org.eclipse.ease.lang.groovy ---
09:56:20 [2020-09-22T13:56:20.568Z] [INFO] 
09:56:20 [2020-09-22T13:56:20.568Z] [INFO] --- tycho-p2-plugin:1.3.0:p2-metadata (attached-p2-metadata) @ org.eclipse.ease.lang.groovy ---
09:56:20 [2020-09-22T13:56:20.568Z] [INFO] 
09:56:20 [2020-09-22T13:56:20.568Z] [INFO] -----< org.eclipse.ease:org.eclipse.ease.lang.groovy.interpreter >------
09:56:20 [2020-09-22T13:56:20.568Z] [INFO] Building org.eclipse.ease.lang.groovy.interpreter 0.8.0-SNAPSHOT [12/49]
09:56:20 [2020-09-22T13:56:20.568Z] [INFO] ---------------------------[ eclipse-plugin ]---------------------------
09:56:20 [2020-09-22T13:56:20.568Z] [INFO] 
09:56:20 [2020-09-22T13:56:20.568Z] [INFO] --- maven-clean-plugin:2.5:clean (default-clean) @ org.eclipse.ease.lang.groovy.interpreter ---
09:56:20 [2020-09-22T13:56:20.568Z] [INFO] 
09:56:20 [2020-09-22T13:56:20.568Z] [INFO] --- tycho-packaging-plugin:1.3.0:build-qualifier (default-build-qualifier) @ org.eclipse.ease.lang.groovy.interpreter ---
09:56:20 [2020-09-22T13:56:20.568Z] [INFO] The project's OSGi version is 0.8.0.I202002270716
09:56:20 [2020-09-22T13:56:20.568Z] [INFO] 
09:56:20 [2020-09-22T13:56:20.568Z] [INFO] --- tycho-packaging-plugin:1.3.0:validate-id (default-validate-id) @ org.eclipse.ease.lang.groovy.interpreter ---
09:56:20 [2020-09-22T13:56:20.568Z] [INFO] 
09:56:20 [2020-09-22T13:56:20.568Z] [INFO] --- tycho-packaging-plugin:1.3.0:validate-version (default-validate-version) @ org.eclipse.ease.lang.groovy.interpreter ---
09:56:20 [2020-09-22T13:56:20.568Z] [INFO] 
09:56:20 [2020-09-22T13:56:20.568Z] [INFO] >>> maven-javadoc-plugin:2.9.1:javadoc (build-docs) > generate-sources @ org.eclipse.ease.lang.groovy.interpreter >>>
09:56:20 [2020-09-22T13:56:20.568Z] [INFO] 
09:56:20 [2020-09-22T13:56:20.568Z] [INFO] --- tycho-packaging-plugin:1.3.0:build-qualifier (default-build-qualifier) @ org.eclipse.ease.lang.groovy.interpreter ---
09:56:20 [2020-09-22T13:56:20.568Z] [INFO] The project's OSGi version is 0.8.0.I202002270716
09:56:20 [2020-09-22T13:56:20.568Z] [INFO] 
09:56:20 [2020-09-22T13:56:20.568Z] [INFO] --- tycho-packaging-plugin:1.3.0:validate-id (default-validate-id) @ org.eclipse.ease.lang.groovy.interpreter ---
09:56:20 [2020-09-22T13:56:20.568Z] [INFO] 
09:56:20 [2020-09-22T13:56:20.568Z] [INFO] --- tycho-packaging-plugin:1.3.0:validate-version (default-validate-version) @ org.eclipse.ease.lang.groovy.interpreter ---
09:56:20 [2020-09-22T13:56:20.568Z] [INFO] 
09:56:20 [2020-09-22T13:56:20.568Z] [INFO] <<< maven-javadoc-plugin:2.9.1:javadoc (build-docs) < generate-sources @ org.eclipse.ease.lang.groovy.interpreter <<<
09:56:20 [2020-09-22T13:56:20.568Z] [INFO] 
09:56:20 [2020-09-22T13:56:20.568Z] [INFO] 
09:56:20 [2020-09-22T13:56:20.568Z] [INFO] --- maven-javadoc-plugin:2.9.1:javadoc (build-docs) @ org.eclipse.ease.lang.groovy.interpreter ---
09:56:20 [2020-09-22T13:56:20.569Z] [ERROR] Error fetching link: http://help.eclipse.org/oxygen/topic/org.eclipse.platform.doc.isv/reference/api/package-list. Ignored it.
09:56:21 [2020-09-22T13:56:21.935Z] [INFO] 
09:56:21 [2020-09-22T13:56:21.935Z] Loading source files for package org.eclipse.ease.lang.groovy.interpreter...
09:56:21 [2020-09-22T13:56:21.935Z] Constructing Javadoc information...
09:56:21 [2020-09-22T13:56:21.935Z] WARNING: Cannot open location "/home/jenkins/agent/workspace/ease.verify.core.gerrit/plugins/org.eclipse.ease.lang.groovy.interpreter/target/javadoc-bundle-options/package-list"
09:56:21 [2020-09-22T13:56:21.935Z] [WARNING] Javadoc Warnings
09:56:21 [2020-09-22T13:56:21.935Z] [WARNING] Picked up JAVA_TOOL_OPTIONS: -Dmaven.ext.class.path="/home/jenkins/agent/workspace/ease.verify.core.gerrit@tmp/withMaven4d46e43a/pipeline-maven-spy.jar" -Dorg.jenkinsci.plugins.pipeline.maven.reportsFolder="/home/jenkins/agent/workspace/ease.verify.core.gerrit@tmp/withMaven4d46e43a"
09:56:21 [2020-09-22T13:56:21.935Z] [INFO] 
09:56:21 [2020-09-22T13:56:21.935Z] [INFO] --- build-helper-maven-plugin:1.9.1:add-resource (add_help) @ org.eclipse.ease.lang.groovy.interpreter ---
09:56:21 [2020-09-22T13:56:21.935Z] [INFO] 
09:56:21 [2020-09-22T13:56:21.935Z] [INFO] --- maven-resources-plugin:2.4.3:resources (default-resources) @ org.eclipse.ease.lang.groovy.interpreter ---
09:56:21 [2020-09-22T13:56:21.935Z] [INFO] Using 'UTF-8' encoding to copy filtered resources.
09:56:21 [2020-09-22T13:56:21.935Z] [INFO] skip non existing resourceDirectory /home/jenkins/agent/workspace/ease.verify.core.gerrit/plugins/org.eclipse.ease.lang.groovy.interpreter/src/main/resources
09:56:21 [2020-09-22T13:56:21.935Z] [INFO] skip non existing resourceDirectory /home/jenkins/agent/workspace/ease.verify.core.gerrit/plugins/org.eclipse.ease.lang.groovy.interpreter/help
09:56:21 [2020-09-22T13:56:21.935Z] [INFO] 
09:56:21 [2020-09-22T13:56:21.935Z] [INFO] --- tycho-compiler-plugin:1.3.0:compile (default-compile) @ org.eclipse.ease.lang.groovy.interpreter ---
09:56:21 [2020-09-22T13:56:21.935Z] [INFO] Compiling 3 source files to /home/jenkins/agent/workspace/ease.verify.core.gerrit/plugins/org.eclipse.ease.lang.groovy.interpreter/target/classes
09:56:21 [2020-09-22T13:56:21.935Z] [INFO] 
09:56:21 [2020-09-22T13:56:21.935Z] [INFO] --- maven-resources-plugin:2.4.3:testResources (default-testResources) @ org.eclipse.ease.lang.groovy.interpreter ---
09:56:21 [2020-09-22T13:56:21.935Z] [INFO] Using 'UTF-8' encoding to copy filtered resources.
09:56:21 [2020-09-22T13:56:21.935Z] [INFO] skip non existing resourceDirectory /home/jenkins/agent/workspace/ease.verify.core.gerrit/plugins/org.eclipse.ease.lang.groovy.interpreter/src/test/resources
09:56:21 [2020-09-22T13:56:21.935Z] [INFO] 
09:56:21 [2020-09-22T13:56:21.935Z] [INFO] --- tycho-source-plugin:1.3.0:plugin-source (plugin-source) @ org.eclipse.ease.lang.groovy.interpreter ---
09:56:21 [2020-09-22T13:56:21.935Z] [INFO] Building jar: /home/jenkins/agent/workspace/ease.verify.core.gerrit/plugins/org.eclipse.ease.lang.groovy.interpreter/target/org.eclipse.ease.lang.groovy.interpreter-0.8.0-SNAPSHOT-sources.jar
09:56:21 [2020-09-22T13:56:21.935Z] [INFO] 
09:56:21 [2020-09-22T13:56:21.935Z] [INFO] --- target-platform-configuration:1.3.0:target-platform (default-target-platform) @ org.eclipse.ease.lang.groovy.interpreter ---
09:56:21 [2020-09-22T13:56:21.935Z] [INFO] 
09:56:21 [2020-09-22T13:56:21.935Z] [INFO] --- tycho-packaging-plugin:1.3.0:package-plugin (default-package-plugin) @ org.eclipse.ease.lang.groovy.interpreter ---
09:56:21 [2020-09-22T13:56:21.935Z] [INFO] Building jar: /home/jenkins/agent/workspace/ease.verify.core.gerrit/plugins/org.eclipse.ease.lang.groovy.interpreter/target/org.eclipse.ease.lang.groovy.interpreter-0.8.0-SNAPSHOT.jar
09:56:21 [2020-09-22T13:56:21.935Z] [INFO] 
09:56:21 [2020-09-22T13:56:21.935Z] [INFO] --- tycho-p2-plugin:1.3.0:p2-metadata-default (default-p2-metadata-default) @ org.eclipse.ease.lang.groovy.interpreter ---
09:56:21 [2020-09-22T13:56:21.935Z] [INFO] 
09:56:21 [2020-09-22T13:56:21.935Z] [INFO] --- tycho-source-feature-plugin:1.3.0:source-feature (source-feature) @ org.eclipse.ease.lang.groovy.interpreter ---
09:56:21 [2020-09-22T13:56:21.935Z] [INFO] 
09:56:21 [2020-09-22T13:56:21.935Z] [INFO] --- tycho-p2-plugin:1.3.0:p2-metadata (attached-p2-metadata) @ org.eclipse.ease.lang.groovy.interpreter ---
09:56:21 [2020-09-22T13:56:21.935Z] [INFO] 
09:56:21 [2020-09-22T13:56:21.935Z] [INFO] ----------< org.eclipse.ease:org.eclipse.ease.lang.unittest >-----------
09:56:21 [2020-09-22T13:56:21.935Z] [INFO] Building org.eclipse.ease.lang.unittest 0.8.0-SNAPSHOT           [13/49]
09:56:21 [2020-09-22T13:56:21.935Z] [INFO] ---------------------------[ eclipse-plugin ]---------------------------
09:56:21 [2020-09-22T13:56:21.935Z] [INFO] 
09:56:21 [2020-09-22T13:56:21.935Z] [INFO] --- maven-clean-plugin:2.5:clean (default-clean) @ org.eclipse.ease.lang.unittest ---
09:56:21 [2020-09-22T13:56:21.935Z] [INFO] 
09:56:21 [2020-09-22T13:56:21.935Z] [INFO] --- tycho-packaging-plugin:1.3.0:build-qualifier (default-build-qualifier) @ org.eclipse.ease.lang.unittest ---
09:56:21 [2020-09-22T13:56:21.935Z] [INFO] The project's OSGi version is 0.8.0.I202006021412
09:56:21 [2020-09-22T13:56:21.935Z] [INFO] 
09:56:21 [2020-09-22T13:56:21.935Z] [INFO] --- tycho-packaging-plugin:1.3.0:validate-id (default-validate-id) @ org.eclipse.ease.lang.unittest ---
09:56:21 [2020-09-22T13:56:21.935Z] [INFO] 
09:56:21 [2020-09-22T13:56:21.935Z] [INFO] --- tycho-packaging-plugin:1.3.0:validate-version (default-validate-version) @ org.eclipse.ease.lang.unittest ---
09:56:21 [2020-09-22T13:56:21.935Z] [INFO] 
09:56:21 [2020-09-22T13:56:21.935Z] [INFO] >>> maven-javadoc-plugin:2.9.1:javadoc (build-docs) > generate-sources @ org.eclipse.ease.lang.unittest >>>
09:56:21 [2020-09-22T13:56:21.935Z] [INFO] 
09:56:21 [2020-09-22T13:56:21.935Z] [INFO] --- tycho-packaging-plugin:1.3.0:build-qualifier (default-build-qualifier) @ org.eclipse.ease.lang.unittest ---
09:56:21 [2020-09-22T13:56:21.935Z] [INFO] The project's OSGi version is 0.8.0.I202006021412
09:56:21 [2020-09-22T13:56:21.935Z] [INFO] 
09:56:21 [2020-09-22T13:56:21.935Z] [INFO] --- tycho-packaging-plugin:1.3.0:validate-id (default-validate-id) @ org.eclipse.ease.lang.unittest ---
09:56:21 [2020-09-22T13:56:21.936Z] [INFO] 
09:56:21 [2020-09-22T13:56:21.936Z] [INFO] --- tycho-packaging-plugin:1.3.0:validate-version (default-validate-version) @ org.eclipse.ease.lang.unittest ---
09:56:21 [2020-09-22T13:56:21.936Z] [INFO] 
09:56:21 [2020-09-22T13:56:21.936Z] [INFO] <<< maven-javadoc-plugin:2.9.1:javadoc (build-docs) < generate-sources @ org.eclipse.ease.lang.unittest <<<
09:56:21 [2020-09-22T13:56:21.936Z] [INFO] 
09:56:21 [2020-09-22T13:56:21.936Z] [INFO] 
09:56:21 [2020-09-22T13:56:21.936Z] [INFO] --- maven-javadoc-plugin:2.9.1:javadoc (build-docs) @ org.eclipse.ease.lang.unittest ---
09:56:21 [2020-09-22T13:56:21.936Z] [ERROR] Error fetching link: http://help.eclipse.org/oxygen/topic/org.eclipse.platform.doc.isv/reference/api/package-list. Ignored it.
09:56:23 [2020-09-22T13:56:23.305Z] [INFO] 
09:56:23 [2020-09-22T13:56:23.305Z] Loading source files for package org.eclipse.ease.lang.unittest...
09:56:23 [2020-09-22T13:56:23.305Z] Loading source files for package org.eclipse.ease.lang.unittest.execution...
09:56:23 [2020-09-22T13:56:23.305Z] Loading source files for package org.eclipse.ease.lang.unittest.reporters...
09:56:23 [2020-09-22T13:56:23.305Z] Loading source files for package org.eclipse.ease.lang.unittest.definition...
09:56:23 [2020-09-22T13:56:23.305Z] Loading source files for package org.eclipse.ease.lang.unittest.definition.impl...
09:56:23 [2020-09-22T13:56:23.305Z] Loading source files for package org.eclipse.ease.lang.unittest.definition.util...
09:56:23 [2020-09-22T13:56:23.305Z] Loading source files for package org.eclipse.ease.lang.unittest.runtime...
09:56:23 [2020-09-22T13:56:23.305Z] Loading source files for package org.eclipse.ease.lang.unittest.runtime.impl...
09:56:23 [2020-09-22T13:56:23.305Z] Loading source files for package org.eclipse.ease.lang.unittest.runtime.util...
09:56:23 [2020-09-22T13:56:23.305Z] Constructing Javadoc information...
09:56:23 [2020-09-22T13:56:23.305Z] WARNING: Cannot open location "/home/jenkins/agent/workspace/ease.verify.core.gerrit/plugins/org.eclipse.ease.lang.unittest/target/javadoc-bundle-options/package-list"
09:56:23 [2020-09-22T13:56:23.305Z] [WARNING] Javadoc Warnings
09:56:23 [2020-09-22T13:56:23.305Z] [WARNING] Picked up JAVA_TOOL_OPTIONS: -Dmaven.ext.class.path="/home/jenkins/agent/workspace/ease.verify.core.gerrit@tmp/withMaven4d46e43a/pipeline-maven-spy.jar" -Dorg.jenkinsci.plugins.pipeline.maven.reportsFolder="/home/jenkins/agent/workspace/ease.verify.core.gerrit@tmp/withMaven4d46e43a"
09:56:23 [2020-09-22T13:56:23.305Z] [INFO] 
09:56:23 [2020-09-22T13:56:23.306Z] [INFO] --- build-helper-maven-plugin:1.9.1:add-resource (add_help) @ org.eclipse.ease.lang.unittest ---
09:56:23 [2020-09-22T13:56:23.306Z] [INFO] 
09:56:23 [2020-09-22T13:56:23.306Z] [INFO] --- maven-resources-plugin:2.4.3:resources (default-resources) @ org.eclipse.ease.lang.unittest ---
09:56:23 [2020-09-22T13:56:23.306Z] [INFO] Using 'UTF-8' encoding to copy filtered resources.
09:56:23 [2020-09-22T13:56:23.306Z] [INFO] skip non existing resourceDirectory /home/jenkins/agent/workspace/ease.verify.core.gerrit/plugins/org.eclipse.ease.lang.unittest/src/main/resources
09:56:23 [2020-09-22T13:56:23.306Z] [INFO] Copying 2 resources to help
09:56:23 [2020-09-22T13:56:23.306Z] [INFO] 
09:56:23 [2020-09-22T13:56:23.306Z] [INFO] --- tycho-compiler-plugin:1.3.0:compile (default-compile) @ org.eclipse.ease.lang.unittest ---
09:56:23 [2020-09-22T13:56:23.306Z] [INFO] Compiling 57 source files to /home/jenkins/agent/workspace/ease.verify.core.gerrit/plugins/org.eclipse.ease.lang.unittest/target/classes
09:56:23 [2020-09-22T13:56:23.306Z] [INFO] 
09:56:23 [2020-09-22T13:56:23.306Z] [INFO] --- maven-resources-plugin:2.4.3:testResources (default-testResources) @ org.eclipse.ease.lang.unittest ---
09:56:23 [2020-09-22T13:56:23.306Z] [INFO] Using 'UTF-8' encoding to copy filtered resources.
09:56:23 [2020-09-22T13:56:23.306Z] [INFO] skip non existing resourceDirectory /home/jenkins/agent/workspace/ease.verify.core.gerrit/plugins/org.eclipse.ease.lang.unittest/src/test/resources
09:56:23 [2020-09-22T13:56:23.306Z] [INFO] 
09:56:23 [2020-09-22T13:56:23.306Z] [INFO] --- tycho-source-plugin:1.3.0:plugin-source (plugin-source) @ org.eclipse.ease.lang.unittest ---
09:56:23 [2020-09-22T13:56:23.306Z] [INFO] Building jar: /home/jenkins/agent/workspace/ease.verify.core.gerrit/plugins/org.eclipse.ease.lang.unittest/target/org.eclipse.ease.lang.unittest-0.8.0-SNAPSHOT-sources.jar
09:56:23 [2020-09-22T13:56:23.306Z] [INFO] 
09:56:23 [2020-09-22T13:56:23.306Z] [INFO] --- target-platform-configuration:1.3.0:target-platform (default-target-platform) @ org.eclipse.ease.lang.unittest ---
09:56:23 [2020-09-22T13:56:23.306Z] [INFO] 
09:56:23 [2020-09-22T13:56:23.306Z] [INFO] --- tycho-packaging-plugin:1.3.0:package-plugin (default-package-plugin) @ org.eclipse.ease.lang.unittest ---
09:56:23 [2020-09-22T13:56:23.306Z] [INFO] Building jar: /home/jenkins/agent/workspace/ease.verify.core.gerrit/plugins/org.eclipse.ease.lang.unittest/target/org.eclipse.ease.lang.unittest-0.8.0-SNAPSHOT.jar
09:56:23 [2020-09-22T13:56:23.562Z] [INFO] 
09:56:23 [2020-09-22T13:56:23.562Z] [INFO] --- tycho-p2-plugin:1.3.0:p2-metadata-default (default-p2-metadata-default) @ org.eclipse.ease.lang.unittest ---
09:56:23 [2020-09-22T13:56:23.562Z] [INFO] 
09:56:23 [2020-09-22T13:56:23.562Z] [INFO] --- tycho-source-feature-plugin:1.3.0:source-feature (source-feature) @ org.eclipse.ease.lang.unittest ---
09:56:23 [2020-09-22T13:56:23.562Z] [INFO] 
09:56:23 [2020-09-22T13:56:23.562Z] [INFO] --- tycho-p2-plugin:1.3.0:p2-metadata (attached-p2-metadata) @ org.eclipse.ease.lang.unittest ---
09:56:23 [2020-09-22T13:56:23.562Z] [INFO] 
09:56:23 [2020-09-22T13:56:23.562Z] [INFO] ---------< org.eclipse.ease:org.eclipse.ease.lang.unittest.ui >---------
09:56:23 [2020-09-22T13:56:23.562Z] [INFO] Building org.eclipse.ease.lang.unittest.ui 0.8.0-SNAPSHOT        [14/49]
09:56:23 [2020-09-22T13:56:23.562Z] [INFO] ---------------------------[ eclipse-plugin ]---------------------------
09:56:23 [2020-09-22T13:56:23.562Z] [INFO] 
09:56:23 [2020-09-22T13:56:23.562Z] [INFO] --- maven-clean-plugin:2.5:clean (default-clean) @ org.eclipse.ease.lang.unittest.ui ---
09:56:23 [2020-09-22T13:56:23.562Z] [INFO] 
09:56:23 [2020-09-22T13:56:23.562Z] [INFO] --- tycho-packaging-plugin:1.3.0:build-qualifier (default-build-qualifier) @ org.eclipse.ease.lang.unittest.ui ---
09:56:23 [2020-09-22T13:56:23.562Z] [INFO] The project's OSGi version is 0.8.0.I202003160826
09:56:23 [2020-09-22T13:56:23.562Z] [INFO] 
09:56:23 [2020-09-22T13:56:23.562Z] [INFO] --- tycho-packaging-plugin:1.3.0:validate-id (default-validate-id) @ org.eclipse.ease.lang.unittest.ui ---
09:56:23 [2020-09-22T13:56:23.562Z] [INFO] 
09:56:23 [2020-09-22T13:56:23.562Z] [INFO] --- tycho-packaging-plugin:1.3.0:validate-version (default-validate-version) @ org.eclipse.ease.lang.unittest.ui ---
09:56:23 [2020-09-22T13:56:23.562Z] [INFO] 
09:56:23 [2020-09-22T13:56:23.562Z] [INFO] >>> maven-javadoc-plugin:2.9.1:javadoc (build-docs) > generate-sources @ org.eclipse.ease.lang.unittest.ui >>>
09:56:23 [2020-09-22T13:56:23.562Z] [INFO] 
09:56:23 [2020-09-22T13:56:23.563Z] [INFO] --- tycho-packaging-plugin:1.3.0:build-qualifier (default-build-qualifier) @ org.eclipse.ease.lang.unittest.ui ---
09:56:23 [2020-09-22T13:56:23.563Z] [INFO] The project's OSGi version is 0.8.0.I202003160826
09:56:23 [2020-09-22T13:56:23.563Z] [INFO] 
09:56:23 [2020-09-22T13:56:23.563Z] [INFO] --- tycho-packaging-plugin:1.3.0:validate-id (default-validate-id) @ org.eclipse.ease.lang.unittest.ui ---
09:56:23 [2020-09-22T13:56:23.563Z] [INFO] 
09:56:23 [2020-09-22T13:56:23.563Z] [INFO] --- tycho-packaging-plugin:1.3.0:validate-version (default-validate-version) @ org.eclipse.ease.lang.unittest.ui ---
09:56:23 [2020-09-22T13:56:23.563Z] [INFO] 
09:56:23 [2020-09-22T13:56:23.563Z] [INFO] <<< maven-javadoc-plugin:2.9.1:javadoc (build-docs) < generate-sources @ org.eclipse.ease.lang.unittest.ui <<<
09:56:23 [2020-09-22T13:56:23.563Z] [INFO] 
09:56:23 [2020-09-22T13:56:23.563Z] [INFO] 
09:56:23 [2020-09-22T13:56:23.563Z] [INFO] --- maven-javadoc-plugin:2.9.1:javadoc (build-docs) @ org.eclipse.ease.lang.unittest.ui ---
09:56:23 [2020-09-22T13:56:23.563Z] [ERROR] Error fetching link: http://help.eclipse.org/oxygen/topic/org.eclipse.platform.doc.isv/reference/api/package-list. Ignored it.
09:56:24 [2020-09-22T13:56:24.932Z] [INFO] 
09:56:24 [2020-09-22T13:56:24.932Z] Loading source files for package org.eclipse.ease.lang.unittest.ui...
09:56:24 [2020-09-22T13:56:24.932Z] Loading source files for package org.eclipse.ease.lang.unittest.ui.decorators...
09:56:24 [2020-09-22T13:56:24.932Z] Loading source files for package org.eclipse.ease.lang.unittest.ui.dialogs...
09:56:24 [2020-09-22T13:56:24.932Z] Loading source files for package org.eclipse.ease.lang.unittest.ui.editor...
09:56:24 [2020-09-22T13:56:24.932Z] Loading source files for package org.eclipse.ease.lang.unittest.ui.handlers...
09:56:24 [2020-09-22T13:56:24.932Z] Loading source files for package org.eclipse.ease.lang.unittest.ui.sourceprovider...
09:56:24 [2020-09-22T13:56:24.932Z] Loading source files for package org.eclipse.ease.lang.unittest.ui.views...
09:56:24 [2020-09-22T13:56:24.932Z] Loading source files for package org.eclipse.ease.lang.unittest.ui.wizards...
09:56:24 [2020-09-22T13:56:24.932Z] Loading source files for package org.eclipse.ease.lang.unittest.definition.provider...
09:56:24 [2020-09-22T13:56:24.932Z] Constructing Javadoc information...
09:56:24 [2020-09-22T13:56:24.932Z] WARNING: Cannot open location "/home/jenkins/agent/workspace/ease.verify.core.gerrit/plugins/org.eclipse.ease.lang.unittest.ui/target/javadoc-bundle-options/package-list"
09:56:24 [2020-09-22T13:56:24.932Z] [WARNING] Javadoc Warnings
09:56:24 [2020-09-22T13:56:24.932Z] [WARNING] Picked up JAVA_TOOL_OPTIONS: -Dmaven.ext.class.path="/home/jenkins/agent/workspace/ease.verify.core.gerrit@tmp/withMaven4d46e43a/pipeline-maven-spy.jar" -Dorg.jenkinsci.plugins.pipeline.maven.reportsFolder="/home/jenkins/agent/workspace/ease.verify.core.gerrit@tmp/withMaven4d46e43a"
09:56:24 [2020-09-22T13:56:24.932Z] [INFO] 
09:56:24 [2020-09-22T13:56:24.932Z] [INFO] --- build-helper-maven-plugin:1.9.1:add-resource (add_help) @ org.eclipse.ease.lang.unittest.ui ---
09:56:24 [2020-09-22T13:56:24.932Z] [INFO] 
09:56:24 [2020-09-22T13:56:24.932Z] [INFO] --- maven-resources-plugin:2.4.3:resources (default-resources) @ org.eclipse.ease.lang.unittest.ui ---
09:56:24 [2020-09-22T13:56:24.932Z] [INFO] Using 'UTF-8' encoding to copy filtered resources.
09:56:24 [2020-09-22T13:56:24.932Z] [INFO] skip non existing resourceDirectory /home/jenkins/agent/workspace/ease.verify.core.gerrit/plugins/org.eclipse.ease.lang.unittest.ui/src/main/resources
09:56:24 [2020-09-22T13:56:24.932Z] [INFO] skip non existing resourceDirectory /home/jenkins/agent/workspace/ease.verify.core.gerrit/plugins/org.eclipse.ease.lang.unittest.ui/help
09:56:24 [2020-09-22T13:56:24.932Z] [INFO] 
09:56:24 [2020-09-22T13:56:24.932Z] [INFO] --- tycho-compiler-plugin:1.3.0:compile (default-compile) @ org.eclipse.ease.lang.unittest.ui ---
09:56:24 [2020-09-22T13:56:24.932Z] [INFO] Compiling 40 source files to /home/jenkins/agent/workspace/ease.verify.core.gerrit/plugins/org.eclipse.ease.lang.unittest.ui/target/classes
09:56:25 [2020-09-22T13:56:25.198Z] [INFO] 
09:56:25 [2020-09-22T13:56:25.198Z] [INFO] --- maven-resources-plugin:2.4.3:testResources (default-testResources) @ org.eclipse.ease.lang.unittest.ui ---
09:56:25 [2020-09-22T13:56:25.198Z] [INFO] Using 'UTF-8' encoding to copy filtered resources.
09:56:25 [2020-09-22T13:56:25.198Z] [INFO] skip non existing resourceDirectory /home/jenkins/agent/workspace/ease.verify.core.gerrit/plugins/org.eclipse.ease.lang.unittest.ui/src/test/resources
09:56:25 [2020-09-22T13:56:25.198Z] [INFO] 
09:56:25 [2020-09-22T13:56:25.198Z] [INFO] --- tycho-source-plugin:1.3.0:plugin-source (plugin-source) @ org.eclipse.ease.lang.unittest.ui ---
09:56:25 [2020-09-22T13:56:25.198Z] [INFO] Building jar: /home/jenkins/agent/workspace/ease.verify.core.gerrit/plugins/org.eclipse.ease.lang.unittest.ui/target/org.eclipse.ease.lang.unittest.ui-0.8.0-SNAPSHOT-sources.jar
09:56:25 [2020-09-22T13:56:25.198Z] [INFO] 
09:56:25 [2020-09-22T13:56:25.198Z] [INFO] --- target-platform-configuration:1.3.0:target-platform (default-target-platform) @ org.eclipse.ease.lang.unittest.ui ---
09:56:25 [2020-09-22T13:56:25.198Z] [INFO] 
09:56:25 [2020-09-22T13:56:25.198Z] [INFO] --- tycho-packaging-plugin:1.3.0:package-plugin (default-package-plugin) @ org.eclipse.ease.lang.unittest.ui ---
09:56:25 [2020-09-22T13:56:25.198Z] [INFO] Building jar: /home/jenkins/agent/workspace/ease.verify.core.gerrit/plugins/org.eclipse.ease.lang.unittest.ui/target/org.eclipse.ease.lang.unittest.ui-0.8.0-SNAPSHOT.jar
09:56:25 [2020-09-22T13:56:25.198Z] [INFO] 
09:56:25 [2020-09-22T13:56:25.199Z] [INFO] --- tycho-p2-plugin:1.3.0:p2-metadata-default (default-p2-metadata-default) @ org.eclipse.ease.lang.unittest.ui ---
09:56:25 [2020-09-22T13:56:25.199Z] [INFO] 
09:56:25 [2020-09-22T13:56:25.199Z] [INFO] --- tycho-source-feature-plugin:1.3.0:source-feature (source-feature) @ org.eclipse.ease.lang.unittest.ui ---
09:56:25 [2020-09-22T13:56:25.199Z] [INFO] 
09:56:25 [2020-09-22T13:56:25.199Z] [INFO] --- tycho-p2-plugin:1.3.0:p2-metadata (attached-p2-metadata) @ org.eclipse.ease.lang.unittest.ui ---
09:56:25 [2020-09-22T13:56:25.199Z] [INFO] 
09:56:25 [2020-09-22T13:56:25.199Z] [INFO] ------------< org.eclipse.ease:org.eclipse.ease.lang.ruby >-------------
09:56:25 [2020-09-22T13:56:25.199Z] [INFO] Building org.eclipse.ease.lang.ruby 0.8.0-SNAPSHOT               [15/49]
09:56:25 [2020-09-22T13:56:25.199Z] [INFO] ---------------------------[ eclipse-plugin ]---------------------------
09:56:25 [2020-09-22T13:56:25.199Z] [INFO] 
09:56:25 [2020-09-22T13:56:25.199Z] [INFO] --- maven-clean-plugin:2.5:clean (default-clean) @ org.eclipse.ease.lang.ruby ---
09:56:25 [2020-09-22T13:56:25.199Z] [INFO] 
09:56:25 [2020-09-22T13:56:25.199Z] [INFO] --- tycho-packaging-plugin:1.3.0:build-qualifier (default-build-qualifier) @ org.eclipse.ease.lang.ruby ---
09:56:25 [2020-09-22T13:56:25.199Z] [INFO] The project's OSGi version is 0.8.0.I201910171213
09:56:25 [2020-09-22T13:56:25.199Z] [INFO] 
09:56:25 [2020-09-22T13:56:25.199Z] [INFO] --- tycho-packaging-plugin:1.3.0:validate-id (default-validate-id) @ org.eclipse.ease.lang.ruby ---
09:56:25 [2020-09-22T13:56:25.199Z] [INFO] 
09:56:25 [2020-09-22T13:56:25.199Z] [INFO] --- tycho-packaging-plugin:1.3.0:validate-version (default-validate-version) @ org.eclipse.ease.lang.ruby ---
09:56:25 [2020-09-22T13:56:25.199Z] [INFO] 
09:56:25 [2020-09-22T13:56:25.199Z] [INFO] >>> maven-javadoc-plugin:2.9.1:javadoc (build-docs) > generate-sources @ org.eclipse.ease.lang.ruby >>>
09:56:25 [2020-09-22T13:56:25.199Z] [INFO] 
09:56:25 [2020-09-22T13:56:25.199Z] [INFO] --- tycho-packaging-plugin:1.3.0:build-qualifier (default-build-qualifier) @ org.eclipse.ease.lang.ruby ---
09:56:25 [2020-09-22T13:56:25.454Z] [INFO] The project's OSGi version is 0.8.0.I201910171213
09:56:25 [2020-09-22T13:56:25.454Z] [INFO] 
09:56:25 [2020-09-22T13:56:25.454Z] [INFO] --- tycho-packaging-plugin:1.3.0:validate-id (default-validate-id) @ org.eclipse.ease.lang.ruby ---
09:56:25 [2020-09-22T13:56:25.454Z] [INFO] 
09:56:25 [2020-09-22T13:56:25.454Z] [INFO] --- tycho-packaging-plugin:1.3.0:validate-version (default-validate-version) @ org.eclipse.ease.lang.ruby ---
09:56:25 [2020-09-22T13:56:25.454Z] [INFO] 
09:56:25 [2020-09-22T13:56:25.454Z] [INFO] <<< maven-javadoc-plugin:2.9.1:javadoc (build-docs) < generate-sources @ org.eclipse.ease.lang.ruby <<<
09:56:25 [2020-09-22T13:56:25.454Z] [INFO] 
09:56:25 [2020-09-22T13:56:25.454Z] [INFO] 
09:56:25 [2020-09-22T13:56:25.454Z] [INFO] --- maven-javadoc-plugin:2.9.1:javadoc (build-docs) @ org.eclipse.ease.lang.ruby ---
09:56:25 [2020-09-22T13:56:25.454Z] [ERROR] Error fetching link: http://help.eclipse.org/oxygen/topic/org.eclipse.platform.doc.isv/reference/api/package-list. Ignored it.
09:56:26 [2020-09-22T13:56:26.819Z] [INFO] 
09:56:26 [2020-09-22T13:56:26.819Z] Loading source files for package org.eclipse.ease.lang.ruby...
09:56:26 [2020-09-22T13:56:26.819Z] Constructing Javadoc information...
09:56:26 [2020-09-22T13:56:26.819Z] WARNING: Cannot open location "/home/jenkins/agent/workspace/ease.verify.core.gerrit/plugins/org.eclipse.ease.lang.ruby/target/javadoc-bundle-options/package-list"
09:56:26 [2020-09-22T13:56:26.819Z] [WARNING] Javadoc Warnings
09:56:26 [2020-09-22T13:56:26.819Z] [WARNING] Picked up JAVA_TOOL_OPTIONS: -Dmaven.ext.class.path="/home/jenkins/agent/workspace/ease.verify.core.gerrit@tmp/withMaven4d46e43a/pipeline-maven-spy.jar" -Dorg.jenkinsci.plugins.pipeline.maven.reportsFolder="/home/jenkins/agent/workspace/ease.verify.core.gerrit@tmp/withMaven4d46e43a"
09:56:26 [2020-09-22T13:56:26.819Z] [INFO] 
09:56:26 [2020-09-22T13:56:26.819Z] [INFO] --- build-helper-maven-plugin:1.9.1:add-resource (add_help) @ org.eclipse.ease.lang.ruby ---
09:56:26 [2020-09-22T13:56:26.819Z] [INFO] 
09:56:26 [2020-09-22T13:56:26.819Z] [INFO] --- maven-resources-plugin:2.4.3:resources (default-resources) @ org.eclipse.ease.lang.ruby ---
09:56:26 [2020-09-22T13:56:26.819Z] [INFO] Using 'UTF-8' encoding to copy filtered resources.
09:56:26 [2020-09-22T13:56:26.819Z] [INFO] skip non existing resourceDirectory /home/jenkins/agent/workspace/ease.verify.core.gerrit/plugins/org.eclipse.ease.lang.ruby/src/main/resources
09:56:26 [2020-09-22T13:56:26.819Z] [INFO] skip non existing resourceDirectory /home/jenkins/agent/workspace/ease.verify.core.gerrit/plugins/org.eclipse.ease.lang.ruby/help
09:56:26 [2020-09-22T13:56:26.819Z] [INFO] 
09:56:26 [2020-09-22T13:56:26.819Z] [INFO] --- tycho-compiler-plugin:1.3.0:compile (default-compile) @ org.eclipse.ease.lang.ruby ---
09:56:26 [2020-09-22T13:56:26.819Z] [INFO] Compiling 4 source files to /home/jenkins/agent/workspace/ease.verify.core.gerrit/plugins/org.eclipse.ease.lang.ruby/target/classes
09:56:26 [2020-09-22T13:56:26.819Z] [INFO] 
09:56:26 [2020-09-22T13:56:26.819Z] [INFO] --- maven-resources-plugin:2.4.3:testResources (default-testResources) @ org.eclipse.ease.lang.ruby ---
09:56:26 [2020-09-22T13:56:26.819Z] [INFO] Using 'UTF-8' encoding to copy filtered resources.
09:56:26 [2020-09-22T13:56:26.819Z] [INFO] skip non existing resourceDirectory /home/jenkins/agent/workspace/ease.verify.core.gerrit/plugins/org.eclipse.ease.lang.ruby/src/test/resources
09:56:26 [2020-09-22T13:56:26.819Z] [INFO] 
09:56:26 [2020-09-22T13:56:26.819Z] [INFO] --- tycho-source-plugin:1.3.0:plugin-source (plugin-source) @ org.eclipse.ease.lang.ruby ---
09:56:26 [2020-09-22T13:56:26.819Z] [INFO] Building jar: /home/jenkins/agent/workspace/ease.verify.core.gerrit/plugins/org.eclipse.ease.lang.ruby/target/org.eclipse.ease.lang.ruby-0.8.0-SNAPSHOT-sources.jar
09:56:26 [2020-09-22T13:56:26.819Z] [INFO] 
09:56:26 [2020-09-22T13:56:26.819Z] [INFO] --- target-platform-configuration:1.3.0:target-platform (default-target-platform) @ org.eclipse.ease.lang.ruby ---
09:56:26 [2020-09-22T13:56:26.819Z] [INFO] 
09:56:26 [2020-09-22T13:56:26.819Z] [INFO] --- tycho-packaging-plugin:1.3.0:package-plugin (default-package-plugin) @ org.eclipse.ease.lang.ruby ---
09:56:26 [2020-09-22T13:56:26.819Z] [INFO] Building jar: /home/jenkins/agent/workspace/ease.verify.core.gerrit/plugins/org.eclipse.ease.lang.ruby/target/org.eclipse.ease.lang.ruby-0.8.0-SNAPSHOT.jar
09:56:26 [2020-09-22T13:56:26.819Z] [INFO] 
09:56:26 [2020-09-22T13:56:26.819Z] [INFO] --- tycho-p2-plugin:1.3.0:p2-metadata-default (default-p2-metadata-default) @ org.eclipse.ease.lang.ruby ---
09:56:26 [2020-09-22T13:56:26.819Z] [INFO] 
09:56:26 [2020-09-22T13:56:26.819Z] [INFO] --- tycho-source-feature-plugin:1.3.0:source-feature (source-feature) @ org.eclipse.ease.lang.ruby ---
09:56:26 [2020-09-22T13:56:26.819Z] [INFO] 
09:56:26 [2020-09-22T13:56:26.819Z] [INFO] --- tycho-p2-plugin:1.3.0:p2-metadata (attached-p2-metadata) @ org.eclipse.ease.lang.ruby ---
09:56:26 [2020-09-22T13:56:26.819Z] [INFO] 
09:56:26 [2020-09-22T13:56:26.819Z] [INFO] ---------< org.eclipse.ease:org.eclipse.ease.lang.ruby.jruby >----------
09:56:26 [2020-09-22T13:56:26.819Z] [INFO] Building org.eclipse.ease.lang.ruby.jruby 0.8.0-SNAPSHOT         [16/49]
09:56:26 [2020-09-22T13:56:26.819Z] [INFO] ---------------------------[ eclipse-plugin ]---------------------------
09:56:26 [2020-09-22T13:56:26.819Z] [INFO] 
09:56:26 [2020-09-22T13:56:26.819Z] [INFO] --- maven-clean-plugin:2.5:clean (default-clean) @ org.eclipse.ease.lang.ruby.jruby ---
09:56:26 [2020-09-22T13:56:26.819Z] [INFO] 
09:56:26 [2020-09-22T13:56:26.819Z] [INFO] --- tycho-packaging-plugin:1.3.0:build-qualifier (default-build-qualifier) @ org.eclipse.ease.lang.ruby.jruby ---
09:56:26 [2020-09-22T13:56:26.819Z] [INFO] The project's OSGi version is 0.8.0.I201910171213
09:56:26 [2020-09-22T13:56:26.819Z] [INFO] 
09:56:26 [2020-09-22T13:56:26.819Z] [INFO] --- tycho-packaging-plugin:1.3.0:validate-id (default-validate-id) @ org.eclipse.ease.lang.ruby.jruby ---
09:56:26 [2020-09-22T13:56:26.819Z] [INFO] 
09:56:26 [2020-09-22T13:56:26.819Z] [INFO] --- tycho-packaging-plugin:1.3.0:validate-version (default-validate-version) @ org.eclipse.ease.lang.ruby.jruby ---
09:56:26 [2020-09-22T13:56:26.819Z] [INFO] 
09:56:26 [2020-09-22T13:56:26.819Z] [INFO] >>> maven-javadoc-plugin:2.9.1:javadoc (build-docs) > generate-sources @ org.eclipse.ease.lang.ruby.jruby >>>
09:56:26 [2020-09-22T13:56:26.819Z] [INFO] 
09:56:26 [2020-09-22T13:56:26.819Z] [INFO] --- tycho-packaging-plugin:1.3.0:build-qualifier (default-build-qualifier) @ org.eclipse.ease.lang.ruby.jruby ---
09:56:26 [2020-09-22T13:56:26.819Z] [INFO] The project's OSGi version is 0.8.0.I201910171213
09:56:26 [2020-09-22T13:56:26.819Z] [INFO] 
09:56:26 [2020-09-22T13:56:26.819Z] [INFO] --- tycho-packaging-plugin:1.3.0:validate-id (default-validate-id) @ org.eclipse.ease.lang.ruby.jruby ---
09:56:26 [2020-09-22T13:56:26.820Z] [INFO] 
09:56:26 [2020-09-22T13:56:26.820Z] [INFO] --- tycho-packaging-plugin:1.3.0:validate-version (default-validate-version) @ org.eclipse.ease.lang.ruby.jruby ---
09:56:26 [2020-09-22T13:56:26.820Z] [INFO] 
09:56:26 [2020-09-22T13:56:26.820Z] [INFO] <<< maven-javadoc-plugin:2.9.1:javadoc (build-docs) < generate-sources @ org.eclipse.ease.lang.ruby.jruby <<<
09:56:26 [2020-09-22T13:56:26.820Z] [INFO] 
09:56:26 [2020-09-22T13:56:26.820Z] [INFO] 
09:56:26 [2020-09-22T13:56:26.820Z] [INFO] --- maven-javadoc-plugin:2.9.1:javadoc (build-docs) @ org.eclipse.ease.lang.ruby.jruby ---
09:56:26 [2020-09-22T13:56:26.820Z] [ERROR] Error fetching link: http://help.eclipse.org/oxygen/topic/org.eclipse.platform.doc.isv/reference/api/package-list. Ignored it.
09:56:28 [2020-09-22T13:56:28.183Z] [INFO] 
09:56:28 [2020-09-22T13:56:28.183Z] Loading source files for package org.eclipse.ease.lang.ruby.jruby...
09:56:28 [2020-09-22T13:56:28.183Z] Constructing Javadoc information...
09:56:28 [2020-09-22T13:56:28.183Z] WARNING: Cannot open location "/home/jenkins/agent/workspace/ease.verify.core.gerrit/plugins/org.eclipse.ease.lang.ruby.jruby/target/javadoc-bundle-options/package-list"
09:56:28 [2020-09-22T13:56:28.183Z] [WARNING] Javadoc Warnings
09:56:28 [2020-09-22T13:56:28.183Z] [WARNING] Picked up JAVA_TOOL_OPTIONS: -Dmaven.ext.class.path="/home/jenkins/agent/workspace/ease.verify.core.gerrit@tmp/withMaven4d46e43a/pipeline-maven-spy.jar" -Dorg.jenkinsci.plugins.pipeline.maven.reportsFolder="/home/jenkins/agent/workspace/ease.verify.core.gerrit@tmp/withMaven4d46e43a"
09:56:28 [2020-09-22T13:56:28.183Z] [INFO] 
09:56:28 [2020-09-22T13:56:28.183Z] [INFO] --- build-helper-maven-plugin:1.9.1:add-resource (add_help) @ org.eclipse.ease.lang.ruby.jruby ---
09:56:28 [2020-09-22T13:56:28.183Z] [INFO] 
09:56:28 [2020-09-22T13:56:28.183Z] [INFO] --- maven-resources-plugin:2.4.3:resources (default-resources) @ org.eclipse.ease.lang.ruby.jruby ---
09:56:28 [2020-09-22T13:56:28.183Z] [INFO] Using 'UTF-8' encoding to copy filtered resources.
09:56:28 [2020-09-22T13:56:28.183Z] [INFO] skip non existing resourceDirectory /home/jenkins/agent/workspace/ease.verify.core.gerrit/plugins/org.eclipse.ease.lang.ruby.jruby/src/main/resources
09:56:28 [2020-09-22T13:56:28.183Z] [INFO] skip non existing resourceDirectory /home/jenkins/agent/workspace/ease.verify.core.gerrit/plugins/org.eclipse.ease.lang.ruby.jruby/help
09:56:28 [2020-09-22T13:56:28.183Z] [INFO] 
09:56:28 [2020-09-22T13:56:28.183Z] [INFO] --- tycho-compiler-plugin:1.3.0:compile (default-compile) @ org.eclipse.ease.lang.ruby.jruby ---
09:56:28 [2020-09-22T13:56:28.183Z] [INFO] Compiling 2 source files to /home/jenkins/agent/workspace/ease.verify.core.gerrit/plugins/org.eclipse.ease.lang.ruby.jruby/target/classes
09:56:28 [2020-09-22T13:56:28.183Z] [INFO] 
09:56:28 [2020-09-22T13:56:28.183Z] [INFO] --- maven-resources-plugin:2.4.3:testResources (default-testResources) @ org.eclipse.ease.lang.ruby.jruby ---
09:56:28 [2020-09-22T13:56:28.183Z] [INFO] Using 'UTF-8' encoding to copy filtered resources.
09:56:28 [2020-09-22T13:56:28.183Z] [INFO] skip non existing resourceDirectory /home/jenkins/agent/workspace/ease.verify.core.gerrit/plugins/org.eclipse.ease.lang.ruby.jruby/src/test/resources
09:56:28 [2020-09-22T13:56:28.183Z] [INFO] 
09:56:28 [2020-09-22T13:56:28.183Z] [INFO] --- tycho-source-plugin:1.3.0:plugin-source (plugin-source) @ org.eclipse.ease.lang.ruby.jruby ---
09:56:28 [2020-09-22T13:56:28.183Z] [INFO] Building jar: /home/jenkins/agent/workspace/ease.verify.core.gerrit/plugins/org.eclipse.ease.lang.ruby.jruby/target/org.eclipse.ease.lang.ruby.jruby-0.8.0-SNAPSHOT-sources.jar
09:56:28 [2020-09-22T13:56:28.183Z] [INFO] 
09:56:28 [2020-09-22T13:56:28.183Z] [INFO] --- target-platform-configuration:1.3.0:target-platform (default-target-platform) @ org.eclipse.ease.lang.ruby.jruby ---
09:56:28 [2020-09-22T13:56:28.184Z] [INFO] 
09:56:28 [2020-09-22T13:56:28.184Z] [INFO] --- tycho-packaging-plugin:1.3.0:package-plugin (default-package-plugin) @ org.eclipse.ease.lang.ruby.jruby ---
09:56:28 [2020-09-22T13:56:28.184Z] [INFO] Building jar: /home/jenkins/agent/workspace/ease.verify.core.gerrit/plugins/org.eclipse.ease.lang.ruby.jruby/target/org.eclipse.ease.lang.ruby.jruby-0.8.0-SNAPSHOT.jar
09:56:28 [2020-09-22T13:56:28.184Z] [INFO] 
09:56:28 [2020-09-22T13:56:28.184Z] [INFO] --- tycho-p2-plugin:1.3.0:p2-metadata-default (default-p2-metadata-default) @ org.eclipse.ease.lang.ruby.jruby ---
09:56:28 [2020-09-22T13:56:28.184Z] [INFO] 
09:56:28 [2020-09-22T13:56:28.184Z] [INFO] --- tycho-source-feature-plugin:1.3.0:source-feature (source-feature) @ org.eclipse.ease.lang.ruby.jruby ---
09:56:28 [2020-09-22T13:56:28.184Z] [INFO] 
09:56:28 [2020-09-22T13:56:28.184Z] [INFO] --- tycho-p2-plugin:1.3.0:p2-metadata (attached-p2-metadata) @ org.eclipse.ease.lang.ruby.jruby ---
09:56:28 [2020-09-22T13:56:28.184Z] [INFO] 
09:56:28 [2020-09-22T13:56:28.184Z] [INFO] -----< org.eclipse.ease:org.eclipse.ease.lang.javascript.nashorn >------
09:56:28 [2020-09-22T13:56:28.184Z] [INFO] Building org.eclipse.ease.lang.javascript.nashorn 0.8.0-SNAPSHOT [17/49]
09:56:28 [2020-09-22T13:56:28.184Z] [INFO] ---------------------------[ eclipse-plugin ]---------------------------
09:56:28 [2020-09-22T13:56:28.184Z] [INFO] 
09:56:28 [2020-09-22T13:56:28.184Z] [INFO] --- maven-clean-plugin:2.5:clean (default-clean) @ org.eclipse.ease.lang.javascript.nashorn ---
09:56:28 [2020-09-22T13:56:28.184Z] [INFO] 
09:56:28 [2020-09-22T13:56:28.184Z] [INFO] --- tycho-packaging-plugin:1.3.0:build-qualifier (default-build-qualifier) @ org.eclipse.ease.lang.javascript.nashorn ---
09:56:28 [2020-09-22T13:56:28.184Z] [INFO] The project's OSGi version is 0.8.0.I202008070902
09:56:28 [2020-09-22T13:56:28.184Z] [INFO] 
09:56:28 [2020-09-22T13:56:28.184Z] [INFO] --- tycho-packaging-plugin:1.3.0:validate-id (default-validate-id) @ org.eclipse.ease.lang.javascript.nashorn ---
09:56:28 [2020-09-22T13:56:28.184Z] [INFO] 
09:56:28 [2020-09-22T13:56:28.184Z] [INFO] --- tycho-packaging-plugin:1.3.0:validate-version (default-validate-version) @ org.eclipse.ease.lang.javascript.nashorn ---
09:56:28 [2020-09-22T13:56:28.184Z] [INFO] 
09:56:28 [2020-09-22T13:56:28.184Z] [INFO] >>> maven-javadoc-plugin:2.9.1:javadoc (build-docs) > generate-sources @ org.eclipse.ease.lang.javascript.nashorn >>>
09:56:28 [2020-09-22T13:56:28.184Z] [INFO] 
09:56:28 [2020-09-22T13:56:28.184Z] [INFO] --- tycho-packaging-plugin:1.3.0:build-qualifier (default-build-qualifier) @ org.eclipse.ease.lang.javascript.nashorn ---
09:56:28 [2020-09-22T13:56:28.184Z] [INFO] The project's OSGi version is 0.8.0.I202008070902
09:56:28 [2020-09-22T13:56:28.184Z] [INFO] 
09:56:28 [2020-09-22T13:56:28.184Z] [INFO] --- tycho-packaging-plugin:1.3.0:validate-id (default-validate-id) @ org.eclipse.ease.lang.javascript.nashorn ---
09:56:28 [2020-09-22T13:56:28.184Z] [INFO] 
09:56:28 [2020-09-22T13:56:28.184Z] [INFO] --- tycho-packaging-plugin:1.3.0:validate-version (default-validate-version) @ org.eclipse.ease.lang.javascript.nashorn ---
09:56:28 [2020-09-22T13:56:28.184Z] [INFO] 
09:56:28 [2020-09-22T13:56:28.184Z] [INFO] <<< maven-javadoc-plugin:2.9.1:javadoc (build-docs) < generate-sources @ org.eclipse.ease.lang.javascript.nashorn <<<
09:56:28 [2020-09-22T13:56:28.184Z] [INFO] 
09:56:28 [2020-09-22T13:56:28.184Z] [INFO] 
09:56:28 [2020-09-22T13:56:28.184Z] [INFO] --- maven-javadoc-plugin:2.9.1:javadoc (build-docs) @ org.eclipse.ease.lang.javascript.nashorn ---
09:56:28 [2020-09-22T13:56:28.184Z] [ERROR] Error fetching link: http://help.eclipse.org/oxygen/topic/org.eclipse.platform.doc.isv/reference/api/package-list. Ignored it.
09:56:29 [2020-09-22T13:56:29.112Z] [INFO] 
09:56:29 [2020-09-22T13:56:29.112Z] Loading source files for package org.eclipse.ease.lang.javascript.nashorn...
09:56:29 [2020-09-22T13:56:29.112Z] Constructing Javadoc information...
09:56:29 [2020-09-22T13:56:29.112Z] WARNING: Cannot open location "/home/jenkins/agent/workspace/ease.verify.core.gerrit/plugins/org.eclipse.ease.lang.javascript.nashorn/target/javadoc-bundle-options/package-list"
09:56:29 [2020-09-22T13:56:29.112Z] [WARNING] Javadoc Warnings
09:56:29 [2020-09-22T13:56:29.112Z] [WARNING] Picked up JAVA_TOOL_OPTIONS: -Dmaven.ext.class.path="/home/jenkins/agent/workspace/ease.verify.core.gerrit@tmp/withMaven4d46e43a/pipeline-maven-spy.jar" -Dorg.jenkinsci.plugins.pipeline.maven.reportsFolder="/home/jenkins/agent/workspace/ease.verify.core.gerrit@tmp/withMaven4d46e43a"
09:56:29 [2020-09-22T13:56:29.112Z] [INFO] 
09:56:29 [2020-09-22T13:56:29.112Z] [INFO] --- build-helper-maven-plugin:1.9.1:add-resource (add_help) @ org.eclipse.ease.lang.javascript.nashorn ---
09:56:29 [2020-09-22T13:56:29.112Z] [INFO] 
09:56:29 [2020-09-22T13:56:29.112Z] [INFO] --- maven-resources-plugin:2.4.3:resources (default-resources) @ org.eclipse.ease.lang.javascript.nashorn ---
09:56:29 [2020-09-22T13:56:29.113Z] [INFO] Using 'UTF-8' encoding to copy filtered resources.
09:56:29 [2020-09-22T13:56:29.113Z] [INFO] skip non existing resourceDirectory /home/jenkins/agent/workspace/ease.verify.core.gerrit/plugins/org.eclipse.ease.lang.javascript.nashorn/src/main/resources
09:56:29 [2020-09-22T13:56:29.113Z] [INFO] Copying 2 resources to help
09:56:29 [2020-09-22T13:56:29.113Z] [INFO] 
09:56:29 [2020-09-22T13:56:29.113Z] [INFO] --- tycho-compiler-plugin:1.3.0:compile (default-compile) @ org.eclipse.ease.lang.javascript.nashorn ---
09:56:29 [2020-09-22T13:56:29.113Z] [INFO] Compiling 2 source files to /home/jenkins/agent/workspace/ease.verify.core.gerrit/plugins/org.eclipse.ease.lang.javascript.nashorn/target/classes
09:56:29 [2020-09-22T13:56:29.368Z] [INFO] 
09:56:29 [2020-09-22T13:56:29.368Z] [INFO] --- maven-resources-plugin:2.4.3:testResources (default-testResources) @ org.eclipse.ease.lang.javascript.nashorn ---
09:56:29 [2020-09-22T13:56:29.368Z] [INFO] Using 'UTF-8' encoding to copy filtered resources.
09:56:29 [2020-09-22T13:56:29.368Z] [INFO] skip non existing resourceDirectory /home/jenkins/agent/workspace/ease.verify.core.gerrit/plugins/org.eclipse.ease.lang.javascript.nashorn/src/test/resources
09:56:29 [2020-09-22T13:56:29.368Z] [INFO] 
09:56:29 [2020-09-22T13:56:29.368Z] [INFO] --- tycho-source-plugin:1.3.0:plugin-source (plugin-source) @ org.eclipse.ease.lang.javascript.nashorn ---
09:56:29 [2020-09-22T13:56:29.368Z] [WARNING] Bundle-Vendor header not found in /home/jenkins/agent/workspace/ease.verify.core.gerrit/plugins/org.eclipse.ease.lang.javascript.nashorn/META-INF/MANIFEST.MF, fallback to 'unknown' for source bundle
09:56:29 [2020-09-22T13:56:29.368Z] [INFO] Building jar: /home/jenkins/agent/workspace/ease.verify.core.gerrit/plugins/org.eclipse.ease.lang.javascript.nashorn/target/org.eclipse.ease.lang.javascript.nashorn-0.8.0-SNAPSHOT-sources.jar
09:56:29 [2020-09-22T13:56:29.368Z] [INFO] 
09:56:29 [2020-09-22T13:56:29.368Z] [INFO] --- target-platform-configuration:1.3.0:target-platform (default-target-platform) @ org.eclipse.ease.lang.javascript.nashorn ---
09:56:29 [2020-09-22T13:56:29.368Z] [INFO] 
09:56:29 [2020-09-22T13:56:29.368Z] [INFO] --- tycho-packaging-plugin:1.3.0:package-plugin (default-package-plugin) @ org.eclipse.ease.lang.javascript.nashorn ---
09:56:29 [2020-09-22T13:56:29.368Z] [INFO] Building jar: /home/jenkins/agent/workspace/ease.verify.core.gerrit/plugins/org.eclipse.ease.lang.javascript.nashorn/target/org.eclipse.ease.lang.javascript.nashorn-0.8.0-SNAPSHOT.jar
09:56:29 [2020-09-22T13:56:29.368Z] [INFO] 
09:56:29 [2020-09-22T13:56:29.368Z] [INFO] --- tycho-p2-plugin:1.3.0:p2-metadata-default (default-p2-metadata-default) @ org.eclipse.ease.lang.javascript.nashorn ---
09:56:29 [2020-09-22T13:56:29.368Z] [INFO] 
09:56:29 [2020-09-22T13:56:29.368Z] [INFO] --- tycho-source-feature-plugin:1.3.0:source-feature (source-feature) @ org.eclipse.ease.lang.javascript.nashorn ---
09:56:29 [2020-09-22T13:56:29.368Z] [INFO] 
09:56:29 [2020-09-22T13:56:29.368Z] [INFO] --- tycho-p2-plugin:1.3.0:p2-metadata (attached-p2-metadata) @ org.eclipse.ease.lang.javascript.nashorn ---
09:56:29 [2020-09-22T13:56:29.368Z] [INFO] 
09:56:29 [2020-09-22T13:56:29.368Z] [INFO] ------< org.eclipse.ease:org.eclipse.ease.lang.javascript.rhino >-------
09:56:29 [2020-09-22T13:56:29.368Z] [INFO] Building org.eclipse.ease.lang.javascript.rhino 0.8.0-SNAPSHOT   [18/49]
09:56:29 [2020-09-22T13:56:29.368Z] [INFO] ---------------------------[ eclipse-plugin ]---------------------------
09:56:29 [2020-09-22T13:56:29.368Z] [INFO] 
09:56:29 [2020-09-22T13:56:29.368Z] [INFO] --- maven-clean-plugin:2.5:clean (default-clean) @ org.eclipse.ease.lang.javascript.rhino ---
09:56:29 [2020-09-22T13:56:29.368Z] [INFO] 
09:56:29 [2020-09-22T13:56:29.368Z] [INFO] --- tycho-packaging-plugin:1.3.0:build-qualifier (default-build-qualifier) @ org.eclipse.ease.lang.javascript.rhino ---
09:56:29 [2020-09-22T13:56:29.368Z] [INFO] The project's OSGi version is 0.8.0.I202008070902
09:56:29 [2020-09-22T13:56:29.368Z] [INFO] 
09:56:29 [2020-09-22T13:56:29.369Z] [INFO] --- tycho-packaging-plugin:1.3.0:validate-id (default-validate-id) @ org.eclipse.ease.lang.javascript.rhino ---
09:56:29 [2020-09-22T13:56:29.369Z] [INFO] 
09:56:29 [2020-09-22T13:56:29.369Z] [INFO] --- tycho-packaging-plugin:1.3.0:validate-version (default-validate-version) @ org.eclipse.ease.lang.javascript.rhino ---
09:56:29 [2020-09-22T13:56:29.369Z] [INFO] 
09:56:29 [2020-09-22T13:56:29.369Z] [INFO] >>> maven-javadoc-plugin:2.9.1:javadoc (build-docs) > generate-sources @ org.eclipse.ease.lang.javascript.rhino >>>
09:56:29 [2020-09-22T13:56:29.369Z] [INFO] 
09:56:29 [2020-09-22T13:56:29.369Z] [INFO] --- tycho-packaging-plugin:1.3.0:build-qualifier (default-build-qualifier) @ org.eclipse.ease.lang.javascript.rhino ---
09:56:29 [2020-09-22T13:56:29.369Z] [INFO] The project's OSGi version is 0.8.0.I202008070902
09:56:29 [2020-09-22T13:56:29.369Z] [INFO] 
09:56:29 [2020-09-22T13:56:29.369Z] [INFO] --- tycho-packaging-plugin:1.3.0:validate-id (default-validate-id) @ org.eclipse.ease.lang.javascript.rhino ---
09:56:29 [2020-09-22T13:56:29.369Z] [INFO] 
09:56:29 [2020-09-22T13:56:29.369Z] [INFO] --- tycho-packaging-plugin:1.3.0:validate-version (default-validate-version) @ org.eclipse.ease.lang.javascript.rhino ---
09:56:29 [2020-09-22T13:56:29.369Z] [INFO] 
09:56:29 [2020-09-22T13:56:29.369Z] [INFO] <<< maven-javadoc-plugin:2.9.1:javadoc (build-docs) < generate-sources @ org.eclipse.ease.lang.javascript.rhino <<<
09:56:29 [2020-09-22T13:56:29.369Z] [INFO] 
09:56:29 [2020-09-22T13:56:29.369Z] [INFO] 
09:56:29 [2020-09-22T13:56:29.369Z] [INFO] --- maven-javadoc-plugin:2.9.1:javadoc (build-docs) @ org.eclipse.ease.lang.javascript.rhino ---
09:56:29 [2020-09-22T13:56:29.369Z] [ERROR] Error fetching link: http://help.eclipse.org/oxygen/topic/org.eclipse.platform.doc.isv/reference/api/package-list. Ignored it.
09:56:30 [2020-09-22T13:56:30.734Z] [INFO] 
09:56:30 [2020-09-22T13:56:30.734Z] Loading source files for package org.eclipse.ease.lang.javascript.rhino...
09:56:30 [2020-09-22T13:56:30.734Z] Loading source files for package org.eclipse.ease.lang.javascript.rhino.debugger...
09:56:30 [2020-09-22T13:56:30.734Z] Loading source files for package org.eclipse.ease.lang.javascript.rhino.debugger.actions...
09:56:30 [2020-09-22T13:56:30.734Z] Loading source files for package org.eclipse.ease.lang.javascript.rhino.debugger.editor...
09:56:30 [2020-09-22T13:56:30.734Z] Loading source files for package org.eclipse.ease.lang.javascript.rhino.debugger.model...
09:56:30 [2020-09-22T13:56:30.734Z] Constructing Javadoc information...
09:56:30 [2020-09-22T13:56:30.734Z] WARNING: Cannot open location "/home/jenkins/agent/workspace/ease.verify.core.gerrit/plugins/org.eclipse.ease.lang.javascript.rhino/target/javadoc-bundle-options/package-list"
09:56:30 [2020-09-22T13:56:30.734Z] [WARNING] Javadoc Warnings
09:56:30 [2020-09-22T13:56:30.734Z] [WARNING] Picked up JAVA_TOOL_OPTIONS: -Dmaven.ext.class.path="/home/jenkins/agent/workspace/ease.verify.core.gerrit@tmp/withMaven4d46e43a/pipeline-maven-spy.jar" -Dorg.jenkinsci.plugins.pipeline.maven.reportsFolder="/home/jenkins/agent/workspace/ease.verify.core.gerrit@tmp/withMaven4d46e43a"
09:56:30 [2020-09-22T13:56:30.734Z] [INFO] 
09:56:30 [2020-09-22T13:56:30.734Z] [INFO] --- build-helper-maven-plugin:1.9.1:add-resource (add_help) @ org.eclipse.ease.lang.javascript.rhino ---
09:56:30 [2020-09-22T13:56:30.734Z] [INFO] 
09:56:30 [2020-09-22T13:56:30.734Z] [INFO] --- maven-resources-plugin:2.4.3:resources (default-resources) @ org.eclipse.ease.lang.javascript.rhino ---
09:56:30 [2020-09-22T13:56:30.734Z] [INFO] Using 'UTF-8' encoding to copy filtered resources.
09:56:30 [2020-09-22T13:56:30.734Z] [INFO] skip non existing resourceDirectory /home/jenkins/agent/workspace/ease.verify.core.gerrit/plugins/org.eclipse.ease.lang.javascript.rhino/src/main/resources
09:56:30 [2020-09-22T13:56:30.734Z] [INFO] Copying 2 resources to help
09:56:30 [2020-09-22T13:56:30.734Z] [INFO] 
09:56:30 [2020-09-22T13:56:30.734Z] [INFO] --- tycho-compiler-plugin:1.3.0:compile (default-compile) @ org.eclipse.ease.lang.javascript.rhino ---
09:56:30 [2020-09-22T13:56:30.734Z] [INFO] Compiling 13 source files to /home/jenkins/agent/workspace/ease.verify.core.gerrit/plugins/org.eclipse.ease.lang.javascript.rhino/target/classes
09:56:30 [2020-09-22T13:56:30.734Z] [INFO] 
09:56:30 [2020-09-22T13:56:30.734Z] [INFO] --- maven-resources-plugin:2.4.3:testResources (default-testResources) @ org.eclipse.ease.lang.javascript.rhino ---
09:56:30 [2020-09-22T13:56:30.734Z] [INFO] Using 'UTF-8' encoding to copy filtered resources.
09:56:30 [2020-09-22T13:56:30.734Z] [INFO] skip non existing resourceDirectory /home/jenkins/agent/workspace/ease.verify.core.gerrit/plugins/org.eclipse.ease.lang.javascript.rhino/src/test/resources
09:56:30 [2020-09-22T13:56:30.734Z] [INFO] 
09:56:30 [2020-09-22T13:56:30.734Z] [INFO] --- tycho-source-plugin:1.3.0:plugin-source (plugin-source) @ org.eclipse.ease.lang.javascript.rhino ---
09:56:30 [2020-09-22T13:56:30.734Z] [INFO] Building jar: /home/jenkins/agent/workspace/ease.verify.core.gerrit/plugins/org.eclipse.ease.lang.javascript.rhino/target/org.eclipse.ease.lang.javascript.rhino-0.8.0-SNAPSHOT-sources.jar
09:56:30 [2020-09-22T13:56:30.734Z] [INFO] 
09:56:30 [2020-09-22T13:56:30.734Z] [INFO] --- target-platform-configuration:1.3.0:target-platform (default-target-platform) @ org.eclipse.ease.lang.javascript.rhino ---
09:56:30 [2020-09-22T13:56:30.734Z] [INFO] 
09:56:30 [2020-09-22T13:56:30.734Z] [INFO] --- tycho-packaging-plugin:1.3.0:package-plugin (default-package-plugin) @ org.eclipse.ease.lang.javascript.rhino ---
09:56:30 [2020-09-22T13:56:30.734Z] [INFO] Building jar: /home/jenkins/agent/workspace/ease.verify.core.gerrit/plugins/org.eclipse.ease.lang.javascript.rhino/target/org.eclipse.ease.lang.javascript.rhino-0.8.0-SNAPSHOT.jar
09:56:30 [2020-09-22T13:56:30.734Z] [INFO] 
09:56:30 [2020-09-22T13:56:30.734Z] [INFO] --- tycho-p2-plugin:1.3.0:p2-metadata-default (default-p2-metadata-default) @ org.eclipse.ease.lang.javascript.rhino ---
09:56:30 [2020-09-22T13:56:30.734Z] [INFO] 
09:56:30 [2020-09-22T13:56:30.735Z] [INFO] --- tycho-source-feature-plugin:1.3.0:source-feature (source-feature) @ org.eclipse.ease.lang.javascript.rhino ---
09:56:30 [2020-09-22T13:56:30.735Z] [INFO] 
09:56:30 [2020-09-22T13:56:30.735Z] [INFO] --- tycho-p2-plugin:1.3.0:p2-metadata (attached-p2-metadata) @ org.eclipse.ease.lang.javascript.rhino ---
09:56:30 [2020-09-22T13:56:30.735Z] [INFO] 
09:56:30 [2020-09-22T13:56:30.735Z] [INFO] --------< org.eclipse.ease:org.eclipse.ease.lang.python.jython >--------
09:56:30 [2020-09-22T13:56:30.735Z] [INFO] Building org.eclipse.ease.lang.python.jython 0.8.0-SNAPSHOT      [19/49]
09:56:30 [2020-09-22T13:56:30.735Z] [INFO] ---------------------------[ eclipse-plugin ]---------------------------
09:56:30 [2020-09-22T13:56:30.735Z] [INFO] 
09:56:30 [2020-09-22T13:56:30.735Z] [INFO] --- maven-clean-plugin:2.5:clean (default-clean) @ org.eclipse.ease.lang.python.jython ---
09:56:30 [2020-09-22T13:56:30.990Z] [INFO] 
09:56:30 [2020-09-22T13:56:30.990Z] [INFO] --- tycho-packaging-plugin:1.3.0:build-qualifier (default-build-qualifier) @ org.eclipse.ease.lang.python.jython ---
09:56:30 [2020-09-22T13:56:30.990Z] [INFO] The project's OSGi version is 0.8.0.I202008070902
09:56:30 [2020-09-22T13:56:30.990Z] [INFO] 
09:56:30 [2020-09-22T13:56:30.990Z] [INFO] --- tycho-packaging-plugin:1.3.0:validate-id (default-validate-id) @ org.eclipse.ease.lang.python.jython ---
09:56:30 [2020-09-22T13:56:30.990Z] [INFO] 
09:56:30 [2020-09-22T13:56:30.990Z] [INFO] --- tycho-packaging-plugin:1.3.0:validate-version (default-validate-version) @ org.eclipse.ease.lang.python.jython ---
09:56:30 [2020-09-22T13:56:30.990Z] [INFO] 
09:56:30 [2020-09-22T13:56:30.990Z] [INFO] >>> maven-javadoc-plugin:2.9.1:javadoc (build-docs) > generate-sources @ org.eclipse.ease.lang.python.jython >>>
09:56:30 [2020-09-22T13:56:30.990Z] [INFO] 
09:56:30 [2020-09-22T13:56:30.990Z] [INFO] --- tycho-packaging-plugin:1.3.0:build-qualifier (default-build-qualifier) @ org.eclipse.ease.lang.python.jython ---
09:56:30 [2020-09-22T13:56:30.990Z] [INFO] The project's OSGi version is 0.8.0.I202008070902
09:56:30 [2020-09-22T13:56:30.990Z] [INFO] 
09:56:30 [2020-09-22T13:56:30.990Z] [INFO] --- tycho-packaging-plugin:1.3.0:validate-id (default-validate-id) @ org.eclipse.ease.lang.python.jython ---
09:56:30 [2020-09-22T13:56:30.990Z] [INFO] 
09:56:30 [2020-09-22T13:56:30.990Z] [INFO] --- tycho-packaging-plugin:1.3.0:validate-version (default-validate-version) @ org.eclipse.ease.lang.python.jython ---
09:56:30 [2020-09-22T13:56:30.990Z] [INFO] 
09:56:30 [2020-09-22T13:56:30.990Z] [INFO] <<< maven-javadoc-plugin:2.9.1:javadoc (build-docs) < generate-sources @ org.eclipse.ease.lang.python.jython <<<
09:56:30 [2020-09-22T13:56:30.990Z] [INFO] 
09:56:30 [2020-09-22T13:56:30.990Z] [INFO] 
09:56:30 [2020-09-22T13:56:30.990Z] [INFO] --- maven-javadoc-plugin:2.9.1:javadoc (build-docs) @ org.eclipse.ease.lang.python.jython ---
09:56:30 [2020-09-22T13:56:30.990Z] [ERROR] Error fetching link: http://help.eclipse.org/oxygen/topic/org.eclipse.platform.doc.isv/reference/api/package-list. Ignored it.
09:56:32 [2020-09-22T13:56:32.356Z] [INFO] 
09:56:32 [2020-09-22T13:56:32.356Z] Loading source files for package org.eclipse.ease.lang.python.jython...
09:56:32 [2020-09-22T13:56:32.356Z] Loading source files for package org.eclipse.ease.lang.python.jython.debugger...
09:56:32 [2020-09-22T13:56:32.356Z] Loading source files for package org.eclipse.ease.lang.python.jython.preferences...
09:56:32 [2020-09-22T13:56:32.356Z] Constructing Javadoc information...
09:56:32 [2020-09-22T13:56:32.356Z] WARNING: Cannot open location "/home/jenkins/agent/workspace/ease.verify.core.gerrit/plugins/org.eclipse.ease.lang.python.jython/target/javadoc-bundle-options/package-list"
09:56:32 [2020-09-22T13:56:32.356Z] [WARNING] Javadoc Warnings
09:56:32 [2020-09-22T13:56:32.356Z] [WARNING] Picked up JAVA_TOOL_OPTIONS: -Dmaven.ext.class.path="/home/jenkins/agent/workspace/ease.verify.core.gerrit@tmp/withMaven4d46e43a/pipeline-maven-spy.jar" -Dorg.jenkinsci.plugins.pipeline.maven.reportsFolder="/home/jenkins/agent/workspace/ease.verify.core.gerrit@tmp/withMaven4d46e43a"
09:56:32 [2020-09-22T13:56:32.356Z] [INFO] 
09:56:32 [2020-09-22T13:56:32.356Z] [INFO] --- build-helper-maven-plugin:1.9.1:add-resource (add_help) @ org.eclipse.ease.lang.python.jython ---
09:56:32 [2020-09-22T13:56:32.356Z] [INFO] 
09:56:32 [2020-09-22T13:56:32.356Z] [INFO] --- maven-resources-plugin:2.4.3:resources (default-resources) @ org.eclipse.ease.lang.python.jython ---
09:56:32 [2020-09-22T13:56:32.356Z] [INFO] Using 'UTF-8' encoding to copy filtered resources.
09:56:32 [2020-09-22T13:56:32.356Z] [INFO] skip non existing resourceDirectory /home/jenkins/agent/workspace/ease.verify.core.gerrit/plugins/org.eclipse.ease.lang.python.jython/src/main/resources
09:56:32 [2020-09-22T13:56:32.356Z] [INFO] Copying 2 resources to help
09:56:32 [2020-09-22T13:56:32.356Z] [INFO] 
09:56:32 [2020-09-22T13:56:32.356Z] [INFO] --- tycho-compiler-plugin:1.3.0:compile (default-compile) @ org.eclipse.ease.lang.python.jython ---
09:56:32 [2020-09-22T13:56:32.356Z] [INFO] Compiling 10 source files to /home/jenkins/agent/workspace/ease.verify.core.gerrit/plugins/org.eclipse.ease.lang.python.jython/target/classes
09:56:32 [2020-09-22T13:56:32.356Z] [INFO] 
09:56:32 [2020-09-22T13:56:32.356Z] [INFO] --- maven-resources-plugin:2.4.3:testResources (default-testResources) @ org.eclipse.ease.lang.python.jython ---
09:56:32 [2020-09-22T13:56:32.356Z] [INFO] Using 'UTF-8' encoding to copy filtered resources.
09:56:32 [2020-09-22T13:56:32.356Z] [INFO] skip non existing resourceDirectory /home/jenkins/agent/workspace/ease.verify.core.gerrit/plugins/org.eclipse.ease.lang.python.jython/src/test/resources
09:56:32 [2020-09-22T13:56:32.356Z] [INFO] 
09:56:32 [2020-09-22T13:56:32.356Z] [INFO] --- tycho-source-plugin:1.3.0:plugin-source (plugin-source) @ org.eclipse.ease.lang.python.jython ---
09:56:32 [2020-09-22T13:56:32.357Z] [WARNING] Bundle-Vendor header not found in /home/jenkins/agent/workspace/ease.verify.core.gerrit/plugins/org.eclipse.ease.lang.python.jython/META-INF/MANIFEST.MF, fallback to 'unknown' for source bundle
09:56:32 [2020-09-22T13:56:32.357Z] [INFO] Building jar: /home/jenkins/agent/workspace/ease.verify.core.gerrit/plugins/org.eclipse.ease.lang.python.jython/target/org.eclipse.ease.lang.python.jython-0.8.0-SNAPSHOT-sources.jar
09:56:32 [2020-09-22T13:56:32.357Z] [INFO] 
09:56:32 [2020-09-22T13:56:32.357Z] [INFO] --- target-platform-configuration:1.3.0:target-platform (default-target-platform) @ org.eclipse.ease.lang.python.jython ---
09:56:32 [2020-09-22T13:56:32.357Z] [INFO] 
09:56:32 [2020-09-22T13:56:32.357Z] [INFO] --- tycho-packaging-plugin:1.3.0:package-plugin (default-package-plugin) @ org.eclipse.ease.lang.python.jython ---
09:56:32 [2020-09-22T13:56:32.357Z] [INFO] Building jar: /home/jenkins/agent/workspace/ease.verify.core.gerrit/plugins/org.eclipse.ease.lang.python.jython/target/org.eclipse.ease.lang.python.jython-0.8.0-SNAPSHOT.jar
09:56:32 [2020-09-22T13:56:32.357Z] [INFO] 
09:56:32 [2020-09-22T13:56:32.357Z] [INFO] --- tycho-p2-plugin:1.3.0:p2-metadata-default (default-p2-metadata-default) @ org.eclipse.ease.lang.python.jython ---
09:56:32 [2020-09-22T13:56:32.357Z] [INFO] 
09:56:32 [2020-09-22T13:56:32.357Z] [INFO] --- tycho-source-feature-plugin:1.3.0:source-feature (source-feature) @ org.eclipse.ease.lang.python.jython ---
09:56:32 [2020-09-22T13:56:32.357Z] [INFO] 
09:56:32 [2020-09-22T13:56:32.357Z] [INFO] --- tycho-p2-plugin:1.3.0:p2-metadata (attached-p2-metadata) @ org.eclipse.ease.lang.python.jython ---
09:56:32 [2020-09-22T13:56:32.357Z] [INFO] 
09:56:32 [2020-09-22T13:56:32.357Z] [INFO] --------< org.eclipse.ease:org.eclipse.ease.lang.javascript.ui >--------
09:56:32 [2020-09-22T13:56:32.357Z] [INFO] Building org.eclipse.ease.lang.javascript.ui 0.8.0-SNAPSHOT      [20/49]
09:56:32 [2020-09-22T13:56:32.357Z] [INFO] ---------------------------[ eclipse-plugin ]---------------------------
09:56:32 [2020-09-22T13:56:32.357Z] [INFO] 
09:56:32 [2020-09-22T13:56:32.357Z] [INFO] --- maven-clean-plugin:2.5:clean (default-clean) @ org.eclipse.ease.lang.javascript.ui ---
09:56:32 [2020-09-22T13:56:32.357Z] [INFO] 
09:56:32 [2020-09-22T13:56:32.357Z] [INFO] --- tycho-packaging-plugin:1.3.0:build-qualifier (default-build-qualifier) @ org.eclipse.ease.lang.javascript.ui ---
09:56:32 [2020-09-22T13:56:32.357Z] [INFO] The project's OSGi version is 0.8.0.I201910171213
09:56:32 [2020-09-22T13:56:32.357Z] [INFO] 
09:56:32 [2020-09-22T13:56:32.357Z] [INFO] --- tycho-packaging-plugin:1.3.0:validate-id (default-validate-id) @ org.eclipse.ease.lang.javascript.ui ---
09:56:32 [2020-09-22T13:56:32.357Z] [INFO] 
09:56:32 [2020-09-22T13:56:32.357Z] [INFO] --- tycho-packaging-plugin:1.3.0:validate-version (default-validate-version) @ org.eclipse.ease.lang.javascript.ui ---
09:56:32 [2020-09-22T13:56:32.357Z] [INFO] 
09:56:32 [2020-09-22T13:56:32.357Z] [INFO] >>> maven-javadoc-plugin:2.9.1:javadoc (build-docs) > generate-sources @ org.eclipse.ease.lang.javascript.ui >>>
09:56:32 [2020-09-22T13:56:32.357Z] [INFO] 
09:56:32 [2020-09-22T13:56:32.357Z] [INFO] --- tycho-packaging-plugin:1.3.0:build-qualifier (default-build-qualifier) @ org.eclipse.ease.lang.javascript.ui ---
09:56:32 [2020-09-22T13:56:32.357Z] [INFO] The project's OSGi version is 0.8.0.I201910171213
09:56:32 [2020-09-22T13:56:32.357Z] [INFO] 
09:56:32 [2020-09-22T13:56:32.357Z] [INFO] --- tycho-packaging-plugin:1.3.0:validate-id (default-validate-id) @ org.eclipse.ease.lang.javascript.ui ---
09:56:32 [2020-09-22T13:56:32.357Z] [INFO] 
09:56:32 [2020-09-22T13:56:32.357Z] [INFO] --- tycho-packaging-plugin:1.3.0:validate-version (default-validate-version) @ org.eclipse.ease.lang.javascript.ui ---
09:56:32 [2020-09-22T13:56:32.357Z] [INFO] 
09:56:32 [2020-09-22T13:56:32.357Z] [INFO] <<< maven-javadoc-plugin:2.9.1:javadoc (build-docs) < generate-sources @ org.eclipse.ease.lang.javascript.ui <<<
09:56:32 [2020-09-22T13:56:32.357Z] [INFO] 
09:56:32 [2020-09-22T13:56:32.357Z] [INFO] 
09:56:32 [2020-09-22T13:56:32.357Z] [INFO] --- maven-javadoc-plugin:2.9.1:javadoc (build-docs) @ org.eclipse.ease.lang.javascript.ui ---
09:56:32 [2020-09-22T13:56:32.613Z] [ERROR] Error fetching link: http://help.eclipse.org/oxygen/topic/org.eclipse.platform.doc.isv/reference/api/package-list. Ignored it.
09:56:33 [2020-09-22T13:56:33.567Z] [INFO] 
09:56:33 [2020-09-22T13:56:33.567Z] Loading source files for package org.eclipse.ease.lang.javascript.ui...
09:56:33 [2020-09-22T13:56:33.567Z] Loading source files for package org.eclipse.ease.lang.javascript.ui.completion...
09:56:33 [2020-09-22T13:56:33.567Z] Constructing Javadoc information...
09:56:33 [2020-09-22T13:56:33.567Z] WARNING: Cannot open location "/home/jenkins/agent/workspace/ease.verify.core.gerrit/plugins/org.eclipse.ease.lang.javascript.ui/target/javadoc-bundle-options/package-list"
09:56:33 [2020-09-22T13:56:33.567Z] [WARNING] Javadoc Warnings
09:56:33 [2020-09-22T13:56:33.567Z] [WARNING] Picked up JAVA_TOOL_OPTIONS: -Dmaven.ext.class.path="/home/jenkins/agent/workspace/ease.verify.core.gerrit@tmp/withMaven4d46e43a/pipeline-maven-spy.jar" -Dorg.jenkinsci.plugins.pipeline.maven.reportsFolder="/home/jenkins/agent/workspace/ease.verify.core.gerrit@tmp/withMaven4d46e43a"
09:56:33 [2020-09-22T13:56:33.567Z] [INFO] 
09:56:33 [2020-09-22T13:56:33.567Z] [INFO] --- build-helper-maven-plugin:1.9.1:add-resource (add_help) @ org.eclipse.ease.lang.javascript.ui ---
09:56:33 [2020-09-22T13:56:33.567Z] [INFO] 
09:56:33 [2020-09-22T13:56:33.568Z] [INFO] --- maven-resources-plugin:2.4.3:resources (default-resources) @ org.eclipse.ease.lang.javascript.ui ---
09:56:33 [2020-09-22T13:56:33.568Z] [INFO] Using 'UTF-8' encoding to copy filtered resources.
09:56:33 [2020-09-22T13:56:33.568Z] [INFO] skip non existing resourceDirectory /home/jenkins/agent/workspace/ease.verify.core.gerrit/plugins/org.eclipse.ease.lang.javascript.ui/src/main/resources
09:56:33 [2020-09-22T13:56:33.568Z] [INFO] skip non existing resourceDirectory /home/jenkins/agent/workspace/ease.verify.core.gerrit/plugins/org.eclipse.ease.lang.javascript.ui/help
09:56:33 [2020-09-22T13:56:33.568Z] [INFO] 
09:56:33 [2020-09-22T13:56:33.568Z] [INFO] --- tycho-compiler-plugin:1.3.0:compile (default-compile) @ org.eclipse.ease.lang.javascript.ui ---
09:56:33 [2020-09-22T13:56:33.568Z] [INFO] Compiling 5 source files to /home/jenkins/agent/workspace/ease.verify.core.gerrit/plugins/org.eclipse.ease.lang.javascript.ui/target/classes
09:56:33 [2020-09-22T13:56:33.824Z] [INFO] 
09:56:33 [2020-09-22T13:56:33.824Z] [INFO] --- maven-resources-plugin:2.4.3:testResources (default-testResources) @ org.eclipse.ease.lang.javascript.ui ---
09:56:33 [2020-09-22T13:56:33.824Z] [INFO] Using 'UTF-8' encoding to copy filtered resources.
09:56:33 [2020-09-22T13:56:33.824Z] [INFO] skip non existing resourceDirectory /home/jenkins/agent/workspace/ease.verify.core.gerrit/plugins/org.eclipse.ease.lang.javascript.ui/src/test/resources
09:56:33 [2020-09-22T13:56:33.824Z] [INFO] 
09:56:33 [2020-09-22T13:56:33.824Z] [INFO] --- tycho-source-plugin:1.3.0:plugin-source (plugin-source) @ org.eclipse.ease.lang.javascript.ui ---
09:56:33 [2020-09-22T13:56:33.824Z] [INFO] Building jar: /home/jenkins/agent/workspace/ease.verify.core.gerrit/plugins/org.eclipse.ease.lang.javascript.ui/target/org.eclipse.ease.lang.javascript.ui-0.8.0-SNAPSHOT-sources.jar
09:56:33 [2020-09-22T13:56:33.824Z] [INFO] 
09:56:33 [2020-09-22T13:56:33.824Z] [INFO] --- target-platform-configuration:1.3.0:target-platform (default-target-platform) @ org.eclipse.ease.lang.javascript.ui ---
09:56:33 [2020-09-22T13:56:33.824Z] [INFO] 
09:56:33 [2020-09-22T13:56:33.824Z] [INFO] --- tycho-packaging-plugin:1.3.0:package-plugin (default-package-plugin) @ org.eclipse.ease.lang.javascript.ui ---
09:56:33 [2020-09-22T13:56:33.824Z] [INFO] Building jar: /home/jenkins/agent/workspace/ease.verify.core.gerrit/plugins/org.eclipse.ease.lang.javascript.ui/target/org.eclipse.ease.lang.javascript.ui-0.8.0-SNAPSHOT.jar
09:56:33 [2020-09-22T13:56:33.824Z] [INFO] 
09:56:33 [2020-09-22T13:56:33.824Z] [INFO] --- tycho-p2-plugin:1.3.0:p2-metadata-default (default-p2-metadata-default) @ org.eclipse.ease.lang.javascript.ui ---
09:56:33 [2020-09-22T13:56:33.824Z] [INFO] 
09:56:33 [2020-09-22T13:56:33.824Z] [INFO] --- tycho-source-feature-plugin:1.3.0:source-feature (source-feature) @ org.eclipse.ease.lang.javascript.ui ---
09:56:33 [2020-09-22T13:56:33.824Z] [INFO] 
09:56:33 [2020-09-22T13:56:33.824Z] [INFO] --- tycho-p2-plugin:1.3.0:p2-metadata (attached-p2-metadata) @ org.eclipse.ease.lang.javascript.ui ---
09:56:33 [2020-09-22T13:56:33.824Z] [INFO] 
09:56:33 [2020-09-22T13:56:33.824Z] [INFO] --------< org.eclipse.ease:org.eclipse.ease.lang.jvm.compiled >---------
09:56:33 [2020-09-22T13:56:33.824Z] [INFO] Building org.eclipse.ease.lang.jvm.compiled 0.8.0-SNAPSHOT       [21/49]
09:56:33 [2020-09-22T13:56:33.824Z] [INFO] ---------------------------[ eclipse-plugin ]---------------------------
09:56:33 [2020-09-22T13:56:33.824Z] [INFO] 
09:56:33 [2020-09-22T13:56:33.824Z] [INFO] --- maven-clean-plugin:2.5:clean (default-clean) @ org.eclipse.ease.lang.jvm.compiled ---
09:56:33 [2020-09-22T13:56:33.824Z] [INFO] 
09:56:33 [2020-09-22T13:56:33.824Z] [INFO] --- tycho-packaging-plugin:1.3.0:build-qualifier (default-build-qualifier) @ org.eclipse.ease.lang.jvm.compiled ---
09:56:33 [2020-09-22T13:56:33.824Z] [INFO] The project's OSGi version is 0.8.0.I201910171213
09:56:33 [2020-09-22T13:56:33.824Z] [INFO] 
09:56:33 [2020-09-22T13:56:33.824Z] [INFO] --- tycho-packaging-plugin:1.3.0:validate-id (default-validate-id) @ org.eclipse.ease.lang.jvm.compiled ---
09:56:33 [2020-09-22T13:56:33.824Z] [INFO] 
09:56:33 [2020-09-22T13:56:33.825Z] [INFO] --- tycho-packaging-plugin:1.3.0:validate-version (default-validate-version) @ org.eclipse.ease.lang.jvm.compiled ---
09:56:33 [2020-09-22T13:56:33.825Z] [INFO] 
09:56:33 [2020-09-22T13:56:33.825Z] [INFO] >>> maven-javadoc-plugin:2.9.1:javadoc (build-docs) > generate-sources @ org.eclipse.ease.lang.jvm.compiled >>>
09:56:33 [2020-09-22T13:56:33.825Z] [INFO] 
09:56:33 [2020-09-22T13:56:33.825Z] [INFO] --- tycho-packaging-plugin:1.3.0:build-qualifier (default-build-qualifier) @ org.eclipse.ease.lang.jvm.compiled ---
09:56:33 [2020-09-22T13:56:33.825Z] [INFO] The project's OSGi version is 0.8.0.I201910171213
09:56:33 [2020-09-22T13:56:33.825Z] [INFO] 
09:56:33 [2020-09-22T13:56:33.825Z] [INFO] --- tycho-packaging-plugin:1.3.0:validate-id (default-validate-id) @ org.eclipse.ease.lang.jvm.compiled ---
09:56:33 [2020-09-22T13:56:33.825Z] [INFO] 
09:56:33 [2020-09-22T13:56:33.825Z] [INFO] --- tycho-packaging-plugin:1.3.0:validate-version (default-validate-version) @ org.eclipse.ease.lang.jvm.compiled ---
09:56:33 [2020-09-22T13:56:33.825Z] [INFO] 
09:56:33 [2020-09-22T13:56:33.825Z] [INFO] <<< maven-javadoc-plugin:2.9.1:javadoc (build-docs) < generate-sources @ org.eclipse.ease.lang.jvm.compiled <<<
09:56:33 [2020-09-22T13:56:33.825Z] [INFO] 
09:56:33 [2020-09-22T13:56:33.825Z] [INFO] 
09:56:33 [2020-09-22T13:56:33.825Z] [INFO] --- maven-javadoc-plugin:2.9.1:javadoc (build-docs) @ org.eclipse.ease.lang.jvm.compiled ---
09:56:34 [2020-09-22T13:56:34.081Z] [ERROR] Error fetching link: http://help.eclipse.org/oxygen/topic/org.eclipse.platform.doc.isv/reference/api/package-list. Ignored it.
09:56:34 [2020-09-22T13:56:34.642Z] [INFO] 
09:56:34 [2020-09-22T13:56:34.642Z] Loading source files for package org.eclipse.ease.lang.jvm.compiled...
09:56:34 [2020-09-22T13:56:34.642Z] Constructing Javadoc information...
09:56:34 [2020-09-22T13:56:34.642Z] 1 error
09:56:34 [2020-09-22T13:56:34.642Z] [INFO] ------------------------------------------------------------------------
09:56:34 [2020-09-22T13:56:34.642Z] [INFO] Reactor Summary:
09:56:34 [2020-09-22T13:56:34.642Z] [INFO] 
09:56:34 [2020-09-22T13:56:34.642Z] [INFO] org.eclipse.ease.releng 0.8.0-SNAPSHOT ............. SUCCESS [  5.157 s]
09:56:34 [2020-09-22T13:56:34.642Z] [INFO] org.eclipse.ease.classloader 0.8.0-SNAPSHOT ........ SUCCESS [  4.335 s]
09:56:34 [2020-09-22T13:56:34.642Z] [INFO] org.eclipse.ease 0.8.0-SNAPSHOT .................... SUCCESS [  2.497 s]
09:56:34 [2020-09-22T13:56:34.642Z] [INFO] org.eclipse.ease.ui 0.8.0-SNAPSHOT ................. SUCCESS [  2.494 s]
09:56:34 [2020-09-22T13:56:34.642Z] [INFO] org.eclipse.ease.ui.completions.java 0.8.0-SNAPSHOT  SUCCESS [  1.665 s]
09:56:34 [2020-09-22T13:56:34.642Z] [INFO] org.eclipse.ease.ui.scripts 0.8.0-SNAPSHOT ......... SUCCESS [  7.299 s]
09:56:34 [2020-09-22T13:56:34.642Z] [INFO] org.eclipse.ease.lang.javascript 0.8.0-SNAPSHOT .... SUCCESS [  1.499 s]
09:56:34 [2020-09-22T13:56:34.642Z] [INFO] org.eclipse.ease.lang.scriptarchive 0.8.0-SNAPSHOT . SUCCESS [  1.439 s]
09:56:34 [2020-09-22T13:56:34.642Z] [INFO] org.eclipse.ease.lang.python 0.8.0-SNAPSHOT ........ SUCCESS [  1.524 s]
09:56:34 [2020-09-22T13:56:34.642Z] [INFO] org.eclipse.ease.lang.python.py4j 0.8.0-SNAPSHOT ... SUCCESS [  1.497 s]
09:56:34 [2020-09-22T13:56:34.642Z] [INFO] org.eclipse.ease.lang.groovy 0.8.0-SNAPSHOT ........ SUCCESS [  1.296 s]
09:56:34 [2020-09-22T13:56:34.642Z] [INFO] org.eclipse.ease.lang.groovy.interpreter 0.8.0-SNAPSHOT SUCCESS [  1.264 s]
09:56:34 [2020-09-22T13:56:34.642Z] [INFO] org.eclipse.ease.lang.unittest 0.8.0-SNAPSHOT ...... SUCCESS [  1.732 s]
09:56:34 [2020-09-22T13:56:34.642Z] [INFO] org.eclipse.ease.lang.unittest.ui 0.8.0-SNAPSHOT ... SUCCESS [  1.829 s]
09:56:34 [2020-09-22T13:56:34.642Z] [INFO] org.eclipse.ease.lang.ruby 0.8.0-SNAPSHOT .......... SUCCESS [  1.369 s]
09:56:34 [2020-09-22T13:56:34.642Z] [INFO] org.eclipse.ease.lang.ruby.jruby 0.8.0-SNAPSHOT .... SUCCESS [  1.347 s]
09:56:34 [2020-09-22T13:56:34.642Z] [INFO] org.eclipse.ease.lang.javascript.nashorn 0.8.0-SNAPSHOT SUCCESS [  1.340 s]
09:56:34 [2020-09-22T13:56:34.642Z] [INFO] org.eclipse.ease.lang.javascript.rhino 0.8.0-SNAPSHOT SUCCESS [  1.525 s]
09:56:34 [2020-09-22T13:56:34.642Z] [INFO] org.eclipse.ease.lang.python.jython 0.8.0-SNAPSHOT . SUCCESS [  1.561 s]
09:56:34 [2020-09-22T13:56:34.642Z] [INFO] org.eclipse.ease.lang.javascript.ui 0.8.0-SNAPSHOT . SUCCESS [  1.405 s]
09:56:34 [2020-09-22T13:56:34.642Z] [INFO] org.eclipse.ease.lang.jvm.compiled 0.8.0-SNAPSHOT .. FAILURE [  0.890 s]
09:56:34 [2020-09-22T13:56:34.642Z] [INFO] org.eclipse.ease.lang.scriptarchive.ui 0.8.0-SNAPSHOT SKIPPED
09:56:34 [2020-09-22T13:56:34.642Z] [INFO] org.eclipse.ease.help 0.8.0-SNAPSHOT ............... SKIPPED
09:56:34 [2020-09-22T13:56:34.642Z] [INFO] org.eclipse.ease.feature 0.8.0-SNAPSHOT ............ SKIPPED
09:56:34 [2020-09-22T13:56:34.642Z] [INFO] org.eclipse.ease.ui.feature 0.8.0-SNAPSHOT ......... SKIPPED
09:56:34 [2020-09-22T13:56:34.642Z] [INFO] org.eclipse.ease.lang.javascript.feature 0.8.0-SNAPSHOT SKIPPED
09:56:34 [2020-09-22T13:56:34.642Z] [INFO] org.eclipse.ease.lang.python.feature 0.8.0-SNAPSHOT  SKIPPED
09:56:34 [2020-09-22T13:56:34.642Z] [INFO] org.eclipse.ease.python.jython.feature 0.8.0-SNAPSHOT SKIPPED
09:56:34 [2020-09-22T13:56:34.642Z] [INFO] org.eclipse.ease.lang.python.py4j.feature 0.8.0-SNAPSHOT SKIPPED
09:56:34 [2020-09-22T13:56:34.642Z] [INFO] org.eclipse.ease.lang.jvm.feature 0.8.0-SNAPSHOT ... SKIPPED
09:56:34 [2020-09-22T13:56:34.642Z] [INFO] org.eclipse.ease.lang.groovy.feature 0.8.0-SNAPSHOT  SKIPPED
09:56:34 [2020-09-22T13:56:34.642Z] [INFO] org.eclipse.ease.lang.ruby.feature 0.8.0-SNAPSHOT .. SKIPPED
09:56:34 [2020-09-22T13:56:34.642Z] [INFO] org.eclipse.ease.lang.scriptarchive.feature 0.8.0-SNAPSHOT SKIPPED
09:56:34 [2020-09-22T13:56:34.642Z] [INFO] org.eclipse.ease.lang.unittest.feature 0.8.0-SNAPSHOT SKIPPED
09:56:34 [2020-09-22T13:56:34.642Z] [INFO] org.eclipse.ease.releng.target 0.8.0-SNAPSHOT ...... SKIPPED
09:56:34 [2020-09-22T13:56:34.642Z] [INFO] org.eclipse.ease.releng.p2 0.8.0-SNAPSHOT .......... SKIPPED
09:56:34 [2020-09-22T13:56:34.642Z] [INFO] org.eclipse.ease.testhelper 0.8.0-SNAPSHOT ......... SKIPPED
09:56:34 [2020-09-22T13:56:34.642Z] [INFO] org.eclipse.ease.test 0.8.0-SNAPSHOT ............... SKIPPED
09:56:34 [2020-09-22T13:56:34.642Z] [INFO] org.eclipse.ease.lang.javascript.nashorn.test 0.8.0-SNAPSHOT SKIPPED
09:56:34 [2020-09-22T13:56:34.642Z] [INFO] org.eclipse.ease.lang.javascript.rhino.test 0.8.0-SNAPSHOT SKIPPED
09:56:34 [2020-09-22T13:56:34.642Z] [INFO] org.eclipse.ease.lang.javascript.test 0.8.0-SNAPSHOT SKIPPED
09:56:34 [2020-09-22T13:56:34.642Z] [INFO] org.eclipse.ease.lang.python.test 0.8.0-SNAPSHOT ... SKIPPED
09:56:34 [2020-09-22T13:56:34.642Z] [INFO] org.eclipse.ease.lang.python.jython.test 0.8.0-SNAPSHOT SKIPPED
09:56:34 [2020-09-22T13:56:34.642Z] [INFO] org.eclipse.ease.lang.python.py4j.test 0.8.0-SNAPSHOT SKIPPED
09:56:34 [2020-09-22T13:56:34.642Z] [INFO] org.eclipse.ease.lang.scriptarchive.test 0.8.0-SNAPSHOT SKIPPED
09:56:34 [2020-09-22T13:56:34.642Z] [INFO] org.eclipse.ease.lang.unittest.test 0.8.0-SNAPSHOT . SKIPPED
09:56:34 [2020-09-22T13:56:34.642Z] [INFO] org.eclipse.ease.ui.scripts.test 0.8.0-SNAPSHOT .... SKIPPED
09:56:34 [2020-09-22T13:56:34.642Z] [INFO] org.eclipse.ease.ui.test 0.8.0-SNAPSHOT ............ SKIPPED
09:56:34 [2020-09-22T13:56:34.642Z] [INFO] EASE (Incubation) 0.4.0-SNAPSHOT ................... SKIPPED
09:56:34 [2020-09-22T13:56:34.642Z] [INFO] ------------------------------------------------------------------------
09:56:34 [2020-09-22T13:56:34.642Z] [INFO] BUILD FAILURE
09:56:34 [2020-09-22T13:56:34.642Z] [INFO] ------------------------------------------------------------------------
09:56:34 [2020-09-22T13:56:34.642Z] [INFO] Total time:  03:04 min
09:56:34 [2020-09-22T13:56:34.642Z] [INFO] Finished at: 2020-09-22T13:56:34Z
09:56:34 [2020-09-22T13:56:34.643Z] [INFO] ------------------------------------------------------------------------
09:56:34 [2020-09-22T13:56:34.643Z] [INFO] [jenkins-event-spy] Generated /home/jenkins/agent/workspace/ease.verify.core.gerrit@tmp/withMaven4d46e43a/maven-spy-20200922-135329-9088512990901062864468.log
09:56:34 [2020-09-22T13:56:34.643Z] [ERROR] Failed to execute goal org.apache.maven.plugins:maven-javadoc-plugin:2.9.1:javadoc (build-docs) on project org.eclipse.ease.lang.jvm.compiled: An error has occurred in JavaDocs report generation: 
09:56:34 [2020-09-22T13:56:34.643Z] [ERROR] Exit code: 1 - Picked up JAVA_TOOL_OPTIONS: -Dmaven.ext.class.path="/home/jenkins/agent/workspace/ease.verify.core.gerrit@tmp/withMaven4d46e43a/pipeline-maven-spy.jar" -Dorg.jenkinsci.plugins.pipeline.maven.reportsFolder="/home/jenkins/agent/workspace/ease.verify.core.gerrit@tmp/withMaven4d46e43a" 
09:56:34 [2020-09-22T13:56:34.643Z] [ERROR] /home/jenkins/agent/workspace/ease.verify.core.gerrit/plugins/org.eclipse.ease.lang.jvm.compiled/src/org/eclipse/ease/lang/jvm/compiled/JVMCompiledScriptEngine.java:48: error: cannot access IBundleProjectDescription
09:56:34 [2020-09-22T13:56:34.643Z] [ERROR] import org.eclipse.pde.core.project.IBundleProjectDescription;
09:56:34 [2020-09-22T13:56:34.643Z] [ERROR]                                    ^
09:56:34 [2020-09-22T13:56:34.643Z] [ERROR]   bad class file: /home/jenkins/.m2/repository/p2/osgi/bundle/org.eclipse.pde.core/3.14.0.v20200817-1143/org.eclipse.pde.core-3.14.0.v20200817-1143.jar(org/eclipse/pde/core/project/IBundleProjectDescription.class)
09:56:34 [2020-09-22T13:56:34.643Z] [ERROR]     class file has wrong version 55.0, should be 52.0
09:56:34 [2020-09-22T13:56:34.643Z] [ERROR]     Please remove or make sure it appears in the correct subdirectory of the classpath.
09:56:34 [2020-09-22T13:56:34.643Z] [ERROR] 
09:56:34 [2020-09-22T13:56:34.643Z] [ERROR] Command line was: /opt/tools/java/oracle/jdk-8/1.8.0_202/jre/../bin/javadoc @options @packages
09:56:34 [2020-09-22T13:56:34.643Z] [ERROR] 
09:56:34 [2020-09-22T13:56:34.643Z] [ERROR] Refer to the generated Javadoc files in '/home/jenkins/agent/workspace/ease.verify.core.gerrit/plugins/org.eclipse.ease.lang.jvm.compiled/target/site/apidocs' dir.
09:56:34 [2020-09-22T13:56:34.643Z] [ERROR] -> [Help 1]
09:56:34 [2020-09-22T13:56:34.643Z] [ERROR] 
09:56:34 [2020-09-22T13:56:34.643Z] [ERROR] To see the full stack trace of the errors, re-run Maven with the -e switch.
09:56:34 [2020-09-22T13:56:34.643Z] [ERROR] Re-run Maven using the -X switch to enable full debug logging.
09:56:34 [2020-09-22T13:56:34.643Z] [ERROR] 
09:56:34 [2020-09-22T13:56:34.643Z] [ERROR] For more information about the errors and possible solutions, please read the following articles:
09:56:34 [2020-09-22T13:56:34.643Z] [ERROR] [Help 1] http://cwiki.apache.org/confluence/display/MAVEN/MojoExecutionException
09:56:34 [2020-09-22T13:56:34.643Z] [ERROR] 
09:56:34 [2020-09-22T13:56:34.643Z] [ERROR] After correcting the problems, you can resume the build with the command
09:56:34 [2020-09-22T13:56:34.643Z] [ERROR]   mvn <args> -rf :org.eclipse.ease.lang.jvm.compiled
[Pipeline] }
09:56:36 [2020-09-22T13:56:36.437Z] [withMaven] Publishers: Pipeline Graph Publisher: 11 ms, Dependencies Fingerprint Publisher: 337 ms
[Pipeline] // withMaven
[Pipeline] }
[Pipeline] // stage
[Pipeline] }
09:56:36 [2020-09-22T13:56:36.495Z] Failed in branch EASE Core
[Pipeline] // parallel
[Pipeline] }
[Pipeline] // stage
[Pipeline] stage
[Pipeline] { (Declarative: Post Actions)
[Pipeline] archiveArtifacts
09:56:36 [2020-09-22T13:56:36.598Z] Archiving artifacts
[Pipeline] emailext
09:56:42 [2020-09-22T13:56:42.462Z] Sending email to: christian.pontesegger@web.de
[Pipeline] }
[Pipeline] // stage
[Pipeline] }
[Pipeline] // timeout
[Pipeline] }
[Pipeline] // timestamps
[Pipeline] }
[Pipeline] // node
[Pipeline] End of Pipeline
ERROR: script returned exit code 1
Finished: FAILURE