FailedConsole Output

Skipping 564 KB.. Full Log
se.ease.lang.scriptarchive/target/classes
09:14:30 [2020-09-22T13:14:30.552Z] [INFO] 
09:14:30 [2020-09-22T13:14:30.552Z] [INFO] --- maven-resources-plugin:2.4.3:testResources (default-testResources) @ org.eclipse.ease.lang.scriptarchive ---
09:14:30 [2020-09-22T13:14:30.552Z] [INFO] Using 'UTF-8' encoding to copy filtered resources.
09:14:30 [2020-09-22T13:14:30.552Z] [INFO] skip non existing resourceDirectory /home/jenkins/agent/workspace/ease.verify.core.gerrit/plugins/org.eclipse.ease.lang.scriptarchive/src/test/resources
09:14:30 [2020-09-22T13:14:30.552Z] [INFO] 
09:14:30 [2020-09-22T13:14:30.552Z] [INFO] --- tycho-source-plugin:1.3.0:plugin-source (plugin-source) @ org.eclipse.ease.lang.scriptarchive ---
09:14:30 [2020-09-22T13:14:30.552Z] [INFO] Building jar: /home/jenkins/agent/workspace/ease.verify.core.gerrit/plugins/org.eclipse.ease.lang.scriptarchive/target/org.eclipse.ease.lang.scriptarchive-0.8.0-SNAPSHOT-sources.jar
09:14:30 [2020-09-22T13:14:30.552Z] [INFO] 
09:14:30 [2020-09-22T13:14:30.552Z] [INFO] --- target-platform-configuration:1.3.0:target-platform (default-target-platform) @ org.eclipse.ease.lang.scriptarchive ---
09:14:30 [2020-09-22T13:14:30.552Z] [INFO] 
09:14:30 [2020-09-22T13:14:30.552Z] [INFO] --- tycho-packaging-plugin:1.3.0:package-plugin (default-package-plugin) @ org.eclipse.ease.lang.scriptarchive ---
09:14:30 [2020-09-22T13:14:30.552Z] [INFO] Building jar: /home/jenkins/agent/workspace/ease.verify.core.gerrit/plugins/org.eclipse.ease.lang.scriptarchive/target/org.eclipse.ease.lang.scriptarchive-0.8.0-SNAPSHOT.jar
09:14:30 [2020-09-22T13:14:30.552Z] [INFO] 
09:14:30 [2020-09-22T13:14:30.552Z] [INFO] --- tycho-p2-plugin:1.3.0:p2-metadata-default (default-p2-metadata-default) @ org.eclipse.ease.lang.scriptarchive ---
09:14:30 [2020-09-22T13:14:30.552Z] [INFO] 
09:14:30 [2020-09-22T13:14:30.552Z] [INFO] --- tycho-source-feature-plugin:1.3.0:source-feature (source-feature) @ org.eclipse.ease.lang.scriptarchive ---
09:14:30 [2020-09-22T13:14:30.552Z] [INFO] 
09:14:30 [2020-09-22T13:14:30.552Z] [INFO] --- tycho-p2-plugin:1.3.0:p2-metadata (attached-p2-metadata) @ org.eclipse.ease.lang.scriptarchive ---
09:14:30 [2020-09-22T13:14:30.552Z] [INFO] 
09:14:30 [2020-09-22T13:14:30.552Z] [INFO] -----------< org.eclipse.ease:org.eclipse.ease.lang.python >------------
09:14:30 [2020-09-22T13:14:30.552Z] [INFO] Building org.eclipse.ease.lang.python 0.8.0-SNAPSHOT              [9/49]
09:14:30 [2020-09-22T13:14:30.552Z] [INFO] ---------------------------[ eclipse-plugin ]---------------------------
09:14:30 [2020-09-22T13:14:30.552Z] [INFO] 
09:14:30 [2020-09-22T13:14:30.552Z] [INFO] --- maven-clean-plugin:2.5:clean (default-clean) @ org.eclipse.ease.lang.python ---
09:14:30 [2020-09-22T13:14:30.552Z] [INFO] 
09:14:30 [2020-09-22T13:14:30.552Z] [INFO] --- tycho-packaging-plugin:1.3.0:build-qualifier (default-build-qualifier) @ org.eclipse.ease.lang.python ---
09:14:30 [2020-09-22T13:14:30.552Z] [INFO] The project's OSGi version is 0.8.0.I202006231119
09:14:30 [2020-09-22T13:14:30.552Z] [INFO] 
09:14:30 [2020-09-22T13:14:30.552Z] [INFO] --- tycho-packaging-plugin:1.3.0:validate-id (default-validate-id) @ org.eclipse.ease.lang.python ---
09:14:30 [2020-09-22T13:14:30.552Z] [INFO] 
09:14:30 [2020-09-22T13:14:30.552Z] [INFO] --- tycho-packaging-plugin:1.3.0:validate-version (default-validate-version) @ org.eclipse.ease.lang.python ---
09:14:30 [2020-09-22T13:14:30.552Z] [INFO] 
09:14:30 [2020-09-22T13:14:30.552Z] [INFO] >>> maven-javadoc-plugin:2.9.1:javadoc (build-docs) > generate-sources @ org.eclipse.ease.lang.python >>>
09:14:30 [2020-09-22T13:14:30.552Z] [INFO] 
09:14:30 [2020-09-22T13:14:30.552Z] [INFO] --- tycho-packaging-plugin:1.3.0:build-qualifier (default-build-qualifier) @ org.eclipse.ease.lang.python ---
09:14:30 [2020-09-22T13:14:30.552Z] [INFO] The project's OSGi version is 0.8.0.I202006231119
09:14:30 [2020-09-22T13:14:30.552Z] [INFO] 
09:14:30 [2020-09-22T13:14:30.552Z] [INFO] --- tycho-packaging-plugin:1.3.0:validate-id (default-validate-id) @ org.eclipse.ease.lang.python ---
09:14:30 [2020-09-22T13:14:30.552Z] [INFO] 
09:14:30 [2020-09-22T13:14:30.552Z] [INFO] --- tycho-packaging-plugin:1.3.0:validate-version (default-validate-version) @ org.eclipse.ease.lang.python ---
09:14:30 [2020-09-22T13:14:30.552Z] [INFO] 
09:14:30 [2020-09-22T13:14:30.552Z] [INFO] <<< maven-javadoc-plugin:2.9.1:javadoc (build-docs) < generate-sources @ org.eclipse.ease.lang.python <<<
09:14:30 [2020-09-22T13:14:30.552Z] [INFO] 
09:14:30 [2020-09-22T13:14:30.553Z] [INFO] 
09:14:30 [2020-09-22T13:14:30.553Z] [INFO] --- maven-javadoc-plugin:2.9.1:javadoc (build-docs) @ org.eclipse.ease.lang.python ---
09:14:30 [2020-09-22T13:14:30.809Z] [ERROR] Error fetching link: http://help.eclipse.org/oxygen/topic/org.eclipse.platform.doc.isv/reference/api/package-list. Ignored it.
09:14:31 [2020-09-22T13:14:31.737Z] [INFO] 
09:14:31 [2020-09-22T13:14:31.737Z] Loading source files for package org.eclipse.ease.lang.python...
09:14:31 [2020-09-22T13:14:31.737Z] Loading source files for package org.eclipse.ease.lang.python.debug...
09:14:31 [2020-09-22T13:14:31.737Z] Loading source files for package org.eclipse.ease.lang.python.debugger...
09:14:31 [2020-09-22T13:14:31.737Z] Loading source files for package org.eclipse.ease.lang.python.debugger.actions...
09:14:31 [2020-09-22T13:14:31.737Z] Loading source files for package org.eclipse.ease.lang.python.debugger.model...
09:14:31 [2020-09-22T13:14:31.737Z] Loading source files for package org.eclipse.ease.lang.python.preferences...
09:14:31 [2020-09-22T13:14:31.737Z] Loading source files for package org.eclipse.ease.lang.python.ui.completion...
09:14:31 [2020-09-22T13:14:31.737Z] Constructing Javadoc information...
09:14:31 [2020-09-22T13:14:31.738Z] WARNING: Cannot open location "/home/jenkins/agent/workspace/ease.verify.core.gerrit/plugins/org.eclipse.ease.lang.python/target/javadoc-bundle-options/package-list"
09:14:31 [2020-09-22T13:14:31.738Z] [WARNING] Javadoc Warnings
09:14:31 [2020-09-22T13:14:31.738Z] [WARNING] Picked up JAVA_TOOL_OPTIONS: -Dmaven.ext.class.path="/home/jenkins/agent/workspace/ease.verify.core.gerrit@tmp/withMavena810d3b2/pipeline-maven-spy.jar" -Dorg.jenkinsci.plugins.pipeline.maven.reportsFolder="/home/jenkins/agent/workspace/ease.verify.core.gerrit@tmp/withMavena810d3b2"
09:14:31 [2020-09-22T13:14:31.738Z] [INFO] 
09:14:31 [2020-09-22T13:14:31.738Z] [INFO] --- build-helper-maven-plugin:1.9.1:add-resource (add_help) @ org.eclipse.ease.lang.python ---
09:14:31 [2020-09-22T13:14:31.738Z] [INFO] 
09:14:31 [2020-09-22T13:14:31.738Z] [INFO] --- maven-resources-plugin:2.4.3:resources (default-resources) @ org.eclipse.ease.lang.python ---
09:14:31 [2020-09-22T13:14:31.738Z] [INFO] Using 'UTF-8' encoding to copy filtered resources.
09:14:31 [2020-09-22T13:14:31.738Z] [INFO] skip non existing resourceDirectory /home/jenkins/agent/workspace/ease.verify.core.gerrit/plugins/org.eclipse.ease.lang.python/src/main/resources
09:14:31 [2020-09-22T13:14:31.738Z] [INFO] skip non existing resourceDirectory /home/jenkins/agent/workspace/ease.verify.core.gerrit/plugins/org.eclipse.ease.lang.python/help
09:14:31 [2020-09-22T13:14:31.738Z] [INFO] 
09:14:31 [2020-09-22T13:14:31.738Z] [INFO] --- tycho-compiler-plugin:1.3.0:compile (default-compile) @ org.eclipse.ease.lang.python ---
09:14:31 [2020-09-22T13:14:31.738Z] [INFO] Compiling 24 source files to /home/jenkins/agent/workspace/ease.verify.core.gerrit/plugins/org.eclipse.ease.lang.python/target/classes
09:14:31 [2020-09-22T13:14:31.993Z] [INFO] 
09:14:31 [2020-09-22T13:14:31.993Z] [INFO] --- maven-resources-plugin:2.4.3:testResources (default-testResources) @ org.eclipse.ease.lang.python ---
09:14:31 [2020-09-22T13:14:31.993Z] [INFO] Using 'UTF-8' encoding to copy filtered resources.
09:14:31 [2020-09-22T13:14:31.993Z] [INFO] skip non existing resourceDirectory /home/jenkins/agent/workspace/ease.verify.core.gerrit/plugins/org.eclipse.ease.lang.python/src/test/resources
09:14:31 [2020-09-22T13:14:31.993Z] [INFO] 
09:14:31 [2020-09-22T13:14:31.993Z] [INFO] --- tycho-source-plugin:1.3.0:plugin-source (plugin-source) @ org.eclipse.ease.lang.python ---
09:14:31 [2020-09-22T13:14:31.993Z] [INFO] Building jar: /home/jenkins/agent/workspace/ease.verify.core.gerrit/plugins/org.eclipse.ease.lang.python/target/org.eclipse.ease.lang.python-0.8.0-SNAPSHOT-sources.jar
09:14:31 [2020-09-22T13:14:31.993Z] [INFO] 
09:14:31 [2020-09-22T13:14:31.993Z] [INFO] --- target-platform-configuration:1.3.0:target-platform (default-target-platform) @ org.eclipse.ease.lang.python ---
09:14:31 [2020-09-22T13:14:31.993Z] [INFO] 
09:14:31 [2020-09-22T13:14:31.993Z] [INFO] --- tycho-packaging-plugin:1.3.0:package-plugin (default-package-plugin) @ org.eclipse.ease.lang.python ---
09:14:31 [2020-09-22T13:14:31.993Z] [INFO] Building jar: /home/jenkins/agent/workspace/ease.verify.core.gerrit/plugins/org.eclipse.ease.lang.python/target/org.eclipse.ease.lang.python-0.8.0-SNAPSHOT.jar
09:14:31 [2020-09-22T13:14:31.993Z] [INFO] 
09:14:31 [2020-09-22T13:14:31.993Z] [INFO] --- tycho-p2-plugin:1.3.0:p2-metadata-default (default-p2-metadata-default) @ org.eclipse.ease.lang.python ---
09:14:31 [2020-09-22T13:14:31.993Z] [INFO] 
09:14:31 [2020-09-22T13:14:31.994Z] [INFO] --- tycho-source-feature-plugin:1.3.0:source-feature (source-feature) @ org.eclipse.ease.lang.python ---
09:14:31 [2020-09-22T13:14:31.994Z] [INFO] 
09:14:31 [2020-09-22T13:14:31.994Z] [INFO] --- tycho-p2-plugin:1.3.0:p2-metadata (attached-p2-metadata) @ org.eclipse.ease.lang.python ---
09:14:31 [2020-09-22T13:14:31.994Z] [INFO] 
09:14:31 [2020-09-22T13:14:31.994Z] [INFO] ---------< org.eclipse.ease:org.eclipse.ease.lang.python.py4j >---------
09:14:31 [2020-09-22T13:14:31.994Z] [INFO] Building org.eclipse.ease.lang.python.py4j 0.8.0-SNAPSHOT        [10/49]
09:14:31 [2020-09-22T13:14:31.994Z] [INFO] ---------------------------[ eclipse-plugin ]---------------------------
09:14:31 [2020-09-22T13:14:31.994Z] [INFO] 
09:14:31 [2020-09-22T13:14:31.994Z] [INFO] --- maven-clean-plugin:2.5:clean (default-clean) @ org.eclipse.ease.lang.python.py4j ---
09:14:31 [2020-09-22T13:14:31.994Z] [INFO] 
09:14:31 [2020-09-22T13:14:31.994Z] [INFO] --- tycho-packaging-plugin:1.3.0:build-qualifier (default-build-qualifier) @ org.eclipse.ease.lang.python.py4j ---
09:14:31 [2020-09-22T13:14:31.994Z] [INFO] The project's OSGi version is 0.8.0.I202008271105
09:14:31 [2020-09-22T13:14:31.994Z] [INFO] 
09:14:31 [2020-09-22T13:14:31.994Z] [INFO] --- tycho-packaging-plugin:1.3.0:validate-id (default-validate-id) @ org.eclipse.ease.lang.python.py4j ---
09:14:31 [2020-09-22T13:14:31.994Z] [INFO] 
09:14:31 [2020-09-22T13:14:31.994Z] [INFO] --- tycho-packaging-plugin:1.3.0:validate-version (default-validate-version) @ org.eclipse.ease.lang.python.py4j ---
09:14:31 [2020-09-22T13:14:31.994Z] [INFO] 
09:14:31 [2020-09-22T13:14:31.994Z] [INFO] >>> maven-javadoc-plugin:2.9.1:javadoc (build-docs) > generate-sources @ org.eclipse.ease.lang.python.py4j >>>
09:14:31 [2020-09-22T13:14:31.994Z] [INFO] 
09:14:31 [2020-09-22T13:14:31.994Z] [INFO] --- tycho-packaging-plugin:1.3.0:build-qualifier (default-build-qualifier) @ org.eclipse.ease.lang.python.py4j ---
09:14:31 [2020-09-22T13:14:31.994Z] [INFO] The project's OSGi version is 0.8.0.I202008271105
09:14:31 [2020-09-22T13:14:31.994Z] [INFO] 
09:14:31 [2020-09-22T13:14:31.994Z] [INFO] --- tycho-packaging-plugin:1.3.0:validate-id (default-validate-id) @ org.eclipse.ease.lang.python.py4j ---
09:14:31 [2020-09-22T13:14:31.994Z] [INFO] 
09:14:31 [2020-09-22T13:14:31.994Z] [INFO] --- tycho-packaging-plugin:1.3.0:validate-version (default-validate-version) @ org.eclipse.ease.lang.python.py4j ---
09:14:31 [2020-09-22T13:14:31.994Z] [INFO] 
09:14:31 [2020-09-22T13:14:31.994Z] [INFO] <<< maven-javadoc-plugin:2.9.1:javadoc (build-docs) < generate-sources @ org.eclipse.ease.lang.python.py4j <<<
09:14:31 [2020-09-22T13:14:31.994Z] [INFO] 
09:14:31 [2020-09-22T13:14:31.994Z] [INFO] 
09:14:31 [2020-09-22T13:14:31.994Z] [INFO] --- maven-javadoc-plugin:2.9.1:javadoc (build-docs) @ org.eclipse.ease.lang.python.py4j ---
09:14:32 [2020-09-22T13:14:32.250Z] [ERROR] Error fetching link: http://help.eclipse.org/oxygen/topic/org.eclipse.platform.doc.isv/reference/api/package-list. Ignored it.
09:14:33 [2020-09-22T13:14:33.184Z] [INFO] 
09:14:33 [2020-09-22T13:14:33.440Z] Loading source files for package org.eclipse.ease.lang.python.py4j.internal...
09:14:33 [2020-09-22T13:14:33.440Z] Loading source files for package org.eclipse.ease.lang.python.py4j.internal.ui...
09:14:33 [2020-09-22T13:14:33.440Z] Constructing Javadoc information...
09:14:33 [2020-09-22T13:14:33.440Z] WARNING: Cannot open location "/home/jenkins/agent/workspace/ease.verify.core.gerrit/plugins/org.eclipse.ease.lang.python.py4j/target/javadoc-bundle-options/package-list"
09:14:33 [2020-09-22T13:14:33.440Z] [WARNING] Javadoc Warnings
09:14:33 [2020-09-22T13:14:33.440Z] [WARNING] Picked up JAVA_TOOL_OPTIONS: -Dmaven.ext.class.path="/home/jenkins/agent/workspace/ease.verify.core.gerrit@tmp/withMavena810d3b2/pipeline-maven-spy.jar" -Dorg.jenkinsci.plugins.pipeline.maven.reportsFolder="/home/jenkins/agent/workspace/ease.verify.core.gerrit@tmp/withMavena810d3b2"
09:14:33 [2020-09-22T13:14:33.440Z] [INFO] 
09:14:33 [2020-09-22T13:14:33.440Z] [INFO] --- build-helper-maven-plugin:1.9.1:add-resource (add_help) @ org.eclipse.ease.lang.python.py4j ---
09:14:33 [2020-09-22T13:14:33.440Z] [INFO] 
09:14:33 [2020-09-22T13:14:33.440Z] [INFO] --- maven-resources-plugin:2.4.3:resources (default-resources) @ org.eclipse.ease.lang.python.py4j ---
09:14:33 [2020-09-22T13:14:33.440Z] [INFO] Using 'UTF-8' encoding to copy filtered resources.
09:14:33 [2020-09-22T13:14:33.440Z] [INFO] skip non existing resourceDirectory /home/jenkins/agent/workspace/ease.verify.core.gerrit/plugins/org.eclipse.ease.lang.python.py4j/src/main/resources
09:14:33 [2020-09-22T13:14:33.440Z] [INFO] Copying 2 resources to help
09:14:33 [2020-09-22T13:14:33.440Z] [INFO] 
09:14:33 [2020-09-22T13:14:33.440Z] [INFO] --- tycho-compiler-plugin:1.3.0:compile (default-compile) @ org.eclipse.ease.lang.python.py4j ---
09:14:33 [2020-09-22T13:14:33.440Z] [INFO] Compiling 11 source files to /home/jenkins/agent/workspace/ease.verify.core.gerrit/plugins/org.eclipse.ease.lang.python.py4j/target/classes
09:14:33 [2020-09-22T13:14:33.440Z] [INFO] 
09:14:33 [2020-09-22T13:14:33.440Z] [INFO] --- maven-resources-plugin:2.4.3:testResources (default-testResources) @ org.eclipse.ease.lang.python.py4j ---
09:14:33 [2020-09-22T13:14:33.440Z] [INFO] Using 'UTF-8' encoding to copy filtered resources.
09:14:33 [2020-09-22T13:14:33.440Z] [INFO] skip non existing resourceDirectory /home/jenkins/agent/workspace/ease.verify.core.gerrit/plugins/org.eclipse.ease.lang.python.py4j/src/test/resources
09:14:33 [2020-09-22T13:14:33.440Z] [INFO] 
09:14:33 [2020-09-22T13:14:33.440Z] [INFO] --- tycho-source-plugin:1.3.0:plugin-source (plugin-source) @ org.eclipse.ease.lang.python.py4j ---
09:14:33 [2020-09-22T13:14:33.440Z] [INFO] Building jar: /home/jenkins/agent/workspace/ease.verify.core.gerrit/plugins/org.eclipse.ease.lang.python.py4j/target/org.eclipse.ease.lang.python.py4j-0.8.0-SNAPSHOT-sources.jar
09:14:33 [2020-09-22T13:14:33.440Z] [INFO] 
09:14:33 [2020-09-22T13:14:33.440Z] [INFO] --- target-platform-configuration:1.3.0:target-platform (default-target-platform) @ org.eclipse.ease.lang.python.py4j ---
09:14:33 [2020-09-22T13:14:33.440Z] [INFO] 
09:14:33 [2020-09-22T13:14:33.440Z] [INFO] --- tycho-packaging-plugin:1.3.0:package-plugin (default-package-plugin) @ org.eclipse.ease.lang.python.py4j ---
09:14:33 [2020-09-22T13:14:33.440Z] [INFO] Building jar: /home/jenkins/agent/workspace/ease.verify.core.gerrit/plugins/org.eclipse.ease.lang.python.py4j/target/org.eclipse.ease.lang.python.py4j-0.8.0-SNAPSHOT.jar
09:14:33 [2020-09-22T13:14:33.440Z] [INFO] 
09:14:33 [2020-09-22T13:14:33.441Z] [INFO] --- tycho-p2-plugin:1.3.0:p2-metadata-default (default-p2-metadata-default) @ org.eclipse.ease.lang.python.py4j ---
09:14:33 [2020-09-22T13:14:33.441Z] [INFO] 
09:14:33 [2020-09-22T13:14:33.441Z] [INFO] --- tycho-source-feature-plugin:1.3.0:source-feature (source-feature) @ org.eclipse.ease.lang.python.py4j ---
09:14:33 [2020-09-22T13:14:33.441Z] [INFO] 
09:14:33 [2020-09-22T13:14:33.441Z] [INFO] --- tycho-p2-plugin:1.3.0:p2-metadata (attached-p2-metadata) @ org.eclipse.ease.lang.python.py4j ---
09:14:33 [2020-09-22T13:14:33.441Z] [INFO] 
09:14:33 [2020-09-22T13:14:33.441Z] [INFO] -----------< org.eclipse.ease:org.eclipse.ease.lang.groovy >------------
09:14:33 [2020-09-22T13:14:33.441Z] [INFO] Building org.eclipse.ease.lang.groovy 0.8.0-SNAPSHOT             [11/49]
09:14:33 [2020-09-22T13:14:33.441Z] [INFO] ---------------------------[ eclipse-plugin ]---------------------------
09:14:33 [2020-09-22T13:14:33.441Z] [INFO] 
09:14:33 [2020-09-22T13:14:33.441Z] [INFO] --- maven-clean-plugin:2.5:clean (default-clean) @ org.eclipse.ease.lang.groovy ---
09:14:33 [2020-09-22T13:14:33.441Z] [INFO] 
09:14:33 [2020-09-22T13:14:33.441Z] [INFO] --- tycho-packaging-plugin:1.3.0:build-qualifier (default-build-qualifier) @ org.eclipse.ease.lang.groovy ---
09:14:33 [2020-09-22T13:14:33.441Z] [INFO] The project's OSGi version is 0.8.0.I201910171213
09:14:33 [2020-09-22T13:14:33.441Z] [INFO] 
09:14:33 [2020-09-22T13:14:33.441Z] [INFO] --- tycho-packaging-plugin:1.3.0:validate-id (default-validate-id) @ org.eclipse.ease.lang.groovy ---
09:14:33 [2020-09-22T13:14:33.441Z] [INFO] 
09:14:33 [2020-09-22T13:14:33.441Z] [INFO] --- tycho-packaging-plugin:1.3.0:validate-version (default-validate-version) @ org.eclipse.ease.lang.groovy ---
09:14:33 [2020-09-22T13:14:33.441Z] [INFO] 
09:14:33 [2020-09-22T13:14:33.441Z] [INFO] >>> maven-javadoc-plugin:2.9.1:javadoc (build-docs) > generate-sources @ org.eclipse.ease.lang.groovy >>>
09:14:33 [2020-09-22T13:14:33.441Z] [INFO] 
09:14:33 [2020-09-22T13:14:33.441Z] [INFO] --- tycho-packaging-plugin:1.3.0:build-qualifier (default-build-qualifier) @ org.eclipse.ease.lang.groovy ---
09:14:33 [2020-09-22T13:14:33.441Z] [INFO] The project's OSGi version is 0.8.0.I201910171213
09:14:33 [2020-09-22T13:14:33.441Z] [INFO] 
09:14:33 [2020-09-22T13:14:33.441Z] [INFO] --- tycho-packaging-plugin:1.3.0:validate-id (default-validate-id) @ org.eclipse.ease.lang.groovy ---
09:14:33 [2020-09-22T13:14:33.441Z] [INFO] 
09:14:33 [2020-09-22T13:14:33.441Z] [INFO] --- tycho-packaging-plugin:1.3.0:validate-version (default-validate-version) @ org.eclipse.ease.lang.groovy ---
09:14:33 [2020-09-22T13:14:33.441Z] [INFO] 
09:14:33 [2020-09-22T13:14:33.441Z] [INFO] <<< maven-javadoc-plugin:2.9.1:javadoc (build-docs) < generate-sources @ org.eclipse.ease.lang.groovy <<<
09:14:33 [2020-09-22T13:14:33.441Z] [INFO] 
09:14:33 [2020-09-22T13:14:33.441Z] [INFO] 
09:14:33 [2020-09-22T13:14:33.441Z] [INFO] --- maven-javadoc-plugin:2.9.1:javadoc (build-docs) @ org.eclipse.ease.lang.groovy ---
09:14:33 [2020-09-22T13:14:33.697Z] [ERROR] Error fetching link: http://help.eclipse.org/oxygen/topic/org.eclipse.platform.doc.isv/reference/api/package-list. Ignored it.
09:14:34 [2020-09-22T13:14:34.628Z] [INFO] 
09:14:34 [2020-09-22T13:14:34.628Z] Loading source files for package org.eclipse.ease.lang.groovy...
09:14:34 [2020-09-22T13:14:34.628Z] Constructing Javadoc information...
09:14:34 [2020-09-22T13:14:34.628Z] WARNING: Cannot open location "/home/jenkins/agent/workspace/ease.verify.core.gerrit/plugins/org.eclipse.ease.lang.groovy/target/javadoc-bundle-options/package-list"
09:14:34 [2020-09-22T13:14:34.629Z] [WARNING] Javadoc Warnings
09:14:34 [2020-09-22T13:14:34.629Z] [WARNING] Picked up JAVA_TOOL_OPTIONS: -Dmaven.ext.class.path="/home/jenkins/agent/workspace/ease.verify.core.gerrit@tmp/withMavena810d3b2/pipeline-maven-spy.jar" -Dorg.jenkinsci.plugins.pipeline.maven.reportsFolder="/home/jenkins/agent/workspace/ease.verify.core.gerrit@tmp/withMavena810d3b2"
09:14:34 [2020-09-22T13:14:34.629Z] [INFO] 
09:14:34 [2020-09-22T13:14:34.629Z] [INFO] --- build-helper-maven-plugin:1.9.1:add-resource (add_help) @ org.eclipse.ease.lang.groovy ---
09:14:34 [2020-09-22T13:14:34.629Z] [INFO] 
09:14:34 [2020-09-22T13:14:34.629Z] [INFO] --- maven-resources-plugin:2.4.3:resources (default-resources) @ org.eclipse.ease.lang.groovy ---
09:14:34 [2020-09-22T13:14:34.629Z] [INFO] Using 'UTF-8' encoding to copy filtered resources.
09:14:34 [2020-09-22T13:14:34.629Z] [INFO] skip non existing resourceDirectory /home/jenkins/agent/workspace/ease.verify.core.gerrit/plugins/org.eclipse.ease.lang.groovy/src/main/resources
09:14:34 [2020-09-22T13:14:34.629Z] [INFO] skip non existing resourceDirectory /home/jenkins/agent/workspace/ease.verify.core.gerrit/plugins/org.eclipse.ease.lang.groovy/help
09:14:34 [2020-09-22T13:14:34.629Z] [INFO] 
09:14:34 [2020-09-22T13:14:34.629Z] [INFO] --- tycho-compiler-plugin:1.3.0:compile (default-compile) @ org.eclipse.ease.lang.groovy ---
09:14:34 [2020-09-22T13:14:34.629Z] [INFO] Compiling 4 source files to /home/jenkins/agent/workspace/ease.verify.core.gerrit/plugins/org.eclipse.ease.lang.groovy/target/classes
09:14:34 [2020-09-22T13:14:34.884Z] [INFO] 
09:14:34 [2020-09-22T13:14:34.884Z] [INFO] --- maven-resources-plugin:2.4.3:testResources (default-testResources) @ org.eclipse.ease.lang.groovy ---
09:14:34 [2020-09-22T13:14:34.884Z] [INFO] Using 'UTF-8' encoding to copy filtered resources.
09:14:34 [2020-09-22T13:14:34.885Z] [INFO] skip non existing resourceDirectory /home/jenkins/agent/workspace/ease.verify.core.gerrit/plugins/org.eclipse.ease.lang.groovy/src/test/resources
09:14:34 [2020-09-22T13:14:34.885Z] [INFO] 
09:14:34 [2020-09-22T13:14:34.885Z] [INFO] --- tycho-source-plugin:1.3.0:plugin-source (plugin-source) @ org.eclipse.ease.lang.groovy ---
09:14:34 [2020-09-22T13:14:34.885Z] [INFO] Building jar: /home/jenkins/agent/workspace/ease.verify.core.gerrit/plugins/org.eclipse.ease.lang.groovy/target/org.eclipse.ease.lang.groovy-0.8.0-SNAPSHOT-sources.jar
09:14:34 [2020-09-22T13:14:34.885Z] [INFO] 
09:14:34 [2020-09-22T13:14:34.885Z] [INFO] --- target-platform-configuration:1.3.0:target-platform (default-target-platform) @ org.eclipse.ease.lang.groovy ---
09:14:34 [2020-09-22T13:14:34.885Z] [INFO] 
09:14:34 [2020-09-22T13:14:34.885Z] [INFO] --- tycho-packaging-plugin:1.3.0:package-plugin (default-package-plugin) @ org.eclipse.ease.lang.groovy ---
09:14:34 [2020-09-22T13:14:34.885Z] [INFO] Building jar: /home/jenkins/agent/workspace/ease.verify.core.gerrit/plugins/org.eclipse.ease.lang.groovy/target/org.eclipse.ease.lang.groovy-0.8.0-SNAPSHOT.jar
09:14:34 [2020-09-22T13:14:34.885Z] [INFO] 
09:14:34 [2020-09-22T13:14:34.885Z] [INFO] --- tycho-p2-plugin:1.3.0:p2-metadata-default (default-p2-metadata-default) @ org.eclipse.ease.lang.groovy ---
09:14:34 [2020-09-22T13:14:34.885Z] [INFO] 
09:14:34 [2020-09-22T13:14:34.885Z] [INFO] --- tycho-source-feature-plugin:1.3.0:source-feature (source-feature) @ org.eclipse.ease.lang.groovy ---
09:14:34 [2020-09-22T13:14:34.885Z] [INFO] 
09:14:34 [2020-09-22T13:14:34.885Z] [INFO] --- tycho-p2-plugin:1.3.0:p2-metadata (attached-p2-metadata) @ org.eclipse.ease.lang.groovy ---
09:14:34 [2020-09-22T13:14:34.885Z] [INFO] 
09:14:34 [2020-09-22T13:14:34.885Z] [INFO] -----< org.eclipse.ease:org.eclipse.ease.lang.groovy.interpreter >------
09:14:34 [2020-09-22T13:14:34.885Z] [INFO] Building org.eclipse.ease.lang.groovy.interpreter 0.8.0-SNAPSHOT [12/49]
09:14:34 [2020-09-22T13:14:34.885Z] [INFO] ---------------------------[ eclipse-plugin ]---------------------------
09:14:34 [2020-09-22T13:14:34.885Z] [INFO] 
09:14:34 [2020-09-22T13:14:34.885Z] [INFO] --- maven-clean-plugin:2.5:clean (default-clean) @ org.eclipse.ease.lang.groovy.interpreter ---
09:14:34 [2020-09-22T13:14:34.885Z] [INFO] 
09:14:34 [2020-09-22T13:14:34.885Z] [INFO] --- tycho-packaging-plugin:1.3.0:build-qualifier (default-build-qualifier) @ org.eclipse.ease.lang.groovy.interpreter ---
09:14:34 [2020-09-22T13:14:34.885Z] [INFO] The project's OSGi version is 0.8.0.I202002270716
09:14:34 [2020-09-22T13:14:34.885Z] [INFO] 
09:14:34 [2020-09-22T13:14:34.885Z] [INFO] --- tycho-packaging-plugin:1.3.0:validate-id (default-validate-id) @ org.eclipse.ease.lang.groovy.interpreter ---
09:14:34 [2020-09-22T13:14:34.885Z] [INFO] 
09:14:34 [2020-09-22T13:14:34.885Z] [INFO] --- tycho-packaging-plugin:1.3.0:validate-version (default-validate-version) @ org.eclipse.ease.lang.groovy.interpreter ---
09:14:34 [2020-09-22T13:14:34.885Z] [INFO] 
09:14:34 [2020-09-22T13:14:34.885Z] [INFO] >>> maven-javadoc-plugin:2.9.1:javadoc (build-docs) > generate-sources @ org.eclipse.ease.lang.groovy.interpreter >>>
09:14:34 [2020-09-22T13:14:34.885Z] [INFO] 
09:14:34 [2020-09-22T13:14:34.885Z] [INFO] --- tycho-packaging-plugin:1.3.0:build-qualifier (default-build-qualifier) @ org.eclipse.ease.lang.groovy.interpreter ---
09:14:34 [2020-09-22T13:14:34.885Z] [INFO] The project's OSGi version is 0.8.0.I202002270716
09:14:34 [2020-09-22T13:14:34.885Z] [INFO] 
09:14:34 [2020-09-22T13:14:34.885Z] [INFO] --- tycho-packaging-plugin:1.3.0:validate-id (default-validate-id) @ org.eclipse.ease.lang.groovy.interpreter ---
09:14:34 [2020-09-22T13:14:34.885Z] [INFO] 
09:14:34 [2020-09-22T13:14:34.885Z] [INFO] --- tycho-packaging-plugin:1.3.0:validate-version (default-validate-version) @ org.eclipse.ease.lang.groovy.interpreter ---
09:14:34 [2020-09-22T13:14:34.885Z] [INFO] 
09:14:34 [2020-09-22T13:14:34.885Z] [INFO] <<< maven-javadoc-plugin:2.9.1:javadoc (build-docs) < generate-sources @ org.eclipse.ease.lang.groovy.interpreter <<<
09:14:34 [2020-09-22T13:14:34.885Z] [INFO] 
09:14:34 [2020-09-22T13:14:34.885Z] [INFO] 
09:14:34 [2020-09-22T13:14:34.885Z] [INFO] --- maven-javadoc-plugin:2.9.1:javadoc (build-docs) @ org.eclipse.ease.lang.groovy.interpreter ---
09:14:34 [2020-09-22T13:14:34.885Z] [ERROR] Error fetching link: http://help.eclipse.org/oxygen/topic/org.eclipse.platform.doc.isv/reference/api/package-list. Ignored it.
09:14:36 [2020-09-22T13:14:36.250Z] [INFO] 
09:14:36 [2020-09-22T13:14:36.250Z] Loading source files for package org.eclipse.ease.lang.groovy.interpreter...
09:14:36 [2020-09-22T13:14:36.250Z] Constructing Javadoc information...
09:14:36 [2020-09-22T13:14:36.250Z] WARNING: Cannot open location "/home/jenkins/agent/workspace/ease.verify.core.gerrit/plugins/org.eclipse.ease.lang.groovy.interpreter/target/javadoc-bundle-options/package-list"
09:14:36 [2020-09-22T13:14:36.250Z] [WARNING] Javadoc Warnings
09:14:36 [2020-09-22T13:14:36.250Z] [WARNING] Picked up JAVA_TOOL_OPTIONS: -Dmaven.ext.class.path="/home/jenkins/agent/workspace/ease.verify.core.gerrit@tmp/withMavena810d3b2/pipeline-maven-spy.jar" -Dorg.jenkinsci.plugins.pipeline.maven.reportsFolder="/home/jenkins/agent/workspace/ease.verify.core.gerrit@tmp/withMavena810d3b2"
09:14:36 [2020-09-22T13:14:36.250Z] [INFO] 
09:14:36 [2020-09-22T13:14:36.250Z] [INFO] --- build-helper-maven-plugin:1.9.1:add-resource (add_help) @ org.eclipse.ease.lang.groovy.interpreter ---
09:14:36 [2020-09-22T13:14:36.250Z] [INFO] 
09:14:36 [2020-09-22T13:14:36.250Z] [INFO] --- maven-resources-plugin:2.4.3:resources (default-resources) @ org.eclipse.ease.lang.groovy.interpreter ---
09:14:36 [2020-09-22T13:14:36.250Z] [INFO] Using 'UTF-8' encoding to copy filtered resources.
09:14:36 [2020-09-22T13:14:36.250Z] [INFO] skip non existing resourceDirectory /home/jenkins/agent/workspace/ease.verify.core.gerrit/plugins/org.eclipse.ease.lang.groovy.interpreter/src/main/resources
09:14:36 [2020-09-22T13:14:36.250Z] [INFO] skip non existing resourceDirectory /home/jenkins/agent/workspace/ease.verify.core.gerrit/plugins/org.eclipse.ease.lang.groovy.interpreter/help
09:14:36 [2020-09-22T13:14:36.250Z] [INFO] 
09:14:36 [2020-09-22T13:14:36.250Z] [INFO] --- tycho-compiler-plugin:1.3.0:compile (default-compile) @ org.eclipse.ease.lang.groovy.interpreter ---
09:14:36 [2020-09-22T13:14:36.250Z] [INFO] Compiling 3 source files to /home/jenkins/agent/workspace/ease.verify.core.gerrit/plugins/org.eclipse.ease.lang.groovy.interpreter/target/classes
09:14:36 [2020-09-22T13:14:36.250Z] [INFO] 
09:14:36 [2020-09-22T13:14:36.250Z] [INFO] --- maven-resources-plugin:2.4.3:testResources (default-testResources) @ org.eclipse.ease.lang.groovy.interpreter ---
09:14:36 [2020-09-22T13:14:36.250Z] [INFO] Using 'UTF-8' encoding to copy filtered resources.
09:14:36 [2020-09-22T13:14:36.250Z] [INFO] skip non existing resourceDirectory /home/jenkins/agent/workspace/ease.verify.core.gerrit/plugins/org.eclipse.ease.lang.groovy.interpreter/src/test/resources
09:14:36 [2020-09-22T13:14:36.250Z] [INFO] 
09:14:36 [2020-09-22T13:14:36.250Z] [INFO] --- tycho-source-plugin:1.3.0:plugin-source (plugin-source) @ org.eclipse.ease.lang.groovy.interpreter ---
09:14:36 [2020-09-22T13:14:36.250Z] [INFO] Building jar: /home/jenkins/agent/workspace/ease.verify.core.gerrit/plugins/org.eclipse.ease.lang.groovy.interpreter/target/org.eclipse.ease.lang.groovy.interpreter-0.8.0-SNAPSHOT-sources.jar
09:14:36 [2020-09-22T13:14:36.250Z] [INFO] 
09:14:36 [2020-09-22T13:14:36.250Z] [INFO] --- target-platform-configuration:1.3.0:target-platform (default-target-platform) @ org.eclipse.ease.lang.groovy.interpreter ---
09:14:36 [2020-09-22T13:14:36.250Z] [INFO] 
09:14:36 [2020-09-22T13:14:36.250Z] [INFO] --- tycho-packaging-plugin:1.3.0:package-plugin (default-package-plugin) @ org.eclipse.ease.lang.groovy.interpreter ---
09:14:36 [2020-09-22T13:14:36.250Z] [INFO] Building jar: /home/jenkins/agent/workspace/ease.verify.core.gerrit/plugins/org.eclipse.ease.lang.groovy.interpreter/target/org.eclipse.ease.lang.groovy.interpreter-0.8.0-SNAPSHOT.jar
09:14:36 [2020-09-22T13:14:36.250Z] [INFO] 
09:14:36 [2020-09-22T13:14:36.250Z] [INFO] --- tycho-p2-plugin:1.3.0:p2-metadata-default (default-p2-metadata-default) @ org.eclipse.ease.lang.groovy.interpreter ---
09:14:36 [2020-09-22T13:14:36.250Z] [INFO] 
09:14:36 [2020-09-22T13:14:36.250Z] [INFO] --- tycho-source-feature-plugin:1.3.0:source-feature (source-feature) @ org.eclipse.ease.lang.groovy.interpreter ---
09:14:36 [2020-09-22T13:14:36.250Z] [INFO] 
09:14:36 [2020-09-22T13:14:36.250Z] [INFO] --- tycho-p2-plugin:1.3.0:p2-metadata (attached-p2-metadata) @ org.eclipse.ease.lang.groovy.interpreter ---
09:14:36 [2020-09-22T13:14:36.250Z] [INFO] 
09:14:36 [2020-09-22T13:14:36.250Z] [INFO] ----------< org.eclipse.ease:org.eclipse.ease.lang.unittest >-----------
09:14:36 [2020-09-22T13:14:36.250Z] [INFO] Building org.eclipse.ease.lang.unittest 0.8.0-SNAPSHOT           [13/49]
09:14:36 [2020-09-22T13:14:36.250Z] [INFO] ---------------------------[ eclipse-plugin ]---------------------------
09:14:36 [2020-09-22T13:14:36.250Z] [INFO] 
09:14:36 [2020-09-22T13:14:36.250Z] [INFO] --- maven-clean-plugin:2.5:clean (default-clean) @ org.eclipse.ease.lang.unittest ---
09:14:36 [2020-09-22T13:14:36.250Z] [INFO] 
09:14:36 [2020-09-22T13:14:36.250Z] [INFO] --- tycho-packaging-plugin:1.3.0:build-qualifier (default-build-qualifier) @ org.eclipse.ease.lang.unittest ---
09:14:36 [2020-09-22T13:14:36.250Z] [INFO] The project's OSGi version is 0.8.0.I202006021412
09:14:36 [2020-09-22T13:14:36.250Z] [INFO] 
09:14:36 [2020-09-22T13:14:36.250Z] [INFO] --- tycho-packaging-plugin:1.3.0:validate-id (default-validate-id) @ org.eclipse.ease.lang.unittest ---
09:14:36 [2020-09-22T13:14:36.250Z] [INFO] 
09:14:36 [2020-09-22T13:14:36.250Z] [INFO] --- tycho-packaging-plugin:1.3.0:validate-version (default-validate-version) @ org.eclipse.ease.lang.unittest ---
09:14:36 [2020-09-22T13:14:36.251Z] [INFO] 
09:14:36 [2020-09-22T13:14:36.251Z] [INFO] >>> maven-javadoc-plugin:2.9.1:javadoc (build-docs) > generate-sources @ org.eclipse.ease.lang.unittest >>>
09:14:36 [2020-09-22T13:14:36.251Z] [INFO] 
09:14:36 [2020-09-22T13:14:36.251Z] [INFO] --- tycho-packaging-plugin:1.3.0:build-qualifier (default-build-qualifier) @ org.eclipse.ease.lang.unittest ---
09:14:36 [2020-09-22T13:14:36.251Z] [INFO] The project's OSGi version is 0.8.0.I202006021412
09:14:36 [2020-09-22T13:14:36.251Z] [INFO] 
09:14:36 [2020-09-22T13:14:36.251Z] [INFO] --- tycho-packaging-plugin:1.3.0:validate-id (default-validate-id) @ org.eclipse.ease.lang.unittest ---
09:14:36 [2020-09-22T13:14:36.251Z] [INFO] 
09:14:36 [2020-09-22T13:14:36.251Z] [INFO] --- tycho-packaging-plugin:1.3.0:validate-version (default-validate-version) @ org.eclipse.ease.lang.unittest ---
09:14:36 [2020-09-22T13:14:36.251Z] [INFO] 
09:14:36 [2020-09-22T13:14:36.251Z] [INFO] <<< maven-javadoc-plugin:2.9.1:javadoc (build-docs) < generate-sources @ org.eclipse.ease.lang.unittest <<<
09:14:36 [2020-09-22T13:14:36.251Z] [INFO] 
09:14:36 [2020-09-22T13:14:36.251Z] [INFO] 
09:14:36 [2020-09-22T13:14:36.251Z] [INFO] --- maven-javadoc-plugin:2.9.1:javadoc (build-docs) @ org.eclipse.ease.lang.unittest ---
09:14:36 [2020-09-22T13:14:36.506Z] [ERROR] Error fetching link: http://help.eclipse.org/oxygen/topic/org.eclipse.platform.doc.isv/reference/api/package-list. Ignored it.
09:14:37 [2020-09-22T13:14:37.871Z] [INFO] 
09:14:37 [2020-09-22T13:14:37.871Z] Loading source files for package org.eclipse.ease.lang.unittest...
09:14:37 [2020-09-22T13:14:37.871Z] Loading source files for package org.eclipse.ease.lang.unittest.execution...
09:14:37 [2020-09-22T13:14:37.871Z] Loading source files for package org.eclipse.ease.lang.unittest.reporters...
09:14:37 [2020-09-22T13:14:37.871Z] Loading source files for package org.eclipse.ease.lang.unittest.definition...
09:14:37 [2020-09-22T13:14:37.871Z] Loading source files for package org.eclipse.ease.lang.unittest.definition.impl...
09:14:37 [2020-09-22T13:14:37.871Z] Loading source files for package org.eclipse.ease.lang.unittest.definition.util...
09:14:37 [2020-09-22T13:14:37.871Z] Loading source files for package org.eclipse.ease.lang.unittest.runtime...
09:14:37 [2020-09-22T13:14:37.871Z] Loading source files for package org.eclipse.ease.lang.unittest.runtime.impl...
09:14:37 [2020-09-22T13:14:37.871Z] Loading source files for package org.eclipse.ease.lang.unittest.runtime.util...
09:14:37 [2020-09-22T13:14:37.871Z] Constructing Javadoc information...
09:14:37 [2020-09-22T13:14:37.871Z] WARNING: Cannot open location "/home/jenkins/agent/workspace/ease.verify.core.gerrit/plugins/org.eclipse.ease.lang.unittest/target/javadoc-bundle-options/package-list"
09:14:37 [2020-09-22T13:14:37.871Z] [WARNING] Javadoc Warnings
09:14:37 [2020-09-22T13:14:37.871Z] [WARNING] Picked up JAVA_TOOL_OPTIONS: -Dmaven.ext.class.path="/home/jenkins/agent/workspace/ease.verify.core.gerrit@tmp/withMavena810d3b2/pipeline-maven-spy.jar" -Dorg.jenkinsci.plugins.pipeline.maven.reportsFolder="/home/jenkins/agent/workspace/ease.verify.core.gerrit@tmp/withMavena810d3b2"
09:14:37 [2020-09-22T13:14:37.871Z] [INFO] 
09:14:37 [2020-09-22T13:14:37.871Z] [INFO] --- build-helper-maven-plugin:1.9.1:add-resource (add_help) @ org.eclipse.ease.lang.unittest ---
09:14:37 [2020-09-22T13:14:37.871Z] [INFO] 
09:14:37 [2020-09-22T13:14:37.871Z] [INFO] --- maven-resources-plugin:2.4.3:resources (default-resources) @ org.eclipse.ease.lang.unittest ---
09:14:37 [2020-09-22T13:14:37.871Z] [INFO] Using 'UTF-8' encoding to copy filtered resources.
09:14:37 [2020-09-22T13:14:37.871Z] [INFO] skip non existing resourceDirectory /home/jenkins/agent/workspace/ease.verify.core.gerrit/plugins/org.eclipse.ease.lang.unittest/src/main/resources
09:14:37 [2020-09-22T13:14:37.871Z] [INFO] Copying 2 resources to help
09:14:37 [2020-09-22T13:14:37.871Z] [INFO] 
09:14:37 [2020-09-22T13:14:37.872Z] [INFO] --- tycho-compiler-plugin:1.3.0:compile (default-compile) @ org.eclipse.ease.lang.unittest ---
09:14:37 [2020-09-22T13:14:37.872Z] [INFO] Compiling 57 source files to /home/jenkins/agent/workspace/ease.verify.core.gerrit/plugins/org.eclipse.ease.lang.unittest/target/classes
09:14:38 [2020-09-22T13:14:38.127Z] [INFO] 
09:14:38 [2020-09-22T13:14:38.127Z] [INFO] --- maven-resources-plugin:2.4.3:testResources (default-testResources) @ org.eclipse.ease.lang.unittest ---
09:14:38 [2020-09-22T13:14:38.127Z] [INFO] Using 'UTF-8' encoding to copy filtered resources.
09:14:38 [2020-09-22T13:14:38.127Z] [INFO] skip non existing resourceDirectory /home/jenkins/agent/workspace/ease.verify.core.gerrit/plugins/org.eclipse.ease.lang.unittest/src/test/resources
09:14:38 [2020-09-22T13:14:38.127Z] [INFO] 
09:14:38 [2020-09-22T13:14:38.127Z] [INFO] --- tycho-source-plugin:1.3.0:plugin-source (plugin-source) @ org.eclipse.ease.lang.unittest ---
09:14:38 [2020-09-22T13:14:38.127Z] [INFO] Building jar: /home/jenkins/agent/workspace/ease.verify.core.gerrit/plugins/org.eclipse.ease.lang.unittest/target/org.eclipse.ease.lang.unittest-0.8.0-SNAPSHOT-sources.jar
09:14:38 [2020-09-22T13:14:38.127Z] [INFO] 
09:14:38 [2020-09-22T13:14:38.127Z] [INFO] --- target-platform-configuration:1.3.0:target-platform (default-target-platform) @ org.eclipse.ease.lang.unittest ---
09:14:38 [2020-09-22T13:14:38.127Z] [INFO] 
09:14:38 [2020-09-22T13:14:38.127Z] [INFO] --- tycho-packaging-plugin:1.3.0:package-plugin (default-package-plugin) @ org.eclipse.ease.lang.unittest ---
09:14:38 [2020-09-22T13:14:38.127Z] [INFO] Building jar: /home/jenkins/agent/workspace/ease.verify.core.gerrit/plugins/org.eclipse.ease.lang.unittest/target/org.eclipse.ease.lang.unittest-0.8.0-SNAPSHOT.jar
09:14:38 [2020-09-22T13:14:38.127Z] [INFO] 
09:14:38 [2020-09-22T13:14:38.127Z] [INFO] --- tycho-p2-plugin:1.3.0:p2-metadata-default (default-p2-metadata-default) @ org.eclipse.ease.lang.unittest ---
09:14:38 [2020-09-22T13:14:38.127Z] [INFO] 
09:14:38 [2020-09-22T13:14:38.127Z] [INFO] --- tycho-source-feature-plugin:1.3.0:source-feature (source-feature) @ org.eclipse.ease.lang.unittest ---
09:14:38 [2020-09-22T13:14:38.127Z] [INFO] 
09:14:38 [2020-09-22T13:14:38.127Z] [INFO] --- tycho-p2-plugin:1.3.0:p2-metadata (attached-p2-metadata) @ org.eclipse.ease.lang.unittest ---
09:14:38 [2020-09-22T13:14:38.127Z] [INFO] 
09:14:38 [2020-09-22T13:14:38.127Z] [INFO] ---------< org.eclipse.ease:org.eclipse.ease.lang.unittest.ui >---------
09:14:38 [2020-09-22T13:14:38.127Z] [INFO] Building org.eclipse.ease.lang.unittest.ui 0.8.0-SNAPSHOT        [14/49]
09:14:38 [2020-09-22T13:14:38.127Z] [INFO] ---------------------------[ eclipse-plugin ]---------------------------
09:14:38 [2020-09-22T13:14:38.127Z] [INFO] 
09:14:38 [2020-09-22T13:14:38.127Z] [INFO] --- maven-clean-plugin:2.5:clean (default-clean) @ org.eclipse.ease.lang.unittest.ui ---
09:14:38 [2020-09-22T13:14:38.127Z] [INFO] 
09:14:38 [2020-09-22T13:14:38.127Z] [INFO] --- tycho-packaging-plugin:1.3.0:build-qualifier (default-build-qualifier) @ org.eclipse.ease.lang.unittest.ui ---
09:14:38 [2020-09-22T13:14:38.127Z] [INFO] The project's OSGi version is 0.8.0.I202003160826
09:14:38 [2020-09-22T13:14:38.127Z] [INFO] 
09:14:38 [2020-09-22T13:14:38.127Z] [INFO] --- tycho-packaging-plugin:1.3.0:validate-id (default-validate-id) @ org.eclipse.ease.lang.unittest.ui ---
09:14:38 [2020-09-22T13:14:38.127Z] [INFO] 
09:14:38 [2020-09-22T13:14:38.128Z] [INFO] --- tycho-packaging-plugin:1.3.0:validate-version (default-validate-version) @ org.eclipse.ease.lang.unittest.ui ---
09:14:38 [2020-09-22T13:14:38.128Z] [INFO] 
09:14:38 [2020-09-22T13:14:38.128Z] [INFO] >>> maven-javadoc-plugin:2.9.1:javadoc (build-docs) > generate-sources @ org.eclipse.ease.lang.unittest.ui >>>
09:14:38 [2020-09-22T13:14:38.128Z] [INFO] 
09:14:38 [2020-09-22T13:14:38.128Z] [INFO] --- tycho-packaging-plugin:1.3.0:build-qualifier (default-build-qualifier) @ org.eclipse.ease.lang.unittest.ui ---
09:14:38 [2020-09-22T13:14:38.128Z] [INFO] The project's OSGi version is 0.8.0.I202003160826
09:14:38 [2020-09-22T13:14:38.128Z] [INFO] 
09:14:38 [2020-09-22T13:14:38.128Z] [INFO] --- tycho-packaging-plugin:1.3.0:validate-id (default-validate-id) @ org.eclipse.ease.lang.unittest.ui ---
09:14:38 [2020-09-22T13:14:38.128Z] [INFO] 
09:14:38 [2020-09-22T13:14:38.128Z] [INFO] --- tycho-packaging-plugin:1.3.0:validate-version (default-validate-version) @ org.eclipse.ease.lang.unittest.ui ---
09:14:38 [2020-09-22T13:14:38.128Z] [INFO] 
09:14:38 [2020-09-22T13:14:38.128Z] [INFO] <<< maven-javadoc-plugin:2.9.1:javadoc (build-docs) < generate-sources @ org.eclipse.ease.lang.unittest.ui <<<
09:14:38 [2020-09-22T13:14:38.128Z] [INFO] 
09:14:38 [2020-09-22T13:14:38.128Z] [INFO] 
09:14:38 [2020-09-22T13:14:38.128Z] [INFO] --- maven-javadoc-plugin:2.9.1:javadoc (build-docs) @ org.eclipse.ease.lang.unittest.ui ---
09:14:38 [2020-09-22T13:14:38.388Z] [ERROR] Error fetching link: http://help.eclipse.org/oxygen/topic/org.eclipse.platform.doc.isv/reference/api/package-list. Ignored it.
09:14:39 [2020-09-22T13:14:39.767Z] [INFO] 
09:14:39 [2020-09-22T13:14:39.767Z] Loading source files for package org.eclipse.ease.lang.unittest.ui...
09:14:39 [2020-09-22T13:14:39.767Z] Loading source files for package org.eclipse.ease.lang.unittest.ui.decorators...
09:14:39 [2020-09-22T13:14:39.767Z] Loading source files for package org.eclipse.ease.lang.unittest.ui.dialogs...
09:14:39 [2020-09-22T13:14:39.767Z] Loading source files for package org.eclipse.ease.lang.unittest.ui.editor...
09:14:39 [2020-09-22T13:14:39.767Z] Loading source files for package org.eclipse.ease.lang.unittest.ui.handlers...
09:14:39 [2020-09-22T13:14:39.767Z] Loading source files for package org.eclipse.ease.lang.unittest.ui.sourceprovider...
09:14:39 [2020-09-22T13:14:39.767Z] Loading source files for package org.eclipse.ease.lang.unittest.ui.views...
09:14:39 [2020-09-22T13:14:39.767Z] Loading source files for package org.eclipse.ease.lang.unittest.ui.wizards...
09:14:39 [2020-09-22T13:14:39.767Z] Loading source files for package org.eclipse.ease.lang.unittest.definition.provider...
09:14:39 [2020-09-22T13:14:39.767Z] Constructing Javadoc information...
09:14:39 [2020-09-22T13:14:39.767Z] WARNING: Cannot open location "/home/jenkins/agent/workspace/ease.verify.core.gerrit/plugins/org.eclipse.ease.lang.unittest.ui/target/javadoc-bundle-options/package-list"
09:14:39 [2020-09-22T13:14:39.767Z] [WARNING] Javadoc Warnings
09:14:39 [2020-09-22T13:14:39.767Z] [WARNING] Picked up JAVA_TOOL_OPTIONS: -Dmaven.ext.class.path="/home/jenkins/agent/workspace/ease.verify.core.gerrit@tmp/withMavena810d3b2/pipeline-maven-spy.jar" -Dorg.jenkinsci.plugins.pipeline.maven.reportsFolder="/home/jenkins/agent/workspace/ease.verify.core.gerrit@tmp/withMavena810d3b2"
09:14:39 [2020-09-22T13:14:39.767Z] [INFO] 
09:14:39 [2020-09-22T13:14:39.767Z] [INFO] --- build-helper-maven-plugin:1.9.1:add-resource (add_help) @ org.eclipse.ease.lang.unittest.ui ---
09:14:39 [2020-09-22T13:14:39.767Z] [INFO] 
09:14:39 [2020-09-22T13:14:39.767Z] [INFO] --- maven-resources-plugin:2.4.3:resources (default-resources) @ org.eclipse.ease.lang.unittest.ui ---
09:14:39 [2020-09-22T13:14:39.767Z] [INFO] Using 'UTF-8' encoding to copy filtered resources.
09:14:39 [2020-09-22T13:14:39.767Z] [INFO] skip non existing resourceDirectory /home/jenkins/agent/workspace/ease.verify.core.gerrit/plugins/org.eclipse.ease.lang.unittest.ui/src/main/resources
09:14:39 [2020-09-22T13:14:39.767Z] [INFO] skip non existing resourceDirectory /home/jenkins/agent/workspace/ease.verify.core.gerrit/plugins/org.eclipse.ease.lang.unittest.ui/help
09:14:39 [2020-09-22T13:14:39.767Z] [INFO] 
09:14:39 [2020-09-22T13:14:39.767Z] [INFO] --- tycho-compiler-plugin:1.3.0:compile (default-compile) @ org.eclipse.ease.lang.unittest.ui ---
09:14:39 [2020-09-22T13:14:39.767Z] [INFO] Compiling 40 source files to /home/jenkins/agent/workspace/ease.verify.core.gerrit/plugins/org.eclipse.ease.lang.unittest.ui/target/classes
09:14:40 [2020-09-22T13:14:40.023Z] [INFO] 
09:14:40 [2020-09-22T13:14:40.024Z] [INFO] --- maven-resources-plugin:2.4.3:testResources (default-testResources) @ org.eclipse.ease.lang.unittest.ui ---
09:14:40 [2020-09-22T13:14:40.024Z] [INFO] Using 'UTF-8' encoding to copy filtered resources.
09:14:40 [2020-09-22T13:14:40.024Z] [INFO] skip non existing resourceDirectory /home/jenkins/agent/workspace/ease.verify.core.gerrit/plugins/org.eclipse.ease.lang.unittest.ui/src/test/resources
09:14:40 [2020-09-22T13:14:40.024Z] [INFO] 
09:14:40 [2020-09-22T13:14:40.024Z] [INFO] --- tycho-source-plugin:1.3.0:plugin-source (plugin-source) @ org.eclipse.ease.lang.unittest.ui ---
09:14:40 [2020-09-22T13:14:40.024Z] [INFO] Building jar: /home/jenkins/agent/workspace/ease.verify.core.gerrit/plugins/org.eclipse.ease.lang.unittest.ui/target/org.eclipse.ease.lang.unittest.ui-0.8.0-SNAPSHOT-sources.jar
09:14:40 [2020-09-22T13:14:40.024Z] [INFO] 
09:14:40 [2020-09-22T13:14:40.024Z] [INFO] --- target-platform-configuration:1.3.0:target-platform (default-target-platform) @ org.eclipse.ease.lang.unittest.ui ---
09:14:40 [2020-09-22T13:14:40.024Z] [INFO] 
09:14:40 [2020-09-22T13:14:40.024Z] [INFO] --- tycho-packaging-plugin:1.3.0:package-plugin (default-package-plugin) @ org.eclipse.ease.lang.unittest.ui ---
09:14:40 [2020-09-22T13:14:40.024Z] [INFO] Building jar: /home/jenkins/agent/workspace/ease.verify.core.gerrit/plugins/org.eclipse.ease.lang.unittest.ui/target/org.eclipse.ease.lang.unittest.ui-0.8.0-SNAPSHOT.jar
09:14:40 [2020-09-22T13:14:40.024Z] [INFO] 
09:14:40 [2020-09-22T13:14:40.024Z] [INFO] --- tycho-p2-plugin:1.3.0:p2-metadata-default (default-p2-metadata-default) @ org.eclipse.ease.lang.unittest.ui ---
09:14:40 [2020-09-22T13:14:40.024Z] [INFO] 
09:14:40 [2020-09-22T13:14:40.024Z] [INFO] --- tycho-source-feature-plugin:1.3.0:source-feature (source-feature) @ org.eclipse.ease.lang.unittest.ui ---
09:14:40 [2020-09-22T13:14:40.024Z] [INFO] 
09:14:40 [2020-09-22T13:14:40.024Z] [INFO] --- tycho-p2-plugin:1.3.0:p2-metadata (attached-p2-metadata) @ org.eclipse.ease.lang.unittest.ui ---
09:14:40 [2020-09-22T13:14:40.024Z] [INFO] 
09:14:40 [2020-09-22T13:14:40.024Z] [INFO] ------------< org.eclipse.ease:org.eclipse.ease.lang.ruby >-------------
09:14:40 [2020-09-22T13:14:40.024Z] [INFO] Building org.eclipse.ease.lang.ruby 0.8.0-SNAPSHOT               [15/49]
09:14:40 [2020-09-22T13:14:40.024Z] [INFO] ---------------------------[ eclipse-plugin ]---------------------------
09:14:40 [2020-09-22T13:14:40.024Z] [INFO] 
09:14:40 [2020-09-22T13:14:40.024Z] [INFO] --- maven-clean-plugin:2.5:clean (default-clean) @ org.eclipse.ease.lang.ruby ---
09:14:40 [2020-09-22T13:14:40.024Z] [INFO] 
09:14:40 [2020-09-22T13:14:40.024Z] [INFO] --- tycho-packaging-plugin:1.3.0:build-qualifier (default-build-qualifier) @ org.eclipse.ease.lang.ruby ---
09:14:40 [2020-09-22T13:14:40.024Z] [INFO] The project's OSGi version is 0.8.0.I201910171213
09:14:40 [2020-09-22T13:14:40.024Z] [INFO] 
09:14:40 [2020-09-22T13:14:40.024Z] [INFO] --- tycho-packaging-plugin:1.3.0:validate-id (default-validate-id) @ org.eclipse.ease.lang.ruby ---
09:14:40 [2020-09-22T13:14:40.024Z] [INFO] 
09:14:40 [2020-09-22T13:14:40.024Z] [INFO] --- tycho-packaging-plugin:1.3.0:validate-version (default-validate-version) @ org.eclipse.ease.lang.ruby ---
09:14:40 [2020-09-22T13:14:40.024Z] [INFO] 
09:14:40 [2020-09-22T13:14:40.024Z] [INFO] >>> maven-javadoc-plugin:2.9.1:javadoc (build-docs) > generate-sources @ org.eclipse.ease.lang.ruby >>>
09:14:40 [2020-09-22T13:14:40.024Z] [INFO] 
09:14:40 [2020-09-22T13:14:40.024Z] [INFO] --- tycho-packaging-plugin:1.3.0:build-qualifier (default-build-qualifier) @ org.eclipse.ease.lang.ruby ---
09:14:40 [2020-09-22T13:14:40.279Z] [INFO] The project's OSGi version is 0.8.0.I201910171213
09:14:40 [2020-09-22T13:14:40.279Z] [INFO] 
09:14:40 [2020-09-22T13:14:40.279Z] [INFO] --- tycho-packaging-plugin:1.3.0:validate-id (default-validate-id) @ org.eclipse.ease.lang.ruby ---
09:14:40 [2020-09-22T13:14:40.279Z] [INFO] 
09:14:40 [2020-09-22T13:14:40.279Z] [INFO] --- tycho-packaging-plugin:1.3.0:validate-version (default-validate-version) @ org.eclipse.ease.lang.ruby ---
09:14:40 [2020-09-22T13:14:40.279Z] [INFO] 
09:14:40 [2020-09-22T13:14:40.279Z] [INFO] <<< maven-javadoc-plugin:2.9.1:javadoc (build-docs) < generate-sources @ org.eclipse.ease.lang.ruby <<<
09:14:40 [2020-09-22T13:14:40.279Z] [INFO] 
09:14:40 [2020-09-22T13:14:40.279Z] [INFO] 
09:14:40 [2020-09-22T13:14:40.280Z] [INFO] --- maven-javadoc-plugin:2.9.1:javadoc (build-docs) @ org.eclipse.ease.lang.ruby ---
09:14:40 [2020-09-22T13:14:40.280Z] [ERROR] Error fetching link: http://help.eclipse.org/oxygen/topic/org.eclipse.platform.doc.isv/reference/api/package-list. Ignored it.
09:14:41 [2020-09-22T13:14:41.644Z] [INFO] 
09:14:41 [2020-09-22T13:14:41.644Z] Loading source files for package org.eclipse.ease.lang.ruby...
09:14:41 [2020-09-22T13:14:41.644Z] Constructing Javadoc information...
09:14:41 [2020-09-22T13:14:41.644Z] WARNING: Cannot open location "/home/jenkins/agent/workspace/ease.verify.core.gerrit/plugins/org.eclipse.ease.lang.ruby/target/javadoc-bundle-options/package-list"
09:14:41 [2020-09-22T13:14:41.644Z] [WARNING] Javadoc Warnings
09:14:41 [2020-09-22T13:14:41.644Z] [WARNING] Picked up JAVA_TOOL_OPTIONS: -Dmaven.ext.class.path="/home/jenkins/agent/workspace/ease.verify.core.gerrit@tmp/withMavena810d3b2/pipeline-maven-spy.jar" -Dorg.jenkinsci.plugins.pipeline.maven.reportsFolder="/home/jenkins/agent/workspace/ease.verify.core.gerrit@tmp/withMavena810d3b2"
09:14:41 [2020-09-22T13:14:41.644Z] [INFO] 
09:14:41 [2020-09-22T13:14:41.644Z] [INFO] --- build-helper-maven-plugin:1.9.1:add-resource (add_help) @ org.eclipse.ease.lang.ruby ---
09:14:41 [2020-09-22T13:14:41.644Z] [INFO] 
09:14:41 [2020-09-22T13:14:41.644Z] [INFO] --- maven-resources-plugin:2.4.3:resources (default-resources) @ org.eclipse.ease.lang.ruby ---
09:14:41 [2020-09-22T13:14:41.644Z] [INFO] Using 'UTF-8' encoding to copy filtered resources.
09:14:41 [2020-09-22T13:14:41.644Z] [INFO] skip non existing resourceDirectory /home/jenkins/agent/workspace/ease.verify.core.gerrit/plugins/org.eclipse.ease.lang.ruby/src/main/resources
09:14:41 [2020-09-22T13:14:41.644Z] [INFO] skip non existing resourceDirectory /home/jenkins/agent/workspace/ease.verify.core.gerrit/plugins/org.eclipse.ease.lang.ruby/help
09:14:41 [2020-09-22T13:14:41.644Z] [INFO] 
09:14:41 [2020-09-22T13:14:41.644Z] [INFO] --- tycho-compiler-plugin:1.3.0:compile (default-compile) @ org.eclipse.ease.lang.ruby ---
09:14:41 [2020-09-22T13:14:41.644Z] [INFO] Compiling 4 source files to /home/jenkins/agent/workspace/ease.verify.core.gerrit/plugins/org.eclipse.ease.lang.ruby/target/classes
09:14:41 [2020-09-22T13:14:41.644Z] [INFO] 
09:14:41 [2020-09-22T13:14:41.644Z] [INFO] --- maven-resources-plugin:2.4.3:testResources (default-testResources) @ org.eclipse.ease.lang.ruby ---
09:14:41 [2020-09-22T13:14:41.644Z] [INFO] Using 'UTF-8' encoding to copy filtered resources.
09:14:41 [2020-09-22T13:14:41.644Z] [INFO] skip non existing resourceDirectory /home/jenkins/agent/workspace/ease.verify.core.gerrit/plugins/org.eclipse.ease.lang.ruby/src/test/resources
09:14:41 [2020-09-22T13:14:41.644Z] [INFO] 
09:14:41 [2020-09-22T13:14:41.644Z] [INFO] --- tycho-source-plugin:1.3.0:plugin-source (plugin-source) @ org.eclipse.ease.lang.ruby ---
09:14:41 [2020-09-22T13:14:41.644Z] [INFO] Building jar: /home/jenkins/agent/workspace/ease.verify.core.gerrit/plugins/org.eclipse.ease.lang.ruby/target/org.eclipse.ease.lang.ruby-0.8.0-SNAPSHOT-sources.jar
09:14:41 [2020-09-22T13:14:41.644Z] [INFO] 
09:14:41 [2020-09-22T13:14:41.644Z] [INFO] --- target-platform-configuration:1.3.0:target-platform (default-target-platform) @ org.eclipse.ease.lang.ruby ---
09:14:41 [2020-09-22T13:14:41.644Z] [INFO] 
09:14:41 [2020-09-22T13:14:41.644Z] [INFO] --- tycho-packaging-plugin:1.3.0:package-plugin (default-package-plugin) @ org.eclipse.ease.lang.ruby ---
09:14:41 [2020-09-22T13:14:41.644Z] [INFO] Building jar: /home/jenkins/agent/workspace/ease.verify.core.gerrit/plugins/org.eclipse.ease.lang.ruby/target/org.eclipse.ease.lang.ruby-0.8.0-SNAPSHOT.jar
09:14:41 [2020-09-22T13:14:41.644Z] [INFO] 
09:14:41 [2020-09-22T13:14:41.644Z] [INFO] --- tycho-p2-plugin:1.3.0:p2-metadata-default (default-p2-metadata-default) @ org.eclipse.ease.lang.ruby ---
09:14:41 [2020-09-22T13:14:41.644Z] [INFO] 
09:14:41 [2020-09-22T13:14:41.644Z] [INFO] --- tycho-source-feature-plugin:1.3.0:source-feature (source-feature) @ org.eclipse.ease.lang.ruby ---
09:14:41 [2020-09-22T13:14:41.644Z] [INFO] 
09:14:41 [2020-09-22T13:14:41.644Z] [INFO] --- tycho-p2-plugin:1.3.0:p2-metadata (attached-p2-metadata) @ org.eclipse.ease.lang.ruby ---
09:14:41 [2020-09-22T13:14:41.644Z] [INFO] 
09:14:41 [2020-09-22T13:14:41.644Z] [INFO] ---------< org.eclipse.ease:org.eclipse.ease.lang.ruby.jruby >----------
09:14:41 [2020-09-22T13:14:41.644Z] [INFO] Building org.eclipse.ease.lang.ruby.jruby 0.8.0-SNAPSHOT         [16/49]
09:14:41 [2020-09-22T13:14:41.644Z] [INFO] ---------------------------[ eclipse-plugin ]---------------------------
09:14:41 [2020-09-22T13:14:41.644Z] [INFO] 
09:14:41 [2020-09-22T13:14:41.644Z] [INFO] --- maven-clean-plugin:2.5:clean (default-clean) @ org.eclipse.ease.lang.ruby.jruby ---
09:14:41 [2020-09-22T13:14:41.644Z] [INFO] 
09:14:41 [2020-09-22T13:14:41.644Z] [INFO] --- tycho-packaging-plugin:1.3.0:build-qualifier (default-build-qualifier) @ org.eclipse.ease.lang.ruby.jruby ---
09:14:41 [2020-09-22T13:14:41.644Z] [INFO] The project's OSGi version is 0.8.0.I201910171213
09:14:41 [2020-09-22T13:14:41.644Z] [INFO] 
09:14:41 [2020-09-22T13:14:41.644Z] [INFO] --- tycho-packaging-plugin:1.3.0:validate-id (default-validate-id) @ org.eclipse.ease.lang.ruby.jruby ---
09:14:41 [2020-09-22T13:14:41.645Z] [INFO] 
09:14:41 [2020-09-22T13:14:41.645Z] [INFO] --- tycho-packaging-plugin:1.3.0:validate-version (default-validate-version) @ org.eclipse.ease.lang.ruby.jruby ---
09:14:41 [2020-09-22T13:14:41.645Z] [INFO] 
09:14:41 [2020-09-22T13:14:41.645Z] [INFO] >>> maven-javadoc-plugin:2.9.1:javadoc (build-docs) > generate-sources @ org.eclipse.ease.lang.ruby.jruby >>>
09:14:41 [2020-09-22T13:14:41.645Z] [INFO] 
09:14:41 [2020-09-22T13:14:41.645Z] [INFO] --- tycho-packaging-plugin:1.3.0:build-qualifier (default-build-qualifier) @ org.eclipse.ease.lang.ruby.jruby ---
09:14:41 [2020-09-22T13:14:41.645Z] [INFO] The project's OSGi version is 0.8.0.I201910171213
09:14:41 [2020-09-22T13:14:41.645Z] [INFO] 
09:14:41 [2020-09-22T13:14:41.645Z] [INFO] --- tycho-packaging-plugin:1.3.0:validate-id (default-validate-id) @ org.eclipse.ease.lang.ruby.jruby ---
09:14:41 [2020-09-22T13:14:41.645Z] [INFO] 
09:14:41 [2020-09-22T13:14:41.645Z] [INFO] --- tycho-packaging-plugin:1.3.0:validate-version (default-validate-version) @ org.eclipse.ease.lang.ruby.jruby ---
09:14:41 [2020-09-22T13:14:41.645Z] [INFO] 
09:14:41 [2020-09-22T13:14:41.645Z] [INFO] <<< maven-javadoc-plugin:2.9.1:javadoc (build-docs) < generate-sources @ org.eclipse.ease.lang.ruby.jruby <<<
09:14:41 [2020-09-22T13:14:41.645Z] [INFO] 
09:14:41 [2020-09-22T13:14:41.645Z] [INFO] 
09:14:41 [2020-09-22T13:14:41.645Z] [INFO] --- maven-javadoc-plugin:2.9.1:javadoc (build-docs) @ org.eclipse.ease.lang.ruby.jruby ---
09:14:41 [2020-09-22T13:14:41.645Z] [ERROR] Error fetching link: http://help.eclipse.org/oxygen/topic/org.eclipse.platform.doc.isv/reference/api/package-list. Ignored it.
09:14:42 [2020-09-22T13:14:42.585Z] [INFO] 
09:14:42 [2020-09-22T13:14:42.585Z] Loading source files for package org.eclipse.ease.lang.ruby.jruby...
09:14:42 [2020-09-22T13:14:42.585Z] Constructing Javadoc information...
09:14:42 [2020-09-22T13:14:42.585Z] WARNING: Cannot open location "/home/jenkins/agent/workspace/ease.verify.core.gerrit/plugins/org.eclipse.ease.lang.ruby.jruby/target/javadoc-bundle-options/package-list"
09:14:42 [2020-09-22T13:14:42.585Z] [WARNING] Javadoc Warnings
09:14:42 [2020-09-22T13:14:42.585Z] [WARNING] Picked up JAVA_TOOL_OPTIONS: -Dmaven.ext.class.path="/home/jenkins/agent/workspace/ease.verify.core.gerrit@tmp/withMavena810d3b2/pipeline-maven-spy.jar" -Dorg.jenkinsci.plugins.pipeline.maven.reportsFolder="/home/jenkins/agent/workspace/ease.verify.core.gerrit@tmp/withMavena810d3b2"
09:14:42 [2020-09-22T13:14:42.585Z] [INFO] 
09:14:42 [2020-09-22T13:14:42.585Z] [INFO] --- build-helper-maven-plugin:1.9.1:add-resource (add_help) @ org.eclipse.ease.lang.ruby.jruby ---
09:14:42 [2020-09-22T13:14:42.585Z] [INFO] 
09:14:42 [2020-09-22T13:14:42.585Z] [INFO] --- maven-resources-plugin:2.4.3:resources (default-resources) @ org.eclipse.ease.lang.ruby.jruby ---
09:14:42 [2020-09-22T13:14:42.585Z] [INFO] Using 'UTF-8' encoding to copy filtered resources.
09:14:42 [2020-09-22T13:14:42.585Z] [INFO] skip non existing resourceDirectory /home/jenkins/agent/workspace/ease.verify.core.gerrit/plugins/org.eclipse.ease.lang.ruby.jruby/src/main/resources
09:14:42 [2020-09-22T13:14:42.585Z] [INFO] skip non existing resourceDirectory /home/jenkins/agent/workspace/ease.verify.core.gerrit/plugins/org.eclipse.ease.lang.ruby.jruby/help
09:14:42 [2020-09-22T13:14:42.585Z] [INFO] 
09:14:42 [2020-09-22T13:14:42.585Z] [INFO] --- tycho-compiler-plugin:1.3.0:compile (default-compile) @ org.eclipse.ease.lang.ruby.jruby ---
09:14:42 [2020-09-22T13:14:42.585Z] [INFO] Compiling 2 source files to /home/jenkins/agent/workspace/ease.verify.core.gerrit/plugins/org.eclipse.ease.lang.ruby.jruby/target/classes
09:14:42 [2020-09-22T13:14:42.840Z] [INFO] 
09:14:42 [2020-09-22T13:14:42.840Z] [INFO] --- maven-resources-plugin:2.4.3:testResources (default-testResources) @ org.eclipse.ease.lang.ruby.jruby ---
09:14:42 [2020-09-22T13:14:42.840Z] [INFO] Using 'UTF-8' encoding to copy filtered resources.
09:14:42 [2020-09-22T13:14:42.840Z] [INFO] skip non existing resourceDirectory /home/jenkins/agent/workspace/ease.verify.core.gerrit/plugins/org.eclipse.ease.lang.ruby.jruby/src/test/resources
09:14:42 [2020-09-22T13:14:42.840Z] [INFO] 
09:14:42 [2020-09-22T13:14:42.840Z] [INFO] --- tycho-source-plugin:1.3.0:plugin-source (plugin-source) @ org.eclipse.ease.lang.ruby.jruby ---
09:14:42 [2020-09-22T13:14:42.840Z] [INFO] Building jar: /home/jenkins/agent/workspace/ease.verify.core.gerrit/plugins/org.eclipse.ease.lang.ruby.jruby/target/org.eclipse.ease.lang.ruby.jruby-0.8.0-SNAPSHOT-sources.jar
09:14:42 [2020-09-22T13:14:42.840Z] [INFO] 
09:14:42 [2020-09-22T13:14:42.840Z] [INFO] --- target-platform-configuration:1.3.0:target-platform (default-target-platform) @ org.eclipse.ease.lang.ruby.jruby ---
09:14:42 [2020-09-22T13:14:42.840Z] [INFO] 
09:14:42 [2020-09-22T13:14:42.840Z] [INFO] --- tycho-packaging-plugin:1.3.0:package-plugin (default-package-plugin) @ org.eclipse.ease.lang.ruby.jruby ---
09:14:42 [2020-09-22T13:14:42.840Z] [INFO] Building jar: /home/jenkins/agent/workspace/ease.verify.core.gerrit/plugins/org.eclipse.ease.lang.ruby.jruby/target/org.eclipse.ease.lang.ruby.jruby-0.8.0-SNAPSHOT.jar
09:14:42 [2020-09-22T13:14:42.841Z] [INFO] 
09:14:42 [2020-09-22T13:14:42.841Z] [INFO] --- tycho-p2-plugin:1.3.0:p2-metadata-default (default-p2-metadata-default) @ org.eclipse.ease.lang.ruby.jruby ---
09:14:42 [2020-09-22T13:14:42.841Z] [INFO] 
09:14:42 [2020-09-22T13:14:42.841Z] [INFO] --- tycho-source-feature-plugin:1.3.0:source-feature (source-feature) @ org.eclipse.ease.lang.ruby.jruby ---
09:14:42 [2020-09-22T13:14:42.841Z] [INFO] 
09:14:42 [2020-09-22T13:14:42.841Z] [INFO] --- tycho-p2-plugin:1.3.0:p2-metadata (attached-p2-metadata) @ org.eclipse.ease.lang.ruby.jruby ---
09:14:42 [2020-09-22T13:14:42.841Z] [INFO] 
09:14:42 [2020-09-22T13:14:42.841Z] [INFO] -----< org.eclipse.ease:org.eclipse.ease.lang.javascript.nashorn >------
09:14:42 [2020-09-22T13:14:42.841Z] [INFO] Building org.eclipse.ease.lang.javascript.nashorn 0.8.0-SNAPSHOT [17/49]
09:14:42 [2020-09-22T13:14:42.841Z] [INFO] ---------------------------[ eclipse-plugin ]---------------------------
09:14:42 [2020-09-22T13:14:42.841Z] [INFO] 
09:14:42 [2020-09-22T13:14:42.841Z] [INFO] --- maven-clean-plugin:2.5:clean (default-clean) @ org.eclipse.ease.lang.javascript.nashorn ---
09:14:42 [2020-09-22T13:14:42.841Z] [INFO] 
09:14:42 [2020-09-22T13:14:42.841Z] [INFO] --- tycho-packaging-plugin:1.3.0:build-qualifier (default-build-qualifier) @ org.eclipse.ease.lang.javascript.nashorn ---
09:14:42 [2020-09-22T13:14:42.841Z] [INFO] The project's OSGi version is 0.8.0.I202008070902
09:14:42 [2020-09-22T13:14:42.841Z] [INFO] 
09:14:42 [2020-09-22T13:14:42.841Z] [INFO] --- tycho-packaging-plugin:1.3.0:validate-id (default-validate-id) @ org.eclipse.ease.lang.javascript.nashorn ---
09:14:42 [2020-09-22T13:14:42.841Z] [INFO] 
09:14:42 [2020-09-22T13:14:42.841Z] [INFO] --- tycho-packaging-plugin:1.3.0:validate-version (default-validate-version) @ org.eclipse.ease.lang.javascript.nashorn ---
09:14:42 [2020-09-22T13:14:42.841Z] [INFO] 
09:14:42 [2020-09-22T13:14:42.841Z] [INFO] >>> maven-javadoc-plugin:2.9.1:javadoc (build-docs) > generate-sources @ org.eclipse.ease.lang.javascript.nashorn >>>
09:14:42 [2020-09-22T13:14:42.841Z] [INFO] 
09:14:42 [2020-09-22T13:14:42.841Z] [INFO] --- tycho-packaging-plugin:1.3.0:build-qualifier (default-build-qualifier) @ org.eclipse.ease.lang.javascript.nashorn ---
09:14:42 [2020-09-22T13:14:42.841Z] [INFO] The project's OSGi version is 0.8.0.I202008070902
09:14:42 [2020-09-22T13:14:42.841Z] [INFO] 
09:14:42 [2020-09-22T13:14:42.841Z] [INFO] --- tycho-packaging-plugin:1.3.0:validate-id (default-validate-id) @ org.eclipse.ease.lang.javascript.nashorn ---
09:14:42 [2020-09-22T13:14:42.841Z] [INFO] 
09:14:42 [2020-09-22T13:14:42.841Z] [INFO] --- tycho-packaging-plugin:1.3.0:validate-version (default-validate-version) @ org.eclipse.ease.lang.javascript.nashorn ---
09:14:42 [2020-09-22T13:14:42.841Z] [INFO] 
09:14:42 [2020-09-22T13:14:42.841Z] [INFO] <<< maven-javadoc-plugin:2.9.1:javadoc (build-docs) < generate-sources @ org.eclipse.ease.lang.javascript.nashorn <<<
09:14:42 [2020-09-22T13:14:42.841Z] [INFO] 
09:14:42 [2020-09-22T13:14:42.841Z] [INFO] 
09:14:42 [2020-09-22T13:14:42.841Z] [INFO] --- maven-javadoc-plugin:2.9.1:javadoc (build-docs) @ org.eclipse.ease.lang.javascript.nashorn ---
09:14:42 [2020-09-22T13:14:42.841Z] [ERROR] Error fetching link: http://help.eclipse.org/oxygen/topic/org.eclipse.platform.doc.isv/reference/api/package-list. Ignored it.
09:14:44 [2020-09-22T13:14:44.220Z] [INFO] 
09:14:44 [2020-09-22T13:14:44.220Z] Loading source files for package org.eclipse.ease.lang.javascript.nashorn...
09:14:44 [2020-09-22T13:14:44.220Z] Constructing Javadoc information...
09:14:44 [2020-09-22T13:14:44.220Z] WARNING: Cannot open location "/home/jenkins/agent/workspace/ease.verify.core.gerrit/plugins/org.eclipse.ease.lang.javascript.nashorn/target/javadoc-bundle-options/package-list"
09:14:44 [2020-09-22T13:14:44.220Z] [WARNING] Javadoc Warnings
09:14:44 [2020-09-22T13:14:44.220Z] [WARNING] Picked up JAVA_TOOL_OPTIONS: -Dmaven.ext.class.path="/home/jenkins/agent/workspace/ease.verify.core.gerrit@tmp/withMavena810d3b2/pipeline-maven-spy.jar" -Dorg.jenkinsci.plugins.pipeline.maven.reportsFolder="/home/jenkins/agent/workspace/ease.verify.core.gerrit@tmp/withMavena810d3b2"
09:14:44 [2020-09-22T13:14:44.220Z] [INFO] 
09:14:44 [2020-09-22T13:14:44.220Z] [INFO] --- build-helper-maven-plugin:1.9.1:add-resource (add_help) @ org.eclipse.ease.lang.javascript.nashorn ---
09:14:44 [2020-09-22T13:14:44.220Z] [INFO] 
09:14:44 [2020-09-22T13:14:44.220Z] [INFO] --- maven-resources-plugin:2.4.3:resources (default-resources) @ org.eclipse.ease.lang.javascript.nashorn ---
09:14:44 [2020-09-22T13:14:44.220Z] [INFO] Using 'UTF-8' encoding to copy filtered resources.
09:14:44 [2020-09-22T13:14:44.220Z] [INFO] skip non existing resourceDirectory /home/jenkins/agent/workspace/ease.verify.core.gerrit/plugins/org.eclipse.ease.lang.javascript.nashorn/src/main/resources
09:14:44 [2020-09-22T13:14:44.220Z] [INFO] Copying 2 resources to help
09:14:44 [2020-09-22T13:14:44.220Z] [INFO] 
09:14:44 [2020-09-22T13:14:44.221Z] [INFO] --- tycho-compiler-plugin:1.3.0:compile (default-compile) @ org.eclipse.ease.lang.javascript.nashorn ---
09:14:44 [2020-09-22T13:14:44.221Z] [INFO] Compiling 2 source files to /home/jenkins/agent/workspace/ease.verify.core.gerrit/plugins/org.eclipse.ease.lang.javascript.nashorn/target/classes
09:14:44 [2020-09-22T13:14:44.221Z] [INFO] 
09:14:44 [2020-09-22T13:14:44.221Z] [INFO] --- maven-resources-plugin:2.4.3:testResources (default-testResources) @ org.eclipse.ease.lang.javascript.nashorn ---
09:14:44 [2020-09-22T13:14:44.221Z] [INFO] Using 'UTF-8' encoding to copy filtered resources.
09:14:44 [2020-09-22T13:14:44.221Z] [INFO] skip non existing resourceDirectory /home/jenkins/agent/workspace/ease.verify.core.gerrit/plugins/org.eclipse.ease.lang.javascript.nashorn/src/test/resources
09:14:44 [2020-09-22T13:14:44.221Z] [INFO] 
09:14:44 [2020-09-22T13:14:44.221Z] [INFO] --- tycho-source-plugin:1.3.0:plugin-source (plugin-source) @ org.eclipse.ease.lang.javascript.nashorn ---
09:14:44 [2020-09-22T13:14:44.221Z] [WARNING] Bundle-Vendor header not found in /home/jenkins/agent/workspace/ease.verify.core.gerrit/plugins/org.eclipse.ease.lang.javascript.nashorn/META-INF/MANIFEST.MF, fallback to 'unknown' for source bundle
09:14:44 [2020-09-22T13:14:44.221Z] [INFO] Building jar: /home/jenkins/agent/workspace/ease.verify.core.gerrit/plugins/org.eclipse.ease.lang.javascript.nashorn/target/org.eclipse.ease.lang.javascript.nashorn-0.8.0-SNAPSHOT-sources.jar
09:14:44 [2020-09-22T13:14:44.221Z] [INFO] 
09:14:44 [2020-09-22T13:14:44.221Z] [INFO] --- target-platform-configuration:1.3.0:target-platform (default-target-platform) @ org.eclipse.ease.lang.javascript.nashorn ---
09:14:44 [2020-09-22T13:14:44.221Z] [INFO] 
09:14:44 [2020-09-22T13:14:44.221Z] [INFO] --- tycho-packaging-plugin:1.3.0:package-plugin (default-package-plugin) @ org.eclipse.ease.lang.javascript.nashorn ---
09:14:44 [2020-09-22T13:14:44.221Z] [INFO] Building jar: /home/jenkins/agent/workspace/ease.verify.core.gerrit/plugins/org.eclipse.ease.lang.javascript.nashorn/target/org.eclipse.ease.lang.javascript.nashorn-0.8.0-SNAPSHOT.jar
09:14:44 [2020-09-22T13:14:44.221Z] [INFO] 
09:14:44 [2020-09-22T13:14:44.221Z] [INFO] --- tycho-p2-plugin:1.3.0:p2-metadata-default (default-p2-metadata-default) @ org.eclipse.ease.lang.javascript.nashorn ---
09:14:44 [2020-09-22T13:14:44.221Z] [INFO] 
09:14:44 [2020-09-22T13:14:44.221Z] [INFO] --- tycho-source-feature-plugin:1.3.0:source-feature (source-feature) @ org.eclipse.ease.lang.javascript.nashorn ---
09:14:44 [2020-09-22T13:14:44.221Z] [INFO] 
09:14:44 [2020-09-22T13:14:44.221Z] [INFO] --- tycho-p2-plugin:1.3.0:p2-metadata (attached-p2-metadata) @ org.eclipse.ease.lang.javascript.nashorn ---
09:14:44 [2020-09-22T13:14:44.221Z] [INFO] 
09:14:44 [2020-09-22T13:14:44.221Z] [INFO] ------< org.eclipse.ease:org.eclipse.ease.lang.javascript.rhino >-------
09:14:44 [2020-09-22T13:14:44.221Z] [INFO] Building org.eclipse.ease.lang.javascript.rhino 0.8.0-SNAPSHOT   [18/49]
09:14:44 [2020-09-22T13:14:44.221Z] [INFO] ---------------------------[ eclipse-plugin ]---------------------------
09:14:44 [2020-09-22T13:14:44.221Z] [INFO] 
09:14:44 [2020-09-22T13:14:44.221Z] [INFO] --- maven-clean-plugin:2.5:clean (default-clean) @ org.eclipse.ease.lang.javascript.rhino ---
09:14:44 [2020-09-22T13:14:44.221Z] [INFO] 
09:14:44 [2020-09-22T13:14:44.221Z] [INFO] --- tycho-packaging-plugin:1.3.0:build-qualifier (default-build-qualifier) @ org.eclipse.ease.lang.javascript.rhino ---
09:14:44 [2020-09-22T13:14:44.221Z] [INFO] The project's OSGi version is 0.8.0.I202008070902
09:14:44 [2020-09-22T13:14:44.221Z] [INFO] 
09:14:44 [2020-09-22T13:14:44.221Z] [INFO] --- tycho-packaging-plugin:1.3.0:validate-id (default-validate-id) @ org.eclipse.ease.lang.javascript.rhino ---
09:14:44 [2020-09-22T13:14:44.221Z] [INFO] 
09:14:44 [2020-09-22T13:14:44.221Z] [INFO] --- tycho-packaging-plugin:1.3.0:validate-version (default-validate-version) @ org.eclipse.ease.lang.javascript.rhino ---
09:14:44 [2020-09-22T13:14:44.221Z] [INFO] 
09:14:44 [2020-09-22T13:14:44.221Z] [INFO] >>> maven-javadoc-plugin:2.9.1:javadoc (build-docs) > generate-sources @ org.eclipse.ease.lang.javascript.rhino >>>
09:14:44 [2020-09-22T13:14:44.221Z] [INFO] 
09:14:44 [2020-09-22T13:14:44.221Z] [INFO] --- tycho-packaging-plugin:1.3.0:build-qualifier (default-build-qualifier) @ org.eclipse.ease.lang.javascript.rhino ---
09:14:44 [2020-09-22T13:14:44.221Z] [INFO] The project's OSGi version is 0.8.0.I202008070902
09:14:44 [2020-09-22T13:14:44.221Z] [INFO] 
09:14:44 [2020-09-22T13:14:44.221Z] [INFO] --- tycho-packaging-plugin:1.3.0:validate-id (default-validate-id) @ org.eclipse.ease.lang.javascript.rhino ---
09:14:44 [2020-09-22T13:14:44.221Z] [INFO] 
09:14:44 [2020-09-22T13:14:44.221Z] [INFO] --- tycho-packaging-plugin:1.3.0:validate-version (default-validate-version) @ org.eclipse.ease.lang.javascript.rhino ---
09:14:44 [2020-09-22T13:14:44.221Z] [INFO] 
09:14:44 [2020-09-22T13:14:44.221Z] [INFO] <<< maven-javadoc-plugin:2.9.1:javadoc (build-docs) < generate-sources @ org.eclipse.ease.lang.javascript.rhino <<<
09:14:44 [2020-09-22T13:14:44.221Z] [INFO] 
09:14:44 [2020-09-22T13:14:44.221Z] [INFO] 
09:14:44 [2020-09-22T13:14:44.221Z] [INFO] --- maven-javadoc-plugin:2.9.1:javadoc (build-docs) @ org.eclipse.ease.lang.javascript.rhino ---
09:14:44 [2020-09-22T13:14:44.221Z] [ERROR] Error fetching link: http://help.eclipse.org/oxygen/topic/org.eclipse.platform.doc.isv/reference/api/package-list. Ignored it.
09:14:45 [2020-09-22T13:14:45.587Z] [INFO] 
09:14:45 [2020-09-22T13:14:45.587Z] Loading source files for package org.eclipse.ease.lang.javascript.rhino...
09:14:45 [2020-09-22T13:14:45.587Z] Loading source files for package org.eclipse.ease.lang.javascript.rhino.debugger...
09:14:45 [2020-09-22T13:14:45.587Z] Loading source files for package org.eclipse.ease.lang.javascript.rhino.debugger.actions...
09:14:45 [2020-09-22T13:14:45.587Z] Loading source files for package org.eclipse.ease.lang.javascript.rhino.debugger.editor...
09:14:45 [2020-09-22T13:14:45.587Z] Loading source files for package org.eclipse.ease.lang.javascript.rhino.debugger.model...
09:14:45 [2020-09-22T13:14:45.587Z] Constructing Javadoc information...
09:14:45 [2020-09-22T13:14:45.587Z] WARNING: Cannot open location "/home/jenkins/agent/workspace/ease.verify.core.gerrit/plugins/org.eclipse.ease.lang.javascript.rhino/target/javadoc-bundle-options/package-list"
09:14:45 [2020-09-22T13:14:45.587Z] [WARNING] Javadoc Warnings
09:14:45 [2020-09-22T13:14:45.587Z] [WARNING] Picked up JAVA_TOOL_OPTIONS: -Dmaven.ext.class.path="/home/jenkins/agent/workspace/ease.verify.core.gerrit@tmp/withMavena810d3b2/pipeline-maven-spy.jar" -Dorg.jenkinsci.plugins.pipeline.maven.reportsFolder="/home/jenkins/agent/workspace/ease.verify.core.gerrit@tmp/withMavena810d3b2"
09:14:45 [2020-09-22T13:14:45.587Z] [INFO] 
09:14:45 [2020-09-22T13:14:45.587Z] [INFO] --- build-helper-maven-plugin:1.9.1:add-resource (add_help) @ org.eclipse.ease.lang.javascript.rhino ---
09:14:45 [2020-09-22T13:14:45.587Z] [INFO] 
09:14:45 [2020-09-22T13:14:45.587Z] [INFO] --- maven-resources-plugin:2.4.3:resources (default-resources) @ org.eclipse.ease.lang.javascript.rhino ---
09:14:45 [2020-09-22T13:14:45.587Z] [INFO] Using 'UTF-8' encoding to copy filtered resources.
09:14:45 [2020-09-22T13:14:45.587Z] [INFO] skip non existing resourceDirectory /home/jenkins/agent/workspace/ease.verify.core.gerrit/plugins/org.eclipse.ease.lang.javascript.rhino/src/main/resources
09:14:45 [2020-09-22T13:14:45.587Z] [INFO] Copying 2 resources to help
09:14:45 [2020-09-22T13:14:45.587Z] [INFO] 
09:14:45 [2020-09-22T13:14:45.587Z] [INFO] --- tycho-compiler-plugin:1.3.0:compile (default-compile) @ org.eclipse.ease.lang.javascript.rhino ---
09:14:45 [2020-09-22T13:14:45.587Z] [INFO] Compiling 13 source files to /home/jenkins/agent/workspace/ease.verify.core.gerrit/plugins/org.eclipse.ease.lang.javascript.rhino/target/classes
09:14:45 [2020-09-22T13:14:45.587Z] [INFO] 
09:14:45 [2020-09-22T13:14:45.587Z] [INFO] --- maven-resources-plugin:2.4.3:testResources (default-testResources) @ org.eclipse.ease.lang.javascript.rhino ---
09:14:45 [2020-09-22T13:14:45.587Z] [INFO] Using 'UTF-8' encoding to copy filtered resources.
09:14:45 [2020-09-22T13:14:45.587Z] [INFO] skip non existing resourceDirectory /home/jenkins/agent/workspace/ease.verify.core.gerrit/plugins/org.eclipse.ease.lang.javascript.rhino/src/test/resources
09:14:45 [2020-09-22T13:14:45.587Z] [INFO] 
09:14:45 [2020-09-22T13:14:45.587Z] [INFO] --- tycho-source-plugin:1.3.0:plugin-source (plugin-source) @ org.eclipse.ease.lang.javascript.rhino ---
09:14:45 [2020-09-22T13:14:45.587Z] [INFO] Building jar: /home/jenkins/agent/workspace/ease.verify.core.gerrit/plugins/org.eclipse.ease.lang.javascript.rhino/target/org.eclipse.ease.lang.javascript.rhino-0.8.0-SNAPSHOT-sources.jar
09:14:45 [2020-09-22T13:14:45.587Z] [INFO] 
09:14:45 [2020-09-22T13:14:45.588Z] [INFO] --- target-platform-configuration:1.3.0:target-platform (default-target-platform) @ org.eclipse.ease.lang.javascript.rhino ---
09:14:45 [2020-09-22T13:14:45.588Z] [INFO] 
09:14:45 [2020-09-22T13:14:45.588Z] [INFO] --- tycho-packaging-plugin:1.3.0:package-plugin (default-package-plugin) @ org.eclipse.ease.lang.javascript.rhino ---
09:14:45 [2020-09-22T13:14:45.588Z] [INFO] Building jar: /home/jenkins/agent/workspace/ease.verify.core.gerrit/plugins/org.eclipse.ease.lang.javascript.rhino/target/org.eclipse.ease.lang.javascript.rhino-0.8.0-SNAPSHOT.jar
09:14:45 [2020-09-22T13:14:45.588Z] [INFO] 
09:14:45 [2020-09-22T13:14:45.588Z] [INFO] --- tycho-p2-plugin:1.3.0:p2-metadata-default (default-p2-metadata-default) @ org.eclipse.ease.lang.javascript.rhino ---
09:14:45 [2020-09-22T13:14:45.588Z] [INFO] 
09:14:45 [2020-09-22T13:14:45.588Z] [INFO] --- tycho-source-feature-plugin:1.3.0:source-feature (source-feature) @ org.eclipse.ease.lang.javascript.rhino ---
09:14:45 [2020-09-22T13:14:45.588Z] [INFO] 
09:14:45 [2020-09-22T13:14:45.588Z] [INFO] --- tycho-p2-plugin:1.3.0:p2-metadata (attached-p2-metadata) @ org.eclipse.ease.lang.javascript.rhino ---
09:14:45 [2020-09-22T13:14:45.588Z] [INFO] 
09:14:45 [2020-09-22T13:14:45.588Z] [INFO] --------< org.eclipse.ease:org.eclipse.ease.lang.python.jython >--------
09:14:45 [2020-09-22T13:14:45.588Z] [INFO] Building org.eclipse.ease.lang.python.jython 0.8.0-SNAPSHOT      [19/49]
09:14:45 [2020-09-22T13:14:45.588Z] [INFO] ---------------------------[ eclipse-plugin ]---------------------------
09:14:45 [2020-09-22T13:14:45.588Z] [INFO] 
09:14:45 [2020-09-22T13:14:45.588Z] [INFO] --- maven-clean-plugin:2.5:clean (default-clean) @ org.eclipse.ease.lang.python.jython ---
09:14:45 [2020-09-22T13:14:45.588Z] [INFO] 
09:14:45 [2020-09-22T13:14:45.588Z] [INFO] --- tycho-packaging-plugin:1.3.0:build-qualifier (default-build-qualifier) @ org.eclipse.ease.lang.python.jython ---
09:14:45 [2020-09-22T13:14:45.588Z] [INFO] The project's OSGi version is 0.8.0.I202008070902
09:14:45 [2020-09-22T13:14:45.588Z] [INFO] 
09:14:45 [2020-09-22T13:14:45.588Z] [INFO] --- tycho-packaging-plugin:1.3.0:validate-id (default-validate-id) @ org.eclipse.ease.lang.python.jython ---
09:14:45 [2020-09-22T13:14:45.588Z] [INFO] 
09:14:45 [2020-09-22T13:14:45.588Z] [INFO] --- tycho-packaging-plugin:1.3.0:validate-version (default-validate-version) @ org.eclipse.ease.lang.python.jython ---
09:14:45 [2020-09-22T13:14:45.588Z] [INFO] 
09:14:45 [2020-09-22T13:14:45.588Z] [INFO] >>> maven-javadoc-plugin:2.9.1:javadoc (build-docs) > generate-sources @ org.eclipse.ease.lang.python.jython >>>
09:14:45 [2020-09-22T13:14:45.588Z] [INFO] 
09:14:45 [2020-09-22T13:14:45.588Z] [INFO] --- tycho-packaging-plugin:1.3.0:build-qualifier (default-build-qualifier) @ org.eclipse.ease.lang.python.jython ---
09:14:45 [2020-09-22T13:14:45.588Z] [INFO] The project's OSGi version is 0.8.0.I202008070902
09:14:45 [2020-09-22T13:14:45.588Z] [INFO] 
09:14:45 [2020-09-22T13:14:45.588Z] [INFO] --- tycho-packaging-plugin:1.3.0:validate-id (default-validate-id) @ org.eclipse.ease.lang.python.jython ---
09:14:45 [2020-09-22T13:14:45.588Z] [INFO] 
09:14:45 [2020-09-22T13:14:45.588Z] [INFO] --- tycho-packaging-plugin:1.3.0:validate-version (default-validate-version) @ org.eclipse.ease.lang.python.jython ---
09:14:45 [2020-09-22T13:14:45.588Z] [INFO] 
09:14:45 [2020-09-22T13:14:45.588Z] [INFO] <<< maven-javadoc-plugin:2.9.1:javadoc (build-docs) < generate-sources @ org.eclipse.ease.lang.python.jython <<<
09:14:45 [2020-09-22T13:14:45.588Z] [INFO] 
09:14:45 [2020-09-22T13:14:45.588Z] [INFO] 
09:14:45 [2020-09-22T13:14:45.588Z] [INFO] --- maven-javadoc-plugin:2.9.1:javadoc (build-docs) @ org.eclipse.ease.lang.python.jython ---
09:14:45 [2020-09-22T13:14:45.844Z] [ERROR] Error fetching link: http://help.eclipse.org/oxygen/topic/org.eclipse.platform.doc.isv/reference/api/package-list. Ignored it.
09:14:47 [2020-09-22T13:14:47.208Z] [INFO] 
09:14:47 [2020-09-22T13:14:47.208Z] Loading source files for package org.eclipse.ease.lang.python.jython...
09:14:47 [2020-09-22T13:14:47.208Z] Loading source files for package org.eclipse.ease.lang.python.jython.debugger...
09:14:47 [2020-09-22T13:14:47.208Z] Loading source files for package org.eclipse.ease.lang.python.jython.preferences...
09:14:47 [2020-09-22T13:14:47.208Z] Constructing Javadoc information...
09:14:47 [2020-09-22T13:14:47.208Z] WARNING: Cannot open location "/home/jenkins/agent/workspace/ease.verify.core.gerrit/plugins/org.eclipse.ease.lang.python.jython/target/javadoc-bundle-options/package-list"
09:14:47 [2020-09-22T13:14:47.208Z] [WARNING] Javadoc Warnings
09:14:47 [2020-09-22T13:14:47.209Z] [WARNING] Picked up JAVA_TOOL_OPTIONS: -Dmaven.ext.class.path="/home/jenkins/agent/workspace/ease.verify.core.gerrit@tmp/withMavena810d3b2/pipeline-maven-spy.jar" -Dorg.jenkinsci.plugins.pipeline.maven.reportsFolder="/home/jenkins/agent/workspace/ease.verify.core.gerrit@tmp/withMavena810d3b2"
09:14:47 [2020-09-22T13:14:47.209Z] [INFO] 
09:14:47 [2020-09-22T13:14:47.209Z] [INFO] --- build-helper-maven-plugin:1.9.1:add-resource (add_help) @ org.eclipse.ease.lang.python.jython ---
09:14:47 [2020-09-22T13:14:47.209Z] [INFO] 
09:14:47 [2020-09-22T13:14:47.209Z] [INFO] --- maven-resources-plugin:2.4.3:resources (default-resources) @ org.eclipse.ease.lang.python.jython ---
09:14:47 [2020-09-22T13:14:47.209Z] [INFO] Using 'UTF-8' encoding to copy filtered resources.
09:14:47 [2020-09-22T13:14:47.209Z] [INFO] skip non existing resourceDirectory /home/jenkins/agent/workspace/ease.verify.core.gerrit/plugins/org.eclipse.ease.lang.python.jython/src/main/resources
09:14:47 [2020-09-22T13:14:47.209Z] [INFO] Copying 2 resources to help
09:14:47 [2020-09-22T13:14:47.209Z] [INFO] 
09:14:47 [2020-09-22T13:14:47.209Z] [INFO] --- tycho-compiler-plugin:1.3.0:compile (default-compile) @ org.eclipse.ease.lang.python.jython ---
09:14:47 [2020-09-22T13:14:47.209Z] [INFO] Compiling 10 source files to /home/jenkins/agent/workspace/ease.verify.core.gerrit/plugins/org.eclipse.ease.lang.python.jython/target/classes
09:14:47 [2020-09-22T13:14:47.209Z] [INFO] 
09:14:47 [2020-09-22T13:14:47.209Z] [INFO] --- maven-resources-plugin:2.4.3:testResources (default-testResources) @ org.eclipse.ease.lang.python.jython ---
09:14:47 [2020-09-22T13:14:47.209Z] [INFO] Using 'UTF-8' encoding to copy filtered resources.
09:14:47 [2020-09-22T13:14:47.209Z] [INFO] skip non existing resourceDirectory /home/jenkins/agent/workspace/ease.verify.core.gerrit/plugins/org.eclipse.ease.lang.python.jython/src/test/resources
09:14:47 [2020-09-22T13:14:47.209Z] [INFO] 
09:14:47 [2020-09-22T13:14:47.209Z] [INFO] --- tycho-source-plugin:1.3.0:plugin-source (plugin-source) @ org.eclipse.ease.lang.python.jython ---
09:14:47 [2020-09-22T13:14:47.209Z] [WARNING] Bundle-Vendor header not found in /home/jenkins/agent/workspace/ease.verify.core.gerrit/plugins/org.eclipse.ease.lang.python.jython/META-INF/MANIFEST.MF, fallback to 'unknown' for source bundle
09:14:47 [2020-09-22T13:14:47.209Z] [INFO] Building jar: /home/jenkins/agent/workspace/ease.verify.core.gerrit/plugins/org.eclipse.ease.lang.python.jython/target/org.eclipse.ease.lang.python.jython-0.8.0-SNAPSHOT-sources.jar
09:14:47 [2020-09-22T13:14:47.209Z] [INFO] 
09:14:47 [2020-09-22T13:14:47.209Z] [INFO] --- target-platform-configuration:1.3.0:target-platform (default-target-platform) @ org.eclipse.ease.lang.python.jython ---
09:14:47 [2020-09-22T13:14:47.209Z] [INFO] 
09:14:47 [2020-09-22T13:14:47.209Z] [INFO] --- tycho-packaging-plugin:1.3.0:package-plugin (default-package-plugin) @ org.eclipse.ease.lang.python.jython ---
09:14:47 [2020-09-22T13:14:47.209Z] [INFO] Building jar: /home/jenkins/agent/workspace/ease.verify.core.gerrit/plugins/org.eclipse.ease.lang.python.jython/target/org.eclipse.ease.lang.python.jython-0.8.0-SNAPSHOT.jar
09:14:47 [2020-09-22T13:14:47.209Z] [INFO] 
09:14:47 [2020-09-22T13:14:47.209Z] [INFO] --- tycho-p2-plugin:1.3.0:p2-metadata-default (default-p2-metadata-default) @ org.eclipse.ease.lang.python.jython ---
09:14:47 [2020-09-22T13:14:47.209Z] [INFO] 
09:14:47 [2020-09-22T13:14:47.209Z] [INFO] --- tycho-source-feature-plugin:1.3.0:source-feature (source-feature) @ org.eclipse.ease.lang.python.jython ---
09:14:47 [2020-09-22T13:14:47.209Z] [INFO] 
09:14:47 [2020-09-22T13:14:47.209Z] [INFO] --- tycho-p2-plugin:1.3.0:p2-metadata (attached-p2-metadata) @ org.eclipse.ease.lang.python.jython ---
09:14:47 [2020-09-22T13:14:47.209Z] [INFO] 
09:14:47 [2020-09-22T13:14:47.209Z] [INFO] --------< org.eclipse.ease:org.eclipse.ease.lang.javascript.ui >--------
09:14:47 [2020-09-22T13:14:47.209Z] [INFO] Building org.eclipse.ease.lang.javascript.ui 0.8.0-SNAPSHOT      [20/49]
09:14:47 [2020-09-22T13:14:47.209Z] [INFO] ---------------------------[ eclipse-plugin ]---------------------------
09:14:47 [2020-09-22T13:14:47.209Z] [INFO] 
09:14:47 [2020-09-22T13:14:47.209Z] [INFO] --- maven-clean-plugin:2.5:clean (default-clean) @ org.eclipse.ease.lang.javascript.ui ---
09:14:47 [2020-09-22T13:14:47.209Z] [INFO] 
09:14:47 [2020-09-22T13:14:47.209Z] [INFO] --- tycho-packaging-plugin:1.3.0:build-qualifier (default-build-qualifier) @ org.eclipse.ease.lang.javascript.ui ---
09:14:47 [2020-09-22T13:14:47.209Z] [INFO] The project's OSGi version is 0.8.0.I201910171213
09:14:47 [2020-09-22T13:14:47.209Z] [INFO] 
09:14:47 [2020-09-22T13:14:47.209Z] [INFO] --- tycho-packaging-plugin:1.3.0:validate-id (default-validate-id) @ org.eclipse.ease.lang.javascript.ui ---
09:14:47 [2020-09-22T13:14:47.209Z] [INFO] 
09:14:47 [2020-09-22T13:14:47.209Z] [INFO] --- tycho-packaging-plugin:1.3.0:validate-version (default-validate-version) @ org.eclipse.ease.lang.javascript.ui ---
09:14:47 [2020-09-22T13:14:47.209Z] [INFO] 
09:14:47 [2020-09-22T13:14:47.209Z] [INFO] >>> maven-javadoc-plugin:2.9.1:javadoc (build-docs) > generate-sources @ org.eclipse.ease.lang.javascript.ui >>>
09:14:47 [2020-09-22T13:14:47.209Z] [INFO] 
09:14:47 [2020-09-22T13:14:47.209Z] [INFO] --- tycho-packaging-plugin:1.3.0:build-qualifier (default-build-qualifier) @ org.eclipse.ease.lang.javascript.ui ---
09:14:47 [2020-09-22T13:14:47.209Z] [INFO] The project's OSGi version is 0.8.0.I201910171213
09:14:47 [2020-09-22T13:14:47.209Z] [INFO] 
09:14:47 [2020-09-22T13:14:47.209Z] [INFO] --- tycho-packaging-plugin:1.3.0:validate-id (default-validate-id) @ org.eclipse.ease.lang.javascript.ui ---
09:14:47 [2020-09-22T13:14:47.209Z] [INFO] 
09:14:47 [2020-09-22T13:14:47.209Z] [INFO] --- tycho-packaging-plugin:1.3.0:validate-version (default-validate-version) @ org.eclipse.ease.lang.javascript.ui ---
09:14:47 [2020-09-22T13:14:47.209Z] [INFO] 
09:14:47 [2020-09-22T13:14:47.209Z] [INFO] <<< maven-javadoc-plugin:2.9.1:javadoc (build-docs) < generate-sources @ org.eclipse.ease.lang.javascript.ui <<<
09:14:47 [2020-09-22T13:14:47.209Z] [INFO] 
09:14:47 [2020-09-22T13:14:47.209Z] [INFO] 
09:14:47 [2020-09-22T13:14:47.210Z] [INFO] --- maven-javadoc-plugin:2.9.1:javadoc (build-docs) @ org.eclipse.ease.lang.javascript.ui ---
09:14:47 [2020-09-22T13:14:47.465Z] [ERROR] Error fetching link: http://help.eclipse.org/oxygen/topic/org.eclipse.platform.doc.isv/reference/api/package-list. Ignored it.
09:14:48 [2020-09-22T13:14:48.831Z] [INFO] 
09:14:48 [2020-09-22T13:14:48.831Z] Loading source files for package org.eclipse.ease.lang.javascript.ui...
09:14:48 [2020-09-22T13:14:48.831Z] Loading source files for package org.eclipse.ease.lang.javascript.ui.completion...
09:14:48 [2020-09-22T13:14:48.831Z] Constructing Javadoc information...
09:14:48 [2020-09-22T13:14:48.831Z] WARNING: Cannot open location "/home/jenkins/agent/workspace/ease.verify.core.gerrit/plugins/org.eclipse.ease.lang.javascript.ui/target/javadoc-bundle-options/package-list"
09:14:48 [2020-09-22T13:14:48.831Z] [WARNING] Javadoc Warnings
09:14:48 [2020-09-22T13:14:48.831Z] [WARNING] Picked up JAVA_TOOL_OPTIONS: -Dmaven.ext.class.path="/home/jenkins/agent/workspace/ease.verify.core.gerrit@tmp/withMavena810d3b2/pipeline-maven-spy.jar" -Dorg.jenkinsci.plugins.pipeline.maven.reportsFolder="/home/jenkins/agent/workspace/ease.verify.core.gerrit@tmp/withMavena810d3b2"
09:14:48 [2020-09-22T13:14:48.831Z] [INFO] 
09:14:48 [2020-09-22T13:14:48.831Z] [INFO] --- build-helper-maven-plugin:1.9.1:add-resource (add_help) @ org.eclipse.ease.lang.javascript.ui ---
09:14:48 [2020-09-22T13:14:48.831Z] [INFO] 
09:14:48 [2020-09-22T13:14:48.831Z] [INFO] --- maven-resources-plugin:2.4.3:resources (default-resources) @ org.eclipse.ease.lang.javascript.ui ---
09:14:48 [2020-09-22T13:14:48.831Z] [INFO] Using 'UTF-8' encoding to copy filtered resources.
09:14:48 [2020-09-22T13:14:48.831Z] [INFO] skip non existing resourceDirectory /home/jenkins/agent/workspace/ease.verify.core.gerrit/plugins/org.eclipse.ease.lang.javascript.ui/src/main/resources
09:14:48 [2020-09-22T13:14:48.831Z] [INFO] skip non existing resourceDirectory /home/jenkins/agent/workspace/ease.verify.core.gerrit/plugins/org.eclipse.ease.lang.javascript.ui/help
09:14:48 [2020-09-22T13:14:48.831Z] [INFO] 
09:14:48 [2020-09-22T13:14:48.831Z] [INFO] --- tycho-compiler-plugin:1.3.0:compile (default-compile) @ org.eclipse.ease.lang.javascript.ui ---
09:14:48 [2020-09-22T13:14:48.831Z] [INFO] Compiling 5 source files to /home/jenkins/agent/workspace/ease.verify.core.gerrit/plugins/org.eclipse.ease.lang.javascript.ui/target/classes
09:14:48 [2020-09-22T13:14:48.831Z] [INFO] 
09:14:48 [2020-09-22T13:14:48.831Z] [INFO] --- maven-resources-plugin:2.4.3:testResources (default-testResources) @ org.eclipse.ease.lang.javascript.ui ---
09:14:48 [2020-09-22T13:14:48.831Z] [INFO] Using 'UTF-8' encoding to copy filtered resources.
09:14:48 [2020-09-22T13:14:48.831Z] [INFO] skip non existing resourceDirectory /home/jenkins/agent/workspace/ease.verify.core.gerrit/plugins/org.eclipse.ease.lang.javascript.ui/src/test/resources
09:14:48 [2020-09-22T13:14:48.831Z] [INFO] 
09:14:48 [2020-09-22T13:14:48.831Z] [INFO] --- tycho-source-plugin:1.3.0:plugin-source (plugin-source) @ org.eclipse.ease.lang.javascript.ui ---
09:14:48 [2020-09-22T13:14:48.831Z] [INFO] Building jar: /home/jenkins/agent/workspace/ease.verify.core.gerrit/plugins/org.eclipse.ease.lang.javascript.ui/target/org.eclipse.ease.lang.javascript.ui-0.8.0-SNAPSHOT-sources.jar
09:14:48 [2020-09-22T13:14:48.831Z] [INFO] 
09:14:48 [2020-09-22T13:14:48.831Z] [INFO] --- target-platform-configuration:1.3.0:target-platform (default-target-platform) @ org.eclipse.ease.lang.javascript.ui ---
09:14:48 [2020-09-22T13:14:48.831Z] [INFO] 
09:14:48 [2020-09-22T13:14:48.831Z] [INFO] --- tycho-packaging-plugin:1.3.0:package-plugin (default-package-plugin) @ org.eclipse.ease.lang.javascript.ui ---
09:14:48 [2020-09-22T13:14:48.831Z] [INFO] Building jar: /home/jenkins/agent/workspace/ease.verify.core.gerrit/plugins/org.eclipse.ease.lang.javascript.ui/target/org.eclipse.ease.lang.javascript.ui-0.8.0-SNAPSHOT.jar
09:14:48 [2020-09-22T13:14:48.831Z] [INFO] 
09:14:48 [2020-09-22T13:14:48.831Z] [INFO] --- tycho-p2-plugin:1.3.0:p2-metadata-default (default-p2-metadata-default) @ org.eclipse.ease.lang.javascript.ui ---
09:14:48 [2020-09-22T13:14:48.831Z] [INFO] 
09:14:48 [2020-09-22T13:14:48.831Z] [INFO] --- tycho-source-feature-plugin:1.3.0:source-feature (source-feature) @ org.eclipse.ease.lang.javascript.ui ---
09:14:48 [2020-09-22T13:14:48.831Z] [INFO] 
09:14:48 [2020-09-22T13:14:48.831Z] [INFO] --- tycho-p2-plugin:1.3.0:p2-metadata (attached-p2-metadata) @ org.eclipse.ease.lang.javascript.ui ---
09:14:48 [2020-09-22T13:14:48.831Z] [INFO] 
09:14:48 [2020-09-22T13:14:48.832Z] [INFO] --------< org.eclipse.ease:org.eclipse.ease.lang.jvm.compiled >---------
09:14:48 [2020-09-22T13:14:48.832Z] [INFO] Building org.eclipse.ease.lang.jvm.compiled 0.8.0-SNAPSHOT       [21/49]
09:14:48 [2020-09-22T13:14:48.832Z] [INFO] ---------------------------[ eclipse-plugin ]---------------------------
09:14:48 [2020-09-22T13:14:48.832Z] [INFO] 
09:14:48 [2020-09-22T13:14:48.832Z] [INFO] --- maven-clean-plugin:2.5:clean (default-clean) @ org.eclipse.ease.lang.jvm.compiled ---
09:14:48 [2020-09-22T13:14:48.832Z] [INFO] 
09:14:48 [2020-09-22T13:14:48.832Z] [INFO] --- tycho-packaging-plugin:1.3.0:build-qualifier (default-build-qualifier) @ org.eclipse.ease.lang.jvm.compiled ---
09:14:48 [2020-09-22T13:14:48.832Z] [INFO] The project's OSGi version is 0.8.0.I201910171213
09:14:48 [2020-09-22T13:14:48.832Z] [INFO] 
09:14:48 [2020-09-22T13:14:48.832Z] [INFO] --- tycho-packaging-plugin:1.3.0:validate-id (default-validate-id) @ org.eclipse.ease.lang.jvm.compiled ---
09:14:48 [2020-09-22T13:14:48.832Z] [INFO] 
09:14:48 [2020-09-22T13:14:48.832Z] [INFO] --- tycho-packaging-plugin:1.3.0:validate-version (default-validate-version) @ org.eclipse.ease.lang.jvm.compiled ---
09:14:48 [2020-09-22T13:14:48.832Z] [INFO] 
09:14:48 [2020-09-22T13:14:48.832Z] [INFO] >>> maven-javadoc-plugin:2.9.1:javadoc (build-docs) > generate-sources @ org.eclipse.ease.lang.jvm.compiled >>>
09:14:48 [2020-09-22T13:14:48.832Z] [INFO] 
09:14:48 [2020-09-22T13:14:48.832Z] [INFO] --- tycho-packaging-plugin:1.3.0:build-qualifier (default-build-qualifier) @ org.eclipse.ease.lang.jvm.compiled ---
09:14:48 [2020-09-22T13:14:48.832Z] [INFO] The project's OSGi version is 0.8.0.I201910171213
09:14:48 [2020-09-22T13:14:48.832Z] [INFO] 
09:14:48 [2020-09-22T13:14:48.832Z] [INFO] --- tycho-packaging-plugin:1.3.0:validate-id (default-validate-id) @ org.eclipse.ease.lang.jvm.compiled ---
09:14:48 [2020-09-22T13:14:48.832Z] [INFO] 
09:14:48 [2020-09-22T13:14:48.832Z] [INFO] --- tycho-packaging-plugin:1.3.0:validate-version (default-validate-version) @ org.eclipse.ease.lang.jvm.compiled ---
09:14:48 [2020-09-22T13:14:48.832Z] [INFO] 
09:14:48 [2020-09-22T13:14:48.832Z] [INFO] <<< maven-javadoc-plugin:2.9.1:javadoc (build-docs) < generate-sources @ org.eclipse.ease.lang.jvm.compiled <<<
09:14:48 [2020-09-22T13:14:48.832Z] [INFO] 
09:14:48 [2020-09-22T13:14:48.832Z] [INFO] 
09:14:48 [2020-09-22T13:14:48.832Z] [INFO] --- maven-javadoc-plugin:2.9.1:javadoc (build-docs) @ org.eclipse.ease.lang.jvm.compiled ---
09:14:49 [2020-09-22T13:14:49.087Z] [ERROR] Error fetching link: http://help.eclipse.org/oxygen/topic/org.eclipse.platform.doc.isv/reference/api/package-list. Ignored it.
09:14:49 [2020-09-22T13:14:49.650Z] [INFO] 
09:14:49 [2020-09-22T13:14:49.650Z] Loading source files for package org.eclipse.ease.lang.jvm.compiled...
09:14:49 [2020-09-22T13:14:49.650Z] Constructing Javadoc information...
09:14:49 [2020-09-22T13:14:49.650Z] 1 error
09:14:49 [2020-09-22T13:14:49.650Z] [INFO] ------------------------------------------------------------------------
09:14:49 [2020-09-22T13:14:49.650Z] [INFO] Reactor Summary:
09:14:49 [2020-09-22T13:14:49.650Z] [INFO] 
09:14:49 [2020-09-22T13:14:49.650Z] [INFO] org.eclipse.ease.releng 0.8.0-SNAPSHOT ............. SUCCESS [  3.456 s]
09:14:49 [2020-09-22T13:14:49.650Z] [INFO] org.eclipse.ease.classloader 0.8.0-SNAPSHOT ........ SUCCESS [  3.062 s]
09:14:49 [2020-09-22T13:14:49.650Z] [INFO] org.eclipse.ease 0.8.0-SNAPSHOT .................... SUCCESS [  2.474 s]
09:14:49 [2020-09-22T13:14:49.650Z] [INFO] org.eclipse.ease.ui 0.8.0-SNAPSHOT ................. SUCCESS [  2.516 s]
09:14:49 [2020-09-22T13:14:49.650Z] [INFO] org.eclipse.ease.ui.completions.java 0.8.0-SNAPSHOT  SUCCESS [  1.691 s]
09:14:49 [2020-09-22T13:14:49.650Z] [INFO] org.eclipse.ease.ui.scripts 0.8.0-SNAPSHOT ......... SUCCESS [  2.410 s]
09:14:49 [2020-09-22T13:14:49.650Z] [INFO] org.eclipse.ease.lang.javascript 0.8.0-SNAPSHOT .... SUCCESS [  1.335 s]
09:14:49 [2020-09-22T13:14:49.650Z] [INFO] org.eclipse.ease.lang.scriptarchive 0.8.0-SNAPSHOT . SUCCESS [  1.480 s]
09:14:49 [2020-09-22T13:14:49.650Z] [INFO] org.eclipse.ease.lang.python 0.8.0-SNAPSHOT ........ SUCCESS [  1.506 s]
09:14:49 [2020-09-22T13:14:49.650Z] [INFO] org.eclipse.ease.lang.python.py4j 0.8.0-SNAPSHOT ... SUCCESS [  1.473 s]
09:14:49 [2020-09-22T13:14:49.650Z] [INFO] org.eclipse.ease.lang.groovy 0.8.0-SNAPSHOT ........ SUCCESS [  1.344 s]
09:14:49 [2020-09-22T13:14:49.650Z] [INFO] org.eclipse.ease.lang.groovy.interpreter 0.8.0-SNAPSHOT SUCCESS [  1.381 s]
09:14:49 [2020-09-22T13:14:49.650Z] [INFO] org.eclipse.ease.lang.unittest 0.8.0-SNAPSHOT ...... SUCCESS [  1.990 s]
09:14:49 [2020-09-22T13:14:49.650Z] [INFO] org.eclipse.ease.lang.unittest.ui 0.8.0-SNAPSHOT ... SUCCESS [  1.869 s]
09:14:49 [2020-09-22T13:14:49.650Z] [INFO] org.eclipse.ease.lang.ruby 0.8.0-SNAPSHOT .......... SUCCESS [  1.363 s]
09:14:49 [2020-09-22T13:14:49.650Z] [INFO] org.eclipse.ease.lang.ruby.jruby 0.8.0-SNAPSHOT .... SUCCESS [  1.359 s]
09:14:49 [2020-09-22T13:14:49.650Z] [INFO] org.eclipse.ease.lang.javascript.nashorn 0.8.0-SNAPSHOT SUCCESS [  1.262 s]
09:14:49 [2020-09-22T13:14:49.650Z] [INFO] org.eclipse.ease.lang.javascript.rhino 0.8.0-SNAPSHOT SUCCESS [  1.575 s]
09:14:49 [2020-09-22T13:14:49.650Z] [INFO] org.eclipse.ease.lang.python.jython 0.8.0-SNAPSHOT . SUCCESS [  1.543 s]
09:14:49 [2020-09-22T13:14:49.650Z] [INFO] org.eclipse.ease.lang.javascript.ui 0.8.0-SNAPSHOT . SUCCESS [  1.513 s]
09:14:49 [2020-09-22T13:14:49.650Z] [INFO] org.eclipse.ease.lang.jvm.compiled 0.8.0-SNAPSHOT .. FAILURE [  1.088 s]
09:14:49 [2020-09-22T13:14:49.650Z] [INFO] org.eclipse.ease.lang.scriptarchive.ui 0.8.0-SNAPSHOT SKIPPED
09:14:49 [2020-09-22T13:14:49.650Z] [INFO] org.eclipse.ease.help 0.8.0-SNAPSHOT ............... SKIPPED
09:14:49 [2020-09-22T13:14:49.650Z] [INFO] org.eclipse.ease.feature 0.8.0-SNAPSHOT ............ SKIPPED
09:14:49 [2020-09-22T13:14:49.650Z] [INFO] org.eclipse.ease.ui.feature 0.8.0-SNAPSHOT ......... SKIPPED
09:14:49 [2020-09-22T13:14:49.650Z] [INFO] org.eclipse.ease.lang.javascript.feature 0.8.0-SNAPSHOT SKIPPED
09:14:49 [2020-09-22T13:14:49.650Z] [INFO] org.eclipse.ease.lang.python.feature 0.8.0-SNAPSHOT  SKIPPED
09:14:49 [2020-09-22T13:14:49.650Z] [INFO] org.eclipse.ease.python.jython.feature 0.8.0-SNAPSHOT SKIPPED
09:14:49 [2020-09-22T13:14:49.650Z] [INFO] org.eclipse.ease.lang.python.py4j.feature 0.8.0-SNAPSHOT SKIPPED
09:14:49 [2020-09-22T13:14:49.650Z] [INFO] org.eclipse.ease.lang.jvm.feature 0.8.0-SNAPSHOT ... SKIPPED
09:14:49 [2020-09-22T13:14:49.650Z] [INFO] org.eclipse.ease.lang.groovy.feature 0.8.0-SNAPSHOT  SKIPPED
09:14:49 [2020-09-22T13:14:49.650Z] [INFO] org.eclipse.ease.lang.ruby.feature 0.8.0-SNAPSHOT .. SKIPPED
09:14:49 [2020-09-22T13:14:49.650Z] [INFO] org.eclipse.ease.lang.scriptarchive.feature 0.8.0-SNAPSHOT SKIPPED
09:14:49 [2020-09-22T13:14:49.650Z] [INFO] org.eclipse.ease.lang.unittest.feature 0.8.0-SNAPSHOT SKIPPED
09:14:49 [2020-09-22T13:14:49.650Z] [INFO] org.eclipse.ease.releng.target 0.8.0-SNAPSHOT ...... SKIPPED
09:14:49 [2020-09-22T13:14:49.650Z] [INFO] org.eclipse.ease.releng.p2 0.8.0-SNAPSHOT .......... SKIPPED
09:14:49 [2020-09-22T13:14:49.650Z] [INFO] org.eclipse.ease.testhelper 0.8.0-SNAPSHOT ......... SKIPPED
09:14:49 [2020-09-22T13:14:49.650Z] [INFO] org.eclipse.ease.test 0.8.0-SNAPSHOT ............... SKIPPED
09:14:49 [2020-09-22T13:14:49.650Z] [INFO] org.eclipse.ease.lang.javascript.nashorn.test 0.8.0-SNAPSHOT SKIPPED
09:14:49 [2020-09-22T13:14:49.650Z] [INFO] org.eclipse.ease.lang.javascript.rhino.test 0.8.0-SNAPSHOT SKIPPED
09:14:49 [2020-09-22T13:14:49.650Z] [INFO] org.eclipse.ease.lang.javascript.test 0.8.0-SNAPSHOT SKIPPED
09:14:49 [2020-09-22T13:14:49.650Z] [INFO] org.eclipse.ease.lang.python.test 0.8.0-SNAPSHOT ... SKIPPED
09:14:49 [2020-09-22T13:14:49.650Z] [INFO] org.eclipse.ease.lang.python.jython.test 0.8.0-SNAPSHOT SKIPPED
09:14:49 [2020-09-22T13:14:49.650Z] [INFO] org.eclipse.ease.lang.python.py4j.test 0.8.0-SNAPSHOT SKIPPED
09:14:49 [2020-09-22T13:14:49.650Z] [INFO] org.eclipse.ease.lang.scriptarchive.test 0.8.0-SNAPSHOT SKIPPED
09:14:49 [2020-09-22T13:14:49.650Z] [INFO] org.eclipse.ease.lang.unittest.test 0.8.0-SNAPSHOT . SKIPPED
09:14:49 [2020-09-22T13:14:49.650Z] [INFO] org.eclipse.ease.ui.scripts.test 0.8.0-SNAPSHOT .... SKIPPED
09:14:49 [2020-09-22T13:14:49.650Z] [INFO] org.eclipse.ease.ui.test 0.8.0-SNAPSHOT ............ SKIPPED
09:14:49 [2020-09-22T13:14:49.650Z] [INFO] EASE (Incubation) 0.4.0-SNAPSHOT ................... SKIPPED
09:14:49 [2020-09-22T13:14:49.650Z] [INFO] ------------------------------------------------------------------------
09:14:49 [2020-09-22T13:14:49.650Z] [INFO] BUILD FAILURE
09:14:49 [2020-09-22T13:14:49.650Z] [INFO] ------------------------------------------------------------------------
09:14:49 [2020-09-22T13:14:49.650Z] [INFO] Total time:  02:49 min
09:14:49 [2020-09-22T13:14:49.650Z] [INFO] Finished at: 2020-09-22T13:14:49Z
09:14:49 [2020-09-22T13:14:49.650Z] [INFO] ------------------------------------------------------------------------
09:14:49 [2020-09-22T13:14:49.650Z] [INFO] [jenkins-event-spy] Generated /home/jenkins/agent/workspace/ease.verify.core.gerrit@tmp/withMavena810d3b2/maven-spy-20200922-131159-5356579163346778495268.log
09:14:49 [2020-09-22T13:14:49.651Z] [ERROR] Failed to execute goal org.apache.maven.plugins:maven-javadoc-plugin:2.9.1:javadoc (build-docs) on project org.eclipse.ease.lang.jvm.compiled: An error has occurred in JavaDocs report generation: 
09:14:49 [2020-09-22T13:14:49.651Z] [ERROR] Exit code: 1 - Picked up JAVA_TOOL_OPTIONS: -Dmaven.ext.class.path="/home/jenkins/agent/workspace/ease.verify.core.gerrit@tmp/withMavena810d3b2/pipeline-maven-spy.jar" -Dorg.jenkinsci.plugins.pipeline.maven.reportsFolder="/home/jenkins/agent/workspace/ease.verify.core.gerrit@tmp/withMavena810d3b2" 
09:14:49 [2020-09-22T13:14:49.651Z] [ERROR] /home/jenkins/agent/workspace/ease.verify.core.gerrit/plugins/org.eclipse.ease.lang.jvm.compiled/src/org/eclipse/ease/lang/jvm/compiled/JVMCompiledScriptEngine.java:48: error: cannot access IBundleProjectDescription
09:14:49 [2020-09-22T13:14:49.651Z] [ERROR] import org.eclipse.pde.core.project.IBundleProjectDescription;
09:14:49 [2020-09-22T13:14:49.651Z] [ERROR]                                    ^
09:14:49 [2020-09-22T13:14:49.651Z] [ERROR]   bad class file: /home/jenkins/.m2/repository/p2/osgi/bundle/org.eclipse.pde.core/3.14.0.v20200817-1143/org.eclipse.pde.core-3.14.0.v20200817-1143.jar(org/eclipse/pde/core/project/IBundleProjectDescription.class)
09:14:49 [2020-09-22T13:14:49.651Z] [ERROR]     class file has wrong version 55.0, should be 52.0
09:14:49 [2020-09-22T13:14:49.651Z] [ERROR]     Please remove or make sure it appears in the correct subdirectory of the classpath.
09:14:49 [2020-09-22T13:14:49.651Z] [ERROR] 
09:14:49 [2020-09-22T13:14:49.651Z] [ERROR] Command line was: /opt/tools/java/oracle/jdk-8/1.8.0_202/jre/../bin/javadoc @options @packages
09:14:49 [2020-09-22T13:14:49.651Z] [ERROR] 
09:14:49 [2020-09-22T13:14:49.651Z] [ERROR] Refer to the generated Javadoc files in '/home/jenkins/agent/workspace/ease.verify.core.gerrit/plugins/org.eclipse.ease.lang.jvm.compiled/target/site/apidocs' dir.
09:14:49 [2020-09-22T13:14:49.651Z] [ERROR] -> [Help 1]
09:14:49 [2020-09-22T13:14:49.651Z] [ERROR] 
09:14:49 [2020-09-22T13:14:49.651Z] [ERROR] To see the full stack trace of the errors, re-run Maven with the -e switch.
09:14:49 [2020-09-22T13:14:49.651Z] [ERROR] Re-run Maven using the -X switch to enable full debug logging.
09:14:49 [2020-09-22T13:14:49.651Z] [ERROR] 
09:14:49 [2020-09-22T13:14:49.651Z] [ERROR] For more information about the errors and possible solutions, please read the following articles:
09:14:49 [2020-09-22T13:14:49.651Z] [ERROR] [Help 1] http://cwiki.apache.org/confluence/display/MAVEN/MojoExecutionException
09:14:49 [2020-09-22T13:14:49.651Z] [ERROR] 
09:14:49 [2020-09-22T13:14:49.651Z] [ERROR] After correcting the problems, you can resume the build with the command
09:14:49 [2020-09-22T13:14:49.651Z] [ERROR]   mvn <args> -rf :org.eclipse.ease.lang.jvm.compiled
[Pipeline] }
09:14:51 [2020-09-22T13:14:51.386Z] [withMaven] Publishers: Pipeline Graph Publisher: 35 ms, Dependencies Fingerprint Publisher: 230 ms
[Pipeline] // withMaven
[Pipeline] }
[Pipeline] // stage
[Pipeline] }
09:14:51 [2020-09-22T13:14:51.445Z] Failed in branch EASE Core
[Pipeline] // parallel
[Pipeline] }
[Pipeline] // stage
[Pipeline] stage
[Pipeline] { (Declarative: Post Actions)
[Pipeline] archiveArtifacts
09:14:51 [2020-09-22T13:14:51.544Z] Archiving artifacts
[Pipeline] emailext
09:14:56 [2020-09-22T13:14:56.758Z] Sending email to: christian.pontesegger@web.de
[Pipeline] }
[Pipeline] // stage
[Pipeline] }
[Pipeline] // timeout
[Pipeline] }
[Pipeline] // timestamps
[Pipeline] }
[Pipeline] // node
[Pipeline] End of Pipeline
ERROR: script returned exit code 1
Finished: FAILURE