Console Output

Started by upstream project "ease.build.nightly" build number 1205
originally caused by:
 Started by timer
[Pipeline] Start of Pipeline
[Pipeline] node
Still waiting to schedule task
Waiting for next available executor
Agent basic-xfh7n is provisioned from template basic
---
apiVersion: "v1"
kind: "Pod"
metadata:
  annotations: {}
  labels:
    jenkins: "slave"
    jenkins/label-digest: "61a7508ed1b04e9ada836fcd14d4d8ef5687c7dd"
    jenkins/label: "basic"
  name: "basic-xfh7n"
  namespace: "ease"
spec:
  containers:
  - env:
    - name: "JENKINS_SECRET"
      value: "********"
    - name: "JENKINS_TUNNEL"
      value: "jenkins-discovery.ease.svc.cluster.local:50000"
    - name: "JENKINS_AGENT_NAME"
      value: "basic-xfh7n"
    - name: "JENKINS_REMOTING_JAVA_OPTS"
      value: "-showversion -XshowSettings:vm -Xmx256m -Dorg.jenkinsci.remoting.engine.JnlpProtocol3.disabled=true\
        \ -Dorg.jenkinsci.plugins.gitclient.CliGitAPIImpl.useSETSID=true"
    - name: "JAVA_TOOL_OPTIONS"
      value: ""
    - name: "_JAVA_OPTIONS"
      value: ""
    - name: "OPENJ9_JAVA_OPTIONS"
      value: "-XX:+IgnoreUnrecognizedVMOptions -XX:+IdleTuningCompactOnIdle -XX:+IdleTuningGcOnIdle"
    - name: "JENKINS_NAME"
      value: "basic-xfh7n"
    - name: "JENKINS_AGENT_WORKDIR"
      value: "/home/jenkins/agent"
    - name: "JENKINS_URL"
      value: "http://jenkins-ui.ease.svc.cluster.local/ease/"
    image: "docker.io/eclipsecbi/jiro-agent-basic:remoting-4.13"
    imagePullPolicy: "Always"
    name: "jnlp"
    resources:
      limits:
        cpu: "2000m"
        memory: "4096Mi"
      requests:
        cpu: "1000m"
        memory: "4096Mi"
    tty: true
    volumeMounts:
    - mountPath: "/home/jenkins/.m2/toolchains.xml"
      name: "m2-dir"
      readOnly: true
      subPath: "toolchains.xml"
    - mountPath: "/home/jenkins/.mavenrc"
      name: "m2-dir"
      readOnly: true
      subPath: ".mavenrc"
    - mountPath: "/opt/tools"
      name: "volume-0"
      readOnly: false
    - mountPath: "/home/jenkins"
      name: "volume-2"
      readOnly: false
    - mountPath: "/home/jenkins/.m2/repository"
      name: "volume-3"
      readOnly: false
    - mountPath: "/home/jenkins/.m2/settings-security.xml"
      name: "m2-secret-dir"
      readOnly: true
      subPath: "settings-security.xml"
    - mountPath: "/home/jenkins/.m2/wrapper"
      name: "volume-4"
      readOnly: false
    - mountPath: "/home/jenkins/.m2/settings.xml"
      name: "m2-secret-dir"
      readOnly: true
      subPath: "settings.xml"
    - mountPath: "/home/jenkins/.ssh"
      name: "volume-1"
      readOnly: false
      subPath: ""
    - mountPath: "/home/jenkins/agent"
      name: "workspace-volume"
      readOnly: false
    workingDir: "/home/jenkins/agent"
  nodeSelector:
    kubernetes.io/os: "linux"
  restartPolicy: "Never"
  volumes:
  - name: "volume-0"
    persistentVolumeClaim:
      claimName: "tools-claim-jiro-ease"
      readOnly: true
  - name: "m2-secret-dir"
    secret:
      secretName: "m2-secret-dir"
  - emptyDir:
      medium: ""
    name: "volume-2"
  - configMap:
      name: "m2-dir"
    name: "m2-dir"
  - configMap:
      name: "known-hosts"
    name: "volume-1"
  - emptyDir:
      medium: ""
    name: "workspace-volume"
  - emptyDir:
      medium: ""
    name: "volume-4"
  - emptyDir:
      medium: ""
    name: "volume-3"

Running on basic-xfh7n in /home/jenkins/agent/workspace/ease.build.module.doclet
[Pipeline] {
[Pipeline] timestamps
[Pipeline] {
[Pipeline] timeout
23:21:28 [2022-08-07T03:21:28.485Z] Timeout set to expire in 30 min
[Pipeline] {
[Pipeline] stage
[Pipeline] { (Checkout)
[Pipeline] checkout
23:21:36 [2022-08-07T03:21:36.076Z] The recommended git tool is: NONE
23:21:37 [2022-08-07T03:21:37.865Z] No credentials specified
23:21:37 [2022-08-07T03:21:37.868Z] Cloning the remote Git repository
23:21:38 [2022-08-07T03:21:38.648Z] Cloning repository https://git.eclipse.org/r/ease/org.eclipse.ease.core.git
23:21:38 [2022-08-07T03:21:38.675Z]  > git init /home/jenkins/agent/workspace/ease.build.module.doclet # timeout=10
23:21:38 [2022-08-07T03:21:38.700Z] Fetching upstream changes from https://git.eclipse.org/r/ease/org.eclipse.ease.core.git
23:21:38 [2022-08-07T03:21:38.701Z]  > git --version # timeout=10
23:21:38 [2022-08-07T03:21:38.703Z]  > git --version # 'git version 2.20.1'
23:21:38 [2022-08-07T03:21:38.703Z]  > git fetch --tags --force --progress -- https://git.eclipse.org/r/ease/org.eclipse.ease.core.git +refs/heads/*:refs/remotes/origin/* # timeout=10
23:21:39 [2022-08-07T03:21:39.658Z] Avoid second fetch
23:21:39 [2022-08-07T03:21:39.665Z] Checking out Revision a37cd8235d80b82777050cb49e34a3e5f9da0801 (refs/remotes/origin/master)
23:21:39 [2022-08-07T03:21:39.652Z]  > git config remote.origin.url https://git.eclipse.org/r/ease/org.eclipse.ease.core.git # timeout=10
23:21:39 [2022-08-07T03:21:39.655Z]  > git config --add remote.origin.fetch +refs/heads/*:refs/remotes/origin/* # timeout=10
23:21:39 [2022-08-07T03:21:39.661Z]  > git rev-parse refs/remotes/origin/master^{commit} # timeout=10
23:21:39 [2022-08-07T03:21:39.674Z]  > git config core.sparsecheckout # timeout=10
23:21:39 [2022-08-07T03:21:39.677Z]  > git checkout -f a37cd8235d80b82777050cb49e34a3e5f9da0801 # timeout=10
23:21:43 [2022-08-07T03:21:43.433Z] Commit message: "Bug 536451: [Python] suppress shell output for 'None' results"
23:21:43 [2022-08-07T03:21:43.437Z]  > git rev-list --no-walk a37cd8235d80b82777050cb49e34a3e5f9da0801 # timeout=10
23:21:43 [2022-08-07T03:21:43.460Z] Cleaning workspace
[Pipeline] }
[Pipeline] // stage
[Pipeline] stage
[Pipeline] { (Build)
[Pipeline] withMaven
23:21:43 [2022-08-07T03:21:43.612Z] [withMaven] Options: [org.jenkinsci.plugins.pipeline.maven.publishers.TasksScannerPublisher[disabled='false', healthy='', unHealthy='', thresholdLimit='low'], org.jenkinsci.plugins.pipeline.maven.publishers.GeneratedArtifactsPublisher[disabled=true], org.jenkinsci.plugins.pipeline.maven.publishers.FindbugsAnalysisPublisher[disabled='false', healthy='', unHealthy='', thresholdLimit='low']]
23:21:43 [2022-08-07T03:21:43.612Z] [withMaven] Available options: 
23:21:43 [2022-08-07T03:21:43.612Z] [withMaven] using JDK installation oracle-jdk9-latest
23:21:43 [2022-08-07T03:21:43.627Z] [withMaven] using Maven installation 'apache-maven-latest'
[Pipeline] {
[Pipeline] sh
23:21:44 [2022-08-07T03:21:44.048Z] + mvn clean verify -f developers/org.eclipse.ease.helpgenerator/pom.xml
23:21:44 [2022-08-07T03:21:44.049Z] ----- withMaven Wrapper script -----
23:21:44 [2022-08-07T03:21:44.309Z] Picked up JAVA_TOOL_OPTIONS: -Dmaven.ext.class.path="/home/jenkins/agent/workspace/ease.build.module.doclet@tmp/withMavenc47c9486/pipeline-maven-spy.jar" -Dorg.jenkinsci.plugins.pipeline.maven.reportsFolder="/home/jenkins/agent/workspace/ease.build.module.doclet@tmp/withMavenc47c9486" 
23:21:43 [2022-08-07T03:21:43.463Z]  > git rev-parse --verify HEAD # timeout=10
23:21:43 [2022-08-07T03:21:43.465Z] Resetting working tree
23:21:43 [2022-08-07T03:21:43.466Z]  > git reset --hard # timeout=10
23:21:43 [2022-08-07T03:21:43.570Z]  > git clean -fdx # timeout=10
23:21:45 [2022-08-07T03:21:45.682Z] Apache Maven 3.8.5 (3599d3414f046de2324203b78ddcf9b5e4388aa0)
23:21:45 [2022-08-07T03:21:45.683Z] Maven home: /opt/tools/apache-maven/latest
23:21:45 [2022-08-07T03:21:45.683Z] Java version: 9.0.4, vendor: Oracle Corporation, runtime: /opt/tools/java/oracle/jdk-9/9.0.4
23:21:45 [2022-08-07T03:21:45.683Z] Default locale: en_US, platform encoding: UTF-8
23:21:45 [2022-08-07T03:21:45.683Z] OS name: "linux", version: "5.14.14-200.fc34.x86_64", arch: "amd64", family: "unix"
23:21:47 [2022-08-07T03:21:47.588Z] [INFO] [jenkins-event-spy] Generate /home/jenkins/agent/workspace/ease.build.module.doclet@tmp/withMavenc47c9486/maven-spy-20220807-032146-9948188214420749266922.log.tmp ...
23:21:47 [2022-08-07T03:21:47.846Z] [INFO] Scanning for projects...
23:21:47 [2022-08-07T03:21:47.847Z] [WARNING] The project org.eclipse.ease:org.eclipse.ease.helpgenerator:jar:0.9.0-SNAPSHOT uses prerequisites which is only intended for maven-plugin projects but not for non maven-plugin projects. For such purposes you should use the maven-enforcer-plugin. See https://maven.apache.org/enforcer/enforcer-rules/requireMavenVersion.html
23:21:47 [2022-08-07T03:21:47.847Z] [INFO] 
23:21:47 [2022-08-07T03:21:47.847Z] [INFO] ----------< org.eclipse.ease:org.eclipse.ease.helpgenerator >-----------
23:21:47 [2022-08-07T03:21:47.847Z] [INFO] Building org.eclipse.ease.helpgenerator 0.9.0-SNAPSHOT
23:21:47 [2022-08-07T03:21:47.847Z] [INFO] --------------------------------[ jar ]---------------------------------
23:21:48 [2022-08-07T03:21:48.782Z] [INFO] ------------------------------------------------------------------------
23:21:48 [2022-08-07T03:21:48.782Z] [INFO] BUILD FAILURE
23:21:48 [2022-08-07T03:21:48.782Z] [INFO] ------------------------------------------------------------------------
23:21:48 [2022-08-07T03:21:48.782Z] [INFO] Total time:  1.437 s
23:21:48 [2022-08-07T03:21:48.782Z] [INFO] Finished at: 2022-08-07T03:21:48Z
23:21:48 [2022-08-07T03:21:48.782Z] [INFO] ------------------------------------------------------------------------
23:21:48 [2022-08-07T03:21:48.782Z] [INFO] [jenkins-event-spy] Generated /home/jenkins/agent/workspace/ease.build.module.doclet@tmp/withMavenc47c9486/maven-spy-20220807-032146-9948188214420749266922.log
23:21:48 [2022-08-07T03:21:48.782Z] [ERROR] Plugin org.apache.maven.plugins:maven-clean-plugin:2.5 or one of its dependencies could not be resolved: Failed to read artifact descriptor for org.apache.maven.plugins:maven-clean-plugin:jar:2.5: Could not transfer artifact org.apache.maven.plugins:maven-clean-plugin:pom:2.5 from/to eclipse.maven.central.mirror (https://repo.eclipse.org/content/repositories/maven_central/): transfer failed for https://repo.eclipse.org/content/repositories/maven_central/org/apache/maven/plugins/maven-clean-plugin/2.5/maven-clean-plugin-2.5.pom, status: 503 Service Unavailable -> [Help 1]
23:21:48 [2022-08-07T03:21:48.782Z] [ERROR] 
23:21:48 [2022-08-07T03:21:48.782Z] [ERROR] To see the full stack trace of the errors, re-run Maven with the -e switch.
23:21:48 [2022-08-07T03:21:48.782Z] [ERROR] Re-run Maven using the -X switch to enable full debug logging.
23:21:48 [2022-08-07T03:21:48.783Z] [ERROR] 
23:21:48 [2022-08-07T03:21:48.783Z] [ERROR] For more information about the errors and possible solutions, please read the following articles:
23:21:48 [2022-08-07T03:21:48.783Z] [ERROR] [Help 1] http://cwiki.apache.org/confluence/display/MAVEN/PluginResolutionException
[Pipeline] }
23:21:49 [2022-08-07T03:21:49.419Z] [withMaven] Jenkins Task Scanner Plugin not found, don't display results of source code scanning for 'TODO' and 'FIXME' in pipeline screen.
23:21:49 [2022-08-07T03:21:49.420Z] [withMaven] Publishers: Open Task Scanner Publisher: 2 ms
[Pipeline] // withMaven
[Pipeline] }
[Pipeline] // stage
[Pipeline] stage
[Pipeline] { (Declarative: Post Actions)
[Pipeline] archiveArtifacts
23:21:50 [2022-08-07T03:21:50.537Z] Archiving artifacts
[Pipeline] emailext
23:22:01 [2022-08-07T03:22:01.487Z] Sending email to: christian.pontesegger@web.de
[Pipeline] }
[Pipeline] // stage
[Pipeline] }
[Pipeline] // timeout
[Pipeline] }
[Pipeline] // timestamps
[Pipeline] }
[Pipeline] // node
[Pipeline] End of Pipeline
ERROR: script returned exit code 1
Finished: FAILURE