FailedConsole Output

Skipping 2,640 KB.. Full Log
[INFO] Signing of nested jars of '/home/jenkins/agent/workspace/ditto-release/services/utils/search/target/ditto-services-utils-search-1.4.0.jar' is disabled.
[INFO] Signing jar: /home/jenkins/agent/workspace/ditto-release/services/utils/search/target/ditto-services-utils-search-1.4.0.jar
[INFO] Signing of nested jars of '/home/jenkins/agent/workspace/ditto-release/services/utils/search/target/ditto-services-utils-search-1.4.0-sources.jar' is disabled.
[INFO] Signing jar: /home/jenkins/agent/workspace/ditto-release/services/utils/search/target/ditto-services-utils-search-1.4.0-sources.jar
[INFO] Signing of nested jars of '/home/jenkins/agent/workspace/ditto-release/services/utils/search/target/ditto-services-utils-search-1.4.0-javadoc.jar' is disabled.
[INFO] Signing jar: /home/jenkins/agent/workspace/ditto-release/services/utils/search/target/ditto-services-utils-search-1.4.0-javadoc.jar
[INFO] 
[INFO] --- maven-gpg-plugin:1.6:sign (sign-artifacts) @ ditto-services-utils-search ---
[INFO] 
[INFO] --- maven-install-plugin:2.5.2:install (default-install) @ ditto-services-utils-search ---
[INFO] Installing /home/jenkins/agent/workspace/ditto-release/services/utils/search/target/ditto-services-utils-search-1.4.0.jar to /home/jenkins/.m2/repository/org/eclipse/ditto/ditto-services-utils-search/1.4.0/ditto-services-utils-search-1.4.0.jar
[INFO] Installing /home/jenkins/agent/workspace/ditto-release/services/utils/search/.flattened-pom.xml to /home/jenkins/.m2/repository/org/eclipse/ditto/ditto-services-utils-search/1.4.0/ditto-services-utils-search-1.4.0.pom
[INFO] Installing /home/jenkins/agent/workspace/ditto-release/services/utils/search/target/ditto-services-utils-search-1.4.0-sources.jar to /home/jenkins/.m2/repository/org/eclipse/ditto/ditto-services-utils-search/1.4.0/ditto-services-utils-search-1.4.0-sources.jar
[INFO] Installing /home/jenkins/agent/workspace/ditto-release/services/utils/search/target/ditto-services-utils-search-1.4.0-javadoc.jar to /home/jenkins/.m2/repository/org/eclipse/ditto/ditto-services-utils-search/1.4.0/ditto-services-utils-search-1.4.0-javadoc.jar
[INFO] Installing /home/jenkins/agent/workspace/ditto-release/services/utils/search/target/ditto-services-utils-search-1.4.0.jar.asc to /home/jenkins/.m2/repository/org/eclipse/ditto/ditto-services-utils-search/1.4.0/ditto-services-utils-search-1.4.0.jar.asc
[INFO] Installing /home/jenkins/agent/workspace/ditto-release/services/utils/search/target/ditto-services-utils-search-1.4.0.pom.asc to /home/jenkins/.m2/repository/org/eclipse/ditto/ditto-services-utils-search/1.4.0/ditto-services-utils-search-1.4.0.pom.asc
[INFO] Installing /home/jenkins/agent/workspace/ditto-release/services/utils/search/target/ditto-services-utils-search-1.4.0-sources.jar.asc to /home/jenkins/.m2/repository/org/eclipse/ditto/ditto-services-utils-search/1.4.0/ditto-services-utils-search-1.4.0-sources.jar.asc
[INFO] Installing /home/jenkins/agent/workspace/ditto-release/services/utils/search/target/ditto-services-utils-search-1.4.0-javadoc.jar.asc to /home/jenkins/.m2/repository/org/eclipse/ditto/ditto-services-utils-search/1.4.0/ditto-services-utils-search-1.4.0-javadoc.jar.asc
[INFO] 
[INFO] ---------< org.eclipse.ditto:ditto-services-utils-aggregator >----------
[INFO] Building Eclipse Ditto :: Services :: Utils :: Aggregator 1.4.0 [86/113]
[INFO] --------------------------------[ jar ]---------------------------------
[INFO] 
[INFO] --- maven-clean-plugin:2.5:clean (default-clean) @ ditto-services-utils-aggregator ---
[INFO] 
[INFO] --- flatten-maven-plugin:1.0.1:clean (flatten.clean) @ ditto-services-utils-aggregator ---
[INFO] 
[INFO] --- maven-enforcer-plugin:1.4.1:enforce (enforce-no-snapshots) @ ditto-services-utils-aggregator ---
[INFO] 
[INFO] --- jacoco-maven-plugin:0.8.5:prepare-agent (prepare-agent) @ ditto-services-utils-aggregator ---
[INFO] argLine set to -javaagent:/home/jenkins/.m2/repository/org/jacoco/org.jacoco.agent/0.8.5/org.jacoco.agent-0.8.5-runtime.jar=destfile=/home/jenkins/agent/workspace/ditto-release/services/utils/aggregator/target/jacoco.exec -Dfile.encoding=UTF-8
[INFO] 
[INFO] --- license-maven-plugin:1.17:add-third-party (default-cli) @ ditto-services-utils-aggregator ---
[WARNING] 
[WARNING] !!! licenseMergesFile is deprecated, use now licenseMergesUrl !!!
[WARNING] 
[WARNING] licenseMerges will be overridden by licenseMergesFile.
[WARNING] 
[INFO] Writing third-party file to /home/jenkins/agent/workspace/ditto-release/services/utils/aggregator/target/classes/META-INF/NOTICE-THIRD-PARTY.md
[INFO] 
[INFO] --- maven-resources-plugin:3.1.0:resources (default-resources) @ ditto-services-utils-aggregator ---
[INFO] Using 'UTF-8' encoding to copy filtered resources.
[INFO] skip non existing resourceDirectory /home/jenkins/agent/workspace/ditto-release/services/utils/aggregator/src/main/resources
[INFO] Copying 0 resource
[INFO] 
[INFO] --- flatten-maven-plugin:1.0.1:flatten (flatten) @ ditto-services-utils-aggregator ---
[INFO] Generating flattened POM of project org.eclipse.ditto:ditto-services-utils-aggregator:jar:1.4.0...
[INFO] 
[INFO] --- maven-compiler-plugin:3.8.1:compile (default-compile) @ ditto-services-utils-aggregator ---
[INFO] Changes detected - recompiling the module!
[INFO] Compiling 1 source file to /home/jenkins/agent/workspace/ditto-release/services/utils/aggregator/target/classes
[INFO] 
[INFO] --- maven-resources-plugin:3.1.0:testResources (default-testResources) @ ditto-services-utils-aggregator ---
[INFO] Using 'UTF-8' encoding to copy filtered resources.
[INFO] skip non existing resourceDirectory /home/jenkins/agent/workspace/ditto-release/services/utils/aggregator/src/test/resources
[INFO] 
[INFO] --- maven-compiler-plugin:3.8.1:testCompile (default-testCompile) @ ditto-services-utils-aggregator ---
[INFO] Changes detected - recompiling the module!
[INFO] Compiling 1 source file to /home/jenkins/agent/workspace/ditto-release/services/utils/aggregator/target/test-classes
[INFO] 
[INFO] --- maven-surefire-plugin:3.0.0-M4:test (default-test) @ ditto-services-utils-aggregator ---
[INFO] Surefire report directory: /home/jenkins/agent/workspace/ditto-release/services/utils/aggregator/target/surefire-reports
[INFO] 
[INFO] -------------------------------------------------------
[INFO]  T E S T S
[INFO] -------------------------------------------------------
[INFO] Running org.eclipse.ditto.services.utils.aggregator.ThingsAggregatorProxyActorTest
[INFO] [10/28/2020 17:02:13.574] [AkkaTestSystem-akka.actor.default-dispatcher-6] [akka://AkkaTestSystem/user/$a][x-correlation-id:213070cc-b32c-4d9c-87fe-1184f6dc8ba9] Got 'RetrieveThings' message. Retrieving requested '1' Things..
[INFO] [10/28/2020 17:02:13.624] [AkkaTestSystem-akka.actor.default-dispatcher-6] [akka://AkkaTestSystem/user/$b][x-correlation-id:213070cc-b32c-4d9c-87fe-1184f6dc8ba9] Got 'RetrieveThings' message. Retrieving requested '1' Things..
[INFO] Tests run: 2, Failures: 0, Errors: 0, Skipped: 0, Time elapsed: 2.607 s - in org.eclipse.ditto.services.utils.aggregator.ThingsAggregatorProxyActorTest
[INFO] 
[INFO] Results:
[INFO] 
[INFO] Tests run: 2, Failures: 0, Errors: 0, Skipped: 0
[INFO] 
[INFO] 
[INFO] --- maven-dependency-plugin:3.0.2:unpack-dependencies (copy-legal-docs) @ ditto-services-utils-aggregator ---
[INFO] Unpacking /home/jenkins/agent/workspace/ditto-release/legal/target/ditto-legal-1.4.0.jar to /home/jenkins/agent/workspace/ditto-release/services/utils/aggregator/target/classes/META-INF with includes "" and excludes "NOTICE-THIRD-PARTY.md,3rd-party-dependencies/**,META-INF/**"
[INFO] 
[INFO] --- maven-jar-plugin:3.0.2:jar (default-jar) @ ditto-services-utils-aggregator ---
[INFO] Building jar: /home/jenkins/agent/workspace/ditto-release/services/utils/aggregator/target/ditto-services-utils-aggregator-1.4.0.jar
[INFO] 
[INFO] >>> maven-source-plugin:3.1.0:jar (attach-sources) > generate-sources @ ditto-services-utils-aggregator >>>
[INFO] 
[INFO] --- maven-enforcer-plugin:1.4.1:enforce (enforce-no-snapshots) @ ditto-services-utils-aggregator ---
[INFO] 
[INFO] --- jacoco-maven-plugin:0.8.5:prepare-agent (prepare-agent) @ ditto-services-utils-aggregator ---
[INFO] argLine set to -javaagent:/home/jenkins/.m2/repository/org/jacoco/org.jacoco.agent/0.8.5/org.jacoco.agent-0.8.5-runtime.jar=destfile=/home/jenkins/agent/workspace/ditto-release/services/utils/aggregator/target/jacoco.exec -Dfile.encoding=UTF-8
[INFO] 
[INFO] <<< maven-source-plugin:3.1.0:jar (attach-sources) < generate-sources @ ditto-services-utils-aggregator <<<
[INFO] 
[INFO] 
[INFO] --- maven-source-plugin:3.1.0:jar (attach-sources) @ ditto-services-utils-aggregator ---
[INFO] Building jar: /home/jenkins/agent/workspace/ditto-release/services/utils/aggregator/target/ditto-services-utils-aggregator-1.4.0-sources.jar
[INFO] 
[INFO] --- maven-javadoc-plugin:3.1.1:jar (attach-javadocs) @ ditto-services-utils-aggregator ---
[ERROR] Error fetching link: /home/jenkins/agent/workspace/ditto-release/legal/target/apidocs. Ignored it.
[INFO] 
Loading source files for package org.eclipse.ditto.services.utils.aggregator...
Constructing Javadoc information...
Standard Doclet version 11.0.2
Building tree for all the packages and classes...
Generating /home/jenkins/agent/workspace/ditto-release/services/utils/aggregator/target/apidocs/org/eclipse/ditto/services/utils/aggregator/ThingsAggregatorProxyActor.html...
Generating /home/jenkins/agent/workspace/ditto-release/services/utils/aggregator/target/apidocs/org/eclipse/ditto/services/utils/aggregator/package-summary.html...
Generating /home/jenkins/agent/workspace/ditto-release/services/utils/aggregator/target/apidocs/org/eclipse/ditto/services/utils/aggregator/package-tree.html...
Generating /home/jenkins/agent/workspace/ditto-release/services/utils/aggregator/target/apidocs/constant-values.html...
Generating /home/jenkins/agent/workspace/ditto-release/services/utils/aggregator/target/apidocs/org/eclipse/ditto/services/utils/aggregator/class-use/ThingsAggregatorProxyActor.html...
Generating /home/jenkins/agent/workspace/ditto-release/services/utils/aggregator/target/apidocs/org/eclipse/ditto/services/utils/aggregator/package-use.html...
Building index for all the packages and classes...
Generating /home/jenkins/agent/workspace/ditto-release/services/utils/aggregator/target/apidocs/overview-tree.html...
Generating /home/jenkins/agent/workspace/ditto-release/services/utils/aggregator/target/apidocs/index-all.html...
Building index for all classes...
Generating /home/jenkins/agent/workspace/ditto-release/services/utils/aggregator/target/apidocs/allclasses-index.html...
Generating /home/jenkins/agent/workspace/ditto-release/services/utils/aggregator/target/apidocs/allpackages-index.html...
Generating /home/jenkins/agent/workspace/ditto-release/services/utils/aggregator/target/apidocs/deprecated-list.html...
Building index for all classes...
Generating /home/jenkins/agent/workspace/ditto-release/services/utils/aggregator/target/apidocs/allclasses.html...
Generating /home/jenkins/agent/workspace/ditto-release/services/utils/aggregator/target/apidocs/allclasses.html...
Generating /home/jenkins/agent/workspace/ditto-release/services/utils/aggregator/target/apidocs/index.html...
Generating /home/jenkins/agent/workspace/ditto-release/services/utils/aggregator/target/apidocs/help-doc.html...
[INFO] Building jar: /home/jenkins/agent/workspace/ditto-release/services/utils/aggregator/target/ditto-services-utils-aggregator-1.4.0-javadoc.jar
[INFO] 
[INFO] --- maven-failsafe-plugin:3.0.0-M4:integration-test (integration-test) @ ditto-services-utils-aggregator ---
[INFO] Tests are skipped.
[INFO] 
[INFO] --- maven-failsafe-plugin:3.0.0-M4:verify (verify) @ ditto-services-utils-aggregator ---
[INFO] Tests are skipped.
[INFO] 
[INFO] --- jacoco-maven-plugin:0.8.5:report (report) @ ditto-services-utils-aggregator ---
[INFO] Loading execution data file /home/jenkins/agent/workspace/ditto-release/services/utils/aggregator/target/jacoco.exec
[INFO] Analyzed bundle 'Eclipse Ditto :: Services :: Utils :: Aggregator' with 2 classes
[INFO] 
[INFO] --- eclipse-jarsigner-plugin:1.1.4:sign (sign-jars) @ ditto-services-utils-aggregator ---
[INFO] Signing of nested jars of '/home/jenkins/agent/workspace/ditto-release/services/utils/aggregator/target/ditto-services-utils-aggregator-1.4.0.jar' is disabled.
[INFO] Signing jar: /home/jenkins/agent/workspace/ditto-release/services/utils/aggregator/target/ditto-services-utils-aggregator-1.4.0.jar
[INFO] Signing of nested jars of '/home/jenkins/agent/workspace/ditto-release/services/utils/aggregator/target/ditto-services-utils-aggregator-1.4.0-sources.jar' is disabled.
[INFO] Signing jar: /home/jenkins/agent/workspace/ditto-release/services/utils/aggregator/target/ditto-services-utils-aggregator-1.4.0-sources.jar
[INFO] Signing of nested jars of '/home/jenkins/agent/workspace/ditto-release/services/utils/aggregator/target/ditto-services-utils-aggregator-1.4.0-javadoc.jar' is disabled.
[INFO] Signing jar: /home/jenkins/agent/workspace/ditto-release/services/utils/aggregator/target/ditto-services-utils-aggregator-1.4.0-javadoc.jar
[INFO] 
[INFO] --- maven-gpg-plugin:1.6:sign (sign-artifacts) @ ditto-services-utils-aggregator ---
[INFO] 
[INFO] --- maven-install-plugin:2.5.2:install (default-install) @ ditto-services-utils-aggregator ---
[INFO] Installing /home/jenkins/agent/workspace/ditto-release/services/utils/aggregator/target/ditto-services-utils-aggregator-1.4.0.jar to /home/jenkins/.m2/repository/org/eclipse/ditto/ditto-services-utils-aggregator/1.4.0/ditto-services-utils-aggregator-1.4.0.jar
[INFO] Installing /home/jenkins/agent/workspace/ditto-release/services/utils/aggregator/.flattened-pom.xml to /home/jenkins/.m2/repository/org/eclipse/ditto/ditto-services-utils-aggregator/1.4.0/ditto-services-utils-aggregator-1.4.0.pom
[INFO] Installing /home/jenkins/agent/workspace/ditto-release/services/utils/aggregator/target/ditto-services-utils-aggregator-1.4.0-sources.jar to /home/jenkins/.m2/repository/org/eclipse/ditto/ditto-services-utils-aggregator/1.4.0/ditto-services-utils-aggregator-1.4.0-sources.jar
[INFO] Installing /home/jenkins/agent/workspace/ditto-release/services/utils/aggregator/target/ditto-services-utils-aggregator-1.4.0-javadoc.jar to /home/jenkins/.m2/repository/org/eclipse/ditto/ditto-services-utils-aggregator/1.4.0/ditto-services-utils-aggregator-1.4.0-javadoc.jar
[INFO] Installing /home/jenkins/agent/workspace/ditto-release/services/utils/aggregator/target/ditto-services-utils-aggregator-1.4.0.jar.asc to /home/jenkins/.m2/repository/org/eclipse/ditto/ditto-services-utils-aggregator/1.4.0/ditto-services-utils-aggregator-1.4.0.jar.asc
[INFO] Installing /home/jenkins/agent/workspace/ditto-release/services/utils/aggregator/target/ditto-services-utils-aggregator-1.4.0.pom.asc to /home/jenkins/.m2/repository/org/eclipse/ditto/ditto-services-utils-aggregator/1.4.0/ditto-services-utils-aggregator-1.4.0.pom.asc
[INFO] Installing /home/jenkins/agent/workspace/ditto-release/services/utils/aggregator/target/ditto-services-utils-aggregator-1.4.0-sources.jar.asc to /home/jenkins/.m2/repository/org/eclipse/ditto/ditto-services-utils-aggregator/1.4.0/ditto-services-utils-aggregator-1.4.0-sources.jar.asc
[INFO] Installing /home/jenkins/agent/workspace/ditto-release/services/utils/aggregator/target/ditto-services-utils-aggregator-1.4.0-javadoc.jar.asc to /home/jenkins/.m2/repository/org/eclipse/ditto/ditto-services-utils-aggregator/1.4.0/ditto-services-utils-aggregator-1.4.0-javadoc.jar.asc
[INFO] 
[INFO] ------------< org.eclipse.ditto:ditto-services-models-acks >------------
[INFO] Building Eclipse Ditto :: Services :: Models :: ACKs 1.4.0      [87/113]
[INFO] --------------------------------[ jar ]---------------------------------
[INFO] 
[INFO] --- maven-clean-plugin:2.5:clean (default-clean) @ ditto-services-models-acks ---
[INFO] 
[INFO] --- flatten-maven-plugin:1.0.1:clean (flatten.clean) @ ditto-services-models-acks ---
[INFO] 
[INFO] --- maven-enforcer-plugin:1.4.1:enforce (enforce-no-snapshots) @ ditto-services-models-acks ---
[INFO] 
[INFO] --- jacoco-maven-plugin:0.8.5:prepare-agent (prepare-agent) @ ditto-services-models-acks ---
[INFO] argLine set to -javaagent:/home/jenkins/.m2/repository/org/jacoco/org.jacoco.agent/0.8.5/org.jacoco.agent-0.8.5-runtime.jar=destfile=/home/jenkins/agent/workspace/ditto-release/services/models/acks/target/jacoco.exec -Dfile.encoding=UTF-8
[INFO] 
[INFO] --- license-maven-plugin:1.17:add-third-party (default-cli) @ ditto-services-models-acks ---
[WARNING] 
[WARNING] !!! licenseMergesFile is deprecated, use now licenseMergesUrl !!!
[WARNING] 
[WARNING] licenseMerges will be overridden by licenseMergesFile.
[WARNING] 
[INFO] Writing third-party file to /home/jenkins/agent/workspace/ditto-release/services/models/acks/target/classes/META-INF/NOTICE-THIRD-PARTY.md
[INFO] 
[INFO] --- maven-resources-plugin:3.1.0:resources (default-resources) @ ditto-services-models-acks ---
[INFO] Using 'UTF-8' encoding to copy filtered resources.
[INFO] skip non existing resourceDirectory /home/jenkins/agent/workspace/ditto-release/services/models/acks/src/main/resources
[INFO] Copying 0 resource
[INFO] 
[INFO] --- flatten-maven-plugin:1.0.1:flatten (flatten) @ ditto-services-models-acks ---
[INFO] Generating flattened POM of project org.eclipse.ditto:ditto-services-models-acks:jar:1.4.0...
[INFO] 
[INFO] --- maven-compiler-plugin:3.8.1:compile (default-compile) @ ditto-services-models-acks ---
[INFO] Changes detected - recompiling the module!
[INFO] Compiling 9 source files to /home/jenkins/agent/workspace/ditto-release/services/models/acks/target/classes
[INFO] /home/jenkins/agent/workspace/ditto-release/services/models/acks/src/main/java/org/eclipse/ditto/services/models/acks/AcknowledgementForwarderActorStarter.java: /home/jenkins/agent/workspace/ditto-release/services/models/acks/src/main/java/org/eclipse/ditto/services/models/acks/AcknowledgementForwarderActorStarter.java uses unchecked or unsafe operations.
[INFO] /home/jenkins/agent/workspace/ditto-release/services/models/acks/src/main/java/org/eclipse/ditto/services/models/acks/AcknowledgementForwarderActorStarter.java: Recompile with -Xlint:unchecked for details.
[INFO] 
[INFO] --- maven-resources-plugin:3.1.0:testResources (default-testResources) @ ditto-services-models-acks ---
[INFO] Using 'UTF-8' encoding to copy filtered resources.
[INFO] Copying 3 resources
[INFO] 
[INFO] --- maven-compiler-plugin:3.8.1:testCompile (default-testCompile) @ ditto-services-models-acks ---
[INFO] Changes detected - recompiling the module!
[INFO] Compiling 5 source files to /home/jenkins/agent/workspace/ditto-release/services/models/acks/target/test-classes
[INFO] /home/jenkins/agent/workspace/ditto-release/services/models/acks/src/test/java/org/eclipse/ditto/services/models/acks/AcknowledgementForwarderActorTest.java: Some input files use or override a deprecated API.
[INFO] /home/jenkins/agent/workspace/ditto-release/services/models/acks/src/test/java/org/eclipse/ditto/services/models/acks/AcknowledgementForwarderActorTest.java: Recompile with -Xlint:deprecation for details.
[INFO] 
[INFO] --- maven-surefire-plugin:3.0.0-M4:test (default-test) @ ditto-services-models-acks ---
[INFO] Surefire report directory: /home/jenkins/agent/workspace/ditto-release/services/models/acks/target/surefire-reports
[INFO] 
[INFO] -------------------------------------------------------
[INFO]  T E S T S
[INFO] -------------------------------------------------------
[INFO] Running org.eclipse.ditto.services.models.acks.AcknowledgementAggregatorTest
[INFO] Tests run: 19, Failures: 0, Errors: 0, Skipped: 0, Time elapsed: 1.931 s - in org.eclipse.ditto.services.models.acks.AcknowledgementAggregatorTest
[INFO] Running org.eclipse.ditto.services.models.acks.AcknowledgementForwarderActorTest
[INFO] Tests run: 4, Failures: 0, Errors: 0, Skipped: 0, Time elapsed: 3.349 s - in org.eclipse.ditto.services.models.acks.AcknowledgementForwarderActorTest
[INFO] Running org.eclipse.ditto.services.models.acks.AcknowledgementForwarderActorStarterTest
[INFO] Tests run: 3, Failures: 0, Errors: 0, Skipped: 0, Time elapsed: 0.526 s - in org.eclipse.ditto.services.models.acks.AcknowledgementForwarderActorStarterTest
[INFO] Running org.eclipse.ditto.services.models.acks.AcknowledgementAggregatorActorTest
[INFO] [10/28/2020 17:02:27.636] [default-akka.actor.default-dispatcher-5] [akka://default/system/testProbe-6/$a][x-correlation-id:singleResponseLive] Starting to wait for all requested acknowledgements <[live-response]> for a maximum duration of <PT1M5S>.
[INFO] [10/28/2020 17:02:27.718] [default-akka.actor.default-dispatcher-7] [akka://default/system/testProbe-7/$a][x-correlation-id:keepCommandHeaders] Starting to wait for all requested acknowledgements <[ack1, ack2]> for a maximum duration of <PT1M5S>.
[INFO] [10/28/2020 17:02:27.783] [default-akka.actor.default-dispatcher-6] [akka://default/system/testProbe-8/$a][x-correlation-id:errorResponseLive] Starting to wait for all requested acknowledgements <[live-response]> for a maximum duration of <PT0.001S>.
[INFO] [10/28/2020 17:02:27.812] [default-akka.actor.default-dispatcher-6] [akka://default/system/testProbe-8/$a][x-correlation-id:errorResponseLive] Timed out waiting for all requested acknowledgements, completing Acknowledgements with timeouts...
[INFO] [10/28/2020 17:02:28.048] [default-akka.actor.default-dispatcher-4] [akka://default/system/testProbe-9/$a][x-correlation-id:errorResponseTwin] Starting to wait for all requested acknowledgements <[twin-persisted]> for a maximum duration of <PT0.001S>.
[INFO] [10/28/2020 17:02:28.076] [default-akka.actor.default-dispatcher-5] [akka://default/system/testProbe-9/$a][x-correlation-id:errorResponseTwin] Timed out waiting for all requested acknowledgements, completing Acknowledgements with timeouts...
[INFO] [10/28/2020 17:02:28.131] [default-akka.actor.default-dispatcher-8] [akka://default/system/testProbe-10/$a][x-correlation-id:discardDuplicateAndUnsolicitedAcknowledgements] Starting to wait for all requested acknowledgements <[ack1, ack2]> for a maximum duration of <PT1M5S>.
[INFO] [10/28/2020 17:02:28.181] [default-akka.actor.default-dispatcher-8] [akka://default/system/testProbe-11/$a][x-correlation-id:singleResponseLive] Starting to wait for all requested acknowledgements <[live-response]> for a maximum duration of <PT1M5S>.
[INFO] [10/28/2020 17:02:28.257] [default-akka.actor.default-dispatcher-7] [akka://default/system/testProbe-12/$a][x-correlation-id:singleResponseTwin] Starting to wait for all requested acknowledgements <[twin-persisted]> for a maximum duration of <PT1M5S>.
[INFO] Tests run: 7, Failures: 0, Errors: 0, Skipped: 0, Time elapsed: 0.705 s - in org.eclipse.ditto.services.models.acks.AcknowledgementAggregatorActorTest
[INFO] Running org.eclipse.ditto.services.models.acks.config.DefaultAcknowledgementConfigTest
[INFO] Tests run: 4, Failures: 0, Errors: 0, Skipped: 0, Time elapsed: 0.834 s - in org.eclipse.ditto.services.models.acks.config.DefaultAcknowledgementConfigTest
[INFO] 
[INFO] Results:
[INFO] 
[INFO] Tests run: 37, Failures: 0, Errors: 0, Skipped: 0
[INFO] 
[INFO] 
[INFO] --- maven-dependency-plugin:3.0.2:unpack-dependencies (copy-legal-docs) @ ditto-services-models-acks ---
[INFO] Unpacking /home/jenkins/agent/workspace/ditto-release/legal/target/ditto-legal-1.4.0.jar to /home/jenkins/agent/workspace/ditto-release/services/models/acks/target/classes/META-INF with includes "" and excludes "NOTICE-THIRD-PARTY.md,3rd-party-dependencies/**,META-INF/**"
[INFO] 
[INFO] --- maven-jar-plugin:3.0.2:jar (default-jar) @ ditto-services-models-acks ---
[INFO] Building jar: /home/jenkins/agent/workspace/ditto-release/services/models/acks/target/ditto-services-models-acks-1.4.0.jar
[INFO] 
[INFO] >>> maven-source-plugin:3.1.0:jar (attach-sources) > generate-sources @ ditto-services-models-acks >>>
[INFO] 
[INFO] --- maven-enforcer-plugin:1.4.1:enforce (enforce-no-snapshots) @ ditto-services-models-acks ---
[INFO] 
[INFO] --- jacoco-maven-plugin:0.8.5:prepare-agent (prepare-agent) @ ditto-services-models-acks ---
[INFO] argLine set to -javaagent:/home/jenkins/.m2/repository/org/jacoco/org.jacoco.agent/0.8.5/org.jacoco.agent-0.8.5-runtime.jar=destfile=/home/jenkins/agent/workspace/ditto-release/services/models/acks/target/jacoco.exec -Dfile.encoding=UTF-8
[INFO] 
[INFO] <<< maven-source-plugin:3.1.0:jar (attach-sources) < generate-sources @ ditto-services-models-acks <<<
[INFO] 
[INFO] 
[INFO] --- maven-source-plugin:3.1.0:jar (attach-sources) @ ditto-services-models-acks ---
[INFO] Building jar: /home/jenkins/agent/workspace/ditto-release/services/models/acks/target/ditto-services-models-acks-1.4.0-sources.jar
[INFO] 
[INFO] --- maven-javadoc-plugin:3.1.1:jar (attach-javadocs) @ ditto-services-models-acks ---
[ERROR] Error fetching link: /home/jenkins/agent/workspace/ditto-release/legal/target/apidocs. Ignored it.
[INFO] 
Loading source files for package org.eclipse.ditto.services.models.acks...
Loading source files for package org.eclipse.ditto.services.models.acks.config...
Constructing Javadoc information...
Standard Doclet version 11.0.2
Building tree for all the packages and classes...
Generating /home/jenkins/agent/workspace/ditto-release/services/models/acks/target/apidocs/org/eclipse/ditto/services/models/acks/AcknowledgementAggregator.html...
Generating /home/jenkins/agent/workspace/ditto-release/services/models/acks/target/apidocs/org/eclipse/ditto/services/models/acks/AcknowledgementAggregatorActor.html...
Generating /home/jenkins/agent/workspace/ditto-release/services/models/acks/target/apidocs/org/eclipse/ditto/services/models/acks/AcknowledgementAggregatorActorStarter.html...
Generating /home/jenkins/agent/workspace/ditto-release/services/models/acks/target/apidocs/org/eclipse/ditto/services/models/acks/AcknowledgementForwarderActor.html...
Generating /home/jenkins/agent/workspace/ditto-release/services/models/acks/target/apidocs/org/eclipse/ditto/services/models/acks/config/AcknowledgementConfig.html...
Generating /home/jenkins/agent/workspace/ditto-release/services/models/acks/target/apidocs/org/eclipse/ditto/services/models/acks/config/AcknowledgementConfig.AcknowledgementConfigValue.html...
Generating /home/jenkins/agent/workspace/ditto-release/services/models/acks/target/apidocs/org/eclipse/ditto/services/models/acks/config/DefaultAcknowledgementConfig.html...
Generating /home/jenkins/agent/workspace/ditto-release/services/models/acks/target/apidocs/org/eclipse/ditto/services/models/acks/package-summary.html...
Generating /home/jenkins/agent/workspace/ditto-release/services/models/acks/target/apidocs/org/eclipse/ditto/services/models/acks/package-tree.html...
Generating /home/jenkins/agent/workspace/ditto-release/services/models/acks/target/apidocs/org/eclipse/ditto/services/models/acks/config/package-summary.html...
Generating /home/jenkins/agent/workspace/ditto-release/services/models/acks/target/apidocs/org/eclipse/ditto/services/models/acks/config/package-tree.html...
Generating /home/jenkins/agent/workspace/ditto-release/services/models/acks/target/apidocs/constant-values.html...
Generating /home/jenkins/agent/workspace/ditto-release/services/models/acks/target/apidocs/org/eclipse/ditto/services/models/acks/class-use/AcknowledgementAggregator.html...
Generating /home/jenkins/agent/workspace/ditto-release/services/models/acks/target/apidocs/org/eclipse/ditto/services/models/acks/class-use/AcknowledgementAggregatorActor.html...
Generating /home/jenkins/agent/workspace/ditto-release/services/models/acks/target/apidocs/org/eclipse/ditto/services/models/acks/class-use/AcknowledgementAggregatorActorStarter.html...
Generating /home/jenkins/agent/workspace/ditto-release/services/models/acks/target/apidocs/org/eclipse/ditto/services/models/acks/class-use/AcknowledgementForwarderActor.html...
Generating /home/jenkins/agent/workspace/ditto-release/services/models/acks/target/apidocs/org/eclipse/ditto/services/models/acks/config/class-use/AcknowledgementConfig.html...
Generating /home/jenkins/agent/workspace/ditto-release/services/models/acks/target/apidocs/org/eclipse/ditto/services/models/acks/config/class-use/AcknowledgementConfig.AcknowledgementConfigValue.html...
Generating /home/jenkins/agent/workspace/ditto-release/services/models/acks/target/apidocs/org/eclipse/ditto/services/models/acks/config/class-use/DefaultAcknowledgementConfig.html...
Generating /home/jenkins/agent/workspace/ditto-release/services/models/acks/target/apidocs/org/eclipse/ditto/services/models/acks/package-use.html...
Generating /home/jenkins/agent/workspace/ditto-release/services/models/acks/target/apidocs/org/eclipse/ditto/services/models/acks/config/package-use.html...
Building index for all the packages and classes...
Generating /home/jenkins/agent/workspace/ditto-release/services/models/acks/target/apidocs/overview-tree.html...
Generating /home/jenkins/agent/workspace/ditto-release/services/models/acks/target/apidocs/index-all.html...
Building index for all classes...
Generating /home/jenkins/agent/workspace/ditto-release/services/models/acks/target/apidocs/allclasses-index.html...
Generating /home/jenkins/agent/workspace/ditto-release/services/models/acks/target/apidocs/allpackages-index.html...
Generating /home/jenkins/agent/workspace/ditto-release/services/models/acks/target/apidocs/deprecated-list.html...
Building index for all classes...
Generating /home/jenkins/agent/workspace/ditto-release/services/models/acks/target/apidocs/allclasses.html...
Generating /home/jenkins/agent/workspace/ditto-release/services/models/acks/target/apidocs/allclasses.html...
Generating /home/jenkins/agent/workspace/ditto-release/services/models/acks/target/apidocs/index.html...
Generating /home/jenkins/agent/workspace/ditto-release/services/models/acks/target/apidocs/overview-summary.html...
Generating /home/jenkins/agent/workspace/ditto-release/services/models/acks/target/apidocs/help-doc.html...
1 warning
[WARNING] Javadoc Warnings
[WARNING] /home/jenkins/agent/workspace/ditto-release/services/models/acks/src/main/java/org/eclipse/ditto/services/models/acks/AcknowledgementAggregatorActorStarter.java:81: warning: no @param for ackRequestSetters
[WARNING] public static AcknowledgementAggregatorActorStarter of(final ActorContext context,
[WARNING] ^
[INFO] Building jar: /home/jenkins/agent/workspace/ditto-release/services/models/acks/target/ditto-services-models-acks-1.4.0-javadoc.jar
[INFO] 
[INFO] --- maven-failsafe-plugin:3.0.0-M4:integration-test (integration-test) @ ditto-services-models-acks ---
[INFO] Tests are skipped.
[INFO] 
[INFO] --- maven-failsafe-plugin:3.0.0-M4:verify (verify) @ ditto-services-models-acks ---
[INFO] Tests are skipped.
[INFO] 
[INFO] --- jacoco-maven-plugin:0.8.5:report (report) @ ditto-services-models-acks ---
[INFO] Loading execution data file /home/jenkins/agent/workspace/ditto-release/services/models/acks/target/jacoco.exec
[INFO] Analyzed bundle 'Eclipse Ditto :: Services :: Models :: ACKs' with 7 classes
[INFO] 
[INFO] --- eclipse-jarsigner-plugin:1.1.4:sign (sign-jars) @ ditto-services-models-acks ---
[INFO] Signing of nested jars of '/home/jenkins/agent/workspace/ditto-release/services/models/acks/target/ditto-services-models-acks-1.4.0.jar' is disabled.
[INFO] Signing jar: /home/jenkins/agent/workspace/ditto-release/services/models/acks/target/ditto-services-models-acks-1.4.0.jar
[INFO] Signing of nested jars of '/home/jenkins/agent/workspace/ditto-release/services/models/acks/target/ditto-services-models-acks-1.4.0-sources.jar' is disabled.
[INFO] Signing jar: /home/jenkins/agent/workspace/ditto-release/services/models/acks/target/ditto-services-models-acks-1.4.0-sources.jar
[INFO] Signing of nested jars of '/home/jenkins/agent/workspace/ditto-release/services/models/acks/target/ditto-services-models-acks-1.4.0-javadoc.jar' is disabled.
[INFO] Signing jar: /home/jenkins/agent/workspace/ditto-release/services/models/acks/target/ditto-services-models-acks-1.4.0-javadoc.jar
[INFO] 
[INFO] --- maven-gpg-plugin:1.6:sign (sign-artifacts) @ ditto-services-models-acks ---
[INFO] 
[INFO] --- maven-install-plugin:2.5.2:install (default-install) @ ditto-services-models-acks ---
[INFO] Installing /home/jenkins/agent/workspace/ditto-release/services/models/acks/target/ditto-services-models-acks-1.4.0.jar to /home/jenkins/.m2/repository/org/eclipse/ditto/ditto-services-models-acks/1.4.0/ditto-services-models-acks-1.4.0.jar
[INFO] Installing /home/jenkins/agent/workspace/ditto-release/services/models/acks/.flattened-pom.xml to /home/jenkins/.m2/repository/org/eclipse/ditto/ditto-services-models-acks/1.4.0/ditto-services-models-acks-1.4.0.pom
[INFO] Installing /home/jenkins/agent/workspace/ditto-release/services/models/acks/target/ditto-services-models-acks-1.4.0-sources.jar to /home/jenkins/.m2/repository/org/eclipse/ditto/ditto-services-models-acks/1.4.0/ditto-services-models-acks-1.4.0-sources.jar
[INFO] Installing /home/jenkins/agent/workspace/ditto-release/services/models/acks/target/ditto-services-models-acks-1.4.0-javadoc.jar to /home/jenkins/.m2/repository/org/eclipse/ditto/ditto-services-models-acks/1.4.0/ditto-services-models-acks-1.4.0-javadoc.jar
[INFO] Installing /home/jenkins/agent/workspace/ditto-release/services/models/acks/target/ditto-services-models-acks-1.4.0.jar.asc to /home/jenkins/.m2/repository/org/eclipse/ditto/ditto-services-models-acks/1.4.0/ditto-services-models-acks-1.4.0.jar.asc
[INFO] Installing /home/jenkins/agent/workspace/ditto-release/services/models/acks/target/ditto-services-models-acks-1.4.0.pom.asc to /home/jenkins/.m2/repository/org/eclipse/ditto/ditto-services-models-acks/1.4.0/ditto-services-models-acks-1.4.0.pom.asc
[INFO] Installing /home/jenkins/agent/workspace/ditto-release/services/models/acks/target/ditto-services-models-acks-1.4.0-sources.jar.asc to /home/jenkins/.m2/repository/org/eclipse/ditto/ditto-services-models-acks/1.4.0/ditto-services-models-acks-1.4.0-sources.jar.asc
[INFO] Installing /home/jenkins/agent/workspace/ditto-release/services/models/acks/target/ditto-services-models-acks-1.4.0-javadoc.jar.asc to /home/jenkins/.m2/repository/org/eclipse/ditto/ditto-services-models-acks/1.4.0/ditto-services-models-acks-1.4.0-javadoc.jar.asc
[INFO] 
[INFO] ----------< org.eclipse.ditto:ditto-services-utils-protocol >-----------
[INFO] Building Eclipse Ditto :: Services :: Utils :: Protocol 1.4.0   [88/113]
[INFO] --------------------------------[ jar ]---------------------------------
[INFO] 
[INFO] --- maven-clean-plugin:2.5:clean (default-clean) @ ditto-services-utils-protocol ---
[INFO] 
[INFO] --- flatten-maven-plugin:1.0.1:clean (flatten.clean) @ ditto-services-utils-protocol ---
[INFO] 
[INFO] --- maven-enforcer-plugin:1.4.1:enforce (enforce-no-snapshots) @ ditto-services-utils-protocol ---
[INFO] 
[INFO] --- jacoco-maven-plugin:0.8.5:prepare-agent (prepare-agent) @ ditto-services-utils-protocol ---
[INFO] argLine set to -javaagent:/home/jenkins/.m2/repository/org/jacoco/org.jacoco.agent/0.8.5/org.jacoco.agent-0.8.5-runtime.jar=destfile=/home/jenkins/agent/workspace/ditto-release/services/utils/protocol/target/jacoco.exec -Dfile.encoding=UTF-8
[INFO] 
[INFO] --- license-maven-plugin:1.17:add-third-party (default-cli) @ ditto-services-utils-protocol ---
[WARNING] 
[WARNING] !!! licenseMergesFile is deprecated, use now licenseMergesUrl !!!
[WARNING] 
[WARNING] licenseMerges will be overridden by licenseMergesFile.
[WARNING] 
[INFO] Writing third-party file to /home/jenkins/agent/workspace/ditto-release/services/utils/protocol/target/classes/META-INF/NOTICE-THIRD-PARTY.md
[INFO] 
[INFO] --- maven-resources-plugin:3.1.0:resources (default-resources) @ ditto-services-utils-protocol ---
[INFO] Using 'UTF-8' encoding to copy filtered resources.
[INFO] skip non existing resourceDirectory /home/jenkins/agent/workspace/ditto-release/services/utils/protocol/src/main/resources
[INFO] Copying 0 resource
[INFO] 
[INFO] --- flatten-maven-plugin:1.0.1:flatten (flatten) @ ditto-services-utils-protocol ---
[INFO] Generating flattened POM of project org.eclipse.ditto:ditto-services-utils-protocol:jar:1.4.0...
[INFO] 
[INFO] --- maven-compiler-plugin:3.8.1:compile (default-compile) @ ditto-services-utils-protocol ---
[INFO] Changes detected - recompiling the module!
[INFO] Compiling 6 source files to /home/jenkins/agent/workspace/ditto-release/services/utils/protocol/target/classes
[INFO] /home/jenkins/agent/workspace/ditto-release/services/utils/protocol/src/main/java/org/eclipse/ditto/services/utils/protocol/ProtocolAdapterProvider.java: /home/jenkins/agent/workspace/ditto-release/services/utils/protocol/src/main/java/org/eclipse/ditto/services/utils/protocol/ProtocolAdapterProvider.java uses or overrides a deprecated API.
[INFO] /home/jenkins/agent/workspace/ditto-release/services/utils/protocol/src/main/java/org/eclipse/ditto/services/utils/protocol/ProtocolAdapterProvider.java: Recompile with -Xlint:deprecation for details.
[INFO] 
[INFO] --- maven-resources-plugin:3.1.0:testResources (default-testResources) @ ditto-services-utils-protocol ---
[INFO] Using 'UTF-8' encoding to copy filtered resources.
[INFO] Copying 1 resource
[INFO] 
[INFO] --- maven-compiler-plugin:3.8.1:testCompile (default-testCompile) @ ditto-services-utils-protocol ---
[INFO] Changes detected - recompiling the module!
[INFO] Compiling 2 source files to /home/jenkins/agent/workspace/ditto-release/services/utils/protocol/target/test-classes
[INFO] 
[INFO] --- maven-surefire-plugin:3.0.0-M4:test (default-test) @ ditto-services-utils-protocol ---
[INFO] Surefire report directory: /home/jenkins/agent/workspace/ditto-release/services/utils/protocol/target/surefire-reports
[INFO] 
[INFO] -------------------------------------------------------
[INFO]  T E S T S
[INFO] -------------------------------------------------------
[INFO] Running org.eclipse.ditto.services.utils.protocol.config.DefaultProtocolConfigTest
[INFO] Tests run: 4, Failures: 0, Errors: 0, Skipped: 0, Time elapsed: 2.715 s - in org.eclipse.ditto.services.utils.protocol.config.DefaultProtocolConfigTest
[INFO] Running org.eclipse.ditto.services.utils.protocol.ProtocolAdapterProviderTest
[INFO] Tests run: 1, Failures: 0, Errors: 0, Skipped: 0, Time elapsed: 1.793 s - in org.eclipse.ditto.services.utils.protocol.ProtocolAdapterProviderTest
[INFO] 
[INFO] Results:
[INFO] 
[INFO] Tests run: 5, Failures: 0, Errors: 0, Skipped: 0
[INFO] 
[INFO] 
[INFO] --- maven-dependency-plugin:3.0.2:unpack-dependencies (copy-legal-docs) @ ditto-services-utils-protocol ---
[INFO] Unpacking /home/jenkins/agent/workspace/ditto-release/legal/target/ditto-legal-1.4.0.jar to /home/jenkins/agent/workspace/ditto-release/services/utils/protocol/target/classes/META-INF with includes "" and excludes "NOTICE-THIRD-PARTY.md,3rd-party-dependencies/**,META-INF/**"
[INFO] 
[INFO] --- maven-jar-plugin:3.0.2:jar (default-jar) @ ditto-services-utils-protocol ---
[INFO] Building jar: /home/jenkins/agent/workspace/ditto-release/services/utils/protocol/target/ditto-services-utils-protocol-1.4.0.jar
[INFO] 
[INFO] >>> maven-source-plugin:3.1.0:jar (attach-sources) > generate-sources @ ditto-services-utils-protocol >>>
[INFO] 
[INFO] --- maven-enforcer-plugin:1.4.1:enforce (enforce-no-snapshots) @ ditto-services-utils-protocol ---
[INFO] 
[INFO] --- jacoco-maven-plugin:0.8.5:prepare-agent (prepare-agent) @ ditto-services-utils-protocol ---
[INFO] argLine set to -javaagent:/home/jenkins/.m2/repository/org/jacoco/org.jacoco.agent/0.8.5/org.jacoco.agent-0.8.5-runtime.jar=destfile=/home/jenkins/agent/workspace/ditto-release/services/utils/protocol/target/jacoco.exec -Dfile.encoding=UTF-8
[INFO] 
[INFO] <<< maven-source-plugin:3.1.0:jar (attach-sources) < generate-sources @ ditto-services-utils-protocol <<<
[INFO] 
[INFO] 
[INFO] --- maven-source-plugin:3.1.0:jar (attach-sources) @ ditto-services-utils-protocol ---
[INFO] Building jar: /home/jenkins/agent/workspace/ditto-release/services/utils/protocol/target/ditto-services-utils-protocol-1.4.0-sources.jar
[INFO] 
[INFO] --- maven-javadoc-plugin:3.1.1:jar (attach-javadocs) @ ditto-services-utils-protocol ---
[ERROR] Error fetching link: /home/jenkins/agent/workspace/ditto-release/legal/target/apidocs. Ignored it.
[INFO] 
Loading source files for package org.eclipse.ditto.services.utils.protocol...
Loading source files for package org.eclipse.ditto.services.utils.protocol.config...
Constructing Javadoc information...
Standard Doclet version 11.0.2
Building tree for all the packages and classes...
Generating /home/jenkins/agent/workspace/ditto-release/services/utils/protocol/target/apidocs/org/eclipse/ditto/services/utils/protocol/DittoProtocolAdapterProvider.html...
Generating /home/jenkins/agent/workspace/ditto-release/services/utils/protocol/target/apidocs/org/eclipse/ditto/services/utils/protocol/ProtocolAdapterProvider.html...
Generating /home/jenkins/agent/workspace/ditto-release/services/utils/protocol/target/apidocs/org/eclipse/ditto/services/utils/protocol/ProtocolAdapterProvider.Ignored.html...
Generating /home/jenkins/agent/workspace/ditto-release/services/utils/protocol/target/apidocs/org/eclipse/ditto/services/utils/protocol/config/DefaultProtocolConfig.html...
Generating /home/jenkins/agent/workspace/ditto-release/services/utils/protocol/target/apidocs/org/eclipse/ditto/services/utils/protocol/config/ProtocolConfig.html...
Generating /home/jenkins/agent/workspace/ditto-release/services/utils/protocol/target/apidocs/org/eclipse/ditto/services/utils/protocol/config/ProtocolConfig.ProtocolConfigValue.html...
Generating /home/jenkins/agent/workspace/ditto-release/services/utils/protocol/target/apidocs/org/eclipse/ditto/services/utils/protocol/config/WithProtocolConfig.html...
Generating /home/jenkins/agent/workspace/ditto-release/services/utils/protocol/target/apidocs/org/eclipse/ditto/services/utils/protocol/package-summary.html...
Generating /home/jenkins/agent/workspace/ditto-release/services/utils/protocol/target/apidocs/org/eclipse/ditto/services/utils/protocol/package-tree.html...
Generating /home/jenkins/agent/workspace/ditto-release/services/utils/protocol/target/apidocs/org/eclipse/ditto/services/utils/protocol/config/package-summary.html...
Generating /home/jenkins/agent/workspace/ditto-release/services/utils/protocol/target/apidocs/org/eclipse/ditto/services/utils/protocol/config/package-tree.html...
Generating /home/jenkins/agent/workspace/ditto-release/services/utils/protocol/target/apidocs/constant-values.html...
Generating /home/jenkins/agent/workspace/ditto-release/services/utils/protocol/target/apidocs/org/eclipse/ditto/services/utils/protocol/class-use/DittoProtocolAdapterProvider.html...
Generating /home/jenkins/agent/workspace/ditto-release/services/utils/protocol/target/apidocs/org/eclipse/ditto/services/utils/protocol/class-use/ProtocolAdapterProvider.html...
Generating /home/jenkins/agent/workspace/ditto-release/services/utils/protocol/target/apidocs/org/eclipse/ditto/services/utils/protocol/class-use/ProtocolAdapterProvider.Ignored.html...
Generating /home/jenkins/agent/workspace/ditto-release/services/utils/protocol/target/apidocs/org/eclipse/ditto/services/utils/protocol/config/class-use/DefaultProtocolConfig.html...
Generating /home/jenkins/agent/workspace/ditto-release/services/utils/protocol/target/apidocs/org/eclipse/ditto/services/utils/protocol/config/class-use/ProtocolConfig.html...
Generating /home/jenkins/agent/workspace/ditto-release/services/utils/protocol/target/apidocs/org/eclipse/ditto/services/utils/protocol/config/class-use/ProtocolConfig.ProtocolConfigValue.html...
Generating /home/jenkins/agent/workspace/ditto-release/services/utils/protocol/target/apidocs/org/eclipse/ditto/services/utils/protocol/config/class-use/WithProtocolConfig.html...
Generating /home/jenkins/agent/workspace/ditto-release/services/utils/protocol/target/apidocs/org/eclipse/ditto/services/utils/protocol/package-use.html...
Generating /home/jenkins/agent/workspace/ditto-release/services/utils/protocol/target/apidocs/org/eclipse/ditto/services/utils/protocol/config/package-use.html...
Building index for all the packages and classes...
Generating /home/jenkins/agent/workspace/ditto-release/services/utils/protocol/target/apidocs/overview-tree.html...
Generating /home/jenkins/agent/workspace/ditto-release/services/utils/protocol/target/apidocs/index-all.html...
Building index for all classes...
Generating /home/jenkins/agent/workspace/ditto-release/services/utils/protocol/target/apidocs/allclasses-index.html...
Generating /home/jenkins/agent/workspace/ditto-release/services/utils/protocol/target/apidocs/allpackages-index.html...
Generating /home/jenkins/agent/workspace/ditto-release/services/utils/protocol/target/apidocs/deprecated-list.html...
Building index for all classes...
Generating /home/jenkins/agent/workspace/ditto-release/services/utils/protocol/target/apidocs/allclasses.html...
Generating /home/jenkins/agent/workspace/ditto-release/services/utils/protocol/target/apidocs/allclasses.html...
Generating /home/jenkins/agent/workspace/ditto-release/services/utils/protocol/target/apidocs/index.html...
Generating /home/jenkins/agent/workspace/ditto-release/services/utils/protocol/target/apidocs/overview-summary.html...
Generating /home/jenkins/agent/workspace/ditto-release/services/utils/protocol/target/apidocs/help-doc.html...
[INFO] Building jar: /home/jenkins/agent/workspace/ditto-release/services/utils/protocol/target/ditto-services-utils-protocol-1.4.0-javadoc.jar
[INFO] 
[INFO] --- maven-failsafe-plugin:3.0.0-M4:integration-test (integration-test) @ ditto-services-utils-protocol ---
[INFO] Tests are skipped.
[INFO] 
[INFO] --- maven-failsafe-plugin:3.0.0-M4:verify (verify) @ ditto-services-utils-protocol ---
[INFO] Tests are skipped.
[INFO] 
[INFO] --- jacoco-maven-plugin:0.8.5:report (report) @ ditto-services-utils-protocol ---
[INFO] Loading execution data file /home/jenkins/agent/workspace/ditto-release/services/utils/protocol/target/jacoco.exec
[INFO] Analyzed bundle 'Eclipse Ditto :: Services :: Utils :: Protocol' with 5 classes
[INFO] 
[INFO] --- eclipse-jarsigner-plugin:1.1.4:sign (sign-jars) @ ditto-services-utils-protocol ---
[INFO] Signing of nested jars of '/home/jenkins/agent/workspace/ditto-release/services/utils/protocol/target/ditto-services-utils-protocol-1.4.0.jar' is disabled.
[INFO] Signing jar: /home/jenkins/agent/workspace/ditto-release/services/utils/protocol/target/ditto-services-utils-protocol-1.4.0.jar
[INFO] Signing of nested jars of '/home/jenkins/agent/workspace/ditto-release/services/utils/protocol/target/ditto-services-utils-protocol-1.4.0-sources.jar' is disabled.
[INFO] Signing jar: /home/jenkins/agent/workspace/ditto-release/services/utils/protocol/target/ditto-services-utils-protocol-1.4.0-sources.jar
[INFO] Signing of nested jars of '/home/jenkins/agent/workspace/ditto-release/services/utils/protocol/target/ditto-services-utils-protocol-1.4.0-javadoc.jar' is disabled.
[INFO] Signing jar: /home/jenkins/agent/workspace/ditto-release/services/utils/protocol/target/ditto-services-utils-protocol-1.4.0-javadoc.jar
[INFO] 
[INFO] --- maven-gpg-plugin:1.6:sign (sign-artifacts) @ ditto-services-utils-protocol ---
[INFO] 
[INFO] --- maven-install-plugin:2.5.2:install (default-install) @ ditto-services-utils-protocol ---
[INFO] Installing /home/jenkins/agent/workspace/ditto-release/services/utils/protocol/target/ditto-services-utils-protocol-1.4.0.jar to /home/jenkins/.m2/repository/org/eclipse/ditto/ditto-services-utils-protocol/1.4.0/ditto-services-utils-protocol-1.4.0.jar
[INFO] Installing /home/jenkins/agent/workspace/ditto-release/services/utils/protocol/.flattened-pom.xml to /home/jenkins/.m2/repository/org/eclipse/ditto/ditto-services-utils-protocol/1.4.0/ditto-services-utils-protocol-1.4.0.pom
[INFO] Installing /home/jenkins/agent/workspace/ditto-release/services/utils/protocol/target/ditto-services-utils-protocol-1.4.0-sources.jar to /home/jenkins/.m2/repository/org/eclipse/ditto/ditto-services-utils-protocol/1.4.0/ditto-services-utils-protocol-1.4.0-sources.jar
[INFO] Installing /home/jenkins/agent/workspace/ditto-release/services/utils/protocol/target/ditto-services-utils-protocol-1.4.0-javadoc.jar to /home/jenkins/.m2/repository/org/eclipse/ditto/ditto-services-utils-protocol/1.4.0/ditto-services-utils-protocol-1.4.0-javadoc.jar
[INFO] Installing /home/jenkins/agent/workspace/ditto-release/services/utils/protocol/target/ditto-services-utils-protocol-1.4.0.jar.asc to /home/jenkins/.m2/repository/org/eclipse/ditto/ditto-services-utils-protocol/1.4.0/ditto-services-utils-protocol-1.4.0.jar.asc
[INFO] Installing /home/jenkins/agent/workspace/ditto-release/services/utils/protocol/target/ditto-services-utils-protocol-1.4.0.pom.asc to /home/jenkins/.m2/repository/org/eclipse/ditto/ditto-services-utils-protocol/1.4.0/ditto-services-utils-protocol-1.4.0.pom.asc
[INFO] Installing /home/jenkins/agent/workspace/ditto-release/services/utils/protocol/target/ditto-services-utils-protocol-1.4.0-sources.jar.asc to /home/jenkins/.m2/repository/org/eclipse/ditto/ditto-services-utils-protocol/1.4.0/ditto-services-utils-protocol-1.4.0-sources.jar.asc
[INFO] Installing /home/jenkins/agent/workspace/ditto-release/services/utils/protocol/target/ditto-services-utils-protocol-1.4.0-javadoc.jar.asc to /home/jenkins/.m2/repository/org/eclipse/ditto/ditto-services-utils-protocol/1.4.0/ditto-services-utils-protocol-1.4.0-javadoc.jar.asc
[INFO] 
[INFO] ------< org.eclipse.ditto:ditto-services-connectivity-messaging >-------
[INFO] Building Eclipse Ditto :: Services :: Connectivity :: Messaging 1.4.0 [89/113]
[INFO] --------------------------------[ jar ]---------------------------------
[INFO] 
[INFO] --- maven-clean-plugin:2.5:clean (default-clean) @ ditto-services-connectivity-messaging ---
[INFO] 
[INFO] --- flatten-maven-plugin:1.0.1:clean (flatten.clean) @ ditto-services-connectivity-messaging ---
[INFO] 
[INFO] --- maven-enforcer-plugin:1.4.1:enforce (enforce-no-snapshots) @ ditto-services-connectivity-messaging ---
[INFO] 
[INFO] --- jacoco-maven-plugin:0.8.5:prepare-agent (prepare-agent) @ ditto-services-connectivity-messaging ---
[INFO] argLine set to -javaagent:/home/jenkins/.m2/repository/org/jacoco/org.jacoco.agent/0.8.5/org.jacoco.agent-0.8.5-runtime.jar=destfile=/home/jenkins/agent/workspace/ditto-release/services/connectivity/messaging/target/jacoco.exec -Dfile.encoding=UTF-8
[INFO] 
[INFO] --- license-maven-plugin:1.17:add-third-party (default-cli) @ ditto-services-connectivity-messaging ---
[WARNING] 
[WARNING] !!! licenseMergesFile is deprecated, use now licenseMergesUrl !!!
[WARNING] 
[WARNING] licenseMerges will be overridden by licenseMergesFile.
[WARNING] 
[INFO] Writing third-party file to /home/jenkins/agent/workspace/ditto-release/services/connectivity/messaging/target/classes/META-INF/NOTICE-THIRD-PARTY.md
[INFO] 
[INFO] --- maven-resources-plugin:3.1.0:resources (default-resources) @ ditto-services-connectivity-messaging ---
[INFO] Using 'UTF-8' encoding to copy filtered resources.
[INFO] skip non existing resourceDirectory /home/jenkins/agent/workspace/ditto-release/services/connectivity/messaging/src/main/resources
[INFO] Copying 0 resource
[INFO] 
[INFO] --- flatten-maven-plugin:1.0.1:flatten (flatten) @ ditto-services-connectivity-messaging ---
[INFO] Generating flattened POM of project org.eclipse.ditto:ditto-services-connectivity-messaging:jar:1.4.0...
[INFO] 
[INFO] --- maven-compiler-plugin:3.8.1:compile (default-compile) @ ditto-services-connectivity-messaging ---
[INFO] Changes detected - recompiling the module!
[INFO] Compiling 243 source files to /home/jenkins/agent/workspace/ditto-release/services/connectivity/messaging/target/classes
[WARNING] /home/jenkins/agent/workspace/ditto-release/services/connectivity/messaging/src/main/java/org/eclipse/ditto/services/connectivity/messaging/internal/ssl/DittoTrustManager.java:[26,25] sun.security.util.HostnameChecker is internal proprietary API and may be removed in a future release
[WARNING] /home/jenkins/agent/workspace/ditto-release/services/connectivity/messaging/src/main/java/org/eclipse/ditto/services/connectivity/messaging/internal/ssl/DittoTrustManager.java:[26,25] sun.security.util.HostnameChecker is internal proprietary API and may be removed in a future release
[WARNING] /home/jenkins/agent/workspace/ditto-release/services/connectivity/messaging/src/main/java/org/eclipse/ditto/services/connectivity/messaging/internal/ssl/DittoTrustManager.java:[26,25] sun.security.util.HostnameChecker is internal proprietary API and may be removed in a future release
[WARNING] /home/jenkins/agent/workspace/ditto-release/services/connectivity/messaging/src/main/java/org/eclipse/ditto/services/connectivity/messaging/internal/ssl/DittoTrustManager.java:[34,26] sun.security.util.HostnameChecker is internal proprietary API and may be removed in a future release
[WARNING] /home/jenkins/agent/workspace/ditto-release/services/connectivity/messaging/src/main/java/org/eclipse/ditto/services/connectivity/messaging/internal/ssl/DittoTrustManager.java:[34,26] sun.security.util.HostnameChecker is internal proprietary API and may be removed in a future release
[WARNING] /home/jenkins/agent/workspace/ditto-release/services/connectivity/messaging/src/main/java/org/eclipse/ditto/services/connectivity/messaging/internal/ssl/DittoTrustManager.java:[34,26] sun.security.util.HostnameChecker is internal proprietary API and may be removed in a future release
[WARNING] /home/jenkins/agent/workspace/ditto-release/services/connectivity/messaging/src/main/java/org/eclipse/ditto/services/connectivity/messaging/internal/ssl/DittoTrustManager.java:[34,89] sun.security.util.HostnameChecker is internal proprietary API and may be removed in a future release
[WARNING] /home/jenkins/agent/workspace/ditto-release/services/connectivity/messaging/src/main/java/org/eclipse/ditto/services/connectivity/messaging/internal/ssl/DittoTrustManager.java:[34,61] sun.security.util.HostnameChecker is internal proprietary API and may be removed in a future release
[INFO] /home/jenkins/agent/workspace/ditto-release/services/connectivity/messaging/src/main/java/org/eclipse/ditto/services/connectivity/messaging/BaseClientActor.java: Some input files use or override a deprecated API.
[INFO] /home/jenkins/agent/workspace/ditto-release/services/connectivity/messaging/src/main/java/org/eclipse/ditto/services/connectivity/messaging/BaseClientActor.java: Recompile with -Xlint:deprecation for details.
[INFO] /home/jenkins/agent/workspace/ditto-release/services/connectivity/messaging/src/main/java/org/eclipse/ditto/services/connectivity/messaging/BasePublisherActor.java: Some input files use unchecked or unsafe operations.
[INFO] /home/jenkins/agent/workspace/ditto-release/services/connectivity/messaging/src/main/java/org/eclipse/ditto/services/connectivity/messaging/BasePublisherActor.java: Recompile with -Xlint:unchecked for details.
[INFO] 
[INFO] --- maven-resources-plugin:3.1.0:testResources (default-testResources) @ ditto-services-connectivity-messaging ---
[INFO] Using 'UTF-8' encoding to copy filtered resources.
[INFO] Copying 22 resources
[INFO] 
[INFO] --- maven-compiler-plugin:3.8.1:testCompile (default-testCompile) @ ditto-services-connectivity-messaging ---
[INFO] Changes detected - recompiling the module!
[INFO] Compiling 99 source files to /home/jenkins/agent/workspace/ditto-release/services/connectivity/messaging/target/test-classes
[INFO] /home/jenkins/agent/workspace/ditto-release/services/connectivity/messaging/src/test/java/org/eclipse/ditto/services/connectivity/messaging/AbstractPublisherActorTest.java: Some input files use or override a deprecated API.
[INFO] /home/jenkins/agent/workspace/ditto-release/services/connectivity/messaging/src/test/java/org/eclipse/ditto/services/connectivity/messaging/AbstractPublisherActorTest.java: Recompile with -Xlint:deprecation for details.
[INFO] /home/jenkins/agent/workspace/ditto-release/services/connectivity/messaging/src/test/java/org/eclipse/ditto/services/connectivity/messaging/TestConstants.java: Some input files use unchecked or unsafe operations.
[INFO] /home/jenkins/agent/workspace/ditto-release/services/connectivity/messaging/src/test/java/org/eclipse/ditto/services/connectivity/messaging/TestConstants.java: Recompile with -Xlint:unchecked for details.
[INFO] 
[INFO] --- maven-surefire-plugin:3.0.0-M4:test (default-test) @ ditto-services-connectivity-messaging ---
[INFO] Surefire report directory: /home/jenkins/agent/workspace/ditto-release/services/connectivity/messaging/target/surefire-reports
[INFO] 
[INFO] -------------------------------------------------------
[INFO]  T E S T S
[INFO] -------------------------------------------------------
[INFO] Running org.eclipse.ditto.services.connectivity.messaging.mqtt.hivemq.HiveMqtt3PublisherActorTest
ImmutableAcknowledgement [label=please-verify, entityId=ditto:thing, statusCode=OK, payload=null, dittoHeaders=ImmutableDittoHeaders [{ditto-connection-id=connection-0dedf16d-8869-456d-b3e4-a455904d9bf4, device_id=ditto:thing, response-required=false, correlation-id=cid, requested-acks=["please-verify"]}]]
[INFO] Tests run: 3, Failures: 0, Errors: 0, Skipped: 0, Time elapsed: 8.547 s - in org.eclipse.ditto.services.connectivity.messaging.mqtt.hivemq.HiveMqtt3PublisherActorTest
[INFO] Running org.eclipse.ditto.services.connectivity.messaging.mqtt.hivemq.HiveMqtt5ClientActorTest
[INFO] Tests run: 19, Failures: 0, Errors: 0, Skipped: 0, Time elapsed: 18.066 s - in org.eclipse.ditto.services.connectivity.messaging.mqtt.hivemq.HiveMqtt5ClientActorTest
[INFO] Running org.eclipse.ditto.services.connectivity.messaging.mqtt.hivemq.HiveMqtt3ConsumerActorTest
[INFO] Tests run: 13, Failures: 0, Errors: 0, Skipped: 0, Time elapsed: 1.741 s - in org.eclipse.ditto.services.connectivity.messaging.mqtt.hivemq.HiveMqtt3ConsumerActorTest
[INFO] Running org.eclipse.ditto.services.connectivity.messaging.mqtt.hivemq.HiveMqtt5ConsumerActorTest
[INFO] Tests run: 13, Failures: 0, Errors: 0, Skipped: 0, Time elapsed: 1.25 s - in org.eclipse.ditto.services.connectivity.messaging.mqtt.hivemq.HiveMqtt5ConsumerActorTest
[INFO] Running org.eclipse.ditto.services.connectivity.messaging.mqtt.hivemq.HiveMqtt3ClientActorTest
[INFO] Tests run: 19, Failures: 0, Errors: 0, Skipped: 0, Time elapsed: 14.502 s - in org.eclipse.ditto.services.connectivity.messaging.mqtt.hivemq.HiveMqtt3ClientActorTest
[INFO] Running org.eclipse.ditto.services.connectivity.messaging.mqtt.hivemq.HiveMqtt5PublisherActorTest
ImmutableAcknowledgement [label=please-verify, entityId=ditto:thing, statusCode=OK, payload=null, dittoHeaders=ImmutableDittoHeaders [{ditto-connection-id=connection-5a8a8301-0904-42c2-a476-fefdb51c8288, device_id=ditto:thing, response-required=false, correlation-id=cid, requested-acks=["please-verify"]}]]
[INFO] Tests run: 3, Failures: 0, Errors: 0, Skipped: 0, Time elapsed: 0.537 s - in org.eclipse.ditto.services.connectivity.messaging.mqtt.hivemq.HiveMqtt5PublisherActorTest
[INFO] Running org.eclipse.ditto.services.connectivity.messaging.mqtt.Mqtt3ValidatorTest
[INFO] Tests run: 12, Failures: 0, Errors: 0, Skipped: 0, Time elapsed: 0.669 s - in org.eclipse.ditto.services.connectivity.messaging.mqtt.Mqtt3ValidatorTest
[INFO] Running org.eclipse.ditto.services.connectivity.messaging.mqtt.Mqtt5ValidatorTest
[INFO] Tests run: 11, Failures: 0, Errors: 0, Skipped: 0, Time elapsed: 0.101 s - in org.eclipse.ditto.services.connectivity.messaging.mqtt.Mqtt5ValidatorTest
[INFO] Running org.eclipse.ditto.services.connectivity.messaging.mqtt.MqttPublishTargetTest
[INFO] Tests run: 5, Failures: 0, Errors: 0, Skipped: 0, Time elapsed: 0.504 s - in org.eclipse.ditto.services.connectivity.messaging.mqtt.MqttPublishTargetTest
[INFO] Running org.eclipse.ditto.services.connectivity.messaging.mqtt.MqttSpecificConfigTest
[INFO] Tests run: 2, Failures: 0, Errors: 0, Skipped: 0, Time elapsed: 0.003 s - in org.eclipse.ditto.services.connectivity.messaging.mqtt.MqttSpecificConfigTest
[INFO] Running org.eclipse.ditto.services.connectivity.messaging.monitoring.logs.EvictingConnectionLoggerTest
[INFO] Tests run: 20, Failures: 0, Errors: 0, Skipped: 0, Time elapsed: 0.485 s - in org.eclipse.ditto.services.connectivity.messaging.monitoring.logs.EvictingConnectionLoggerTest
[INFO] Running org.eclipse.ditto.services.connectivity.messaging.monitoring.logs.ImmutableInfoProviderTest
[INFO] Tests run: 1, Failures: 0, Errors: 0, Skipped: 0, Time elapsed: 0.001 s - in org.eclipse.ditto.services.connectivity.messaging.monitoring.logs.ImmutableInfoProviderTest
[INFO] Running org.eclipse.ditto.services.connectivity.messaging.monitoring.logs.InfoProviderFactoryTest
[INFO] Tests run: 11, Failures: 0, Errors: 0, Skipped: 0, Time elapsed: 0.002 s - in org.eclipse.ditto.services.connectivity.messaging.monitoring.logs.InfoProviderFactoryTest
[INFO] Running org.eclipse.ditto.services.connectivity.messaging.monitoring.logs.ConnectionLoggerRegistryTest
[INFO] Tests run: 19, Failures: 0, Errors: 0, Skipped: 0, Time elapsed: 0.234 s - in org.eclipse.ditto.services.connectivity.messaging.monitoring.logs.ConnectionLoggerRegistryTest
[INFO] Running org.eclipse.ditto.services.connectivity.messaging.monitoring.logs.RetrieveConnectionLogsAggregatorActorTest
[INFO] Tests run: 5, Failures: 0, Errors: 0, Skipped: 0, Time elapsed: 5.704 s - in org.eclipse.ditto.services.connectivity.messaging.monitoring.logs.RetrieveConnectionLogsAggregatorActorTest
[INFO] Running org.eclipse.ditto.services.connectivity.messaging.monitoring.logs.DefaultMuteableConnectionLoggerTest
[INFO] Tests run: 12, Failures: 0, Errors: 0, Skipped: 0, Time elapsed: 0.27 s - in org.eclipse.ditto.services.connectivity.messaging.monitoring.logs.DefaultMuteableConnectionLoggerTest
[INFO] Running org.eclipse.ditto.services.connectivity.messaging.monitoring.logs.ConnectivityHeadersTest
[INFO] Tests run: 6, Failures: 0, Errors: 0, Skipped: 0, Time elapsed: 0.001 s - in org.eclipse.ditto.services.connectivity.messaging.monitoring.logs.ConnectivityHeadersTest
[INFO] Running org.eclipse.ditto.services.connectivity.messaging.monitoring.logs.DefaultEvictingQueueTest
[INFO] Tests run: 2, Failures: 0, Errors: 0, Skipped: 0, Time elapsed: 0.022 s - in org.eclipse.ditto.services.connectivity.messaging.monitoring.logs.DefaultEvictingQueueTest
[INFO] Running org.eclipse.ditto.services.connectivity.messaging.monitoring.logs.ConnectionLoggerFactoryTest
[INFO] Tests run: 1, Failures: 0, Errors: 0, Skipped: 0, Time elapsed: 0.003 s - in org.eclipse.ditto.services.connectivity.messaging.monitoring.logs.ConnectionLoggerFactoryTest
[INFO] Running org.eclipse.ditto.services.connectivity.messaging.monitoring.DefaultConnectionMonitorRegistryTest
[INFO] Tests run: 2, Failures: 0, Errors: 0, Skipped: 0, Time elapsed: 0.044 s - in org.eclipse.ditto.services.connectivity.messaging.monitoring.DefaultConnectionMonitorRegistryTest
[INFO] Running org.eclipse.ditto.services.connectivity.messaging.monitoring.metrics.DefaultConnectionMetricsCounterTest
[INFO] Tests run: 1, Failures: 0, Errors: 0, Skipped: 0, Time elapsed: 0.005 s - in org.eclipse.ditto.services.connectivity.messaging.monitoring.metrics.DefaultConnectionMetricsCounterTest
[INFO] Running org.eclipse.ditto.services.connectivity.messaging.monitoring.metrics.SlidingWindowCounterTest
[INFO] Tests run: 2, Failures: 0, Errors: 0, Skipped: 0, Time elapsed: 0.104 s - in org.eclipse.ditto.services.connectivity.messaging.monitoring.metrics.SlidingWindowCounterTest
[INFO] Running org.eclipse.ditto.services.connectivity.messaging.monitoring.metrics.ConnectivityCounterRegistryTest
[INFO] Tests run: 4, Failures: 0, Errors: 0, Skipped: 0, Time elapsed: 0.051 s - in org.eclipse.ditto.services.connectivity.messaging.monitoring.metrics.ConnectivityCounterRegistryTest
[INFO] Running org.eclipse.ditto.services.connectivity.messaging.monitoring.DefaultConnectionMonitorTest
[INFO] Tests run: 4, Failures: 0, Errors: 0, Skipped: 0, Time elapsed: 0.144 s - in org.eclipse.ditto.services.connectivity.messaging.monitoring.DefaultConnectionMonitorTest
[INFO] Running org.eclipse.ditto.services.connectivity.messaging.MessageMappingProcessorActorTest
[INFO] Tests run: 21, Failures: 0, Errors: 0, Skipped: 0, Time elapsed: 5.129 s - in org.eclipse.ditto.services.connectivity.messaging.MessageMappingProcessorActorTest
[INFO] Running org.eclipse.ditto.services.connectivity.messaging.persistence.ConnectionPersistenceActorTest
17:03:54.970 [WARN ] [ConnectionPersistenceActorTest-akka.actor.default-dispatcher-6] akka.serialization.Serialization(akka://ConnectionPersistenceActorTest) a.s.Serialization(akka://ConnectionPersistenceActorTest) - Using the Java serializer for class [org.bson.BsonDocument] which is not recommended because of performance implications. Use another serializer or disable this warning using the setting 'akka.actor.warn-about-java-serializer-usage'
17:03:55.853 [WARN ] [ConnectionPersistenceActorTest-akka.actor.default-dispatcher-8] akka.serialization.Serialization(akka://ConnectionPersistenceActorTest) a.s.Serialization(akka://ConnectionPersistenceActorTest) - Using the Java serializer for class [org.bson.BsonDocument] which is not recommended because of performance implications. Use another serializer or disable this warning using the setting 'akka.actor.warn-about-java-serializer-usage'
17:03:56.208 [WARN ] [ConnectionPersistenceActorTestWithBlocklist-akka.actor.default-dispatcher-12] akka.serialization.Serialization(akka://ConnectionPersistenceActorTestWithBlocklist) a.s.Serialization(akka://ConnectionPersistenceActorTestWithBlocklist) - Using the Java serializer for class [org.bson.BsonDocument] which is not recommended because of performance implications. Use another serializer or disable this warning using the setting 'akka.actor.warn-about-java-serializer-usage'
17:03:56.408 [WARN ] [ConnectionPersistenceActorTest-akka.actor.default-dispatcher-14] akka.serialization.Serialization(akka://ConnectionPersistenceActorTest) a.s.Serialization(akka://ConnectionPersistenceActorTest) - Using the Java serializer for class [org.bson.BsonDocument] which is not recommended because of performance implications. Use another serializer or disable this warning using the setting 'akka.actor.warn-about-java-serializer-usage'
17:03:56.595 [WARN ] [ConnectionPersistenceActorTest-akka.actor.default-dispatcher-13] akka.serialization.Serialization(akka://ConnectionPersistenceActorTest) a.s.Serialization(akka://ConnectionPersistenceActorTest) - Using the Java serializer for class [org.bson.BsonDocument] which is not recommended because of performance implications. Use another serializer or disable this warning using the setting 'akka.actor.warn-about-java-serializer-usage'
17:03:58.870 [WARN ] [ConnectionPersistenceActorTest-akka.actor.default-dispatcher-18] akka.serialization.Serialization(akka://ConnectionPersistenceActorTest) a.s.Serialization(akka://ConnectionPersistenceActorTest) - Using the Java serializer for class [org.bson.BsonDocument] which is not recommended because of performance implications. Use another serializer or disable this warning using the setting 'akka.actor.warn-about-java-serializer-usage'
17:03:59.111 [WARN ] [ConnectionPersistenceActorTest-akka.actor.default-dispatcher-6] akka.serialization.Serialization(akka://ConnectionPersistenceActorTest) a.s.Serialization(akka://ConnectionPersistenceActorTest) - Using the Java serializer for class [org.bson.BsonDocument] which is not recommended because of performance implications. Use another serializer or disable this warning using the setting 'akka.actor.warn-about-java-serializer-usage'
17:03:59.269 [WARN ] [ConnectionPersistenceActorTestWithBlocklist-akka.actor.default-dispatcher-11] akka.serialization.Serialization(akka://ConnectionPersistenceActorTestWithBlocklist) a.s.Serialization(akka://ConnectionPersistenceActorTestWithBlocklist) - Using the Java serializer for class [org.bson.BsonDocument] which is not recommended because of performance implications. Use another serializer or disable this warning using the setting 'akka.actor.warn-about-java-serializer-usage'
17:03:59.519 [WARN ] [ConnectionPersistenceActorTest-akka.actor.default-dispatcher-12] akka.serialization.Serialization(akka://ConnectionPersistenceActorTest) a.s.Serialization(akka://ConnectionPersistenceActorTest) - Using the Java serializer for class [org.bson.BsonDocument] which is not recommended because of performance implications. Use another serializer or disable this warning using the setting 'akka.actor.warn-about-java-serializer-usage'
17:03:59.735 [WARN ] [ConnectionPersistenceActorTest-akka.actor.default-dispatcher-15] akka.serialization.Serialization(akka://ConnectionPersistenceActorTest) a.s.Serialization(akka://ConnectionPersistenceActorTest) - Using the Java serializer for class [org.bson.BsonDocument] which is not recommended because of performance implications. Use another serializer or disable this warning using the setting 'akka.actor.warn-about-java-serializer-usage'
17:04:00.004 [WARN ] [ConnectionPersistenceActorTest-akka.actor.default-dispatcher-9] akka.serialization.Serialization(akka://ConnectionPersistenceActorTest) a.s.Serialization(akka://ConnectionPersistenceActorTest) - Using the Java serializer for class [org.bson.BsonDocument] which is not recommended because of performance implications. Use another serializer or disable this warning using the setting 'akka.actor.warn-about-java-serializer-usage'
17:04:00.181 [WARN ] [ConnectionPersistenceActorTest-akka.actor.default-dispatcher-13] akka.serialization.Serialization(akka://ConnectionPersistenceActorTest) a.s.Serialization(akka://ConnectionPersistenceActorTest) - Using the Java serializer for class [org.bson.BsonDocument] which is not recommended because of performance implications. Use another serializer or disable this warning using the setting 'akka.actor.warn-about-java-serializer-usage'
17:04:02.367 [WARN ] [ConnectionPersistenceActorTest-akka.actor.default-dispatcher-12] akka.serialization.Serialization(akka://ConnectionPersistenceActorTest) a.s.Serialization(akka://ConnectionPersistenceActorTest) - Using the Java serializer for class [org.bson.BsonDocument] which is not recommended because of performance implications. Use another serializer or disable this warning using the setting 'akka.actor.warn-about-java-serializer-usage'
17:04:02.517 [WARN ] [ConnectionPersistenceActorTest-akka.actor.default-dispatcher-14] akka.serialization.Serialization(akka://ConnectionPersistenceActorTest) a.s.Serialization(akka://ConnectionPersistenceActorTest) - Using the Java serializer for class [org.bson.BsonDocument] which is not recommended because of performance implications. Use another serializer or disable this warning using the setting 'akka.actor.warn-about-java-serializer-usage'
17:04:02.788 [WARN ] [ConnectionPersistenceActorTest-akka.actor.default-dispatcher-14] akka.serialization.Serialization(akka://ConnectionPersistenceActorTest) a.s.Serialization(akka://ConnectionPersistenceActorTest) - Using the Java serializer for class [org.bson.BsonDocument] which is not recommended because of performance implications. Use another serializer or disable this warning using the setting 'akka.actor.warn-about-java-serializer-usage'
17:04:03.399 [WARN ] [ConnectionPersistenceActorTest-akka.actor.default-dispatcher-11] akka.serialization.Serialization(akka://ConnectionPersistenceActorTest) a.s.Serialization(akka://ConnectionPersistenceActorTest) - Using the Java serializer for class [org.bson.BsonDocument] which is not recommended because of performance implications. Use another serializer or disable this warning using the setting 'akka.actor.warn-about-java-serializer-usage'
17:04:03.776 [WARN ] [ConnectionPersistenceActorTest-akka.actor.default-dispatcher-12] akka.serialization.Serialization(akka://ConnectionPersistenceActorTest) a.s.Serialization(akka://ConnectionPersistenceActorTest) - Using the Java serializer for class [org.bson.BsonDocument] which is not recommended because of performance implications. Use another serializer or disable this warning using the setting 'akka.actor.warn-about-java-serializer-usage'
17:04:04.042 [WARN ] [ConnectionPersistenceActorTest-akka.actor.default-dispatcher-13] akka.serialization.Serialization(akka://ConnectionPersistenceActorTest) a.s.Serialization(akka://ConnectionPersistenceActorTest) - Using the Java serializer for class [org.bson.BsonDocument] which is not recommended because of performance implications. Use another serializer or disable this warning using the setting 'akka.actor.warn-about-java-serializer-usage'
17:04:04.277 [WARN ] [ConnectionPersistenceActorTest-akka.actor.default-dispatcher-9] akka.serialization.Serialization(akka://ConnectionPersistenceActorTest) a.s.Serialization(akka://ConnectionPersistenceActorTest) - Using the Java serializer for class [org.bson.BsonDocument] which is not recommended because of performance implications. Use another serializer or disable this warning using the setting 'akka.actor.warn-about-java-serializer-usage'
17:04:04.436 [WARN ] [ConnectionPersistenceActorTest-akka.actor.default-dispatcher-13] akka.serialization.Serialization(akka://ConnectionPersistenceActorTest) a.s.Serialization(akka://ConnectionPersistenceActorTest) - Using the Java serializer for class [org.bson.BsonDocument] which is not recommended because of performance implications. Use another serializer or disable this warning using the setting 'akka.actor.warn-about-java-serializer-usage'
17:04:05.713 [WARN ] [ConnectionPersistenceActorTest-akka.actor.default-dispatcher-12] akka.serialization.Serialization(akka://ConnectionPersistenceActorTest) a.s.Serialization(akka://ConnectionPersistenceActorTest) - Using the Java serializer for class [org.bson.BsonDocument] which is not recommended because of performance implications. Use another serializer or disable this warning using the setting 'akka.actor.warn-about-java-serializer-usage'
17:04:08.746 [WARN ] [ConnectionPersistenceActorTest-akka.actor.default-dispatcher-24] akka.stream.Log(akka://ConnectionPersistenceActorTest/system/Materializers/StreamSupervisor-556) a.s.Materializer - [outbound connection to [akka://ConnectionPersistenceActorTest@127.0.0.1:37881], message stream] Upstream failed, cause: StreamTcpException: The connection has been aborted
17:04:08.747 [WARN ] [ConnectionPersistenceActorTest-akka.actor.default-dispatcher-24] akka.stream.Log(akka://ConnectionPersistenceActorTest/system/Materializers/StreamSupervisor-556) a.s.Materializer - [outbound connection to [akka://ConnectionPersistenceActorTest@127.0.0.1:37881], control stream] Upstream failed, cause: StreamTcpException: The connection has been aborted
17:04:10.877 [WARN ] [ConnectionPersistenceActorTest-akka.actor.default-dispatcher-8] akka.serialization.Serialization(akka://ConnectionPersistenceActorTest) a.s.Serialization(akka://ConnectionPersistenceActorTest) - Using the Java serializer for class [org.bson.BsonDocument] which is not recommended because of performance implications. Use another serializer or disable this warning using the setting 'akka.actor.warn-about-java-serializer-usage'
17:04:11.271 [WARN ] [ConnectionPersistenceActorTest-akka.actor.default-dispatcher-10] akka.serialization.Serialization(akka://ConnectionPersistenceActorTest) a.s.Serialization(akka://ConnectionPersistenceActorTest) - Using the Java serializer for class [org.bson.BsonDocument] which is not recommended because of performance implications. Use another serializer or disable this warning using the setting 'akka.actor.warn-about-java-serializer-usage'
17:04:11.463 [WARN ] [ConnectionPersistenceActorTest-akka.actor.default-dispatcher-14] akka.serialization.Serialization(akka://ConnectionPersistenceActorTest) a.s.Serialization(akka://ConnectionPersistenceActorTest) - Using the Java serializer for class [org.bson.BsonDocument] which is not recommended because of performance implications. Use another serializer or disable this warning using the setting 'akka.actor.warn-about-java-serializer-usage'
17:04:11.550 [WARN ] [ConnectionPersistenceActorTest-akka.actor.default-dispatcher-13] akka.serialization.Serialization(akka://ConnectionPersistenceActorTest) a.s.Serialization(akka://ConnectionPersistenceActorTest) - Using the Java serializer for class [org.bson.BsonDocument] which is not recommended because of performance implications. Use another serializer or disable this warning using the setting 'akka.actor.warn-about-java-serializer-usage'
17:04:11.656 [WARN ] [ConnectionPersistenceActorTest-akka.actor.default-dispatcher-6] akka.serialization.Serialization(akka://ConnectionPersistenceActorTest) a.s.Serialization(akka://ConnectionPersistenceActorTest) - Using the Java serializer for class [org.bson.BsonDocument] which is not recommended because of performance implications. Use another serializer or disable this warning using the setting 'akka.actor.warn-about-java-serializer-usage'
17:04:11.736 [WARN ] [ConnectionPersistenceActorTest-akka.actor.default-dispatcher-10] akka.serialization.Serialization(akka://ConnectionPersistenceActorTest) a.s.Serialization(akka://ConnectionPersistenceActorTest) - Using the Java serializer for class [org.bson.BsonDocument] which is not recommended because of performance implications. Use another serializer or disable this warning using the setting 'akka.actor.warn-about-java-serializer-usage'
17:04:12.021 [WARN ] [ConnectionPersistenceActorTest-akka.actor.default-dispatcher-9] akka.serialization.Serialization(akka://ConnectionPersistenceActorTest) a.s.Serialization(akka://ConnectionPersistenceActorTest) - Using the Java serializer for class [org.bson.BsonDocument] which is not recommended because of performance implications. Use another serializer or disable this warning using the setting 'akka.actor.warn-about-java-serializer-usage'
17:04:12.935 [WARN ] [ConnectionPersistenceActorTest-akka.actor.default-dispatcher-11] akka.serialization.Serialization(akka://ConnectionPersistenceActorTest) a.s.Serialization(akka://ConnectionPersistenceActorTest) - Using the Java serializer for class [org.bson.BsonDocument] which is not recommended because of performance implications. Use another serializer or disable this warning using the setting 'akka.actor.warn-about-java-serializer-usage'
17:04:13.655 [WARN ] [ConnectionPersistenceActorTest-akka.actor.default-dispatcher-13] akka.serialization.Serialization(akka://ConnectionPersistenceActorTest) a.s.Serialization(akka://ConnectionPersistenceActorTest) - Using the Java serializer for class [org.bson.BsonDocument] which is not recommended because of performance implications. Use another serializer or disable this warning using the setting 'akka.actor.warn-about-java-serializer-usage'
17:04:13.782 [WARN ] [ConnectionPersistenceActorTest-akka.actor.default-dispatcher-6] akka.serialization.Serialization(akka://ConnectionPersistenceActorTest) a.s.Serialization(akka://ConnectionPersistenceActorTest) - Using the Java serializer for class [org.bson.BsonDocument] which is not recommended because of performance implications. Use another serializer or disable this warning using the setting 'akka.actor.warn-about-java-serializer-usage'
17:04:13.894 [WARN ] [ConnectionPersistenceActorTest-akka.actor.default-dispatcher-9] akka.serialization.Serialization(akka://ConnectionPersistenceActorTest) a.s.Serialization(akka://ConnectionPersistenceActorTest) - Using the Java serializer for class [org.bson.BsonDocument] which is not recommended because of performance implications. Use another serializer or disable this warning using the setting 'akka.actor.warn-about-java-serializer-usage'
17:04:16.125 [WARN ] [ConnectionPersistenceActorTest-akka.actor.default-dispatcher-6] akka.serialization.Serialization(akka://ConnectionPersistenceActorTest) a.s.Serialization(akka://ConnectionPersistenceActorTest) - Using the Java serializer for class [org.bson.BsonDocument] which is not recommended because of performance implications. Use another serializer or disable this warning using the setting 'akka.actor.warn-about-java-serializer-usage'
[INFO] Tests run: 43, Failures: 0, Errors: 0, Skipped: 0, Time elapsed: 22.039 s - in org.eclipse.ditto.services.connectivity.messaging.persistence.ConnectionPersistenceActorTest
[INFO] Running org.eclipse.ditto.services.connectivity.messaging.persistence.SignalFilterWithFilterTest
[INFO] Tests run: 3, Failures: 0, Errors: 0, Skipped: 0, Time elapsed: 0.096 s - in org.eclipse.ditto.services.connectivity.messaging.persistence.SignalFilterWithFilterTest
[INFO] Running org.eclipse.ditto.services.connectivity.messaging.persistence.ConnectionMigrationUtilTest
[INFO] Tests run: 5, Failures: 0, Errors: 0, Skipped: 0, Time elapsed: 0.077 s - in org.eclipse.ditto.services.connectivity.messaging.persistence.ConnectionMigrationUtilTest
[INFO] Running org.eclipse.ditto.services.connectivity.messaging.persistence.SignalFilterTest
[INFO] Tests run: 89, Failures: 0, Errors: 0, Skipped: 0, Time elapsed: 0.16 s - in org.eclipse.ditto.services.connectivity.messaging.persistence.SignalFilterTest
[INFO] Running org.eclipse.ditto.services.connectivity.messaging.rabbitmq.RabbitMQValidatorTest
[INFO] Tests run: 9, Failures: 0, Errors: 0, Skipped: 0, Time elapsed: 0.073 s - in org.eclipse.ditto.services.connectivity.messaging.rabbitmq.RabbitMQValidatorTest
[INFO] Running org.eclipse.ditto.services.connectivity.messaging.rabbitmq.RabbitMQPublisherActorTest
[INFO] Tests run: 4, Failures: 0, Errors: 0, Skipped: 0, Time elapsed: 0.966 s - in org.eclipse.ditto.services.connectivity.messaging.rabbitmq.RabbitMQPublisherActorTest
[INFO] Running org.eclipse.ditto.services.connectivity.messaging.rabbitmq.RabbitMQClientActorTest
17:04:18.324 [INFO ] [AkkaTestSystem-akka.actor.default-dispatcher-6] akka://AkkaTestSystem@127.0.0.1:46514/user/$a/rmq-connection1 c.n.a.r.ConnectionActor - akka://AkkaTestSystem/user/$a/rmq-connection1 connected to amqp://null@null:0/null
17:04:18.328 [INFO ] [AkkaTestSystem-akka.actor.default-dispatcher-6] akka://AkkaTestSystem@127.0.0.1:46514/user/$a/rmq-connection1/publisher-channel c.n.a.r.ChannelActor - akka://AkkaTestSystem/user/$a/rmq-connection1/publisher-channel connected
17:04:19.305 [INFO ] [AkkaTestSystem-akka.actor.default-dispatcher-6] akka://AkkaTestSystem@127.0.0.1:46514/user/$a/rmq-connection1/consumer-channel c.n.a.r.ChannelActor - akka://AkkaTestSystem/user/$a/rmq-connection1/consumer-channel connected
17:04:19.311 [INFO ] [AkkaTestSystem-akka.actor.default-dispatcher-16] akka://AkkaTestSystem@127.0.0.1:46514/user/$a/rmq-connection1 c.n.a.r.ConnectionActor - closing connection to amqp://null@null:0/null
17:04:19.342 [INFO ] [AkkaTestSystem-akka.actor.default-dispatcher-9] akka://AkkaTestSystem@127.0.0.1:46514/user/$b/rmq-connection1 c.n.a.r.ConnectionActor - akka://AkkaTestSystem/user/$b/rmq-connection1 connected to amqp://null@null:0/null
17:04:19.342 [INFO ] [AkkaTestSystem-akka.actor.default-dispatcher-9] akka://AkkaTestSystem@127.0.0.1:46514/user/$b/rmq-connection1/publisher-channel c.n.a.r.ChannelActor - akka://AkkaTestSystem/user/$b/rmq-connection1/publisher-channel connected
17:04:20.342 [INFO ] [AkkaTestSystem-akka.actor.default-dispatcher-6] akka://AkkaTestSystem@127.0.0.1:46514/user/$b/rmq-connection1/consumer-channel c.n.a.r.ChannelActor - akka://AkkaTestSystem/user/$b/rmq-connection1/consumer-channel connected
17:04:20.381 [INFO ] [AkkaTestSystem-akka.actor.default-dispatcher-14] akka://AkkaTestSystem@127.0.0.1:46514/user/$d/rmq-connection1 c.n.a.r.ConnectionActor - akka://AkkaTestSystem/user/$d/rmq-connection1 connected to amqp://null@null:0/null
17:04:20.382 [INFO ] [AkkaTestSystem-akka.actor.default-dispatcher-16] akka://AkkaTestSystem@127.0.0.1:46514/user/$d/rmq-connection1/publisher-channel c.n.a.r.ChannelActor - akka://AkkaTestSystem/user/$d/rmq-connection1/publisher-channel connected
17:04:21.382 [INFO ] [AkkaTestSystem-akka.actor.default-dispatcher-8] akka://AkkaTestSystem@127.0.0.1:46514/user/$d/rmq-connection1/consumer-channel c.n.a.r.ChannelActor - akka://AkkaTestSystem/user/$d/rmq-connection1/consumer-channel connected
17:04:21.407 [INFO ] [AkkaTestSystem-akka.actor.default-dispatcher-6] akka://AkkaTestSystem@127.0.0.1:46514/user/$d/rmq-connection1 c.n.a.r.ConnectionActor - akka://AkkaTestSystem/user/$d/rmq-connection1 in Connected received AmqpShutdownSignal(com.rabbitmq.client.ShutdownSignalException: clean connection shutdown): reconnecting to amqp://null@null:0/null in 5 seconds
17:04:21.407 [WARN ] [AkkaTestSystem-akka.actor.default-dispatcher-6] akka://AkkaTestSystem@127.0.0.1:46514/user/$d/rmq-connection1/consumer-channel c.n.a.r.ChannelActor - akka://AkkaTestSystem/user/$d/rmq-connection1/consumer-channel disconnected
17:04:21.407 [WARN ] [AkkaTestSystem-akka.actor.default-dispatcher-6] akka://AkkaTestSystem@127.0.0.1:46514/user/$d/rmq-connection1/publisher-channel c.n.a.r.ChannelActor - akka://AkkaTestSystem/user/$d/rmq-connection1/publisher-channel disconnected
17:04:21.408 [WARN ] [AkkaTestSystem-akka.actor.default-dispatcher-6] akka://AkkaTestSystem@127.0.0.1:46514/user/$d/rmq-connection1 c.n.a.r.ConnectionActor - akka://AkkaTestSystem/user/$d/rmq-connection1 lost connection to amqp://null@null:0/null
17:04:26.418 [INFO ] [AkkaTestSystem-akka.actor.default-dispatcher-6] akka://AkkaTestSystem@127.0.0.1:46514/user/$d/rmq-connection1 c.n.a.r.ConnectionActor - akka://AkkaTestSystem/user/$d/rmq-connection1 connected to amqp://null@null:0/null
17:04:26.419 [INFO ] [AkkaTestSystem-akka.actor.default-dispatcher-16] akka://AkkaTestSystem@127.0.0.1:46514/user/$d/rmq-connection1/publisher-channel c.n.a.r.ChannelActor - akka://AkkaTestSystem/user/$d/rmq-connection1/publisher-channel connected
17:04:26.448 [INFO ] [AkkaTestSystem-akka.actor.default-dispatcher-6] akka://AkkaTestSystem@127.0.0.1:46514/user/$d/rmq-connection1/consumer-channel c.n.a.r.ChannelActor - akka://AkkaTestSystem/user/$d/rmq-connection1/consumer-channel connected
17:04:26.453 [INFO ] [AkkaTestSystem-akka.actor.default-dispatcher-8] akka://AkkaTestSystem@127.0.0.1:46514/user/$d/rmq-connection1 c.n.a.r.ConnectionActor - closing connection to amqp://null@null:0/null
17:04:26.487 [INFO ] [AkkaTestSystem-akka.actor.default-dispatcher-16] akka://AkkaTestSystem@127.0.0.1:46514/user/$e/rmq-connection1 c.n.a.r.ConnectionActor - akka://AkkaTestSystem/user/$e/rmq-connection1 connected to amqp://null@null:0/null
17:04:26.487 [INFO ] [AkkaTestSystem-akka.actor.default-dispatcher-16] akka://AkkaTestSystem@127.0.0.1:46514/user/$e/rmq-connection1/publisher-channel c.n.a.r.ChannelActor - akka://AkkaTestSystem/user/$e/rmq-connection1/publisher-channel connected
17:04:27.490 [INFO ] [AkkaTestSystem-akka.actor.default-dispatcher-16] akka://AkkaTestSystem@127.0.0.1:46514/user/$e/rmq-connection1/consumer-channel c.n.a.r.ChannelActor - akka://AkkaTestSystem/user/$e/rmq-connection1/consumer-channel connected
17:04:27.492 [INFO ] [AkkaTestSystem-akka.actor.default-dispatcher-15] akka://AkkaTestSystem@127.0.0.1:46514/user/$e/rmq-connection1 c.n.a.r.ConnectionActor - closing connection to amqp://null@null:0/null
17:04:27.514 [INFO ] [AkkaTestSystem-akka.actor.default-dispatcher-15] akka://AkkaTestSystem@127.0.0.1:46514/user/$f/rmq-connection1 c.n.a.r.ConnectionActor - akka://AkkaTestSystem/user/$f/rmq-connection1 connected to amqp://null@null:0/null
17:04:27.514 [INFO ] [AkkaTestSystem-akka.actor.default-dispatcher-15] akka://AkkaTestSystem@127.0.0.1:46514/user/$f/rmq-connection1/publisher-channel c.n.a.r.ChannelActor - akka://AkkaTestSystem/user/$f/rmq-connection1/publisher-channel connected
17:04:28.519 [INFO ] [AkkaTestSystem-akka.actor.default-dispatcher-15] akka://AkkaTestSystem@127.0.0.1:46514/user/$f/rmq-connection1/consumer-channel c.n.a.r.ChannelActor - akka://AkkaTestSystem/user/$f/rmq-connection1/consumer-channel connected
17:04:28.527 [INFO ] [AkkaTestSystem-akka.actor.default-dispatcher-14] akka://AkkaTestSystem@127.0.0.1:46514/user/$f/rmq-connection1 c.n.a.r.ConnectionActor - closing connection to amqp://null@null:0/null
17:04:28.528 [INFO ] [AkkaTestSystem-akka.actor.default-dispatcher-14] akka://AkkaTestSystem@127.0.0.1:46514/user/$f/rmq-connection5 c.n.a.r.ConnectionActor - akka://AkkaTestSystem/user/$f/rmq-connection5 connected to amqp://null@null:0/null
17:04:28.528 [INFO ] [AkkaTestSystem-akka.actor.default-dispatcher-14] akka://AkkaTestSystem@127.0.0.1:46514/user/$f/rmq-connection5/publisher-channel c.n.a.r.ChannelActor - akka://AkkaTestSystem/user/$f/rmq-connection5/publisher-channel connected
17:04:29.528 [INFO ] [AkkaTestSystem-akka.actor.default-dispatcher-16] akka://AkkaTestSystem@127.0.0.1:46514/user/$f/rmq-connection5/consumer-channel c.n.a.r.ChannelActor - akka://AkkaTestSystem/user/$f/rmq-connection5/consumer-channel connected
17:04:29.530 [INFO ] [AkkaTestSystem-akka.actor.default-dispatcher-16] akka://AkkaTestSystem@127.0.0.1:46514/user/$f/rmq-connection5 c.n.a.r.ConnectionActor - closing connection to amqp://null@null:0/null
17:04:29.532 [INFO ] [AkkaTestSystem-akka.actor.default-dispatcher-6] akka://AkkaTestSystem@127.0.0.1:46514/user/$f/rmq-connection9 c.n.a.r.ConnectionActor - akka://AkkaTestSystem/user/$f/rmq-connection9 connected to amqp://null@null:0/null
17:04:29.532 [INFO ] [AkkaTestSystem-akka.actor.default-dispatcher-8] akka://AkkaTestSystem@127.0.0.1:46514/user/$f/rmq-connection9/publisher-channel c.n.a.r.ChannelActor - akka://AkkaTestSystem/user/$f/rmq-connection9/publisher-channel connected
17:04:30.535 [INFO ] [AkkaTestSystem-akka.actor.default-dispatcher-14] akka://AkkaTestSystem@127.0.0.1:46514/user/$f/rmq-connection9/consumer-channel c.n.a.r.ChannelActor - akka://AkkaTestSystem/user/$f/rmq-connection9/consumer-channel connected
17:04:30.538 [INFO ] [AkkaTestSystem-akka.actor.default-dispatcher-16] akka://AkkaTestSystem@127.0.0.1:46514/user/$f/rmq-connection9 c.n.a.r.ConnectionActor - closing connection to amqp://null@null:0/null
17:04:30.564 [INFO ] [AkkaTestSystem-akka.actor.default-dispatcher-6] akka://AkkaTestSystem@127.0.0.1:46514/user/$g/rmq-connection1 c.n.a.r.ConnectionActor - akka://AkkaTestSystem/user/$g/rmq-connection1 connected to amqp://null@null:0/null
17:04:30.564 [INFO ] [AkkaTestSystem-akka.actor.default-dispatcher-6] akka://AkkaTestSystem@127.0.0.1:46514/user/$g/rmq-connection1/publisher-channel c.n.a.r.ChannelActor - akka://AkkaTestSystem/user/$g/rmq-connection1/publisher-channel connected
17:04:31.567 [INFO ] [AkkaTestSystem-akka.actor.default-dispatcher-9] akka://AkkaTestSystem@127.0.0.1:46514/user/$g/rmq-connection1/consumer-channel c.n.a.r.ChannelActor - akka://AkkaTestSystem/user/$g/rmq-connection1/consumer-channel connected
17:04:31.569 [INFO ] [AkkaTestSystem-akka.actor.default-dispatcher-15] akka://AkkaTestSystem@127.0.0.1:46514/user/$g/rmq-connection1 c.n.a.r.ConnectionActor - closing connection to amqp://null@null:0/null
17:04:31.589 [INFO ] [AkkaTestSystem-akka.actor.default-dispatcher-6] akka://AkkaTestSystem@127.0.0.1:46514/user/$h/rmq-connection1 c.n.a.r.ConnectionActor - akka://AkkaTestSystem/user/$h/rmq-connection1 connected to amqp://null@null:0/null
17:04:31.589 [INFO ] [AkkaTestSystem-akka.actor.default-dispatcher-6] akka://AkkaTestSystem@127.0.0.1:46514/user/$h/rmq-connection1/publisher-channel c.n.a.r.ChannelActor - akka://AkkaTestSystem/user/$h/rmq-connection1/publisher-channel connected
17:04:32.595 [INFO ] [AkkaTestSystem-akka.actor.default-dispatcher-16] akka://AkkaTestSystem@127.0.0.1:46514/user/$h/rmq-connection1/consumer-channel c.n.a.r.ChannelActor - akka://AkkaTestSystem/user/$h/rmq-connection1/consumer-channel connected
17:04:33.266 [ERROR] [AkkaTestSystem-jms-connection-handling-dispatcher-22]  o.a.q.j.JmsConnection - Failed to connect to remote at: amqps://127.0.0.1:42266
17:04:33.535 [INFO ] [AkkaTestSystem-akka.actor.default-dispatcher-9] akka://AkkaTestSystem@127.0.0.1:46514/user/$b/rmq-connection1 c.n.a.r.ConnectionActor - closing connection to amqp://null@null:0/null
17:04:33.540 [INFO ] [AkkaTestSystem-akka.actor.default-dispatcher-6] akka://AkkaTestSystem@127.0.0.1:46514/user/$h/rmq-connection1 c.n.a.r.ConnectionActor - closing connection to amqp://null@null:0/null
[INFO] Tests run: 17, Failures: 0, Errors: 0, Skipped: 0, Time elapsed: 15.919 s - in org.eclipse.ditto.services.connectivity.messaging.rabbitmq.RabbitMQClientActorTest
[INFO] Running org.eclipse.ditto.services.connectivity.messaging.rabbitmq.RabbitMQConsumerActorTest
[INFO] Tests run: 13, Failures: 0, Errors: 0, Skipped: 0, Time elapsed: 1.098 s - in org.eclipse.ditto.services.connectivity.messaging.rabbitmq.RabbitMQConsumerActorTest
[INFO] Running org.eclipse.ditto.services.connectivity.messaging.DefaultClientActorPropsFactoryTest
17:04:34.772 [WARN ] [AkkaTestSystem-akka.actor.default-dispatcher-13] akka.serialization.Serialization(akka://AkkaTestSystem) a.s.Serialization(akka://AkkaTestSystem) - Using the Java serializer for class [org.eclipse.ditto.services.connectivity.messaging.kafka.DefaultKafkaPublisherActorFactory] which is not recommended because of performance implications. Use another serializer or disable this warning using the setting 'akka.actor.warn-about-java-serializer-usage'
[INFO] Tests run: 5, Failures: 0, Errors: 0, Skipped: 0, Time elapsed: 0.375 s - in org.eclipse.ditto.services.connectivity.messaging.DefaultClientActorPropsFactoryTest
[INFO] Running org.eclipse.ditto.services.connectivity.messaging.httppush.HttpPublisherActorTest
[INFO] Tests run: 10, Failures: 0, Errors: 0, Skipped: 0, Time elapsed: 1.097 s - in org.eclipse.ditto.services.connectivity.messaging.httppush.HttpPublisherActorTest
[INFO] Running org.eclipse.ditto.services.connectivity.messaging.httppush.HttpPushClientActorTest
[INFO] Tests run: 14, Failures: 0, Errors: 0, Skipped: 0, Time elapsed: 2.649 s - in org.eclipse.ditto.services.connectivity.messaging.httppush.HttpPushClientActorTest
[INFO] Running org.eclipse.ditto.services.connectivity.messaging.httppush.HttpPushValidatorTest
[INFO] Tests run: 4, Failures: 0, Errors: 0, Skipped: 0, Time elapsed: 0.096 s - in org.eclipse.ditto.services.connectivity.messaging.httppush.HttpPushValidatorTest
[INFO] Running org.eclipse.ditto.services.connectivity.messaging.httppush.HttpPushFactoryTest
17:04:39.297 [ERROR] [HttpPushFactoryTest-akka.actor.default-dispatcher-12] akka.actor.ActorSystemImpl(HttpPushFactoryTest) a.a.ActorSystemImpl - Internal server error, sending 500 response
akka.stream.SubscriptionWithCancelException$StageWasCompleted$: null
17:04:39.430 [WARN ] [HttpPushFactoryTest-akka.actor.default-dispatcher-22] akka.actor.ActorSystemImpl(HttpPushFactoryTest) a.a.ActorSystemImpl - Illegal request, responding with status '400 Bad Request': Illegal character '\r' in header name
17:04:39.440 [WARN ] [HttpPushFactoryTest-akka.actor.default-dispatcher-21] akka.actor.ActorSystemImpl(HttpPushFactoryTest) a.a.ActorSystemImpl - Illegal request, responding with status '400 Bad Request': Illegal character '\r' in header name
17:04:39.447 [WARN ] [HttpPushFactoryTest-akka.actor.default-dispatcher-21] akka.actor.ActorSystemImpl(HttpPushFactoryTest) a.a.ActorSystemImpl - Illegal request, responding with status '400 Bad Request': Illegal character '\r' in header name
17:04:39.453 [WARN ] [HttpPushFactoryTest-akka.actor.default-dispatcher-22] akka.actor.ActorSystemImpl(HttpPushFactoryTest) a.a.ActorSystemImpl - Illegal request, responding with status '400 Bad Request': Illegal character '\r' in header name
17:04:39.460 [WARN ] [HttpPushFactoryTest-akka.actor.default-dispatcher-22] akka.actor.ActorSystemImpl(HttpPushFactoryTest) a.a.ActorSystemImpl - Illegal request, responding with status '400 Bad Request': Illegal character '\r' in header name
17:04:39.466 [WARN ] [HttpPushFactoryTest-akka.actor.default-dispatcher-12] akka.actor.ActorSystemImpl(HttpPushFactoryTest) a.a.ActorSystemImpl - Illegal request, responding with status '400 Bad Request': Illegal character '\r' in header name
[INFO] Tests run: 4, Failures: 0, Errors: 0, Skipped: 0, Time elapsed: 0.618 s - in org.eclipse.ditto.services.connectivity.messaging.httppush.HttpPushFactoryTest
[INFO] Running org.eclipse.ditto.services.connectivity.messaging.httppush.HttpPublisherErrorTest
[INFO] Tests run: 2, Failures: 0, Errors: 0, Skipped: 0, Time elapsed: 0.682 s - in org.eclipse.ditto.services.connectivity.messaging.httppush.HttpPublisherErrorTest
[INFO] Running org.eclipse.ditto.services.connectivity.messaging.kafka.KafkaValidatorTest
[INFO] Tests run: 6, Failures: 0, Errors: 0, Skipped: 0, Time elapsed: 0.097 s - in org.eclipse.ditto.services.connectivity.messaging.kafka.KafkaValidatorTest
[INFO] Running org.eclipse.ditto.services.connectivity.messaging.kafka.KafkaClientActorTest
[INFO] Tests run: 12, Failures: 0, Errors: 0, Skipped: 0, Time elapsed: 1.307 s - in org.eclipse.ditto.services.connectivity.messaging.kafka.KafkaClientActorTest
[INFO] Running org.eclipse.ditto.services.connectivity.messaging.kafka.KafkaBootstrapServerSpecificConfigTest
[INFO] Tests run: 11, Failures: 0, Errors: 0, Skipped: 0, Time elapsed: 0.005 s - in org.eclipse.ditto.services.connectivity.messaging.kafka.KafkaBootstrapServerSpecificConfigTest
[INFO] Running org.eclipse.ditto.services.connectivity.messaging.kafka.KafkaPublisherActorTest
[INFO] Tests run: 6, Failures: 0, Errors: 0, Skipped: 0, Time elapsed: 1.01 s - in org.eclipse.ditto.services.connectivity.messaging.kafka.KafkaPublisherActorTest
[INFO] Running org.eclipse.ditto.services.connectivity.messaging.kafka.KafkaPublishTargetTest
[INFO] Tests run: 11, Failures: 0, Errors: 0, Skipped: 0, Time elapsed: 0.053 s - in org.eclipse.ditto.services.connectivity.messaging.kafka.KafkaPublishTargetTest
[INFO] Running org.eclipse.ditto.services.connectivity.messaging.kafka.KafkaAuthenticationSpecificConfigTest
[INFO] Tests run: 12, Failures: 0, Errors: 0, Skipped: 0, Time elapsed: 0.001 s - in org.eclipse.ditto.services.connectivity.messaging.kafka.KafkaAuthenticationSpecificConfigTest
[INFO] Running org.eclipse.ditto.services.connectivity.messaging.kafka.DefaultKafkaPublisherActorFactoryTest
[INFO] Tests run: 2, Failures: 0, Errors: 0, Skipped: 0, Time elapsed: 0.001 s - in org.eclipse.ditto.services.connectivity.messaging.kafka.DefaultKafkaPublisherActorFactoryTest
[INFO] Running org.eclipse.ditto.services.connectivity.messaging.kafka.ProducerPropertiesFactoryTest
[INFO] Tests run: 1, Failures: 0, Errors: 0, Skipped: 0, Time elapsed: 0.001 s - in org.eclipse.ditto.services.connectivity.messaging.kafka.ProducerPropertiesFactoryTest
[INFO] Running org.eclipse.ditto.services.connectivity.messaging.config.DefaultClientConfigTest
[INFO] Tests run: 4, Failures: 0, Errors: 0, Skipped: 0, Time elapsed: 0.509 s - in org.eclipse.ditto.services.connectivity.messaging.config.DefaultClientConfigTest
[INFO] Running org.eclipse.ditto.services.connectivity.messaging.config.DefaultReconnectConfigTest
[INFO] Tests run: 4, Failures: 0, Errors: 0, Skipped: 0, Time elapsed: 0.055 s - in org.eclipse.ditto.services.connectivity.messaging.config.DefaultReconnectConfigTest
[INFO] Running org.eclipse.ditto.services.connectivity.messaging.config.DefaultAmqp10ConfigTest
[INFO] Tests run: 4, Failures: 0, Errors: 0, Skipped: 0, Time elapsed: 0.198 s - in org.eclipse.ditto.services.connectivity.messaging.config.DefaultAmqp10ConfigTest
[INFO] Running org.eclipse.ditto.services.connectivity.messaging.config.DefaultMonitoringConfigTest
[INFO] Tests run: 3, Failures: 0, Errors: 0, Skipped: 0, Time elapsed: 0.231 s - in org.eclipse.ditto.services.connectivity.messaging.config.DefaultMonitoringConfigTest
[INFO] Running org.eclipse.ditto.services.connectivity.messaging.config.DefaultConnectionConfigTest
[INFO] Tests run: 3, Failures: 0, Errors: 0, Skipped: 0, Time elapsed: 0.6 s - in org.eclipse.ditto.services.connectivity.messaging.config.DefaultConnectionConfigTest
[INFO] Running org.eclipse.ditto.services.connectivity.messaging.internal.ssl.CustomSSLContextTest
[INFO] Tests run: 10, Failures: 0, Errors: 0, Skipped: 0, Time elapsed: 2.059 s - in org.eclipse.ditto.services.connectivity.messaging.internal.ssl.CustomSSLContextTest
[INFO] Running org.eclipse.ditto.services.connectivity.messaging.internal.ssl.SSLContextCreatorTest
[INFO] Tests run: 10, Failures: 0, Errors: 0, Skipped: 0, Time elapsed: 1.843 s - in org.eclipse.ditto.services.connectivity.messaging.internal.ssl.SSLContextCreatorTest
[INFO] Running org.eclipse.ditto.services.connectivity.messaging.ConnectionPersistenceActorRecoveryTest
17:04:48.913 [WARN ] [AkkaTestSystem-akka.actor.default-dispatcher-12] akka.serialization.Serialization(akka://AkkaTestSystem) a.s.Serialization(akka://AkkaTestSystem) - Using the Java serializer for class [org.bson.BsonDocument] which is not recommended because of performance implications. Use another serializer or disable this warning using the setting 'akka.actor.warn-about-java-serializer-usage'
[INFO] Tests run: 2, Failures: 0, Errors: 0, Skipped: 0, Time elapsed: 2.723 s - in org.eclipse.ditto.services.connectivity.messaging.ConnectionPersistenceActorRecoveryTest
[INFO] Running org.eclipse.ditto.services.connectivity.messaging.ConnectivityProxyActorTest
[INFO] [10/28/2020 17:04:51.604] [AkkaTestSystem-akka.actor.default-dispatcher-7] [akka://AkkaTestSystem/user/$b/aggregatorProxy][x-correlation-id:6a911ca5-5383-4f61-a4aa-268f11c5c99c] Got 'RetrieveThings' message. Retrieving requested '10' Things..
[INFO] Tests run: 2, Failures: 0, Errors: 0, Skipped: 0, Time elapsed: 0.647 s - in org.eclipse.ditto.services.connectivity.messaging.ConnectivityProxyActorTest
[INFO] Running org.eclipse.ditto.services.connectivity.messaging.MessageMappingProcessorActorHeaderInteractionTest
[INFO] Tests run: 16, Failures: 0, Errors: 0, Skipped: 0, Time elapsed: 3.001 s - in org.eclipse.ditto.services.connectivity.messaging.MessageMappingProcessorActorHeaderInteractionTest
[INFO] Running org.eclipse.ditto.services.connectivity.messaging.amqp.AmqpConsumerActorTest
[INFO] Tests run: 17, Failures: 0, Errors: 0, Skipped: 0, Time elapsed: 2.489 s - in org.eclipse.ditto.services.connectivity.messaging.amqp.AmqpConsumerActorTest
[INFO] Running org.eclipse.ditto.services.connectivity.messaging.amqp.AmqpValidatorTest
[INFO] Tests run: 8, Failures: 0, Errors: 0, Skipped: 0, Time elapsed: 0.011 s - in org.eclipse.ditto.services.connectivity.messaging.amqp.AmqpValidatorTest
[INFO] Running org.eclipse.ditto.services.connectivity.messaging.amqp.AmqpClientActorTest
17:05:02.237 [ERROR] [AkkaTestSystem-akka.actor.default-dispatcher-8] akka://AkkaTestSystem/user/$$a/jmsConnectionHandling-connection-09af9be2-5dba-4895-8dc1-bcedc67c4662-connect1 a.a.OneForOneStrategy - expected exception
java.lang.IllegalStateException: expected exception
	at org.apache.qpid.jms.JmsSession.createConsumer(JmsSession.java:458)
	at org.eclipse.ditto.services.connectivity.messaging.amqp.JMSConnectionHandlingActor.createJmsConsumer(JMSConnectionHandlingActor.java:346)
	at org.eclipse.ditto.services.connectivity.messaging.amqp.JMSConnectionHandlingActor.createMessageConsumer(JMSConnectionHandlingActor.java:154)
	at akka.japi.pf.UnitCaseStatement.apply(CaseStatements.scala:24)
	at akka.japi.pf.UnitCaseStatement.apply(CaseStatements.scala:20)
	at scala.PartialFunction.applyOrElse(PartialFunction.scala:187)
	at scala.PartialFunction.applyOrElse$(PartialFunction.scala:186)
	at akka.japi.pf.UnitCaseStatement.applyOrElse(CaseStatements.scala:20)
	at scala.PartialFunction$OrElse.applyOrElse(PartialFunction.scala:241)
	at scala.PartialFunction$OrElse.applyOrElse(PartialFunction.scala:242)
	at scala.PartialFunction$OrElse.applyOrElse(PartialFunction.scala:242)
	at scala.PartialFunction$OrElse.applyOrElse(PartialFunction.scala:242)
	at scala.PartialFunction$OrElse.applyOrElse(PartialFunction.scala:242)
	at akka.actor.Actor.aroundReceive(Actor.scala:537)
	at akka.actor.Actor.aroundReceive$(Actor.scala:535)
	at akka.actor.AbstractActor.aroundReceive(AbstractActor.scala:220)
	at akka.actor.ActorCell.receiveMessage(ActorCell.scala:577)
	at akka.actor.ActorCell.invoke(ActorCell.scala:547)
	at akka.dispatch.Mailbox.processMailbox(Mailbox.scala:270)
	at akka.dispatch.Mailbox.run(Mailbox.scala:231)
	at java.base/java.util.concurrent.ThreadPoolExecutor.runWorker(ThreadPoolExecutor.java:1128)
	at java.base/java.util.concurrent.ThreadPoolExecutor$Worker.run(ThreadPoolExecutor.java:628)
	at java.base/java.lang.Thread.run(Thread.java:834)
17:05:02.791 [ERROR] [AkkaTestSystem-jms-connection-handling-dispatcher-106]  o.a.q.j.JmsConnection - Failed to connect to remote at: amqps://127.0.0.1:38600
[INFO] Tests run: 33, Failures: 0, Errors: 0, Skipped: 0, Time elapsed: 5.96 s - in org.eclipse.ditto.services.connectivity.messaging.amqp.AmqpClientActorTest
[INFO] Running org.eclipse.ditto.services.connectivity.messaging.amqp.AmqpPublisherActorTest
ImmutableAcknowledgement [label=please-verify, entityId=ditto:thing, statusCode=OK, payload=null, dittoHeaders=ImmutableDittoHeaders [{ditto-connection-id=connection-43c0beca-fe5c-4b6b-8380-c21529230fab, device_id=ditto:thing, response-required=false, correlation-id=cid, requested-acks=["please-verify"]}]]
[ERROR] Tests run: 7, Failures: 1, Errors: 0, Skipped: 0, Time elapsed: 22.14 s <<< FAILURE! - in org.eclipse.ditto.services.connectivity.messaging.amqp.AmqpPublisherActorTest
[ERROR] org.eclipse.ditto.services.connectivity.messaging.amqp.AmqpPublisherActorTest.testMsgPublishedOntoFullQueueShallBeDropped  Time elapsed: 3.116 s  <<< FAILURE!
java.lang.AssertionError: assertion failed: timeout (3 seconds) during expectMsgClass waiting for interface org.eclipse.ditto.signals.acks.base.Acknowledgements
	at org.eclipse.ditto.services.connectivity.messaging.amqp.AmqpPublisherActorTest.testMsgPublishedOntoFullQueueShallBeDropped(AmqpPublisherActorTest.java:115)

[INFO] Running org.eclipse.ditto.services.connectivity.messaging.amqp.AmqpTargetTest
[INFO] Tests run: 5, Failures: 0, Errors: 0, Skipped: 0, Time elapsed: 0.033 s - in org.eclipse.ditto.services.connectivity.messaging.amqp.AmqpTargetTest
[INFO] Running org.eclipse.ditto.services.connectivity.messaging.amqp.JmsConnectionHandlingActorTest
[INFO] Tests run: 7, Failures: 0, Errors: 0, Skipped: 0, Time elapsed: 0.254 s - in org.eclipse.ditto.services.connectivity.messaging.amqp.JmsConnectionHandlingActorTest
[INFO] Running org.eclipse.ditto.services.connectivity.messaging.OutboundMappingProcessorTest
[INFO] Tests run: 10, Failures: 0, Errors: 0, Skipped: 0, Time elapsed: 0.63 s - in org.eclipse.ditto.services.connectivity.messaging.OutboundMappingProcessorTest
[INFO] Running org.eclipse.ditto.services.connectivity.messaging.SendingTest
[INFO] Tests run: 10, Failures: 0, Errors: 0, Skipped: 0, Time elapsed: 1.186 s - in org.eclipse.ditto.services.connectivity.messaging.SendingTest
[INFO] Running org.eclipse.ditto.services.connectivity.messaging.OutboundSignalToExternalMessageTest
[INFO] Tests run: 1, Failures: 0, Errors: 0, Skipped: 0, Time elapsed: 0.015 s - in org.eclipse.ditto.services.connectivity.messaging.OutboundSignalToExternalMessageTest
[INFO] Running org.eclipse.ditto.services.connectivity.messaging.ReconnectActorTest
[INFO] Tests run: 3, Failures: 0, Errors: 0, Skipped: 0, Time elapsed: 2.288 s - in org.eclipse.ditto.services.connectivity.messaging.ReconnectActorTest
[INFO] Running org.eclipse.ditto.services.connectivity.messaging.backoff.BackOffActorTest
[INFO] Tests run: 5, Failures: 0, Errors: 0, Skipped: 0, Time elapsed: 36.4 s - in org.eclipse.ditto.services.connectivity.messaging.backoff.BackOffActorTest
[INFO] Running org.eclipse.ditto.services.connectivity.messaging.backoff.DuplicationRetryTimeoutStrategyTest
[INFO] Tests run: 4, Failures: 0, Errors: 0, Skipped: 0, Time elapsed: 0.001 s - in org.eclipse.ditto.services.connectivity.messaging.backoff.DuplicationRetryTimeoutStrategyTest
[INFO] Running org.eclipse.ditto.services.connectivity.messaging.backoff.DefaultTimeoutConfigTest
[INFO] Tests run: 3, Failures: 0, Errors: 0, Skipped: 0, Time elapsed: 0.005 s - in org.eclipse.ditto.services.connectivity.messaging.backoff.DefaultTimeoutConfigTest
[INFO] Running org.eclipse.ditto.services.connectivity.messaging.backoff.DefaultBackOffConfigTest
[INFO] Tests run: 3, Failures: 0, Errors: 0, Skipped: 0, Time elapsed: 0.056 s - in org.eclipse.ditto.services.connectivity.messaging.backoff.DefaultBackOffConfigTest
[INFO] Running org.eclipse.ditto.services.connectivity.messaging.validation.ConnectionValidatorTest
[INFO] Tests run: 22, Failures: 0, Errors: 0, Skipped: 0, Time elapsed: 0.363 s - in org.eclipse.ditto.services.connectivity.messaging.validation.ConnectionValidatorTest
[INFO] Running org.eclipse.ditto.services.connectivity.messaging.validation.HostValidatorTest
[INFO] Tests run: 5, Failures: 0, Errors: 0, Skipped: 0, Time elapsed: 0.971 s - in org.eclipse.ditto.services.connectivity.messaging.validation.HostValidatorTest
[INFO] Running org.eclipse.ditto.services.connectivity.messaging.ErrorHandlingActorTest
17:06:07.662 [WARN ] [AkkaTestSystem-akka.actor.default-dispatcher-6] akka.serialization.Serialization(akka://AkkaTestSystem) a.s.Serialization(akka://AkkaTestSystem) - Using the Java serializer for class [org.bson.BsonDocument] which is not recommended because of performance implications. Use another serializer or disable this warning using the setting 'akka.actor.warn-about-java-serializer-usage'
[INFO] Tests run: 4, Failures: 0, Errors: 0, Skipped: 0, Time elapsed: 0.222 s - in org.eclipse.ditto.services.connectivity.messaging.ErrorHandlingActorTest
[INFO] Running org.eclipse.ditto.services.connectivity.messaging.BaseClientActorTest
[INFO] Tests run: 10, Failures: 0, Errors: 0, Skipped: 0, Time elapsed: 6.765 s - in org.eclipse.ditto.services.connectivity.messaging.BaseClientActorTest
[INFO] Running org.eclipse.ditto.services.connectivity.messaging.InboundMappingProcessorTest
[INFO] Tests run: 11, Failures: 0, Errors: 0, Skipped: 0, Time elapsed: 0.197 s - in org.eclipse.ditto.services.connectivity.messaging.InboundMappingProcessorTest
[INFO] Running org.eclipse.ditto.services.connectivity.messaging.DefaultExceptionToAcknowledgementConverterTest
[INFO] Tests run: 11, Failures: 0, Errors: 0, Skipped: 0, Time elapsed: 0.004 s - in org.eclipse.ditto.services.connectivity.messaging.DefaultExceptionToAcknowledgementConverterTest
[INFO] Running org.eclipse.ditto.services.connectivity.messaging.DroppedTest
[INFO] Tests run: 2, Failures: 0, Errors: 0, Skipped: 0, Time elapsed: 0.001 s - in org.eclipse.ditto.services.connectivity.messaging.DroppedTest
[INFO] Running org.eclipse.ditto.services.connectivity.messaging.ResponseCollectorActorTest
[INFO] Tests run: 4, Failures: 0, Errors: 0, Skipped: 0, Time elapsed: 0.153 s - in org.eclipse.ditto.services.connectivity.messaging.ResponseCollectorActorTest
[INFO] 
[INFO] Results:
[INFO] 
[ERROR] Failures: 
[ERROR]   AmqpPublisherActorTest.testMsgPublishedOntoFullQueueShallBeDropped:115 assertion failed: timeout (3 seconds) during expectMsgClass waiting for interface org.eclipse.ditto.signals.acks.base.Acknowledgements
[INFO] 
[ERROR] Tests run: 737, Failures: 1, Errors: 0, Skipped: 0
[INFO] 
[INFO] ------------------------------------------------------------------------
[INFO] Reactor Summary for Eclipse Ditto 1.4.0:
[INFO] 
[INFO] Eclipse Ditto ...................................... SUCCESS [ 47.138 s]
[INFO] Eclipse Ditto :: Legal ............................. SUCCESS [  4.524 s]
[INFO] Eclipse Ditto :: BOM ............................... SUCCESS [  0.931 s]
[INFO] Eclipse Ditto :: Documentation ..................... SUCCESS [  0.874 s]
[INFO] Eclipse Ditto :: Utils ............................. SUCCESS [  0.228 s]
[INFO] Eclipse Ditto :: Utils :: JSR-305 Extensions ....... SUCCESS [ 15.498 s]
[INFO] Eclipse Ditto :: JSON .............................. SUCCESS [ 24.002 s]
[INFO] Eclipse Ditto :: JSON :: CBOR ...................... SUCCESS [ 10.050 s]
[INFO] Eclipse Ditto :: Model ............................. SUCCESS [  0.425 s]
[INFO] Eclipse Ditto :: Model :: Base ..................... SUCCESS [ 22.143 s]
[INFO] Eclipse Ditto :: Model :: Policies ................. SUCCESS [ 14.629 s]
[INFO] Eclipse Ditto :: Model :: Things ................... SUCCESS [ 18.032 s]
[INFO] Eclipse Ditto :: Model :: Connectivity ............. SUCCESS [ 15.654 s]
[INFO] Eclipse Ditto :: Model :: DevOps ................... SUCCESS [  6.589 s]
[INFO] Eclipse Ditto :: Model :: Messages ................. SUCCESS [ 13.815 s]
[INFO] Eclipse Ditto :: Model :: Namespaces ............... SUCCESS [  9.845 s]
[INFO] Eclipse Ditto :: Model :: Enforcers ................ SUCCESS [01:05 min]
[INFO] Eclipse Ditto :: Model :: JWT ...................... SUCCESS [  9.760 s]
[INFO] Eclipse Ditto :: Model :: Thing Search ............. SUCCESS [ 11.471 s]
[INFO] Eclipse Ditto :: Model :: RQL ...................... SUCCESS [  9.083 s]
[INFO] Eclipse Ditto :: Model :: RQL parser ............... SUCCESS [ 36.293 s]
[INFO] Eclipse Ditto :: Model :: Thing Search Parser ...... SUCCESS [ 22.064 s]
[INFO] Eclipse Ditto :: Model :: Query .................... SUCCESS [ 12.094 s]
[INFO] Eclipse Ditto :: Signals ........................... SUCCESS [  0.246 s]
[INFO] Eclipse Ditto :: Signals :: Base ................... SUCCESS [ 11.463 s]
[INFO] Eclipse Ditto :: Signals :: Commands ............... SUCCESS [  0.202 s]
[INFO] Eclipse Ditto :: Signals :: Commands :: Base ....... SUCCESS [ 12.209 s]
[INFO] Eclipse Ditto :: Signals :: ACKs ................... SUCCESS [  0.229 s]
[INFO] Eclipse Ditto :: Signals :: ACKs :: Base ........... SUCCESS [ 12.042 s]
[INFO] Eclipse Ditto :: Signals :: ACKs :: Things ......... SUCCESS [ 10.323 s]
[INFO] Eclipse Ditto :: Signals :: Commands :: Policies ... SUCCESS [ 16.839 s]
[INFO] Eclipse Ditto :: Signals :: Commands :: Things ..... SUCCESS [ 26.668 s]
[INFO] Eclipse Ditto :: Signals :: Commands :: Thing Search SUCCESS [ 11.075 s]
[INFO] Eclipse Ditto :: Signals :: Commands :: Messages ... SUCCESS [ 11.537 s]
[INFO] Eclipse Ditto :: Signals :: Events ................. SUCCESS [  0.188 s]
[INFO] Eclipse Ditto :: Signals :: Events :: Base ......... SUCCESS [  9.757 s]
[INFO] Eclipse Ditto :: Signals :: Events :: Policies ..... SUCCESS [ 12.445 s]
[INFO] Eclipse Ditto :: Signals :: Events :: Things ....... SUCCESS [ 15.872 s]
[INFO] Eclipse Ditto :: Signals :: Events :: Thing Search . SUCCESS [ 10.191 s]
[INFO] Eclipse Ditto :: Protocol Adapter .................. SUCCESS [ 22.399 s]
[INFO] Eclipse Ditto :: Model :: Placeholders ............. SUCCESS [ 12.271 s]
[INFO] Eclipse Ditto :: Signals :: Commands :: Common ..... SUCCESS [ 10.290 s]
[INFO] Eclipse Ditto :: Signals :: Commands :: Connectivity SUCCESS [ 14.882 s]
[INFO] Eclipse Ditto :: Signals :: Commands :: DevOps ..... SUCCESS [  9.994 s]
[INFO] Eclipse Ditto :: Signals :: Commands :: Live ....... SUCCESS [ 18.999 s]
[INFO] Eclipse Ditto :: Signals :: Commands :: Namespaces . SUCCESS [ 10.398 s]
[INFO] Eclipse Ditto :: Signals :: Commands :: Cleanup .... SUCCESS [  9.428 s]
[INFO] Eclipse Ditto :: Signals :: Events :: Connectivity . SUCCESS [  9.977 s]
[INFO] Eclipse Ditto :: Services .......................... SUCCESS [  0.195 s]
[INFO] Eclipse Ditto :: Services :: Models ................ SUCCESS [  0.166 s]
[INFO] Eclipse Ditto :: Services :: Models :: Base ........ SUCCESS [  6.101 s]
[INFO] Eclipse Ditto :: Services :: Utils ................. SUCCESS [  0.155 s]
[INFO] Eclipse Ditto :: Services :: Utils :: Config Utils . SUCCESS [ 13.312 s]
[INFO] Eclipse Ditto :: Services :: Utils :: Metrics ...... SUCCESS [ 23.222 s]
[INFO] Eclipse Ditto :: Services :: Models :: Streaming ... SUCCESS [  9.886 s]
[INFO] Eclipse Ditto :: Services :: Utils :: Akka Utils ... SUCCESS [ 37.325 s]
[INFO] Eclipse Ditto :: Services :: Utils :: Health Utils . SUCCESS [ 12.691 s]
[INFO] Eclipse Ditto :: Services :: Utils :: Cluster Utils  SUCCESS [ 15.569 s]
[INFO] Eclipse Ditto :: Services :: Utils :: DevOps ....... SUCCESS [  7.329 s]
[INFO] Eclipse Ditto :: Services :: Utils :: Tracing Utils  SUCCESS [  8.765 s]
[INFO] Eclipse Ditto :: Services :: Utils :: Cache Utils .. SUCCESS [ 13.297 s]
[INFO] Eclipse Ditto :: Services :: Utils :: Test Utils ... SUCCESS [  4.853 s]
[INFO] Eclipse Ditto :: Services :: Utils :: Persistence Utils SUCCESS [ 24.480 s]
[INFO] Eclipse Ditto :: Services :: Base .................. SUCCESS [ 15.255 s]
[INFO] Eclipse Ditto :: Services :: Concierge ............. SUCCESS [  0.186 s]
[INFO] Eclipse Ditto :: Services :: Concierge :: Common ... SUCCESS [ 12.588 s]
[INFO] Eclipse Ditto :: Services :: Utils :: Distributed Data SUCCESS [ 10.870 s]
[INFO] Eclipse Ditto :: Services :: Utils :: Pub-Sub ...... SUCCESS [01:02 min]
[INFO] Eclipse Ditto :: Services :: Models :: Things ...... SUCCESS [ 11.181 s]
[INFO] Eclipse Ditto :: Services :: Models :: Policies .... SUCCESS [ 10.793 s]
[INFO] Eclipse Ditto :: Services :: Models :: Things Search SUCCESS [ 11.367 s]
[INFO] Eclipse Ditto :: Services :: Models :: Connectivity  SUCCESS [ 12.502 s]
[INFO] Eclipse Ditto :: Services :: Models :: Concierge ... SUCCESS [  6.827 s]
[INFO] Eclipse Ditto :: Services :: Concierge :: Actors ... SUCCESS [ 12.395 s]
[INFO] Eclipse Ditto :: Services :: Utils :: Cache Loaders  SUCCESS [ 11.608 s]
[INFO] Eclipse Ditto :: Services :: Concierge :: Enforcement SUCCESS [ 30.996 s]
[INFO] Eclipse Ditto :: Services :: Utils :: Namespaces ... SUCCESS [ 14.777 s]
[INFO] Eclipse Ditto :: Services :: Concierge :: Starter .. SUCCESS [ 52.281 s]
[INFO] Eclipse Ditto :: Services :: Connectivity .......... SUCCESS [  0.175 s]
[INFO] Eclipse Ditto :: Services :: Connectivity :: Util .. SUCCESS [  8.945 s]
[INFO] Eclipse Ditto :: Services :: Models :: Signal Enrichment SUCCESS [ 27.687 s]
[INFO] Eclipse Ditto :: Services :: Connectivity :: Mapping SUCCESS [01:15 min]
[INFO] Eclipse Ditto :: Services :: Utils :: Conditional Header Utils SUCCESS [  8.268 s]
[INFO] Eclipse Ditto :: Services :: Utils :: Persistent Actors SUCCESS [ 14.353 s]
[INFO] Eclipse Ditto :: Services :: Utils :: Search ....... SUCCESS [ 13.557 s]
[INFO] Eclipse Ditto :: Services :: Utils :: Aggregator ... SUCCESS [ 10.233 s]
[INFO] Eclipse Ditto :: Services :: Models :: ACKs ........ SUCCESS [ 15.566 s]
[INFO] Eclipse Ditto :: Services :: Utils :: Protocol ..... SUCCESS [ 12.420 s]
[INFO] Eclipse Ditto :: Services :: Connectivity :: Messaging FAILURE [03:26 min]
[INFO] Eclipse Ditto :: Services :: Connectivity :: Starter SKIPPED
[INFO] Eclipse Ditto :: Services :: Gateway ............... SKIPPED
[INFO] Eclipse Ditto :: Services :: Gateway :: Util ....... SKIPPED
[INFO] Eclipse Ditto :: Services :: Utils :: JWT .......... SKIPPED
[INFO] Eclipse Ditto :: Services :: Gateway :: Security ... SKIPPED
[INFO] Eclipse Ditto :: Services :: Gateway :: Health ..... SKIPPED
[INFO] Eclipse Ditto :: Services :: Gateway :: Streaming .. SKIPPED
[INFO] Eclipse Ditto :: Services :: Gateway :: Endpoints .. SKIPPED
[INFO] Eclipse Ditto :: Services :: Gateway :: Proxy ...... SKIPPED
[INFO] Eclipse Ditto :: Services :: Gateway :: Starter .... SKIPPED
[INFO] Eclipse Ditto :: Services :: Policies .............. SKIPPED
[INFO] Eclipse Ditto :: Services :: Policies :: Common .... SKIPPED
[INFO] Eclipse Ditto :: Services :: Policies :: Persistence SKIPPED
[INFO] Eclipse Ditto :: Services :: Policies :: Starter ... SKIPPED
[INFO] Eclipse Ditto :: Services :: Things ................ SKIPPED
[INFO] Eclipse Ditto :: Services :: Things :: Common ...... SKIPPED
[INFO] Eclipse Ditto :: Services :: Things :: Persistence . SKIPPED
[INFO] Eclipse Ditto :: Services :: Things :: Starter ..... SKIPPED
[INFO] Eclipse Ditto :: Services :: Thing Search .......... SKIPPED
[INFO] Eclipse Ditto :: Services :: Thing Search :: Common  SKIPPED
[INFO] Eclipse Ditto :: Services :: Thing Search :: Persistence SKIPPED
[INFO] Eclipse Ditto :: Services :: Thing Search :: Updater Actors SKIPPED
[INFO] Eclipse Ditto :: Services :: Thing Search :: Starter SKIPPED
[INFO] Eclipse Ditto :: Services :: Legal ................. SKIPPED
[INFO] ------------------------------------------------------------------------
[INFO] BUILD FAILURE
[INFO] ------------------------------------------------------------------------
[INFO] Total time:  25:24 min
[INFO] Finished at: 2020-10-28T17:06:15Z
[INFO] ------------------------------------------------------------------------
[ERROR] Failed to execute goal org.apache.maven.plugins:maven-surefire-plugin:3.0.0-M4:test (default-test) on project ditto-services-connectivity-messaging: There are test failures.
[ERROR] 
[ERROR] Please refer to /home/jenkins/agent/workspace/ditto-release/services/connectivity/messaging/target/surefire-reports for the individual test results.
[ERROR] Please refer to dump files (if any exist) [date].dump, [date]-jvmRun[N].dump and [date].dumpstream.
[ERROR] -> [Help 1]
org.apache.maven.lifecycle.LifecycleExecutionException: Failed to execute goal org.apache.maven.plugins:maven-surefire-plugin:3.0.0-M4:test (default-test) on project ditto-services-connectivity-messaging: There are test failures.

Please refer to /home/jenkins/agent/workspace/ditto-release/services/connectivity/messaging/target/surefire-reports for the individual test results.
Please refer to dump files (if any exist) [date].dump, [date]-jvmRun[N].dump and [date].dumpstream.
    at org.apache.maven.lifecycle.internal.MojoExecutor.execute (MojoExecutor.java:215)
    at org.apache.maven.lifecycle.internal.MojoExecutor.execute (MojoExecutor.java:156)
    at org.apache.maven.lifecycle.internal.MojoExecutor.execute (MojoExecutor.java:148)
    at org.apache.maven.lifecycle.internal.LifecycleModuleBuilder.buildProject (LifecycleModuleBuilder.java:117)
    at org.apache.maven.lifecycle.internal.LifecycleModuleBuilder.buildProject (LifecycleModuleBuilder.java:81)
    at org.apache.maven.lifecycle.internal.builder.singlethreaded.SingleThreadedBuilder.build (SingleThreadedBuilder.java:56)
    at org.apache.maven.lifecycle.internal.LifecycleStarter.execute (LifecycleStarter.java:128)
    at org.apache.maven.DefaultMaven.doExecute (DefaultMaven.java:305)
    at org.apache.maven.DefaultMaven.doExecute (DefaultMaven.java:192)
    at org.apache.maven.DefaultMaven.execute (DefaultMaven.java:105)
    at org.apache.maven.cli.MavenCli.execute (MavenCli.java:957)
    at org.apache.maven.cli.MavenCli.doMain (MavenCli.java:289)
    at org.apache.maven.cli.MavenCli.main (MavenCli.java:193)
    at jdk.internal.reflect.NativeMethodAccessorImpl.invoke0 (Native Method)
    at jdk.internal.reflect.NativeMethodAccessorImpl.invoke (NativeMethodAccessorImpl.java:62)
    at jdk.internal.reflect.DelegatingMethodAccessorImpl.invoke (DelegatingMethodAccessorImpl.java:43)
    at java.lang.reflect.Method.invoke (Method.java:566)
    at org.codehaus.plexus.classworlds.launcher.Launcher.launchEnhanced (Launcher.java:282)
    at org.codehaus.plexus.classworlds.launcher.Launcher.launch (Launcher.java:225)
    at org.codehaus.plexus.classworlds.launcher.Launcher.mainWithExitCode (Launcher.java:406)
    at org.codehaus.plexus.classworlds.launcher.Launcher.main (Launcher.java:347)
Caused by: org.apache.maven.plugin.MojoFailureException: There are test failures.

Please refer to /home/jenkins/agent/workspace/ditto-release/services/connectivity/messaging/target/surefire-reports for the individual test results.
Please refer to dump files (if any exist) [date].dump, [date]-jvmRun[N].dump and [date].dumpstream.
    at org.apache.maven.plugin.surefire.SurefireHelper.throwException (SurefireHelper.java:271)
    at org.apache.maven.plugin.surefire.SurefireHelper.reportExecution (SurefireHelper.java:159)
    at org.apache.maven.plugin.surefire.SurefirePlugin.handleSummary (SurefirePlugin.java:435)
    at org.apache.maven.plugin.surefire.AbstractSurefireMojo.executeAfterPreconditionsChecked (AbstractSurefireMojo.java:1079)
    at org.apache.maven.plugin.surefire.AbstractSurefireMojo.execute (AbstractSurefireMojo.java:889)
    at org.apache.maven.plugin.DefaultBuildPluginManager.executeMojo (DefaultBuildPluginManager.java:137)
    at org.apache.maven.lifecycle.internal.MojoExecutor.execute (MojoExecutor.java:210)
    at org.apache.maven.lifecycle.internal.MojoExecutor.execute (MojoExecutor.java:156)
    at org.apache.maven.lifecycle.internal.MojoExecutor.execute (MojoExecutor.java:148)
    at org.apache.maven.lifecycle.internal.LifecycleModuleBuilder.buildProject (LifecycleModuleBuilder.java:117)
    at org.apache.maven.lifecycle.internal.LifecycleModuleBuilder.buildProject (LifecycleModuleBuilder.java:81)
    at org.apache.maven.lifecycle.internal.builder.singlethreaded.SingleThreadedBuilder.build (SingleThreadedBuilder.java:56)
    at org.apache.maven.lifecycle.internal.LifecycleStarter.execute (LifecycleStarter.java:128)
    at org.apache.maven.DefaultMaven.doExecute (DefaultMaven.java:305)
    at org.apache.maven.DefaultMaven.doExecute (DefaultMaven.java:192)
    at org.apache.maven.DefaultMaven.execute (DefaultMaven.java:105)
    at org.apache.maven.cli.MavenCli.execute (MavenCli.java:957)
    at org.apache.maven.cli.MavenCli.doMain (MavenCli.java:289)
    at org.apache.maven.cli.MavenCli.main (MavenCli.java:193)
    at jdk.internal.reflect.NativeMethodAccessorImpl.invoke0 (Native Method)
    at jdk.internal.reflect.NativeMethodAccessorImpl.invoke (NativeMethodAccessorImpl.java:62)
    at jdk.internal.reflect.DelegatingMethodAccessorImpl.invoke (DelegatingMethodAccessorImpl.java:43)
    at java.lang.reflect.Method.invoke (Method.java:566)
    at org.codehaus.plexus.classworlds.launcher.Launcher.launchEnhanced (Launcher.java:282)
    at org.codehaus.plexus.classworlds.launcher.Launcher.launch (Launcher.java:225)
    at org.codehaus.plexus.classworlds.launcher.Launcher.mainWithExitCode (Launcher.java:406)
    at org.codehaus.plexus.classworlds.launcher.Launcher.main (Launcher.java:347)
[ERROR] 
[ERROR] Re-run Maven using the -X switch to enable full debug logging.
[ERROR] 
[ERROR] For more information about the errors and possible solutions, please read the following articles:
[ERROR] [Help 1] http://cwiki.apache.org/confluence/display/MAVEN/MojoFailureException
[ERROR] 
[ERROR] After correcting the problems, you can resume the build with the command
[ERROR]   mvn <args> -rf :ditto-services-connectivity-messaging
Build step 'Invoke top-level Maven targets' marked build as failure
$ ssh-agent -k
unset SSH_AUTH_SOCK;
unset SSH_AGENT_PID;
echo Agent pid 83 killed;
[ssh-agent] Stopped.
Recording test results
Finished: FAILURE