AbortedConsole Output

Skipping 1,563 KB.. Full Log
[INFO] 
08:03:13 [INFO] --- flatten-maven-plugin:1.0.1:clean (flatten.clean) @ ditto-services-gateway ---
08:03:13 [INFO] 
08:03:13 [INFO] --- jacoco-maven-plugin:0.8.5:prepare-agent (prepare-agent) @ ditto-services-gateway ---
08:03:13 [INFO] argLine set to -javaagent:/home/jenkins/.m2/repository/org/jacoco/org.jacoco.agent/0.8.5/org.jacoco.agent-0.8.5-runtime.jar=destfile=/home/jenkins/agent/workspace/ditto-ci/services/gateway/target/jacoco.exec -Dfile.encoding=UTF-8
08:03:13 [INFO] 
08:03:13 [INFO] --- license-maven-plugin:1.17:add-third-party (default-cli) @ ditto-services-gateway ---
08:03:13 [WARNING] The goal is skip due to packaging 'pom'
08:03:13 [INFO] 
08:03:13 [INFO] --- flatten-maven-plugin:1.0.1:flatten (flatten) @ ditto-services-gateway ---
08:03:13 [INFO] Generating flattened POM of project org.eclipse.ditto:ditto-services-gateway:pom:0-SNAPSHOT...
08:03:13 [INFO] 
08:03:13 [INFO] --- maven-dependency-plugin:3.0.2:unpack-dependencies (copy-legal-docs) @ ditto-services-gateway ---
08:03:13 [INFO] Unpacking /home/jenkins/agent/workspace/ditto-ci/legal/target/ditto-legal-0-SNAPSHOT.jar to /home/jenkins/agent/workspace/ditto-ci/services/gateway/target/classes/META-INF with includes "" and excludes "NOTICE-THIRD-PARTY.md,3rd-party-dependencies/**,META-INF/**"
08:03:13 [INFO] 
08:03:13 [INFO] --- maven-failsafe-plugin:3.0.0-M4:integration-test (integration-test) @ ditto-services-gateway ---
08:03:13 [INFO] Tests are skipped.
08:03:13 [INFO] 
08:03:13 [INFO] --- maven-failsafe-plugin:3.0.0-M4:verify (verify) @ ditto-services-gateway ---
08:03:13 [INFO] Tests are skipped.
08:03:13 [INFO] 
08:03:13 [INFO] --- jacoco-maven-plugin:0.8.5:report (report) @ ditto-services-gateway ---
08:03:13 [INFO] Skipping JaCoCo execution due to missing execution data file.
08:03:13 [INFO] 
08:03:13 [INFO] --- maven-install-plugin:2.5.2:install (default-install) @ ditto-services-gateway ---
08:03:13 [INFO] Installing /home/jenkins/agent/workspace/ditto-ci/services/gateway/.flattened-pom.xml to /home/jenkins/.m2/repository/org/eclipse/ditto/ditto-services-gateway/0-SNAPSHOT/ditto-services-gateway-0-SNAPSHOT.pom
08:03:13 [INFO] 
08:03:13 [INFO] -----------< org.eclipse.ditto:ditto-services-gateway-util >------------
08:03:13 [INFO] Building Eclipse Ditto :: Services :: Gateway :: Util 0-SNAPSHOT [93/114]
08:03:13 [INFO] --------------------------------[ jar ]---------------------------------
08:03:13 [INFO] 
08:03:13 [INFO] --- maven-clean-plugin:2.5:clean (default-clean) @ ditto-services-gateway-util ---
08:03:13 [INFO] 
08:03:13 [INFO] --- flatten-maven-plugin:1.0.1:clean (flatten.clean) @ ditto-services-gateway-util ---
08:03:13 [INFO] 
08:03:13 [INFO] --- jacoco-maven-plugin:0.8.5:prepare-agent (prepare-agent) @ ditto-services-gateway-util ---
08:03:13 [INFO] argLine set to -javaagent:/home/jenkins/.m2/repository/org/jacoco/org.jacoco.agent/0.8.5/org.jacoco.agent-0.8.5-runtime.jar=destfile=/home/jenkins/agent/workspace/ditto-ci/services/gateway/util/target/jacoco.exec -Dfile.encoding=UTF-8
08:03:13 [INFO] 
08:03:13 [INFO] --- license-maven-plugin:1.17:add-third-party (default-cli) @ ditto-services-gateway-util ---
08:03:13 [WARNING] 
08:03:13 [WARNING] !!! licenseMergesFile is deprecated, use now licenseMergesUrl !!!
08:03:13 [WARNING] 
08:03:13 [WARNING] licenseMerges will be overridden by licenseMergesFile.
08:03:13 [WARNING] 
08:03:13 [INFO] Writing third-party file to /home/jenkins/agent/workspace/ditto-ci/services/gateway/util/target/classes/META-INF/NOTICE-THIRD-PARTY.md
08:03:13 [INFO] 
08:03:13 [INFO] --- maven-resources-plugin:3.1.0:resources (default-resources) @ ditto-services-gateway-util ---
08:03:13 [INFO] Using 'UTF-8' encoding to copy filtered resources.
08:03:13 [INFO] skip non existing resourceDirectory /home/jenkins/agent/workspace/ditto-ci/services/gateway/util/src/main/resources
08:03:13 [INFO] Copying 0 resource
08:03:13 [INFO] 
08:03:13 [INFO] --- flatten-maven-plugin:1.0.1:flatten (flatten) @ ditto-services-gateway-util ---
08:03:13 [INFO] Generating flattened POM of project org.eclipse.ditto:ditto-services-gateway-util:jar:0-SNAPSHOT...
08:03:13 [INFO] 
08:03:13 [INFO] --- maven-compiler-plugin:3.8.1:compile (default-compile) @ ditto-services-gateway-util ---
08:03:13 [INFO] Changes detected - recompiling the module!
08:03:13 [INFO] Compiling 38 source files to /home/jenkins/agent/workspace/ditto-ci/services/gateway/util/target/classes
08:03:13 [INFO] 
08:03:13 [INFO] --- maven-resources-plugin:3.1.0:testResources (default-testResources) @ ditto-services-gateway-util ---
08:03:13 [INFO] Using 'UTF-8' encoding to copy filtered resources.
08:03:13 [INFO] Copying 14 resources
08:03:13 [INFO] 
08:03:13 [INFO] --- maven-compiler-plugin:3.8.1:testCompile (default-testCompile) @ ditto-services-gateway-util ---
08:03:13 [INFO] Changes detected - recompiling the module!
08:03:13 [INFO] Compiling 14 source files to /home/jenkins/agent/workspace/ditto-ci/services/gateway/util/target/test-classes
08:03:13 [INFO] /home/jenkins/agent/workspace/ditto-ci/services/gateway/util/src/test/java/org/eclipse/ditto/services/gateway/util/config/endpoints/GatewayHttpConfigTest.java: Some input files use or override a deprecated API.
08:03:13 [INFO] /home/jenkins/agent/workspace/ditto-ci/services/gateway/util/src/test/java/org/eclipse/ditto/services/gateway/util/config/endpoints/GatewayHttpConfigTest.java: Recompile with -Xlint:deprecation for details.
08:03:13 [INFO] 
08:03:13 [INFO] --- maven-surefire-plugin:3.0.0-M4:test (default-test) @ ditto-services-gateway-util ---
08:03:13 [INFO] Surefire report directory: /home/jenkins/agent/workspace/ditto-ci/services/gateway/util/target/surefire-reports
08:03:13 [INFO] 
08:03:13 [INFO] -------------------------------------------------------
08:03:13 [INFO]  T E S T S
08:03:13 [INFO] -------------------------------------------------------
08:03:13 [INFO] Running org.eclipse.ditto.services.gateway.util.config.health.DefaultClusterRolesConfigTest
08:03:14 [INFO] Tests run: 4, Failures: 0, Errors: 0, Skipped: 0, Time elapsed: 2.144 s - in org.eclipse.ditto.services.gateway.util.config.health.DefaultClusterRolesConfigTest
08:03:16 [INFO] Running org.eclipse.ditto.services.gateway.util.config.health.DefaultHealthCheckConfigTest
08:03:16 [INFO] Tests run: 4, Failures: 0, Errors: 0, Skipped: 0, Time elapsed: 0.471 s - in org.eclipse.ditto.services.gateway.util.config.health.DefaultHealthCheckConfigTest
08:03:17 [INFO] Running org.eclipse.ditto.services.gateway.util.config.streaming.DefaultStreamingConfigTest
08:03:17 [INFO] Tests run: 4, Failures: 0, Errors: 0, Skipped: 0, Time elapsed: 0.238 s - in org.eclipse.ditto.services.gateway.util.config.streaming.DefaultStreamingConfigTest
08:03:17 [INFO] Running org.eclipse.ditto.services.gateway.util.config.streaming.DefaultWebsocketConfigTest
08:03:17 [INFO] Tests run: 5, Failures: 0, Errors: 0, Skipped: 0, Time elapsed: 0.239 s - in org.eclipse.ditto.services.gateway.util.config.streaming.DefaultWebsocketConfigTest
08:03:17 [INFO] Running org.eclipse.ditto.services.gateway.util.config.streaming.DefaultGatewaySignalEnrichmentConfigTest
08:03:17 [INFO] Tests run: 4, Failures: 0, Errors: 0, Skipped: 0, Time elapsed: 0.026 s - in org.eclipse.ditto.services.gateway.util.config.streaming.DefaultGatewaySignalEnrichmentConfigTest
08:03:17 [INFO] Running org.eclipse.ditto.services.gateway.util.config.endpoints.DefaultPublicHealthConfigTest
08:03:17 [INFO] Tests run: 4, Failures: 0, Errors: 0, Skipped: 0, Time elapsed: 0.019 s - in org.eclipse.ditto.services.gateway.util.config.endpoints.DefaultPublicHealthConfigTest
08:03:17 [INFO] Running org.eclipse.ditto.services.gateway.util.config.endpoints.DefaultClaimMessageConfigTest
08:03:17 [INFO] Tests run: 4, Failures: 0, Errors: 0, Skipped: 0, Time elapsed: 0.065 s - in org.eclipse.ditto.services.gateway.util.config.endpoints.DefaultClaimMessageConfigTest
08:03:17 [INFO] Running org.eclipse.ditto.services.gateway.util.config.endpoints.DefaultMessageConfigTest
08:03:17 [INFO] Tests run: 4, Failures: 0, Errors: 0, Skipped: 0, Time elapsed: 0.024 s - in org.eclipse.ditto.services.gateway.util.config.endpoints.DefaultMessageConfigTest
08:03:18 [INFO] Running org.eclipse.ditto.services.gateway.util.config.endpoints.DefaultCommandConfigTest
08:03:18 [INFO] Tests run: 4, Failures: 0, Errors: 0, Skipped: 0, Time elapsed: 0.06 s - in org.eclipse.ditto.services.gateway.util.config.endpoints.DefaultCommandConfigTest
08:03:18 [INFO] Running org.eclipse.ditto.services.gateway.util.config.endpoints.GatewayHttpConfigTest
08:03:18 [INFO] Tests run: 11, Failures: 0, Errors: 0, Skipped: 0, Time elapsed: 0.8 s - in org.eclipse.ditto.services.gateway.util.config.endpoints.GatewayHttpConfigTest
08:03:18 [INFO] Running org.eclipse.ditto.services.gateway.util.config.security.DefaultOAuthConfigTest
08:03:18 [INFO] Tests run: 4, Failures: 0, Errors: 0, Skipped: 0, Time elapsed: 0.291 s - in org.eclipse.ditto.services.gateway.util.config.security.DefaultOAuthConfigTest
08:03:19 [INFO] Running org.eclipse.ditto.services.gateway.util.config.security.DefaultAuthenticationConfigTest
08:03:19 [INFO] Tests run: 4, Failures: 0, Errors: 0, Skipped: 0, Time elapsed: 0.038 s - in org.eclipse.ditto.services.gateway.util.config.security.DefaultAuthenticationConfigTest
08:03:19 [INFO] Running org.eclipse.ditto.services.gateway.util.config.security.DefaultDevOpsConfigTest
08:03:19 [INFO] Tests run: 4, Failures: 0, Errors: 0, Skipped: 0, Time elapsed: 0.055 s - in org.eclipse.ditto.services.gateway.util.config.security.DefaultDevOpsConfigTest
08:03:19 [INFO] Running org.eclipse.ditto.services.gateway.util.GatewayMappingStrategiesTest
08:03:19 [INFO] Tests run: 5, Failures: 0, Errors: 0, Skipped: 0, Time elapsed: 0.501 s - in org.eclipse.ditto.services.gateway.util.GatewayMappingStrategiesTest
08:03:19 [INFO] 
08:03:20 [INFO] Results:
08:03:20 [INFO] 
08:03:20 [INFO] Tests run: 65, Failures: 0, Errors: 0, Skipped: 0
08:03:20 [INFO] 
08:03:20 [INFO] 
08:03:20 [INFO] --- maven-dependency-plugin:3.0.2:unpack-dependencies (copy-legal-docs) @ ditto-services-gateway-util ---
08:03:20 [INFO] Unpacking /home/jenkins/agent/workspace/ditto-ci/legal/target/ditto-legal-0-SNAPSHOT.jar to /home/jenkins/agent/workspace/ditto-ci/services/gateway/util/target/classes/META-INF with includes "" and excludes "NOTICE-THIRD-PARTY.md,3rd-party-dependencies/**,META-INF/**"
08:03:20 [INFO] 
08:03:20 [INFO] --- maven-jar-plugin:3.0.2:jar (default-jar) @ ditto-services-gateway-util ---
08:03:20 [INFO] Building jar: /home/jenkins/agent/workspace/ditto-ci/services/gateway/util/target/ditto-services-gateway-util-0-SNAPSHOT.jar
08:03:20 [INFO] 
08:03:20 [INFO] --- maven-failsafe-plugin:3.0.0-M4:integration-test (integration-test) @ ditto-services-gateway-util ---
08:03:20 [INFO] Tests are skipped.
08:03:20 [INFO] 
08:03:20 [INFO] --- maven-failsafe-plugin:3.0.0-M4:verify (verify) @ ditto-services-gateway-util ---
08:03:20 [INFO] Tests are skipped.
08:03:20 [INFO] 
08:03:20 [INFO] --- jacoco-maven-plugin:0.8.5:report (report) @ ditto-services-gateway-util ---
08:03:20 [INFO] Loading execution data file /home/jenkins/agent/workspace/ditto-ci/services/gateway/util/target/jacoco.exec
08:03:20 [INFO] Analyzed bundle 'Eclipse Ditto :: Services :: Gateway :: Util' with 36 classes
08:03:20 [INFO] 
08:03:20 [INFO] --- maven-install-plugin:2.5.2:install (default-install) @ ditto-services-gateway-util ---
08:03:20 [INFO] Installing /home/jenkins/agent/workspace/ditto-ci/services/gateway/util/target/ditto-services-gateway-util-0-SNAPSHOT.jar to /home/jenkins/.m2/repository/org/eclipse/ditto/ditto-services-gateway-util/0-SNAPSHOT/ditto-services-gateway-util-0-SNAPSHOT.jar
08:03:20 [INFO] Installing /home/jenkins/agent/workspace/ditto-ci/services/gateway/util/.flattened-pom.xml to /home/jenkins/.m2/repository/org/eclipse/ditto/ditto-services-gateway-util/0-SNAPSHOT/ditto-services-gateway-util-0-SNAPSHOT.pom
08:03:20 [INFO] 
08:03:20 [INFO] -------------< org.eclipse.ditto:ditto-services-utils-jwt >-------------
08:03:20 [INFO] Building Eclipse Ditto :: Services :: Utils :: JWT 0-SNAPSHOT   [94/114]
08:03:20 [INFO] --------------------------------[ jar ]---------------------------------
08:03:20 [INFO] 
08:03:20 [INFO] --- maven-clean-plugin:2.5:clean (default-clean) @ ditto-services-utils-jwt ---
08:03:20 [INFO] 
08:03:20 [INFO] --- flatten-maven-plugin:1.0.1:clean (flatten.clean) @ ditto-services-utils-jwt ---
08:03:20 [INFO] 
08:03:20 [INFO] --- jacoco-maven-plugin:0.8.5:prepare-agent (prepare-agent) @ ditto-services-utils-jwt ---
08:03:20 [INFO] argLine set to -javaagent:/home/jenkins/.m2/repository/org/jacoco/org.jacoco.agent/0.8.5/org.jacoco.agent-0.8.5-runtime.jar=destfile=/home/jenkins/agent/workspace/ditto-ci/services/utils/jwt/target/jacoco.exec -Dfile.encoding=UTF-8
08:03:20 [INFO] 
08:03:20 [INFO] --- license-maven-plugin:1.17:add-third-party (default-cli) @ ditto-services-utils-jwt ---
08:03:20 [WARNING] 
08:03:20 [WARNING] !!! licenseMergesFile is deprecated, use now licenseMergesUrl !!!
08:03:20 [WARNING] 
08:03:20 [WARNING] licenseMerges will be overridden by licenseMergesFile.
08:03:20 [WARNING] 
08:03:20 [INFO] Writing third-party file to /home/jenkins/agent/workspace/ditto-ci/services/utils/jwt/target/classes/META-INF/NOTICE-THIRD-PARTY.md
08:03:20 [INFO] 
08:03:20 [INFO] --- maven-resources-plugin:3.1.0:resources (default-resources) @ ditto-services-utils-jwt ---
08:03:20 [INFO] Using 'UTF-8' encoding to copy filtered resources.
08:03:20 [INFO] skip non existing resourceDirectory /home/jenkins/agent/workspace/ditto-ci/services/utils/jwt/src/main/resources
08:03:20 [INFO] Copying 0 resource
08:03:20 [INFO] 
08:03:20 [INFO] --- flatten-maven-plugin:1.0.1:flatten (flatten) @ ditto-services-utils-jwt ---
08:03:20 [INFO] Generating flattened POM of project org.eclipse.ditto:ditto-services-utils-jwt:jar:0-SNAPSHOT...
08:03:20 [INFO] 
08:03:20 [INFO] --- maven-compiler-plugin:3.8.1:compile (default-compile) @ ditto-services-utils-jwt ---
08:03:20 [INFO] Changes detected - recompiling the module!
08:03:20 [INFO] Compiling 2 source files to /home/jenkins/agent/workspace/ditto-ci/services/utils/jwt/target/classes
08:03:20 [INFO] /home/jenkins/agent/workspace/ditto-ci/services/utils/jwt/src/main/java/org/eclipse/ditto/services/utils/jwt/JjwtSerializer.java: /home/jenkins/agent/workspace/ditto-ci/services/utils/jwt/src/main/java/org/eclipse/ditto/services/utils/jwt/JjwtSerializer.java uses unchecked or unsafe operations.
08:03:20 [INFO] /home/jenkins/agent/workspace/ditto-ci/services/utils/jwt/src/main/java/org/eclipse/ditto/services/utils/jwt/JjwtSerializer.java: Recompile with -Xlint:unchecked for details.
08:03:20 [INFO] 
08:03:20 [INFO] --- maven-resources-plugin:3.1.0:testResources (default-testResources) @ ditto-services-utils-jwt ---
08:03:20 [INFO] Using 'UTF-8' encoding to copy filtered resources.
08:03:20 [INFO] skip non existing resourceDirectory /home/jenkins/agent/workspace/ditto-ci/services/utils/jwt/src/test/resources
08:03:20 [INFO] 
08:03:20 [INFO] --- maven-compiler-plugin:3.8.1:testCompile (default-testCompile) @ ditto-services-utils-jwt ---
08:03:20 [INFO] Changes detected - recompiling the module!
08:03:20 [INFO] Compiling 1 source file to /home/jenkins/agent/workspace/ditto-ci/services/utils/jwt/target/test-classes
08:03:20 [INFO] /home/jenkins/agent/workspace/ditto-ci/services/utils/jwt/src/test/java/org/eclipse/ditto/services/utils/jwt/JjwtDeserializerTest.java: /home/jenkins/agent/workspace/ditto-ci/services/utils/jwt/src/test/java/org/eclipse/ditto/services/utils/jwt/JjwtDeserializerTest.java uses unchecked or unsafe operations.
08:03:20 [INFO] /home/jenkins/agent/workspace/ditto-ci/services/utils/jwt/src/test/java/org/eclipse/ditto/services/utils/jwt/JjwtDeserializerTest.java: Recompile with -Xlint:unchecked for details.
08:03:20 [INFO] 
08:03:20 [INFO] --- maven-surefire-plugin:3.0.0-M4:test (default-test) @ ditto-services-utils-jwt ---
08:03:20 [INFO] Surefire report directory: /home/jenkins/agent/workspace/ditto-ci/services/utils/jwt/target/surefire-reports
08:03:20 [INFO] 
08:03:20 [INFO] -------------------------------------------------------
08:03:20 [INFO]  T E S T S
08:03:20 [INFO] -------------------------------------------------------
08:03:20 [INFO] Running org.eclipse.ditto.services.utils.jwt.JjwtDeserializerTest
08:03:21 [INFO] Tests run: 1, Failures: 0, Errors: 0, Skipped: 0, Time elapsed: 0.26 s - in org.eclipse.ditto.services.utils.jwt.JjwtDeserializerTest
08:03:21 [INFO] 
08:03:21 [INFO] Results:
08:03:21 [INFO] 
08:03:21 [INFO] Tests run: 1, Failures: 0, Errors: 0, Skipped: 0
08:03:21 [INFO] 
08:03:21 [INFO] 
08:03:21 [INFO] --- maven-dependency-plugin:3.0.2:unpack-dependencies (copy-legal-docs) @ ditto-services-utils-jwt ---
08:03:21 [INFO] Unpacking /home/jenkins/agent/workspace/ditto-ci/legal/target/ditto-legal-0-SNAPSHOT.jar to /home/jenkins/agent/workspace/ditto-ci/services/utils/jwt/target/classes/META-INF with includes "" and excludes "NOTICE-THIRD-PARTY.md,3rd-party-dependencies/**,META-INF/**"
08:03:21 [INFO] 
08:03:21 [INFO] --- maven-jar-plugin:3.0.2:jar (default-jar) @ ditto-services-utils-jwt ---
08:03:21 [INFO] Building jar: /home/jenkins/agent/workspace/ditto-ci/services/utils/jwt/target/ditto-services-utils-jwt-0-SNAPSHOT.jar
08:03:21 [INFO] 
08:03:21 [INFO] --- maven-failsafe-plugin:3.0.0-M4:integration-test (integration-test) @ ditto-services-utils-jwt ---
08:03:21 [INFO] Tests are skipped.
08:03:21 [INFO] 
08:03:21 [INFO] --- maven-failsafe-plugin:3.0.0-M4:verify (verify) @ ditto-services-utils-jwt ---
08:03:21 [INFO] Tests are skipped.
08:03:21 [INFO] 
08:03:21 [INFO] --- jacoco-maven-plugin:0.8.5:report (report) @ ditto-services-utils-jwt ---
08:03:21 [INFO] Loading execution data file /home/jenkins/agent/workspace/ditto-ci/services/utils/jwt/target/jacoco.exec
08:03:21 [INFO] Analyzed bundle 'Eclipse Ditto :: Services :: Utils :: JWT' with 2 classes
08:03:21 [INFO] 
08:03:21 [INFO] --- maven-install-plugin:2.5.2:install (default-install) @ ditto-services-utils-jwt ---
08:03:21 [INFO] Installing /home/jenkins/agent/workspace/ditto-ci/services/utils/jwt/target/ditto-services-utils-jwt-0-SNAPSHOT.jar to /home/jenkins/.m2/repository/org/eclipse/ditto/ditto-services-utils-jwt/0-SNAPSHOT/ditto-services-utils-jwt-0-SNAPSHOT.jar
08:03:21 [INFO] Installing /home/jenkins/agent/workspace/ditto-ci/services/utils/jwt/.flattened-pom.xml to /home/jenkins/.m2/repository/org/eclipse/ditto/ditto-services-utils-jwt/0-SNAPSHOT/ditto-services-utils-jwt-0-SNAPSHOT.pom
08:03:21 [INFO] 
08:03:21 [INFO] ---------< org.eclipse.ditto:ditto-services-gateway-security >----------
08:03:21 [INFO] Building Eclipse Ditto :: Services :: Gateway :: Security 0-SNAPSHOT [95/114]
08:03:21 [INFO] --------------------------------[ jar ]---------------------------------
08:03:21 [INFO] 
08:03:21 [INFO] --- maven-clean-plugin:2.5:clean (default-clean) @ ditto-services-gateway-security ---
08:03:21 [INFO] 
08:03:21 [INFO] --- flatten-maven-plugin:1.0.1:clean (flatten.clean) @ ditto-services-gateway-security ---
08:03:21 [INFO] 
08:03:21 [INFO] --- jacoco-maven-plugin:0.8.5:prepare-agent (prepare-agent) @ ditto-services-gateway-security ---
08:03:21 [INFO] argLine set to -javaagent:/home/jenkins/.m2/repository/org/jacoco/org.jacoco.agent/0.8.5/org.jacoco.agent-0.8.5-runtime.jar=destfile=/home/jenkins/agent/workspace/ditto-ci/services/gateway/security/target/jacoco.exec -Dfile.encoding=UTF-8
08:03:21 [INFO] 
08:03:21 [INFO] --- license-maven-plugin:1.17:add-third-party (default-cli) @ ditto-services-gateway-security ---
08:03:21 [WARNING] 
08:03:21 [WARNING] !!! licenseMergesFile is deprecated, use now licenseMergesUrl !!!
08:03:21 [WARNING] 
08:03:21 [WARNING] licenseMerges will be overridden by licenseMergesFile.
08:03:21 [WARNING] 
08:03:21 [INFO] Writing third-party file to /home/jenkins/agent/workspace/ditto-ci/services/gateway/security/target/classes/META-INF/NOTICE-THIRD-PARTY.md
08:03:21 [INFO] 
08:03:21 [INFO] --- maven-resources-plugin:3.1.0:resources (default-resources) @ ditto-services-gateway-security ---
08:03:21 [INFO] Using 'UTF-8' encoding to copy filtered resources.
08:03:21 [INFO] skip non existing resourceDirectory /home/jenkins/agent/workspace/ditto-ci/services/gateway/security/src/main/resources
08:03:21 [INFO] Copying 0 resource
08:03:21 [INFO] 
08:03:21 [INFO] --- flatten-maven-plugin:1.0.1:flatten (flatten) @ ditto-services-gateway-security ---
08:03:21 [INFO] Generating flattened POM of project org.eclipse.ditto:ditto-services-gateway-security:jar:0-SNAPSHOT...
08:03:21 [INFO] 
08:03:21 [INFO] --- maven-compiler-plugin:3.8.1:compile (default-compile) @ ditto-services-gateway-security ---
08:03:21 [INFO] Changes detected - recompiling the module!
08:03:21 [INFO] Compiling 31 source files to /home/jenkins/agent/workspace/ditto-ci/services/gateway/security/target/classes
08:03:21 [INFO] /home/jenkins/agent/workspace/ditto-ci/services/gateway/security/src/main/java/org/eclipse/ditto/services/gateway/security/authentication/preauth/PreAuthenticatedAuthenticationProvider.java: /home/jenkins/agent/workspace/ditto-ci/services/gateway/security/src/main/java/org/eclipse/ditto/services/gateway/security/authentication/preauth/PreAuthenticatedAuthenticationProvider.java uses or overrides a deprecated API.
08:03:22 [INFO] /home/jenkins/agent/workspace/ditto-ci/services/gateway/security/src/main/java/org/eclipse/ditto/services/gateway/security/authentication/preauth/PreAuthenticatedAuthenticationProvider.java: Recompile with -Xlint:deprecation for details.
08:03:22 [INFO] /home/jenkins/agent/workspace/ditto-ci/services/gateway/security/src/main/java/org/eclipse/ditto/services/gateway/security/authentication/DefaultAuthenticationFailureAggregator.java: /home/jenkins/agent/workspace/ditto-ci/services/gateway/security/src/main/java/org/eclipse/ditto/services/gateway/security/authentication/DefaultAuthenticationFailureAggregator.java uses unchecked or unsafe operations.
08:03:22 [INFO] /home/jenkins/agent/workspace/ditto-ci/services/gateway/security/src/main/java/org/eclipse/ditto/services/gateway/security/authentication/DefaultAuthenticationFailureAggregator.java: Recompile with -Xlint:unchecked for details.
08:03:22 [INFO] 
08:03:22 [INFO] --- maven-resources-plugin:3.1.0:testResources (default-testResources) @ ditto-services-gateway-security ---
08:03:22 [INFO] Using 'UTF-8' encoding to copy filtered resources.
08:03:22 [INFO] Copying 1 resource
08:03:22 [INFO] 
08:03:22 [INFO] --- maven-compiler-plugin:3.8.1:testCompile (default-testCompile) @ ditto-services-gateway-security ---
08:03:22 [INFO] Changes detected - recompiling the module!
08:03:22 [INFO] Compiling 13 source files to /home/jenkins/agent/workspace/ditto-ci/services/gateway/security/target/test-classes
08:03:22 [INFO] /home/jenkins/agent/workspace/ditto-ci/services/gateway/security/src/test/java/org/eclipse/ditto/services/gateway/security/authentication/DefaultAuthenticationFailureAggregatorTest.java: /home/jenkins/agent/workspace/ditto-ci/services/gateway/security/src/test/java/org/eclipse/ditto/services/gateway/security/authentication/DefaultAuthenticationFailureAggregatorTest.java uses unchecked or unsafe operations.
08:03:22 [INFO] /home/jenkins/agent/workspace/ditto-ci/services/gateway/security/src/test/java/org/eclipse/ditto/services/gateway/security/authentication/DefaultAuthenticationFailureAggregatorTest.java: Recompile with -Xlint:unchecked for details.
08:03:22 [INFO] 
08:03:22 [INFO] --- maven-surefire-plugin:3.0.0-M4:test (default-test) @ ditto-services-gateway-security ---
08:03:22 [INFO] Surefire report directory: /home/jenkins/agent/workspace/ditto-ci/services/gateway/security/target/surefire-reports
08:03:22 [INFO] 
08:03:22 [INFO] -------------------------------------------------------
08:03:22 [INFO]  T E S T S
08:03:22 [INFO] -------------------------------------------------------
08:03:22 [INFO] Running org.eclipse.ditto.services.gateway.security.authentication.jwt.JwtValidatorTest
08:03:23 13:03:24.976 [main] INFO org.eclipse.ditto.services.gateway.security.authentication.jwt.DefaultJwtValidator - Failed to parse JWT!
08:03:24 io.jsonwebtoken.ExpiredJwtException: JWT expired at 2020-12-10T13:03:23Z. Current time: 2020-12-10T13:03:24Z, a difference of 1971 milliseconds.  Allowed clock skew: 0 milliseconds.
08:03:24 	at io.jsonwebtoken.impl.DefaultJwtParser.parse(DefaultJwtParser.java:411)
08:03:24 	at org.eclipse.ditto.services.gateway.security.authentication.jwt.DefaultJwtValidator.validateWithPublicKey(DefaultJwtValidator.java:84)
08:03:24 	at org.eclipse.ditto.services.gateway.security.authentication.jwt.DefaultJwtValidator.tryToValidateWithPublicKey(DefaultJwtValidator.java:72)
08:03:24 	at org.eclipse.ditto.services.gateway.security.authentication.jwt.DefaultJwtValidator.lambda$validate$0(DefaultJwtValidator.java:61)
08:03:24 	at java.base/java.util.Optional.map(Optional.java:265)
08:03:24 	at org.eclipse.ditto.services.gateway.security.authentication.jwt.DefaultJwtValidator.lambda$validate$2(DefaultJwtValidator.java:61)
08:03:24 	at java.base/java.util.concurrent.CompletableFuture.uniApplyNow(CompletableFuture.java:680)
08:03:24 	at java.base/java.util.concurrent.CompletableFuture.uniApplyStage(CompletableFuture.java:658)
08:03:24 	at java.base/java.util.concurrent.CompletableFuture.thenApply(CompletableFuture.java:2094)
08:03:24 	at org.eclipse.ditto.services.gateway.security.authentication.jwt.DefaultJwtValidator.validate(DefaultJwtValidator.java:60)
08:03:24 	at org.eclipse.ditto.services.gateway.security.authentication.jwt.JwtValidatorTest.validateFails(JwtValidatorTest.java:66)
08:03:24 	at java.base/jdk.internal.reflect.NativeMethodAccessorImpl.invoke0(Native Method)
08:03:24 	at java.base/jdk.internal.reflect.NativeMethodAccessorImpl.invoke(NativeMethodAccessorImpl.java:62)
08:03:24 	at java.base/jdk.internal.reflect.DelegatingMethodAccessorImpl.invoke(DelegatingMethodAccessorImpl.java:43)
08:03:24 	at java.base/java.lang.reflect.Method.invoke(Method.java:566)
08:03:24 	at org.junit.runners.model.FrameworkMethod$1.runReflectiveCall(FrameworkMethod.java:59)
08:03:24 	at org.junit.internal.runners.model.ReflectiveCallable.run(ReflectiveCallable.java:12)
08:03:24 	at org.junit.runners.model.FrameworkMethod.invokeExplosively(FrameworkMethod.java:56)
08:03:24 	at org.junit.internal.runners.statements.InvokeMethod.evaluate(InvokeMethod.java:17)
08:03:24 	at org.mockito.internal.runners.DefaultInternalRunner$1$1.evaluate(DefaultInternalRunner.java:44)
08:03:24 	at org.junit.runners.ParentRunner$3.evaluate(ParentRunner.java:306)
08:03:24 	at org.junit.runners.BlockJUnit4ClassRunner$1.evaluate(BlockJUnit4ClassRunner.java:100)
08:03:24 	at org.junit.runners.ParentRunner.runLeaf(ParentRunner.java:366)
08:03:24 	at org.junit.runners.BlockJUnit4ClassRunner.runChild(BlockJUnit4ClassRunner.java:103)
08:03:24 	at org.junit.runners.BlockJUnit4ClassRunner.runChild(BlockJUnit4ClassRunner.java:63)
08:03:24 	at org.junit.runners.ParentRunner$4.run(ParentRunner.java:331)
08:03:24 	at org.junit.runners.ParentRunner$1.schedule(ParentRunner.java:79)
08:03:24 	at org.junit.runners.ParentRunner.runChildren(ParentRunner.java:329)
08:03:24 	at org.junit.runners.ParentRunner.access$100(ParentRunner.java:66)
08:03:24 	at org.junit.runners.ParentRunner$2.evaluate(ParentRunner.java:293)
08:03:24 	at org.junit.runners.ParentRunner$3.evaluate(ParentRunner.java:306)
08:03:24 	at org.junit.runners.ParentRunner.run(ParentRunner.java:413)
08:03:24 	at org.mockito.internal.runners.DefaultInternalRunner$1.run(DefaultInternalRunner.java:74)
08:03:24 	at org.mockito.internal.runners.DefaultInternalRunner.run(DefaultInternalRunner.java:80)
08:03:24 	at org.mockito.internal.runners.StrictRunner.run(StrictRunner.java:39)
08:03:24 	at org.mockito.junit.MockitoJUnitRunner.run(MockitoJUnitRunner.java:163)
08:03:24 	at org.apache.maven.surefire.junit4.JUnit4Provider.execute(JUnit4Provider.java:365)
08:03:24 	at org.apache.maven.surefire.junit4.JUnit4Provider.executeWithRerun(JUnit4Provider.java:273)
08:03:24 	at org.apache.maven.surefire.junit4.JUnit4Provider.executeTestSet(JUnit4Provider.java:238)
08:03:24 	at org.apache.maven.surefire.junit4.JUnit4Provider.invoke(JUnit4Provider.java:159)
08:03:24 	at org.apache.maven.surefire.booter.ForkedBooter.runSuitesInProcess(ForkedBooter.java:377)
08:03:24 	at org.apache.maven.surefire.booter.ForkedBooter.execute(ForkedBooter.java:138)
08:03:24 	at org.apache.maven.surefire.booter.ForkedBooter.run(ForkedBooter.java:465)
08:03:24 	at org.apache.maven.surefire.booter.ForkedBooter.main(ForkedBooter.java:451)
08:03:24 [INFO] Tests run: 2, Failures: 0, Errors: 0, Skipped: 0, Time elapsed: 1.97 s - in org.eclipse.ditto.services.gateway.security.authentication.jwt.JwtValidatorTest
08:03:24 [INFO] Running org.eclipse.ditto.services.gateway.security.authentication.jwt.DittoPublicKeyProviderTest
08:03:24 13:03:26.972 [main] DEBUG org.eclipse.ditto.services.gateway.security.authentication.jwt.DittoPublicKeyProvider - Loading public key with id <cc34c0a0-bd5a-4a3c-a50d-a2a7db7643df> from issuer <google.com>.
08:03:26 13:03:26.979 [main] DEBUG org.eclipse.ditto.services.gateway.security.authentication.jwt.DittoPublicKeyProvider - Loading public keys from discovery endpoint <https://google.com/.well-known/openid-configuration>.
08:03:26 13:03:27.107 [Thread-1] DEBUG org.eclipse.ditto.services.gateway.security.authentication.jwt.DittoPublicKeyProvider - Trying to find key with id <cc34c0a0-bd5a-4a3c-a50d-a2a7db7643df> in json array <[{"kty":"RSA","alg":"HS256","use":"sig","kid":"anotherId","n":"pjdss8ZaDfEH6K6U7GeW2nxDqR4IP049fk1fK0lndimbMMVBdPv_hSpm8T8EtBDxrUdi1OHZfMhUixGaut-3nQ4GG9nM249oxhCtxqqNvEXrmQRGqczyLxuh-fKn9Fg--hS9UpazHpfVAFnB5aCfXoNhPuI8oByyFKMKaOVgHNqP5NBEqabiLftZD3W_lsFCPGuzr4Vp0YS7zS2hDYScC2oOMu4rGU1LcMZf39p3153Cq7bS2Xh6Y-vw5pwzFYZdjQxDn8x8BG3fJ6j8TGLXQsbKH1218_HcUJRvMwdpbUQG5nvA2GXVqLqdwp054Lzk9_B_f1lVrmOKuHjTNHq48w","e":"AQAB"}]>.
08:03:27 13:03:27.111 [Thread-1] DEBUG org.eclipse.ditto.services.gateway.security.authentication.jwt.DittoPublicKeyProvider - Did not find key with id <cc34c0a0-bd5a-4a3c-a50d-a2a7db7643df>.
08:03:27 13:03:27.114 [Thread-2] DEBUG org.eclipse.ditto.services.gateway.security.authentication.jwt.DittoPublicKeyProvider - Removed PublicKey with ID <PublicKeyIdWithIssuer [keyId='cc34c0a0-bd5a-4a3c-a50d-a2a7db7643df', issuer='google.com']> from cache due to cause 'EXPLICIT'.
08:03:27 13:03:27.169 [main] DEBUG org.eclipse.ditto.services.gateway.security.authentication.jwt.DittoPublicKeyProvider - Loading public key with id <cc34c0a0-bd5a-4a3c-a50d-a2a7db7643df> from issuer <google.com>.
08:03:27 13:03:27.169 [main] DEBUG org.eclipse.ditto.services.gateway.security.authentication.jwt.DittoPublicKeyProvider - Loading public keys from discovery endpoint <https://google.com/.well-known/openid-configuration>.
08:03:27 13:03:27.173 [Thread-3] DEBUG org.eclipse.ditto.services.gateway.security.authentication.jwt.DittoPublicKeyProvider - Trying to find key with id <cc34c0a0-bd5a-4a3c-a50d-a2a7db7643df> in json array <[{"kty":"RSA","alg":"HS256","use":"sig","kid":"anotherId","n":"pjdss8ZaDfEH6K6U7GeW2nxDqR4IP049fk1fK0lndimbMMVBdPv_hSpm8T8EtBDxrUdi1OHZfMhUixGaut-3nQ4GG9nM249oxhCtxqqNvEXrmQRGqczyLxuh-fKn9Fg--hS9UpazHpfVAFnB5aCfXoNhPuI8oByyFKMKaOVgHNqP5NBEqabiLftZD3W_lsFCPGuzr4Vp0YS7zS2hDYScC2oOMu4rGU1LcMZf39p3153Cq7bS2Xh6Y-vw5pwzFYZdjQxDn8x8BG3fJ6j8TGLXQsbKH1218_HcUJRvMwdpbUQG5nvA2GXVqLqdwp054Lzk9_B_f1lVrmOKuHjTNHq48w","e":"AQAB"}]>.
08:03:27 13:03:27.173 [Thread-3] DEBUG org.eclipse.ditto.services.gateway.security.authentication.jwt.DittoPublicKeyProvider - Did not find key with id <cc34c0a0-bd5a-4a3c-a50d-a2a7db7643df>.
08:03:27 13:03:27.173 [Thread-4] DEBUG org.eclipse.ditto.services.gateway.security.authentication.jwt.DittoPublicKeyProvider - Removed PublicKey with ID <PublicKeyIdWithIssuer [keyId='cc34c0a0-bd5a-4a3c-a50d-a2a7db7643df', issuer='google.com']> from cache due to cause 'EXPLICIT'.
08:03:27 13:03:27.280 [main] DEBUG org.eclipse.ditto.services.gateway.security.authentication.jwt.DittoPublicKeyProvider - Loading public key with id <cc34c0a0-bd5a-4a3c-a50d-a2a7db7643df> from issuer <google.com>.
08:03:27 13:03:27.280 [main] DEBUG org.eclipse.ditto.services.gateway.security.authentication.jwt.DittoPublicKeyProvider - Loading public keys from discovery endpoint <https://google.com/.well-known/openid-configuration>.
08:03:27 13:03:27.282 [Thread-6] INFO org.eclipse.ditto.services.gateway.security.authentication.jwt.DittoPublicKeyProvider - Got non success response from public key provider with status code: <503 Service Unavailable> and body: <{"message":"Something went wrong."}>.
08:03:27 Dec 10, 2020 1:03:27 PM com.github.benmanes.caffeine.cache.LocalAsyncCache lambda$handleCompletion$7
08:03:27 WARNING: Exception thrown during asynchronous load
08:03:27 java.util.concurrent.CompletionException: org.eclipse.ditto.signals.commands.base.exceptions.GatewayAuthenticationProviderUnavailableException [message='Got unexpected response from public key provider.', errorCode=gateway:authentication.provider.unavailable, statusCode=SERVICE_UNAVAILABLE, description='If after retry it is still unavailable, please contact the service team.', href=null, dittoHeaders=ImmutableDittoHeaders [{}]]
08:03:27 	at java.base/java.util.concurrent.CompletableFuture.encodeThrowable(CompletableFuture.java:314)
08:03:27 	at java.base/java.util.concurrent.CompletableFuture.completeThrowable(CompletableFuture.java:319)
08:03:27 	at java.base/java.util.concurrent.CompletableFuture.uniExceptionally(CompletableFuture.java:990)
08:03:27 	at java.base/java.util.concurrent.CompletableFuture.uniExceptionallyStage(CompletableFuture.java:1004)
08:03:27 	at java.base/java.util.concurrent.CompletableFuture.exceptionally(CompletableFuture.java:2307)
08:03:27 	at java.base/java.util.concurrent.CompletableFuture.exceptionally(CompletableFuture.java:143)
08:03:27 	at org.eclipse.ditto.services.gateway.security.authentication.jwt.DittoPublicKeyProvider.getPublicKeysFromDiscoveryEndpoint(DittoPublicKeyProvider.java:181)
08:03:27 	at org.eclipse.ditto.services.gateway.security.authentication.jwt.DittoPublicKeyProvider.loadPublicKey(DittoPublicKeyProvider.java:140)
08:03:27 	at com.github.benmanes.caffeine.cache.LocalAsyncCache.lambda$get$2(LocalAsyncCache.java:92)
08:03:27 	at com.github.benmanes.caffeine.cache.LocalCache.lambda$statsAware$0(LocalCache.java:139)
08:03:27 	at com.github.benmanes.caffeine.cache.BoundedLocalCache.lambda$doComputeIfAbsent$14(BoundedLocalCache.java:2344)
08:03:27 	at java.base/java.util.concurrent.ConcurrentHashMap.compute(ConcurrentHashMap.java:1908)
08:03:27 	at com.github.benmanes.caffeine.cache.BoundedLocalCache.doComputeIfAbsent(BoundedLocalCache.java:2342)
08:03:27 	at com.github.benmanes.caffeine.cache.BoundedLocalCache.computeIfAbsent(BoundedLocalCache.java:2325)
08:03:27 	at com.github.benmanes.caffeine.cache.LocalAsyncCache.get(LocalAsyncCache.java:91)
08:03:27 	at com.github.benmanes.caffeine.cache.LocalAsyncCache.get(LocalAsyncCache.java:82)
08:03:27 	at org.eclipse.ditto.services.utils.cache.CaffeineCache.get(CaffeineCache.java:152)
08:03:27 	at org.eclipse.ditto.services.gateway.security.authentication.jwt.DittoPublicKeyProvider.getPublicKey(DittoPublicKeyProvider.java:125)
08:03:27 	at org.eclipse.ditto.services.gateway.security.authentication.jwt.DittoPublicKeyProviderTest.lambda$verifyThatKeyIsNotCachedOnErrorResponseFromDiscoveryEndpoint$0(DittoPublicKeyProviderTest.java:118)
08:03:27 	at org.assertj.core.api.ThrowableAssert.catchThrowable(ThrowableAssert.java:62)
08:03:27 	at org.assertj.core.api.ThrowableTypeAssert.isThrownBy(ThrowableTypeAssert.java:59)
08:03:27 	at org.eclipse.ditto.services.gateway.security.authentication.jwt.DittoPublicKeyProviderTest.verifyThatKeyIsNotCachedOnErrorResponseFromDiscoveryEndpoint(DittoPublicKeyProviderTest.java:118)
08:03:27 	at java.base/jdk.internal.reflect.NativeMethodAccessorImpl.invoke0(Native Method)
08:03:27 	at java.base/jdk.internal.reflect.NativeMethodAccessorImpl.invoke(NativeMethodAccessorImpl.java:62)
08:03:27 	at java.base/jdk.internal.reflect.DelegatingMethodAccessorImpl.invoke(DelegatingMethodAccessorImpl.java:43)
08:03:27 	at java.base/java.lang.reflect.Method.invoke(Method.java:566)
08:03:27 	at org.junit.runners.model.FrameworkMethod$1.runReflectiveCall(FrameworkMethod.java:59)
08:03:27 	at org.junit.internal.runners.model.ReflectiveCallable.run(ReflectiveCallable.java:12)
08:03:27 	at org.junit.runners.model.FrameworkMethod.invokeExplosively(FrameworkMethod.java:56)
08:03:27 	at org.junit.internal.runners.statements.InvokeMethod.evaluate(InvokeMethod.java:17)
08:03:27 	at org.junit.internal.runners.statements.RunBefores.evaluate(RunBefores.java:26)
08:03:27 	at org.mockito.internal.runners.DefaultInternalRunner$1$1.evaluate(DefaultInternalRunner.java:44)
08:03:27 	at org.junit.internal.runners.statements.RunAfters.evaluate(RunAfters.java:27)
08:03:27 	at org.junit.runners.ParentRunner$3.evaluate(ParentRunner.java:306)
08:03:27 	at org.junit.runners.BlockJUnit4ClassRunner$1.evaluate(BlockJUnit4ClassRunner.java:100)
08:03:27 	at org.junit.runners.ParentRunner.runLeaf(ParentRunner.java:366)
08:03:27 	at org.junit.runners.BlockJUnit4ClassRunner.runChild(BlockJUnit4ClassRunner.java:103)
08:03:27 	at org.junit.runners.BlockJUnit4ClassRunner.runChild(BlockJUnit4ClassRunner.java:63)
08:03:27 	at org.junit.runners.ParentRunner$4.run(ParentRunner.java:331)
08:03:27 	at org.junit.runners.ParentRunner$1.schedule(ParentRunner.java:79)
08:03:27 	at org.junit.runners.ParentRunner.runChildren(ParentRunner.java:329)
08:03:27 	at org.junit.runners.ParentRunner.access$100(ParentRunner.java:66)
08:03:27 	at org.junit.runners.ParentRunner$2.evaluate(ParentRunner.java:293)
08:03:27 	at org.junit.runners.ParentRunner$3.evaluate(ParentRunner.java:306)
08:03:27 	at org.junit.runners.ParentRunner.run(ParentRunner.java:413)
08:03:27 	at org.mockito.internal.runners.DefaultInternalRunner$1.run(DefaultInternalRunner.java:74)
08:03:27 	at org.mockito.internal.runners.DefaultInternalRunner.run(DefaultInternalRunner.java:80)
08:03:27 	at org.mockito.internal.runners.StrictRunner.run(StrictRunner.java:39)
08:03:27 	at org.mockito.junit.MockitoJUnitRunner.run(MockitoJUnitRunner.java:163)
08:03:27 	at org.apache.maven.surefire.junit4.JUnit4Provider.execute(JUnit4Provider.java:365)
08:03:27 	at org.apache.maven.surefire.junit4.JUnit4Provider.executeWithRerun(JUnit4Provider.java:273)
08:03:27 	at org.apache.maven.surefire.junit4.JUnit4Provider.executeTestSet(JUnit4Provider.java:238)
08:03:27 	at org.apache.maven.surefire.junit4.JUnit4Provider.invoke(JUnit4Provider.java:159)
08:03:27 	at org.apache.maven.surefire.booter.ForkedBooter.runSuitesInProcess(ForkedBooter.java:377)
08:03:27 	at org.apache.maven.surefire.booter.ForkedBooter.execute(ForkedBooter.java:138)
08:03:27 	at org.apache.maven.surefire.booter.ForkedBooter.run(ForkedBooter.java:465)
08:03:27 	at org.apache.maven.surefire.booter.ForkedBooter.main(ForkedBooter.java:451)
08:03:27 Caused by: org.eclipse.ditto.signals.commands.base.exceptions.GatewayAuthenticationProviderUnavailableException [message='Got unexpected response from public key provider.', errorCode=gateway:authentication.provider.unavailable, statusCode=SERVICE_UNAVAILABLE, description='If after retry it is still unavailable, please contact the service team.', href=null, dittoHeaders=ImmutableDittoHeaders [{}]]
08:03:27 	at org.eclipse.ditto.signals.commands.base.exceptions.GatewayAuthenticationProviderUnavailableException$Builder.doBuild(GatewayAuthenticationProviderUnavailableException.java:126)
08:03:27 	at org.eclipse.ditto.signals.commands.base.exceptions.GatewayAuthenticationProviderUnavailableException$Builder.doBuild(GatewayAuthenticationProviderUnavailableException.java:111)
08:03:27 	at org.eclipse.ditto.model.base.exceptions.DittoRuntimeExceptionBuilder.build(DittoRuntimeExceptionBuilder.java:180)
08:03:27 	at org.eclipse.ditto.services.gateway.security.authentication.jwt.DittoPublicKeyProvider.handleNonSuccessResponse(DittoPublicKeyProvider.java:206)
08:03:27 	at org.eclipse.ditto.services.gateway.security.authentication.jwt.DittoPublicKeyProvider.mapResponseToJsonObject(DittoPublicKeyProvider.java:189)
08:03:27 	at java.base/java.util.concurrent.CompletableFuture.uniComposeStage(CompletableFuture.java:1106)
08:03:27 	at java.base/java.util.concurrent.CompletableFuture.thenCompose(CompletableFuture.java:2235)
08:03:27 	at java.base/java.util.concurrent.CompletableFuture.thenCompose(CompletableFuture.java:143)
08:03:27 	at org.eclipse.ditto.services.gateway.security.authentication.jwt.DittoPublicKeyProvider.getPublicKeysFromDiscoveryEndpoint(DittoPublicKeyProvider.java:178)
08:03:27 	... 50 more
08:03:27 
08:03:27 13:03:27.314 [main] DEBUG org.eclipse.ditto.services.gateway.security.authentication.jwt.DittoPublicKeyProvider - Loading public key with id <cc34c0a0-bd5a-4a3c-a50d-a2a7db7643df> from issuer <google.com>.
08:03:27 13:03:27.314 [main] DEBUG org.eclipse.ditto.services.gateway.security.authentication.jwt.DittoPublicKeyProvider - Loading public keys from discovery endpoint <https://google.com/.well-known/openid-configuration>.
08:03:27 13:03:27.316 [Thread-7] INFO org.eclipse.ditto.services.gateway.security.authentication.jwt.DittoPublicKeyProvider - Got non success response from public key provider with status code: <503 Service Unavailable> and body: <{"message":"Something went wrong."}>.
08:03:27 Dec 10, 2020 1:03:27 PM com.github.benmanes.caffeine.cache.LocalAsyncCache lambda$handleCompletion$7
08:03:27 WARNING: Exception thrown during asynchronous load
08:03:27 java.util.concurrent.CompletionException: org.eclipse.ditto.signals.commands.base.exceptions.GatewayAuthenticationProviderUnavailableException [message='Got unexpected response from public key provider.', errorCode=gateway:authentication.provider.unavailable, statusCode=SERVICE_UNAVAILABLE, description='If after retry it is still unavailable, please contact the service team.', href=null, dittoHeaders=ImmutableDittoHeaders [{}]]
08:03:27 	at java.base/java.util.concurrent.CompletableFuture.encodeThrowable(CompletableFuture.java:314)
08:03:27 	at java.base/java.util.concurrent.CompletableFuture.completeThrowable(CompletableFuture.java:319)
08:03:27 	at java.base/java.util.concurrent.CompletableFuture.uniExceptionally(CompletableFuture.java:990)
08:03:27 	at java.base/java.util.concurrent.CompletableFuture.uniExceptionallyStage(CompletableFuture.java:1004)
08:03:27 	at java.base/java.util.concurrent.CompletableFuture.exceptionally(CompletableFuture.java:2307)
08:03:27 	at java.base/java.util.concurrent.CompletableFuture.exceptionally(CompletableFuture.java:143)
08:03:27 	at org.eclipse.ditto.services.gateway.security.authentication.jwt.DittoPublicKeyProvider.getPublicKeysFromDiscoveryEndpoint(DittoPublicKeyProvider.java:181)
08:03:27 	at org.eclipse.ditto.services.gateway.security.authentication.jwt.DittoPublicKeyProvider.loadPublicKey(DittoPublicKeyProvider.java:140)
08:03:27 	at com.github.benmanes.caffeine.cache.LocalAsyncCache.lambda$get$2(LocalAsyncCache.java:92)
08:03:27 	at com.github.benmanes.caffeine.cache.LocalCache.lambda$statsAware$0(LocalCache.java:139)
08:03:27 	at com.github.benmanes.caffeine.cache.BoundedLocalCache.lambda$doComputeIfAbsent$14(BoundedLocalCache.java:2344)
08:03:27 	at java.base/java.util.concurrent.ConcurrentHashMap.compute(ConcurrentHashMap.java:1908)
08:03:27 	at com.github.benmanes.caffeine.cache.BoundedLocalCache.doComputeIfAbsent(BoundedLocalCache.java:2342)
08:03:27 	at com.github.benmanes.caffeine.cache.BoundedLocalCache.computeIfAbsent(BoundedLocalCache.java:2325)
08:03:27 	at com.github.benmanes.caffeine.cache.LocalAsyncCache.get(LocalAsyncCache.java:91)
08:03:27 	at com.github.benmanes.caffeine.cache.LocalAsyncCache.get(LocalAsyncCache.java:82)
08:03:27 	at org.eclipse.ditto.services.utils.cache.CaffeineCache.get(CaffeineCache.java:152)
08:03:27 	at org.eclipse.ditto.services.gateway.security.authentication.jwt.DittoPublicKeyProvider.getPublicKey(DittoPublicKeyProvider.java:125)
08:03:27 	at org.eclipse.ditto.services.gateway.security.authentication.jwt.DittoPublicKeyProviderTest.lambda$verifyThatKeyIsNotCachedOnErrorResponseFromDiscoveryEndpoint$1(DittoPublicKeyProviderTest.java:126)
08:03:27 	at org.assertj.core.api.ThrowableAssert.catchThrowable(ThrowableAssert.java:62)
08:03:27 	at org.assertj.core.api.ThrowableTypeAssert.isThrownBy(ThrowableTypeAssert.java:59)
08:03:27 	at org.eclipse.ditto.services.gateway.security.authentication.jwt.DittoPublicKeyProviderTest.verifyThatKeyIsNotCachedOnErrorResponseFromDiscoveryEndpoint(DittoPublicKeyProviderTest.java:126)
08:03:27 	at java.base/jdk.internal.reflect.NativeMethodAccessorImpl.invoke0(Native Method)
08:03:27 	at java.base/jdk.internal.reflect.NativeMethodAccessorImpl.invoke(NativeMethodAccessorImpl.java:62)
08:03:27 	at java.base/jdk.internal.reflect.DelegatingMethodAccessorImpl.invoke(DelegatingMethodAccessorImpl.java:43)
08:03:27 	at java.base/java.lang.reflect.Method.invoke(Method.java:566)
08:03:27 	at org.junit.runners.model.FrameworkMethod$1.runReflectiveCall(FrameworkMethod.java:59)
08:03:27 	at org.junit.internal.runners.model.ReflectiveCallable.run(ReflectiveCallable.java:12)
08:03:27 	at org.junit.runners.model.FrameworkMethod.invokeExplosively(FrameworkMethod.java:56)
08:03:27 	at org.junit.internal.runners.statements.InvokeMethod.evaluate(InvokeMethod.java:17)
08:03:27 	at org.junit.internal.runners.statements.RunBefores.evaluate(RunBefores.java:26)
08:03:27 	at org.mockito.internal.runners.DefaultInternalRunner$1$1.evaluate(DefaultInternalRunner.java:44)
08:03:27 	at org.junit.internal.runners.statements.RunAfters.evaluate(RunAfters.java:27)
08:03:27 	at org.junit.runners.ParentRunner$3.evaluate(ParentRunner.java:306)
08:03:27 	at org.junit.runners.BlockJUnit4ClassRunner$1.evaluate(BlockJUnit4ClassRunner.java:100)
08:03:27 	at org.junit.runners.ParentRunner.runLeaf(ParentRunner.java:366)
08:03:27 	at org.junit.runners.BlockJUnit4ClassRunner.runChild(BlockJUnit4ClassRunner.java:103)
08:03:27 	at org.junit.runners.BlockJUnit4ClassRunner.runChild(BlockJUnit4ClassRunner.java:63)
08:03:27 	at org.junit.runners.ParentRunner$4.run(ParentRunner.java:331)
08:03:27 	at org.junit.runners.ParentRunner$1.schedule(ParentRunner.java:79)
08:03:27 	at org.junit.runners.ParentRunner.runChildren(ParentRunner.java:329)
08:03:27 	at org.junit.runners.ParentRunner.access$100(ParentRunner.java:66)
08:03:27 	at org.junit.runners.ParentRunner$2.evaluate(ParentRunner.java:293)
08:03:27 	at org.junit.runners.ParentRunner$3.evaluate(ParentRunner.java:306)
08:03:27 	at org.junit.runners.ParentRunner.run(ParentRunner.java:413)
08:03:27 	at org.mockito.internal.runners.DefaultInternalRunner$1.run(DefaultInternalRunner.java:74)
08:03:27 	at org.mockito.internal.runners.DefaultInternalRunner.run(DefaultInternalRunner.java:80)
08:03:27 	at org.mockito.internal.runners.StrictRunner.run(StrictRunner.java:39)
08:03:27 	at org.mockito.junit.MockitoJUnitRunner.run(MockitoJUnitRunner.java:163)
08:03:27 	at org.apache.maven.surefire.junit4.JUnit4Provider.execute(JUnit4Provider.java:365)
08:03:27 	at org.apache.maven.surefire.junit4.JUnit4Provider.executeWithRerun(JUnit4Provider.java:273)
08:03:27 	at org.apache.maven.surefire.junit4.JUnit4Provider.executeTestSet(JUnit4Provider.java:238)
08:03:27 	at org.apache.maven.surefire.junit4.JUnit4Provider.invoke(JUnit4Provider.java:159)
08:03:27 	at org.apache.maven.surefire.booter.ForkedBooter.runSuitesInProcess(ForkedBooter.java:377)
08:03:27 	at org.apache.maven.surefire.booter.ForkedBooter.execute(ForkedBooter.java:138)
08:03:27 	at org.apache.maven.surefire.booter.ForkedBooter.run(ForkedBooter.java:465)
08:03:27 	at org.apache.maven.surefire.booter.ForkedBooter.main(ForkedBooter.java:451)
08:03:27 Caused by: org.eclipse.ditto.signals.commands.base.exceptions.GatewayAuthenticationProviderUnavailableException [message='Got unexpected response from public key provider.', errorCode=gateway:authentication.provider.unavailable, statusCode=SERVICE_UNAVAILABLE, description='If after retry it is still unavailable, please contact the service team.', href=null, dittoHeaders=ImmutableDittoHeaders [{}]]
08:03:27 	at org.eclipse.ditto.signals.commands.base.exceptions.GatewayAuthenticationProviderUnavailableException$Builder.doBuild(GatewayAuthenticationProviderUnavailableException.java:126)
08:03:27 	at org.eclipse.ditto.signals.commands.base.exceptions.GatewayAuthenticationProviderUnavailableException$Builder.doBuild(GatewayAuthenticationProviderUnavailableException.java:111)
08:03:27 	at org.eclipse.ditto.model.base.exceptions.DittoRuntimeExceptionBuilder.build(DittoRuntimeExceptionBuilder.java:180)
08:03:27 	at org.eclipse.ditto.services.gateway.security.authentication.jwt.DittoPublicKeyProvider.handleNonSuccessResponse(DittoPublicKeyProvider.java:206)
08:03:27 	at org.eclipse.ditto.services.gateway.security.authentication.jwt.DittoPublicKeyProvider.mapResponseToJsonObject(DittoPublicKeyProvider.java:189)
08:03:27 	at java.base/java.util.concurrent.CompletableFuture.uniComposeStage(CompletableFuture.java:1106)
08:03:27 	at java.base/java.util.concurrent.CompletableFuture.thenCompose(CompletableFuture.java:2235)
08:03:27 	at java.base/java.util.concurrent.CompletableFuture.thenCompose(CompletableFuture.java:143)
08:03:27 	at org.eclipse.ditto.services.gateway.security.authentication.jwt.DittoPublicKeyProvider.getPublicKeysFromDiscoveryEndpoint(DittoPublicKeyProvider.java:178)
08:03:27 	... 50 more
08:03:27 
08:03:27 13:03:27.403 [main] DEBUG org.eclipse.ditto.services.gateway.security.authentication.jwt.DittoPublicKeyProvider - Loading public key with id <cc34c0a0-bd5a-4a3c-a50d-a2a7db7643df> from issuer <google.com>.
08:03:27 13:03:27.404 [main] DEBUG org.eclipse.ditto.services.gateway.security.authentication.jwt.DittoPublicKeyProvider - Loading public keys from discovery endpoint <https://google.com/.well-known/openid-configuration>.
08:03:27 13:03:27.408 [Thread-9] DEBUG org.eclipse.ditto.services.gateway.security.authentication.jwt.DittoPublicKeyProvider - Trying to find key with id <cc34c0a0-bd5a-4a3c-a50d-a2a7db7643df> in json array <[{"kty":"RSA","alg":"HS256","use":"sig","kid":"cc34c0a0-bd5a-4a3c-a50d-a2a7db7643df","n":"pjdss8ZaDfEH6K6U7GeW2nxDqR4IP049fk1fK0lndimbMMVBdPv_hSpm8T8EtBDxrUdi1OHZfMhUixGaut-3nQ4GG9nM249oxhCtxqqNvEXrmQRGqczyLxuh-fKn9Fg--hS9UpazHpfVAFnB5aCfXoNhPuI8oByyFKMKaOVgHNqP5NBEqabiLftZD3W_lsFCPGuzr4Vp0YS7zS2hDYScC2oOMu4rGU1LcMZf39p3153Cq7bS2Xh6Y-vw5pwzFYZdjQxDn8x8BG3fJ6j8TGLXQsbKH1218_HcUJRvMwdpbUQG5nvA2GXVqLqdwp054Lzk9_B_f1lVrmOKuHjTNHq48w","e":"AQAB"}]>.
08:03:27 13:03:27.408 [Thread-9] DEBUG org.eclipse.ditto.services.gateway.security.authentication.jwt.DittoPublicKeyProvider - Found matching JsonWebKey for id <cc34c0a0-bd5a-4a3c-a50d-a2a7db7643df>: <ImmutableJsonWebKey [type=RSA, algorithm=HS256, usage=sig, id=cc34c0a0-bd5a-4a3c-a50d-a2a7db7643df, modulus=20982889522210001485650410725548922714309004261159005191923853277569518095682375600129793584411516345789872208924969839152517544658111642093952927038816881641948818632238417188498242143523765174081399999494314050268311269402093545048106991194235300814993180598205253206169039836506632301798403286558820023478126889320420683019302287562002617906146354858300957371133354462216686693432439912285976045003759341642352273348041815115125987680080949457435339036206259974518778815081216683851476361113727053210191478876976067331169489847253132775698962309270441870495028428711506394321134768203259087454022424620914469157107, exponent=65537]>.
08:03:27 [INFO] Tests run: 3, Failures: 0, Errors: 0, Skipped: 0, Time elapsed: 2.428 s - in org.eclipse.ditto.services.gateway.security.authentication.jwt.DittoPublicKeyProviderTest
08:03:27 [INFO] Running org.eclipse.ditto.services.gateway.security.authentication.jwt.JwtSubjectIssuersConfigTest
08:03:27 [INFO] Tests run: 6, Failures: 0, Errors: 0, Skipped: 0, Time elapsed: 0.665 s - in org.eclipse.ditto.services.gateway.security.authentication.jwt.JwtSubjectIssuersConfigTest
08:03:28 [INFO] Running org.eclipse.ditto.services.gateway.security.authentication.jwt.DefaultJwtAuthenticationResultProviderTest
08:03:28 [INFO] Tests run: 2, Failures: 0, Errors: 0, Skipped: 0, Time elapsed: 0.071 s - in org.eclipse.ditto.services.gateway.security.authentication.jwt.DefaultJwtAuthenticationResultProviderTest
08:03:28 [INFO] Running org.eclipse.ditto.services.gateway.security.authentication.jwt.JwtSubjectIssuerConfigTest
08:03:28 [INFO] Tests run: 2, Failures: 0, Errors: 0, Skipped: 0, Time elapsed: 0.018 s - in org.eclipse.ditto.services.gateway.security.authentication.jwt.JwtSubjectIssuerConfigTest
08:03:28 [INFO] Running org.eclipse.ditto.services.gateway.security.authentication.jwt.JwtAuthenticationProviderTest
08:03:28 13:03:29.110 [main] DEBUG org.eclipse.ditto.services.gateway.security.authentication.jwt.JwtAuthenticationProvider - JWT Authentication failed.
08:03:29 java.util.concurrent.CompletionException: org.eclipse.ditto.signals.commands.base.exceptions.GatewayAuthenticationFailedException [message='The JWT could not be verified.', errorCode=gateway:authentication.failed, statusCode=UNAUTHORIZED, description='Something happened', href=null, dittoHeaders=ImmutableDittoHeaders [{correlation-id=doExtractAuthenticationWhenAuthorizationContextProviderErrors}]]
08:03:29 	at java.base/java.util.concurrent.CompletableFuture.encodeThrowable(CompletableFuture.java:314)
08:03:29 	at java.base/java.util.concurrent.CompletableFuture.uniApplyNow(CompletableFuture.java:683)
08:03:29 	at java.base/java.util.concurrent.CompletableFuture.uniApplyStage(CompletableFuture.java:658)
08:03:29 	at java.base/java.util.concurrent.CompletableFuture.thenApply(CompletableFuture.java:2094)
08:03:29 	at org.eclipse.ditto.services.gateway.security.authentication.jwt.JwtAuthenticationProvider.getAuthenticationResult(JwtAuthenticationProvider.java:131)
08:03:29 	at org.eclipse.ditto.services.gateway.security.authentication.jwt.JwtAuthenticationProvider.tryToAuthenticate(JwtAuthenticationProvider.java:107)
08:03:29 	at org.eclipse.ditto.services.gateway.security.authentication.TimeMeasuringAuthenticationProvider.authenticate(TimeMeasuringAuthenticationProvider.java:65)
08:03:29 	at org.eclipse.ditto.services.gateway.security.authentication.jwt.JwtAuthenticationProviderTest.doExtractAuthenticationWhenAuthorizationContextProviderErrors(JwtAuthenticationProviderTest.java:121)
08:03:29 	at java.base/jdk.internal.reflect.NativeMethodAccessorImpl.invoke0(Native Method)
08:03:29 	at java.base/jdk.internal.reflect.NativeMethodAccessorImpl.invoke(NativeMethodAccessorImpl.java:62)
08:03:29 	at java.base/jdk.internal.reflect.DelegatingMethodAccessorImpl.invoke(DelegatingMethodAccessorImpl.java:43)
08:03:29 	at java.base/java.lang.reflect.Method.invoke(Method.java:566)
08:03:29 	at org.junit.runners.model.FrameworkMethod$1.runReflectiveCall(FrameworkMethod.java:59)
08:03:29 	at org.junit.internal.runners.model.ReflectiveCallable.run(ReflectiveCallable.java:12)
08:03:29 	at org.junit.runners.model.FrameworkMethod.invokeExplosively(FrameworkMethod.java:56)
08:03:29 	at org.junit.internal.runners.statements.InvokeMethod.evaluate(InvokeMethod.java:17)
08:03:29 	at org.junit.internal.runners.statements.RunBefores.evaluate(RunBefores.java:26)
08:03:29 	at org.mockito.internal.runners.DefaultInternalRunner$1$1.evaluate(DefaultInternalRunner.java:44)
08:03:29 	at org.assertj.core.api.SoftAssertionsStatement$1.evaluate(SoftAssertionsStatement.java:40)
08:03:29 	at org.junit.rules.TestWatcher$1.evaluate(TestWatcher.java:61)
08:03:29 	at org.junit.runners.ParentRunner$3.evaluate(ParentRunner.java:306)
08:03:29 	at org.junit.runners.BlockJUnit4ClassRunner$1.evaluate(BlockJUnit4ClassRunner.java:100)
08:03:29 	at org.junit.runners.ParentRunner.runLeaf(ParentRunner.java:366)
08:03:29 	at org.junit.runners.BlockJUnit4ClassRunner.runChild(BlockJUnit4ClassRunner.java:103)
08:03:29 	at org.junit.runners.BlockJUnit4ClassRunner.runChild(BlockJUnit4ClassRunner.java:63)
08:03:29 	at org.junit.runners.ParentRunner$4.run(ParentRunner.java:331)
08:03:29 	at org.junit.runners.ParentRunner$1.schedule(ParentRunner.java:79)
08:03:29 	at org.junit.runners.ParentRunner.runChildren(ParentRunner.java:329)
08:03:29 	at org.junit.runners.ParentRunner.access$100(ParentRunner.java:66)
08:03:29 	at org.junit.runners.ParentRunner$2.evaluate(ParentRunner.java:293)
08:03:29 	at org.junit.runners.ParentRunner$3.evaluate(ParentRunner.java:306)
08:03:29 	at org.junit.runners.ParentRunner.run(ParentRunner.java:413)
08:03:29 	at org.mockito.internal.runners.DefaultInternalRunner$1.run(DefaultInternalRunner.java:74)
08:03:29 	at org.mockito.internal.runners.DefaultInternalRunner.run(DefaultInternalRunner.java:80)
08:03:29 	at org.mockito.internal.runners.StrictRunner.run(StrictRunner.java:39)
08:03:29 	at org.mockito.junit.MockitoJUnitRunner.run(MockitoJUnitRunner.java:163)
08:03:29 	at org.apache.maven.surefire.junit4.JUnit4Provider.execute(JUnit4Provider.java:365)
08:03:29 	at org.apache.maven.surefire.junit4.JUnit4Provider.executeWithRerun(JUnit4Provider.java:273)
08:03:29 	at org.apache.maven.surefire.junit4.JUnit4Provider.executeTestSet(JUnit4Provider.java:238)
08:03:29 	at org.apache.maven.surefire.junit4.JUnit4Provider.invoke(JUnit4Provider.java:159)
08:03:29 	at org.apache.maven.surefire.booter.ForkedBooter.runSuitesInProcess(ForkedBooter.java:377)
08:03:29 	at org.apache.maven.surefire.booter.ForkedBooter.execute(ForkedBooter.java:138)
08:03:29 	at org.apache.maven.surefire.booter.ForkedBooter.run(ForkedBooter.java:465)
08:03:29 	at org.apache.maven.surefire.booter.ForkedBooter.main(ForkedBooter.java:451)
08:03:29 Caused by: org.eclipse.ditto.signals.commands.base.exceptions.GatewayAuthenticationFailedException: The JWT could not be verified.
08:03:29 	at org.eclipse.ditto.signals.commands.base.exceptions.GatewayAuthenticationFailedException$Builder.doBuild(GatewayAuthenticationFailedException.java:124)
08:03:29 	at org.eclipse.ditto.signals.commands.base.exceptions.GatewayAuthenticationFailedException$Builder.doBuild(GatewayAuthenticationFailedException.java:106)
08:03:29 	at org.eclipse.ditto.model.base.exceptions.DittoRuntimeExceptionBuilder.build(DittoRuntimeExceptionBuilder.java:180)
08:03:29 	at org.eclipse.ditto.services.gateway.security.authentication.jwt.JwtAuthenticationProvider.buildJwtUnauthorizedException(JwtAuthenticationProvider.java:153)
08:03:29 	at org.eclipse.ditto.services.gateway.security.authentication.jwt.JwtAuthenticationProvider.tryToGetAuthenticationResult(JwtAuthenticationProvider.java:160)
08:03:29 	at org.eclipse.ditto.services.gateway.security.authentication.jwt.JwtAuthenticationProvider.lambda$getAuthenticationResult$1(JwtAuthenticationProvider.java:140)
08:03:29 	at java.base/java.util.concurrent.CompletableFuture.uniApplyNow(CompletableFuture.java:680)
08:03:29 	... 42 common frames omitted
08:03:29 Caused by: java.lang.RuntimeException: Something happened
08:03:29 	at org.eclipse.ditto.services.gateway.security.authentication.jwt.JwtAuthenticationProvider.tryToGetAuthenticationResult(JwtAuthenticationProvider.java:158)
08:03:29 	... 44 common frames omitted
08:03:29 13:03:29.440 [main] DEBUG org.eclipse.ditto.services.gateway.security.authentication.jwt.JwtAuthenticationProvider - JWT Authentication failed.
08:03:29 org.eclipse.ditto.model.base.exceptions.DittoRuntimeException: null
08:03:29 	at org.eclipse.ditto.model.base.exceptions.DittoRuntimeException$Builder.doBuild(DittoRuntimeException.java:476)
08:03:29 	at org.eclipse.ditto.model.base.exceptions.DittoRuntimeExceptionBuilder.build(DittoRuntimeExceptionBuilder.java:180)
08:03:29 	at org.eclipse.ditto.services.gateway.security.authentication.jwt.JwtAuthenticationProviderTest.toFailedAuthenticationResult(JwtAuthenticationProviderTest.java:195)
08:03:29 	at java.base/jdk.internal.reflect.NativeMethodAccessorImpl.invoke0(Native Method)
08:03:29 	at java.base/jdk.internal.reflect.NativeMethodAccessorImpl.invoke(NativeMethodAccessorImpl.java:62)
08:03:29 	at java.base/jdk.internal.reflect.DelegatingMethodAccessorImpl.invoke(DelegatingMethodAccessorImpl.java:43)
08:03:29 	at java.base/java.lang.reflect.Method.invoke(Method.java:566)
08:03:29 	at org.junit.runners.model.FrameworkMethod$1.runReflectiveCall(FrameworkMethod.java:59)
08:03:29 	at org.junit.internal.runners.model.ReflectiveCallable.run(ReflectiveCallable.java:12)
08:03:29 	at org.junit.runners.model.FrameworkMethod.invokeExplosively(FrameworkMethod.java:56)
08:03:29 	at org.junit.internal.runners.statements.InvokeMethod.evaluate(InvokeMethod.java:17)
08:03:29 	at org.junit.internal.runners.statements.RunBefores.evaluate(RunBefores.java:26)
08:03:29 	at org.mockito.internal.runners.DefaultInternalRunner$1$1.evaluate(DefaultInternalRunner.java:44)
08:03:29 	at org.assertj.core.api.SoftAssertionsStatement$1.evaluate(SoftAssertionsStatement.java:40)
08:03:29 	at org.junit.rules.TestWatcher$1.evaluate(TestWatcher.java:61)
08:03:29 	at org.junit.runners.ParentRunner$3.evaluate(ParentRunner.java:306)
08:03:29 	at org.junit.runners.BlockJUnit4ClassRunner$1.evaluate(BlockJUnit4ClassRunner.java:100)
08:03:29 	at org.junit.runners.ParentRunner.runLeaf(ParentRunner.java:366)
08:03:29 	at org.junit.runners.BlockJUnit4ClassRunner.runChild(BlockJUnit4ClassRunner.java:103)
08:03:29 	at org.junit.runners.BlockJUnit4ClassRunner.runChild(BlockJUnit4ClassRunner.java:63)
08:03:29 	at org.junit.runners.ParentRunner$4.run(ParentRunner.java:331)
08:03:29 	at org.junit.runners.ParentRunner$1.schedule(ParentRunner.java:79)
08:03:29 	at org.junit.runners.ParentRunner.runChildren(ParentRunner.java:329)
08:03:29 	at org.junit.runners.ParentRunner.access$100(ParentRunner.java:66)
08:03:29 	at org.junit.runners.ParentRunner$2.evaluate(ParentRunner.java:293)
08:03:29 	at org.junit.runners.ParentRunner$3.evaluate(ParentRunner.java:306)
08:03:29 	at org.junit.runners.ParentRunner.run(ParentRunner.java:413)
08:03:29 	at org.mockito.internal.runners.DefaultInternalRunner$1.run(DefaultInternalRunner.java:74)
08:03:29 	at org.mockito.internal.runners.DefaultInternalRunner.run(DefaultInternalRunner.java:80)
08:03:29 	at org.mockito.internal.runners.StrictRunner.run(StrictRunner.java:39)
08:03:29 	at org.mockito.junit.MockitoJUnitRunner.run(MockitoJUnitRunner.java:163)
08:03:29 	at org.apache.maven.surefire.junit4.JUnit4Provider.execute(JUnit4Provider.java:365)
08:03:29 	at org.apache.maven.surefire.junit4.JUnit4Provider.executeWithRerun(JUnit4Provider.java:273)
08:03:29 	at org.apache.maven.surefire.junit4.JUnit4Provider.executeTestSet(JUnit4Provider.java:238)
08:03:29 	at org.apache.maven.surefire.junit4.JUnit4Provider.invoke(JUnit4Provider.java:159)
08:03:29 	at org.apache.maven.surefire.booter.ForkedBooter.runSuitesInProcess(ForkedBooter.java:377)
08:03:29 	at org.apache.maven.surefire.booter.ForkedBooter.execute(ForkedBooter.java:138)
08:03:29 	at org.apache.maven.surefire.booter.ForkedBooter.run(ForkedBooter.java:465)
08:03:29 	at org.apache.maven.surefire.booter.ForkedBooter.main(ForkedBooter.java:451)
08:03:29 13:03:29.444 [main] DEBUG org.eclipse.ditto.services.gateway.security.authentication.jwt.JwtAuthenticationProvider - The JWT is invalid.
08:03:29 java.lang.IllegalStateException: foo
08:03:29 	at org.eclipse.ditto.services.gateway.security.authentication.jwt.JwtAuthenticationProviderTest.doExtractAuthenticationWithInvalidJwt(JwtAuthenticationProviderTest.java:160)
08:03:29 	at java.base/jdk.internal.reflect.NativeMethodAccessorImpl.invoke0(Native Method)
08:03:29 	at java.base/jdk.internal.reflect.NativeMethodAccessorImpl.invoke(NativeMethodAccessorImpl.java:62)
08:03:29 	at java.base/jdk.internal.reflect.DelegatingMethodAccessorImpl.invoke(DelegatingMethodAccessorImpl.java:43)
08:03:29 	at java.base/java.lang.reflect.Method.invoke(Method.java:566)
08:03:29 	at org.junit.runners.model.FrameworkMethod$1.runReflectiveCall(FrameworkMethod.java:59)
08:03:29 	at org.junit.internal.runners.model.ReflectiveCallable.run(ReflectiveCallable.java:12)
08:03:29 	at org.junit.runners.model.FrameworkMethod.invokeExplosively(FrameworkMethod.java:56)
08:03:29 	at org.junit.internal.runners.statements.InvokeMethod.evaluate(InvokeMethod.java:17)
08:03:29 	at org.junit.internal.runners.statements.RunBefores.evaluate(RunBefores.java:26)
08:03:29 	at org.mockito.internal.runners.DefaultInternalRunner$1$1.evaluate(DefaultInternalRunner.java:44)
08:03:29 	at org.assertj.core.api.SoftAssertionsStatement$1.evaluate(SoftAssertionsStatement.java:40)
08:03:29 	at org.junit.rules.TestWatcher$1.evaluate(TestWatcher.java:61)
08:03:29 	at org.junit.runners.ParentRunner$3.evaluate(ParentRunner.java:306)
08:03:29 	at org.junit.runners.BlockJUnit4ClassRunner$1.evaluate(BlockJUnit4ClassRunner.java:100)
08:03:29 	at org.junit.runners.ParentRunner.runLeaf(ParentRunner.java:366)
08:03:29 	at org.junit.runners.BlockJUnit4ClassRunner.runChild(BlockJUnit4ClassRunner.java:103)
08:03:29 	at org.junit.runners.BlockJUnit4ClassRunner.runChild(BlockJUnit4ClassRunner.java:63)
08:03:29 	at org.junit.runners.ParentRunner$4.run(ParentRunner.java:331)
08:03:29 	at org.junit.runners.ParentRunner$1.schedule(ParentRunner.java:79)
08:03:29 	at org.junit.runners.ParentRunner.runChildren(ParentRunner.java:329)
08:03:29 	at org.junit.runners.ParentRunner.access$100(ParentRunner.java:66)
08:03:29 	at org.junit.runners.ParentRunner$2.evaluate(ParentRunner.java:293)
08:03:29 	at org.junit.runners.ParentRunner$3.evaluate(ParentRunner.java:306)
08:03:29 	at org.junit.runners.ParentRunner.run(ParentRunner.java:413)
08:03:29 	at org.mockito.internal.runners.DefaultInternalRunner$1.run(DefaultInternalRunner.java:74)
08:03:29 	at org.mockito.internal.runners.DefaultInternalRunner.run(DefaultInternalRunner.java:80)
08:03:29 	at org.mockito.internal.runners.StrictRunner.run(StrictRunner.java:39)
08:03:29 	at org.mockito.junit.MockitoJUnitRunner.run(MockitoJUnitRunner.java:163)
08:03:29 	at org.apache.maven.surefire.junit4.JUnit4Provider.execute(JUnit4Provider.java:365)
08:03:29 	at org.apache.maven.surefire.junit4.JUnit4Provider.executeWithRerun(JUnit4Provider.java:273)
08:03:29 	at org.apache.maven.surefire.junit4.JUnit4Provider.executeTestSet(JUnit4Provider.java:238)
08:03:29 	at org.apache.maven.surefire.junit4.JUnit4Provider.invoke(JUnit4Provider.java:159)
08:03:29 	at org.apache.maven.surefire.booter.ForkedBooter.runSuitesInProcess(ForkedBooter.java:377)
08:03:29 	at org.apache.maven.surefire.booter.ForkedBooter.execute(ForkedBooter.java:138)
08:03:29 	at org.apache.maven.surefire.booter.ForkedBooter.run(ForkedBooter.java:465)
08:03:29 	at org.apache.maven.surefire.booter.ForkedBooter.main(ForkedBooter.java:451)
08:03:29 13:03:29.808 [main] DEBUG org.eclipse.ditto.services.gateway.security.authentication.jwt.JwtAuthenticationProvider - JWT Authentication failed.
08:03:29 java.lang.IllegalStateException: notExpected
08:03:29 	at org.eclipse.ditto.services.gateway.security.authentication.jwt.JwtAuthenticationProviderTest.toFailedAuthenticationResultExtractsDittoRuntimeExceptionFromCause(JwtAuthenticationProviderTest.java:184)
08:03:29 	at java.base/jdk.internal.reflect.NativeMethodAccessorImpl.invoke0(Native Method)
08:03:29 	at java.base/jdk.internal.reflect.NativeMethodAccessorImpl.invoke(NativeMethodAccessorImpl.java:62)
08:03:29 	at java.base/jdk.internal.reflect.DelegatingMethodAccessorImpl.invoke(DelegatingMethodAccessorImpl.java:43)
08:03:29 	at java.base/java.lang.reflect.Method.invoke(Method.java:566)
08:03:29 	at org.junit.runners.model.FrameworkMethod$1.runReflectiveCall(FrameworkMethod.java:59)
08:03:29 	at org.junit.internal.runners.model.ReflectiveCallable.run(ReflectiveCallable.java:12)
08:03:29 	at org.junit.runners.model.FrameworkMethod.invokeExplosively(FrameworkMethod.java:56)
08:03:29 	at org.junit.internal.runners.statements.InvokeMethod.evaluate(InvokeMethod.java:17)
08:03:29 	at org.junit.internal.runners.statements.RunBefores.evaluate(RunBefores.java:26)
08:03:29 	at org.mockito.internal.runners.DefaultInternalRunner$1$1.evaluate(DefaultInternalRunner.java:44)
08:03:29 	at org.assertj.core.api.SoftAssertionsStatement$1.evaluate(SoftAssertionsStatement.java:40)
08:03:29 	at org.junit.rules.TestWatcher$1.evaluate(TestWatcher.java:61)
08:03:29 	at org.junit.runners.ParentRunner$3.evaluate(ParentRunner.java:306)
08:03:29 	at org.junit.runners.BlockJUnit4ClassRunner$1.evaluate(BlockJUnit4ClassRunner.java:100)
08:03:29 	at org.junit.runners.ParentRunner.runLeaf(ParentRunner.java:366)
08:03:29 	at org.junit.runners.BlockJUnit4ClassRunner.runChild(BlockJUnit4ClassRunner.java:103)
08:03:29 	at org.junit.runners.BlockJUnit4ClassRunner.runChild(BlockJUnit4ClassRunner.java:63)
08:03:29 	at org.junit.runners.ParentRunner$4.run(ParentRunner.java:331)
08:03:29 	at org.junit.runners.ParentRunner$1.schedule(ParentRunner.java:79)
08:03:29 	at org.junit.runners.ParentRunner.runChildren(ParentRunner.java:329)
08:03:29 	at org.junit.runners.ParentRunner.access$100(ParentRunner.java:66)
08:03:29 	at org.junit.runners.ParentRunner$2.evaluate(ParentRunner.java:293)
08:03:29 	at org.junit.runners.ParentRunner$3.evaluate(ParentRunner.java:306)
08:03:29 	at org.junit.runners.ParentRunner.run(ParentRunner.java:413)
08:03:29 	at org.mockito.internal.runners.DefaultInternalRunner$1.run(DefaultInternalRunner.java:74)
08:03:29 	at org.mockito.internal.runners.DefaultInternalRunner.run(DefaultInternalRunner.java:80)
08:03:29 	at org.mockito.internal.runners.StrictRunner.run(StrictRunner.java:39)
08:03:29 	at org.mockito.junit.MockitoJUnitRunner.run(MockitoJUnitRunner.java:163)
08:03:29 	at org.apache.maven.surefire.junit4.JUnit4Provider.execute(JUnit4Provider.java:365)
08:03:29 	at org.apache.maven.surefire.junit4.JUnit4Provider.executeWithRerun(JUnit4Provider.java:273)
08:03:29 	at org.apache.maven.surefire.junit4.JUnit4Provider.executeTestSet(JUnit4Provider.java:238)
08:03:29 	at org.apache.maven.surefire.junit4.JUnit4Provider.invoke(JUnit4Provider.java:159)
08:03:29 	at org.apache.maven.surefire.booter.ForkedBooter.runSuitesInProcess(ForkedBooter.java:377)
08:03:29 	at org.apache.maven.surefire.booter.ForkedBooter.execute(ForkedBooter.java:138)
08:03:29 	at org.apache.maven.surefire.booter.ForkedBooter.run(ForkedBooter.java:465)
08:03:29 	at org.apache.maven.surefire.booter.ForkedBooter.main(ForkedBooter.java:451)
08:03:29 Caused by: org.eclipse.ditto.model.base.exceptions.DittoRuntimeException: null
08:03:29 	at org.eclipse.ditto.model.base.exceptions.DittoRuntimeException$Builder.doBuild(DittoRuntimeException.java:476)
08:03:29 	at org.eclipse.ditto.model.base.exceptions.DittoRuntimeExceptionBuilder.build(DittoRuntimeExceptionBuilder.java:180)
08:03:29 	at org.eclipse.ditto.services.gateway.security.authentication.jwt.JwtAuthenticationProviderTest.toFailedAuthenticationResultExtractsDittoRuntimeExceptionFromCause(JwtAuthenticationProviderTest.java:183)
08:03:29 	... 36 common frames omitted
08:03:29 13:03:29.813 [main] INFO org.eclipse.ditto.services.gateway.security.authentication.jwt.JwtAuthenticationProvider - Completed JWT authentication successfully.
08:03:29 13:03:29.815 [main] DEBUG org.eclipse.ditto.services.gateway.security.authentication.jwt.JwtAuthenticationProvider - JWT is missing.
08:03:29 [INFO] Tests run: 10, Failures: 0, Errors: 0, Skipped: 0, Time elapsed: 1.592 s - in org.eclipse.ditto.services.gateway.security.authentication.jwt.JwtAuthenticationProviderTest
08:03:29 [INFO] Running org.eclipse.ditto.services.gateway.security.authentication.jwt.PublicKeyProviderUnavailableExceptionTest
08:03:29 [INFO] Tests run: 2, Failures: 0, Errors: 0, Skipped: 0, Time elapsed: 0.009 s - in org.eclipse.ditto.services.gateway.security.authentication.jwt.PublicKeyProviderUnavailableExceptionTest
08:03:29 [INFO] Running org.eclipse.ditto.services.gateway.security.authentication.DefaultAuthenticationResultTest
08:03:29 [INFO] Tests run: 14, Failures: 0, Errors: 0, Skipped: 0, Time elapsed: 0.143 s - in org.eclipse.ditto.services.gateway.security.authentication.DefaultAuthenticationResultTest
08:03:29 [INFO] Running org.eclipse.ditto.services.gateway.security.authentication.AuthenticationChainTest
08:03:29 13:03:30.171 [pool-5-thread-2] DEBUG org.eclipse.ditto.services.gateway.security.authentication.AuthenticationChain - Authentication using authentication provider <AuthenticationProvider$MockitoMock$1655907877> to URI <https://test.org> failed due to DittoRuntimeException$MockitoMock$245468793: null
08:03:30 13:03:30.175 [pool-5-thread-4] DEBUG org.eclipse.ditto.services.gateway.security.authentication.AuthenticationChain - Authentication using authentication provider <AuthenticationProvider$MockitoMock$1655907877> to URI <https://test.org> failed due to DittoRuntimeException$MockitoMock$245468793: null
08:03:30 13:03:30.185 [pool-5-thread-2] DEBUG org.eclipse.ditto.services.gateway.security.authentication.AuthenticationChain - Authentication using authentication provider <AuthenticationProvider$MockitoMock$1655907877> to URI <https://test.org> failed due to DittoRuntimeException$MockitoMock$245468793: null
08:03:30 13:03:30.286 [pool-5-thread-5] DEBUG org.eclipse.ditto.services.gateway.security.authentication.AuthenticationChain - Authentication using authentication provider <AuthenticationProvider$MockitoMock$1655907877> to URI <https://test.org> failed due to DittoRuntimeException$MockitoMock$245468793: null
08:03:30 13:03:30.287 [pool-5-thread-5] DEBUG org.eclipse.ditto.services.gateway.security.authentication.AuthenticationChain - Authentication using authentication provider <AuthenticationProvider$MockitoMock$1655907877> to URI <https://test.org> was successful.
08:03:30 13:03:30.292 [pool-5-thread-2] DEBUG org.eclipse.ditto.services.gateway.security.authentication.AuthenticationChain - Authentication using authentication provider <AuthenticationProvider$MockitoMock$1655907877> to URI <https://test.org> was successful.
08:03:30 13:03:30.296 [pool-5-thread-7] DEBUG org.eclipse.ditto.services.gateway.security.authentication.AuthenticationChain - Authentication using authentication provider <AuthenticationProvider$MockitoMock$1655907877> to URI <https://test.org> was successful.
08:03:30 [INFO] Tests run: 7, Failures: 0, Errors: 0, Skipped: 0, Time elapsed: 0.321 s - in org.eclipse.ditto.services.gateway.security.authentication.AuthenticationChainTest
08:03:30 [INFO] Running org.eclipse.ditto.services.gateway.security.authentication.DefaultAuthenticationFailureAggregatorTest
08:03:30 [INFO] Tests run: 6, Failures: 0, Errors: 0, Skipped: 0, Time elapsed: 0.009 s - in org.eclipse.ditto.services.gateway.security.authentication.DefaultAuthenticationFailureAggregatorTest
08:03:30 [INFO] Running org.eclipse.ditto.services.gateway.security.authentication.preauth.PreAuthenticatedAuthenticationProviderTest
08:03:30 13:03:30.327 [main] INFO org.eclipse.ditto.services.gateway.security.authentication.preauth.PreAuthenticatedAuthenticationProvider - Pre-authentication has been applied resulting in AuthorizationContext <ImmutableAuthorizationContext [type=pre-authenticated-http, authorizationSubjects=[myDummy]]>.
08:03:30 13:03:30.329 [main] INFO org.eclipse.ditto.services.gateway.security.authentication.preauth.PreAuthenticatedAuthenticationProvider - Pre-authentication has been applied resulting in AuthorizationContext <ImmutableAuthorizationContext [type=pre-authenticated-http, authorizationSubjects=[myDummy]]>.
08:03:30 13:03:30.368 [main] INFO org.eclipse.ditto.services.gateway.security.authentication.preauth.PreAuthenticatedAuthenticationProvider - Pre-authentication has been applied resulting in AuthorizationContext <ImmutableAuthorizationContext [type=pre-authenticated-http, authorizationSubjects=[myDummy]]>.
08:03:30 [INFO] Tests run: 13, Failures: 0, Errors: 0, Skipped: 0, Time elapsed: 0.06 s - in org.eclipse.ditto.services.gateway.security.authentication.preauth.PreAuthenticatedAuthenticationProviderTest
08:03:30 [INFO] Running org.eclipse.ditto.services.gateway.security.cache.PublicKeyIdWithIssuerTest
08:03:30 [INFO] Tests run: 2, Failures: 0, Errors: 0, Skipped: 0, Time elapsed: 0.012 s - in org.eclipse.ditto.services.gateway.security.cache.PublicKeyIdWithIssuerTest
08:03:30 [INFO] 
08:03:30 [INFO] Results:
08:03:30 [INFO] 
08:03:30 [INFO] Tests run: 69, Failures: 0, Errors: 0, Skipped: 0
08:03:30 [INFO] 
08:03:30 [INFO] 
08:03:30 [INFO] --- maven-dependency-plugin:3.0.2:unpack-dependencies (copy-legal-docs) @ ditto-services-gateway-security ---
08:03:30 [INFO] Unpacking /home/jenkins/agent/workspace/ditto-ci/legal/target/ditto-legal-0-SNAPSHOT.jar to /home/jenkins/agent/workspace/ditto-ci/services/gateway/security/target/classes/META-INF with includes "" and excludes "NOTICE-THIRD-PARTY.md,3rd-party-dependencies/**,META-INF/**"
08:03:30 [INFO] 
08:03:30 [INFO] --- maven-jar-plugin:3.0.2:jar (default-jar) @ ditto-services-gateway-security ---
08:03:30 [INFO] Building jar: /home/jenkins/agent/workspace/ditto-ci/services/gateway/security/target/ditto-services-gateway-security-0-SNAPSHOT.jar
08:03:30 [INFO] 
08:03:30 [INFO] --- maven-failsafe-plugin:3.0.0-M4:integration-test (integration-test) @ ditto-services-gateway-security ---
08:03:30 [INFO] Tests are skipped.
08:03:30 [INFO] 
08:03:30 [INFO] --- maven-failsafe-plugin:3.0.0-M4:verify (verify) @ ditto-services-gateway-security ---
08:03:30 [INFO] Tests are skipped.
08:03:30 [INFO] 
08:03:30 [INFO] --- jacoco-maven-plugin:0.8.5:report (report) @ ditto-services-gateway-security ---
08:03:30 [INFO] Loading execution data file /home/jenkins/agent/workspace/ditto-ci/services/gateway/security/target/jacoco.exec
08:03:30 [INFO] Analyzed bundle 'Eclipse Ditto :: Services :: Gateway :: Security' with 24 classes
08:03:30 [INFO] 
08:03:30 [INFO] --- maven-install-plugin:2.5.2:install (default-install) @ ditto-services-gateway-security ---
08:03:30 [INFO] Installing /home/jenkins/agent/workspace/ditto-ci/services/gateway/security/target/ditto-services-gateway-security-0-SNAPSHOT.jar to /home/jenkins/.m2/repository/org/eclipse/ditto/ditto-services-gateway-security/0-SNAPSHOT/ditto-services-gateway-security-0-SNAPSHOT.jar
08:03:30 [INFO] Installing /home/jenkins/agent/workspace/ditto-ci/services/gateway/security/.flattened-pom.xml to /home/jenkins/.m2/repository/org/eclipse/ditto/ditto-services-gateway-security/0-SNAPSHOT/ditto-services-gateway-security-0-SNAPSHOT.pom
08:03:30 [INFO] 
08:03:30 [INFO] ----------< org.eclipse.ditto:ditto-services-gateway-health >-----------
08:03:30 [INFO] Building Eclipse Ditto :: Services :: Gateway :: Health 0-SNAPSHOT [96/114]
08:03:30 [INFO] --------------------------------[ jar ]---------------------------------
08:03:30 [INFO] 
08:03:30 [INFO] --- maven-clean-plugin:2.5:clean (default-clean) @ ditto-services-gateway-health ---
08:03:30 [INFO] 
08:03:30 [INFO] --- flatten-maven-plugin:1.0.1:clean (flatten.clean) @ ditto-services-gateway-health ---
08:03:30 [INFO] 
08:03:30 [INFO] --- jacoco-maven-plugin:0.8.5:prepare-agent (prepare-agent) @ ditto-services-gateway-health ---
08:03:30 [INFO] argLine set to -javaagent:/home/jenkins/.m2/repository/org/jacoco/org.jacoco.agent/0.8.5/org.jacoco.agent-0.8.5-runtime.jar=destfile=/home/jenkins/agent/workspace/ditto-ci/services/gateway/health/target/jacoco.exec -Dfile.encoding=UTF-8
08:03:30 [INFO] 
08:03:30 [INFO] --- license-maven-plugin:1.17:add-third-party (default-cli) @ ditto-services-gateway-health ---
08:03:30 [WARNING] 
08:03:30 [WARNING] !!! licenseMergesFile is deprecated, use now licenseMergesUrl !!!
08:03:30 [WARNING] 
08:03:30 [WARNING] licenseMerges will be overridden by licenseMergesFile.
08:03:30 [WARNING] 
08:03:30 [INFO] Writing third-party file to /home/jenkins/agent/workspace/ditto-ci/services/gateway/health/target/classes/META-INF/NOTICE-THIRD-PARTY.md
08:03:30 [INFO] 
08:03:30 [INFO] --- maven-resources-plugin:3.1.0:resources (default-resources) @ ditto-services-gateway-health ---
08:03:30 [INFO] Using 'UTF-8' encoding to copy filtered resources.
08:03:30 [INFO] skip non existing resourceDirectory /home/jenkins/agent/workspace/ditto-ci/services/gateway/health/src/main/resources
08:03:30 [INFO] Copying 0 resource
08:03:30 [INFO] 
08:03:30 [INFO] --- flatten-maven-plugin:1.0.1:flatten (flatten) @ ditto-services-gateway-health ---
08:03:30 [INFO] Generating flattened POM of project org.eclipse.ditto:ditto-services-gateway-health:jar:0-SNAPSHOT...
08:03:30 [INFO] 
08:03:30 [INFO] --- maven-compiler-plugin:3.8.1:compile (default-compile) @ ditto-services-gateway-health ---
08:03:30 [INFO] Changes detected - recompiling the module!
08:03:30 [INFO] Compiling 8 source files to /home/jenkins/agent/workspace/ditto-ci/services/gateway/health/target/classes
08:03:30 [INFO] /home/jenkins/agent/workspace/ditto-ci/services/gateway/health/src/main/java/org/eclipse/ditto/services/gateway/health/ClusterStatusAndHealthHelper.java: /home/jenkins/agent/workspace/ditto-ci/services/gateway/health/src/main/java/org/eclipse/ditto/services/gateway/health/ClusterStatusAndHealthHelper.java uses or overrides a deprecated API.
08:03:31 [INFO] /home/jenkins/agent/workspace/ditto-ci/services/gateway/health/src/main/java/org/eclipse/ditto/services/gateway/health/ClusterStatusAndHealthHelper.java: Recompile with -Xlint:deprecation for details.
08:03:31 [INFO] 
08:03:31 [INFO] --- maven-resources-plugin:3.1.0:testResources (default-testResources) @ ditto-services-gateway-health ---
08:03:31 [INFO] Using 'UTF-8' encoding to copy filtered resources.
08:03:31 [INFO] skip non existing resourceDirectory /home/jenkins/agent/workspace/ditto-ci/services/gateway/health/src/test/resources
08:03:31 [INFO] 
08:03:31 [INFO] --- maven-compiler-plugin:3.8.1:testCompile (default-testCompile) @ ditto-services-gateway-health ---
08:03:31 [INFO] No sources to compile
08:03:31 [INFO] 
08:03:31 [INFO] --- maven-surefire-plugin:3.0.0-M4:test (default-test) @ ditto-services-gateway-health ---
08:03:31 [INFO] No tests to run.
08:03:31 [INFO] 
08:03:31 [INFO] --- maven-dependency-plugin:3.0.2:unpack-dependencies (copy-legal-docs) @ ditto-services-gateway-health ---
08:03:31 [INFO] Unpacking /home/jenkins/agent/workspace/ditto-ci/legal/target/ditto-legal-0-SNAPSHOT.jar to /home/jenkins/agent/workspace/ditto-ci/services/gateway/health/target/classes/META-INF with includes "" and excludes "NOTICE-THIRD-PARTY.md,3rd-party-dependencies/**,META-INF/**"
08:03:31 [INFO] 
08:03:31 [INFO] --- maven-jar-plugin:3.0.2:jar (default-jar) @ ditto-services-gateway-health ---
08:03:31 [INFO] Building jar: /home/jenkins/agent/workspace/ditto-ci/services/gateway/health/target/ditto-services-gateway-health-0-SNAPSHOT.jar
08:03:31 [INFO] 
08:03:31 [INFO] --- maven-failsafe-plugin:3.0.0-M4:integration-test (integration-test) @ ditto-services-gateway-health ---
08:03:31 [INFO] Tests are skipped.
08:03:31 [INFO] 
08:03:31 [INFO] --- maven-failsafe-plugin:3.0.0-M4:verify (verify) @ ditto-services-gateway-health ---
08:03:31 [INFO] Tests are skipped.
08:03:31 [INFO] 
08:03:31 [INFO] --- jacoco-maven-plugin:0.8.5:report (report) @ ditto-services-gateway-health ---
08:03:31 [INFO] Skipping JaCoCo execution due to missing execution data file.
08:03:31 [INFO] 
08:03:31 [INFO] --- maven-install-plugin:2.5.2:install (default-install) @ ditto-services-gateway-health ---
08:03:31 [INFO] Installing /home/jenkins/agent/workspace/ditto-ci/services/gateway/health/target/ditto-services-gateway-health-0-SNAPSHOT.jar to /home/jenkins/.m2/repository/org/eclipse/ditto/ditto-services-gateway-health/0-SNAPSHOT/ditto-services-gateway-health-0-SNAPSHOT.jar
08:03:31 [INFO] Installing /home/jenkins/agent/workspace/ditto-ci/services/gateway/health/.flattened-pom.xml to /home/jenkins/.m2/repository/org/eclipse/ditto/ditto-services-gateway-health/0-SNAPSHOT/ditto-services-gateway-health-0-SNAPSHOT.pom
08:03:31 [INFO] 
08:03:31 [INFO] ---------< org.eclipse.ditto:ditto-services-gateway-streaming >---------
08:03:31 [INFO] Building Eclipse Ditto :: Services :: Gateway :: Streaming 0-SNAPSHOT [97/114]
08:03:31 [INFO] --------------------------------[ jar ]---------------------------------
08:03:31 [INFO] 
08:03:31 [INFO] --- maven-clean-plugin:2.5:clean (default-clean) @ ditto-services-gateway-streaming ---
08:03:31 [INFO] 
08:03:31 [INFO] --- flatten-maven-plugin:1.0.1:clean (flatten.clean) @ ditto-services-gateway-streaming ---
08:03:31 [INFO] 
08:03:31 [INFO] --- jacoco-maven-plugin:0.8.5:prepare-agent (prepare-agent) @ ditto-services-gateway-streaming ---
08:03:31 [INFO] argLine set to -javaagent:/home/jenkins/.m2/repository/org/jacoco/org.jacoco.agent/0.8.5/org.jacoco.agent-0.8.5-runtime.jar=destfile=/home/jenkins/agent/workspace/ditto-ci/services/gateway/streaming/target/jacoco.exec -Dfile.encoding=UTF-8
08:03:31 [INFO] 
08:03:31 [INFO] --- license-maven-plugin:1.17:add-third-party (default-cli) @ ditto-services-gateway-streaming ---
08:03:31 [WARNING] 
08:03:31 [WARNING] !!! licenseMergesFile is deprecated, use now licenseMergesUrl !!!
08:03:31 [WARNING] 
08:03:31 [WARNING] licenseMerges will be overridden by licenseMergesFile.
08:03:31 [WARNING] 
08:03:31 [INFO] Writing third-party file to /home/jenkins/agent/workspace/ditto-ci/services/gateway/streaming/target/classes/META-INF/NOTICE-THIRD-PARTY.md
08:03:31 [INFO] 
08:03:31 [INFO] --- maven-resources-plugin:3.1.0:resources (default-resources) @ ditto-services-gateway-streaming ---
08:03:31 [INFO] Using 'UTF-8' encoding to copy filtered resources.
08:03:31 [INFO] skip non existing resourceDirectory /home/jenkins/agent/workspace/ditto-ci/services/gateway/streaming/src/main/resources
08:03:31 [INFO] Copying 0 resource
08:03:31 [INFO] 
08:03:31 [INFO] --- flatten-maven-plugin:1.0.1:flatten (flatten) @ ditto-services-gateway-streaming ---
08:03:31 [INFO] Generating flattened POM of project org.eclipse.ditto:ditto-services-gateway-streaming:jar:0-SNAPSHOT...
08:03:31 [INFO] 
08:03:31 [INFO] --- maven-compiler-plugin:3.8.1:compile (default-compile) @ ditto-services-gateway-streaming ---
08:03:31 [INFO] Changes detected - recompiling the module!
08:03:31 [INFO] Compiling 20 source files to /home/jenkins/agent/workspace/ditto-ci/services/gateway/streaming/target/classes
08:03:31 [INFO] /home/jenkins/agent/workspace/ditto-ci/services/gateway/streaming/src/main/java/org/eclipse/ditto/services/gateway/streaming/actors/StreamingActor.java: Some input files use or override a deprecated API.
08:03:31 [INFO] /home/jenkins/agent/workspace/ditto-ci/services/gateway/streaming/src/main/java/org/eclipse/ditto/services/gateway/streaming/actors/StreamingActor.java: Recompile with -Xlint:deprecation for details.
08:03:31 [INFO] 
08:03:31 [INFO] --- maven-resources-plugin:3.1.0:testResources (default-testResources) @ ditto-services-gateway-streaming ---
08:03:31 [INFO] Using 'UTF-8' encoding to copy filtered resources.
08:03:31 [INFO] skip non existing resourceDirectory /home/jenkins/agent/workspace/ditto-ci/services/gateway/streaming/src/test/resources
08:03:31 [INFO] 
08:03:31 [INFO] --- maven-compiler-plugin:3.8.1:testCompile (default-testCompile) @ ditto-services-gateway-streaming ---
08:03:31 [INFO] Changes detected - recompiling the module!
08:03:31 [INFO] Compiling 3 source files to /home/jenkins/agent/workspace/ditto-ci/services/gateway/streaming/target/test-classes
08:03:31 [INFO] /home/jenkins/agent/workspace/ditto-ci/services/gateway/streaming/src/test/java/org/eclipse/ditto/services/gateway/streaming/actors/StreamingSessionActorTest.java: /home/jenkins/agent/workspace/ditto-ci/services/gateway/streaming/src/test/java/org/eclipse/ditto/services/gateway/streaming/actors/StreamingSessionActorTest.java uses or overrides a deprecated API.
08:03:31 [INFO] /home/jenkins/agent/workspace/ditto-ci/services/gateway/streaming/src/test/java/org/eclipse/ditto/services/gateway/streaming/actors/StreamingSessionActorTest.java: Recompile with -Xlint:deprecation for details.
08:03:31 [INFO] /home/jenkins/agent/workspace/ditto-ci/services/gateway/streaming/src/test/java/org/eclipse/ditto/services/gateway/streaming/actors/StreamingSessionActorHeaderInteractionTest.java: Some input files use unchecked or unsafe operations.
08:03:31 [INFO] /home/jenkins/agent/workspace/ditto-ci/services/gateway/streaming/src/test/java/org/eclipse/ditto/services/gateway/streaming/actors/StreamingSessionActorHeaderInteractionTest.java: Recompile with -Xlint:unchecked for details.
08:03:31 [INFO] 
08:03:31 [INFO] --- maven-surefire-plugin:3.0.0-M4:test (default-test) @ ditto-services-gateway-streaming ---
08:03:31 [INFO] Surefire report directory: /home/jenkins/agent/workspace/ditto-ci/services/gateway/streaming/target/surefire-reports
08:03:31 [INFO] 
08:03:31 [INFO] -------------------------------------------------------
08:03:31 [INFO]  T E S T S
08:03:31 [INFO] -------------------------------------------------------
08:03:31 [INFO] Running org.eclipse.ditto.services.gateway.streaming.actors.StreamingSessionActorHeaderInteractionTest
08:03:32 [INFO] Tests run: 16, Failures: 0, Errors: 0, Skipped: 0, Time elapsed: 4.348 s - in org.eclipse.ditto.services.gateway.streaming.actors.StreamingSessionActorHeaderInteractionTest
08:03:36 [INFO] Running org.eclipse.ditto.services.gateway.streaming.actors.StreamingSessionActorTest
08:03:36 [INFO] [12/10/2020 13:03:36.839] [default-akka.actor.default-dispatcher-6] [akka://default/user/$a][x-correlation-id:sendDeclaredAckForGlobalDispatching] Declaring acknowledgement labels <[ack]>
08:03:36 [INFO] [12/10/2020 13:03:36.840] [default-akka.actor.default-dispatcher-6] [akka://default/user/$a][x-correlation-id:sendDeclaredAckForGlobalDispatching] Acknowledgement label declaration successful for labels: <[ack]>
08:03:36 [INFO] [12/10/2020 13:03:36.844] [default-akka.actor.default-dispatcher-6] [akka://default/user/$a][x-correlation-id:corr:sendDeclaredAckForGlobalDispatching] No AcknowledgementForwarderActor found, forwarding to concierge: <acknowledgement.thing>
08:03:36 [INFO] [12/10/2020 13:03:36.847] [default-akka.actor.default-dispatcher-7] [akka://default/user/$a][x-correlation-id:sendDeclaredAckForGlobalDispatching] Closing <WS> streaming session.
08:03:36 [INFO] [12/10/2020 13:03:36.926] [default-akka.actor.default-dispatcher-5] [akka://default/user/$a][x-correlation-id:sendNonDeclaredAck] Declaring acknowledgement labels <[ack]>
08:03:36 [INFO] [12/10/2020 13:03:36.927] [default-akka.actor.default-dispatcher-5] [akka://default/user/$a][x-correlation-id:sendNonDeclaredAck] Acknowledgement label declaration successful for labels: <[ack]>
08:03:36 [INFO] [12/10/2020 13:03:36.938] [default-akka.actor.default-dispatcher-5] [akka://default/user/$a][x-correlation-id:sendNonDeclaredAck] Closing <WS> streaming session.
08:03:36 [INFO] [12/10/2020 13:03:37.017] [default-akka.actor.default-dispatcher-6] [akka://default/user/$a][x-correlation-id:terminateOnAckLabelDeclarationFailure] Declaring acknowledgement labels <[ack]>
08:03:37 [INFO] [12/10/2020 13:03:37.018] [default-akka.actor.default-dispatcher-6] [akka://default/user/$a][x-correlation-id:terminateOnAckLabelDeclarationFailure] Acknowledgement label declaration failed for labels: <[ack]> - cause: CompletionException org.eclipse.ditto.model.base.acks.AcknowledgementLabelNotUniqueException [message='One or more declared acknowledgement labels are taken by other subscribers.', errorCode=acknowledgement:label.not.unique, statusCode=CONFLICT, description='Please ensure all other subscribers with the declared acknowledgement labels are offline.', href=null, dittoHeaders=ImmutableDittoHeaders [{}]]
08:03:37 [INFO] [12/10/2020 13:03:37.018] [default-akka.actor.default-dispatcher-6] [akka://default/user/$a] pubsubFailed cause=<org.eclipse.ditto.model.base.acks.AcknowledgementLabelNotUniqueException [message='One or more declared acknowledgement labels are taken by other subscribers.', errorCode=acknowledgement:label.not.unique, statusCode=CONFLICT, description='Please ensure all other subscribers with the declared acknowledgement labels are offline.', href=null, dittoHeaders=ImmutableDittoHeaders [{}]]>
08:03:37 [INFO] [12/10/2020 13:03:37.019] [default-akka.actor.default-dispatcher-6] [akka://default/user/$a][x-correlation-id:terminateOnAckLabelDeclarationFailure] Closing <WS> streaming session.
08:03:37 [INFO] [12/10/2020 13:03:37.084] [default-akka.actor.default-dispatcher-6] [akka://default/user/$a][x-correlation-id:terminateOnStreamFailure] Declaring acknowledgement labels <[]>
08:03:37 [INFO] [12/10/2020 13:03:37.086] [default-akka.actor.default-dispatcher-6] [akka://default/user/$a][x-correlation-id:terminateOnStreamFailure] Acknowledgement label declaration successful for labels: <[]>
08:03:37 [INFO] [12/10/2020 13:03:37.087] [default-akka.actor.default-dispatcher-6] [akka://default/user/$a][x-correlation-id:terminateOnStreamFailure] <WS> connection was closed, unsubscribing from Streams in Cluster ...
08:03:37 [INFO] [12/10/2020 13:03:37.087] [default-akka.actor.default-dispatcher-6] [akka://default/user/$a][x-correlation-id:terminateOnStreamFailure] Closing <WS> streaming session.
08:03:37 [INFO] [12/10/2020 13:03:37.160] [default-akka.actor.default-dispatcher-6] [akka://default/user/$a][x-correlation-id:acknowledgementRequestsAreRestrictedToDeclaredAcks] Declaring acknowledgement labels <[ack]>
08:03:37 [INFO] [12/10/2020 13:03:37.160] [default-akka.actor.default-dispatcher-6] [akka://default/user/$a][x-correlation-id:acknowledgementRequestsAreRestrictedToDeclaredAcks] Acknowledgement label declaration successful for labels: <[ack]>
08:03:37 [INFO] [12/10/2020 13:03:37.183] [default-akka.actor.default-dispatcher-6] [akka://default/user/$a][x-correlation-id:acknowledgementRequestsAreRestrictedToDeclaredAcks] Closing <WS> streaming session.
08:03:37 [INFO] [12/10/2020 13:03:37.254] [default-akka.actor.default-dispatcher-7] [akka://default/user/$a][x-correlation-id:invalidJwtClosesStream] Declaring acknowledgement labels <[ack]>
08:03:37 [INFO] [12/10/2020 13:03:37.268] [default-akka.actor.default-dispatcher-7] [akka://default/user/$a][x-correlation-id:invalidJwtClosesStream] Acknowledgement label declaration successful for labels: <[ack]>
08:03:37 [INFO] [12/10/2020 13:03:37.286] [default-akka.actor.default-dispatcher-6] [akka://default/user/$a][x-correlation-id:invalidJwtClosesStream] <WS> connection was closed, unsubscribing from Streams in Cluster ...
08:03:37 [INFO] [12/10/2020 13:03:37.287] [default-akka.actor.default-dispatcher-6] [akka://default/user/$a][x-correlation-id:invalidJwtClosesStream] Closing <WS> streaming session.
08:03:37 [INFO] [12/10/2020 13:03:37.351] [default-akka.actor.default-dispatcher-7] [akka://default/user/$a][x-correlation-id:sendMalformedAck] Declaring acknowledgement labels <[ack]>
08:03:37 [INFO] [12/10/2020 13:03:37.352] [default-akka.actor.default-dispatcher-7] [akka://default/user/$a][x-correlation-id:sendMalformedAck] Acknowledgement label declaration successful for labels: <[ack]>
08:03:37 [INFO] [12/10/2020 13:03:37.370] [default-akka.actor.default-dispatcher-7] [akka://default/user/$a][x-correlation-id:sendMalformedAck] Closing <WS> streaming session.
08:03:37 Build was aborted
08:03:37 Aborted by Thomas Jaeckle
08:03:37 Recording test results
08:03:37 [INFO] [12/10/2020 13:03:37.432] [default-akka.actor.default-dispatcher-7] [akka://default/user/$a][x-correlation-id:completeStreamWhenStopped] Declaring acknowledgement labels <[]>
08:03:37 [INFO] [12/10/2020 13:03:37.432] [default-akka.actor.default-dispatcher-7] [akka://default/user/$a][x-correlation-id:completeStreamWhenStopped] Acknowledgement label declaration successful for labels: <[]>
08:03:37 [INFO] [12/10/2020 13:03:37.434] [default-akka.actor.default-dispatcher-7] [akka://default/user/$a][x-correlation-id:completeStreamWhenStopped] Closing <WS> streaming session.
08:03:37 [INFO] [akkaDeadLetter][12/10/2020 13:03:37.436] [default-akka.actor.default-dispatcher-7] [akka://default/user/$a] Message [org.eclipse.ditto.services.gateway.streaming.actors.StreamingSessionActor$Control] from Actor[akka://default/user/$a#1051911735] to Actor[akka://default/user/$a#1051911735] was not delivered. [1] dead letters encountered. If this is not an expected behavior then Actor[akka://default/user/$a#1051911735] may have terminated unexpectedly. This logging can be turned off or adjusted with configuration settings 'akka.log-dead-letters' and 'akka.log-dead-letters-during-shutdown'.
08:03:37 [INFO] Tests run: 8, Failures: 0, Errors: 0, Skipped: 0, Time elapsed: 0.725 s - in org.eclipse.ditto.services.gateway.streaming.actors.StreamingSessionActorTest
08:03:37 [INFO] Running org.eclipse.ditto.services.gateway.streaming.StopStreamingTest
08:03:37 [INFO] 
08:03:39 [INFO] Results:
08:03:39 [INFO] 
08:03:39 [INFO] Tests run: 24, Failures: 0, Errors: 0, Skipped: 0
08:03:39 [INFO] 
08:03:39 [INFO] ------------------------------------------------------------------------
08:03:39 [INFO] Reactor Summary for Eclipse Ditto 0-SNAPSHOT:
08:03:39 [INFO] 
08:03:39 [INFO] Eclipse Ditto ...................................... SUCCESS [ 29.715 s]
08:03:39 [INFO] Eclipse Ditto :: Legal ............................. SUCCESS [  2.523 s]
08:03:39 [INFO] Eclipse Ditto :: BOM ............................... SUCCESS [  0.164 s]
08:03:39 [INFO] Eclipse Ditto :: Documentation ..................... SUCCESS [  0.259 s]
08:03:39 [INFO] Eclipse Ditto :: Utils ............................. SUCCESS [  2.332 s]
08:03:39 [INFO] Eclipse Ditto :: Utils :: JSR-305 Extensions ....... SUCCESS [ 16.563 s]
08:03:39 [INFO] Eclipse Ditto :: JSON .............................. SUCCESS [ 12.047 s]
08:03:39 [INFO] Eclipse Ditto :: JSON :: CBOR ...................... SUCCESS [  2.240 s]
08:03:39 [INFO] Eclipse Ditto :: Model ............................. SUCCESS [  0.118 s]
08:03:39 [INFO] Eclipse Ditto :: Model :: Base ..................... SUCCESS [  8.049 s]
08:03:39 [INFO] Eclipse Ditto :: Model :: Policies ................. SUCCESS [  3.797 s]
08:03:39 [INFO] Eclipse Ditto :: Model :: Things ................... SUCCESS [  6.690 s]
08:03:39 [INFO] Eclipse Ditto :: Model :: Connectivity ............. SUCCESS [  4.914 s]
08:03:39 [INFO] Eclipse Ditto :: Model :: DevOps ................... SUCCESS [  0.223 s]
08:03:39 [INFO] Eclipse Ditto :: Model :: Messages ................. SUCCESS [  4.300 s]
08:03:39 [INFO] Eclipse Ditto :: Model :: Namespaces ............... SUCCESS [  1.763 s]
08:03:39 [INFO] Eclipse Ditto :: Model :: Enforcers ................ SUCCESS [ 23.959 s]
08:03:39 [INFO] Eclipse Ditto :: Model :: JWT ...................... SUCCESS [  2.458 s]
08:03:39 [INFO] Eclipse Ditto :: Model :: Thing Search ............. SUCCESS [  3.308 s]
08:03:39 [INFO] Eclipse Ditto :: Model :: RQL ...................... SUCCESS [  2.196 s]
08:03:39 [INFO] Eclipse Ditto :: Model :: RQL parser ............... SUCCESS [ 22.399 s]
08:03:39 [INFO] Eclipse Ditto :: Model :: Thing Search Parser ...... SUCCESS [  8.584 s]
08:03:39 [INFO] Eclipse Ditto :: Model :: Query .................... SUCCESS [  3.281 s]
08:03:39 [INFO] Eclipse Ditto :: Signals ........................... SUCCESS [  0.023 s]
08:03:39 [INFO] Eclipse Ditto :: Signals :: Base ................... SUCCESS [  2.306 s]
08:03:39 [INFO] Eclipse Ditto :: Signals :: Commands ............... SUCCESS [  0.120 s]
08:03:39 [INFO] Eclipse Ditto :: Signals :: Commands :: Base ....... SUCCESS [  2.135 s]
08:03:39 [INFO] Eclipse Ditto :: Signals :: ACKs ................... SUCCESS [  0.031 s]
08:03:39 [INFO] Eclipse Ditto :: Signals :: ACKs :: Base ........... SUCCESS [  4.212 s]
08:03:39 [INFO] Eclipse Ditto :: Signals :: ACKs :: Things ......... SUCCESS [  3.242 s]
08:03:39 [INFO] Eclipse Ditto :: Signals :: Commands :: Policies ... SUCCESS [  5.518 s]
08:03:39 [INFO] Eclipse Ditto :: Signals :: Commands :: Things ..... SUCCESS [ 11.243 s]
08:03:39 [INFO] Eclipse Ditto :: Signals :: Commands :: Thing Search SUCCESS [  3.102 s]
08:03:39 [INFO] Eclipse Ditto :: Signals :: Commands :: Messages ... SUCCESS [  3.046 s]
08:03:39 [INFO] Eclipse Ditto :: Signals :: Events ................. SUCCESS [  0.020 s]
08:03:39 [INFO] Eclipse Ditto :: Signals :: Events :: Base ......... SUCCESS [  1.918 s]
08:03:39 [INFO] Eclipse Ditto :: Signals :: Events :: Policies ..... SUCCESS [  4.000 s]
08:03:39 [INFO] Eclipse Ditto :: Signals :: Events :: Things ....... SUCCESS [  5.547 s]
08:03:39 [INFO] Eclipse Ditto :: Signals :: Events :: Thing Search . SUCCESS [  2.586 s]
08:03:39 [INFO] Eclipse Ditto :: Protocol Adapter .................. SUCCESS [ 10.892 s]
08:03:39 [INFO] Eclipse Ditto :: Model :: Placeholders ............. SUCCESS [  3.655 s]
08:03:39 [INFO] Eclipse Ditto :: Signals :: Commands :: Common ..... SUCCESS [  3.143 s]
08:03:39 [INFO] Eclipse Ditto :: Signals :: Commands :: Connectivity SUCCESS [  4.485 s]
08:03:39 [INFO] Eclipse Ditto :: Signals :: Commands :: DevOps ..... SUCCESS [  2.574 s]
08:03:39 [INFO] Eclipse Ditto :: Signals :: Commands :: Live ....... SUCCESS [  7.612 s]
08:03:39 [INFO] Eclipse Ditto :: Signals :: Commands :: Namespaces . SUCCESS [  2.746 s]
08:03:39 [INFO] Eclipse Ditto :: Signals :: Commands :: Cleanup .... SUCCESS [  2.178 s]
08:03:39 [INFO] Eclipse Ditto :: Signals :: Events :: Connectivity . SUCCESS [  2.725 s]
08:03:39 [INFO] Eclipse Ditto :: Services .......................... SUCCESS [  0.024 s]
08:03:39 [INFO] Eclipse Ditto :: Services :: Models ................ SUCCESS [  0.035 s]
08:03:39 [INFO] Eclipse Ditto :: Services :: Models :: Base ........ SUCCESS [  0.068 s]
08:03:39 [INFO] Eclipse Ditto :: Services :: Utils ................. SUCCESS [  0.035 s]
08:03:39 [INFO] Eclipse Ditto :: Services :: Utils :: Config Utils . SUCCESS [  4.937 s]
08:03:39 [INFO] Eclipse Ditto :: Services :: Utils :: Metrics ...... SUCCESS [  5.903 s]
08:03:39 [INFO] Eclipse Ditto :: Services :: Models :: Streaming ... SUCCESS [  2.396 s]
08:03:39 [INFO] Eclipse Ditto :: Services :: Utils :: Akka Utils ... SUCCESS [ 23.766 s]
08:03:39 [INFO] Eclipse Ditto :: Services :: Utils :: Health Utils . SUCCESS [  4.793 s]
08:03:39 [INFO] Eclipse Ditto :: Services :: Utils :: Cluster Utils  SUCCESS [  7.686 s]
08:03:39 [INFO] Eclipse Ditto :: Services :: Utils :: DevOps ....... SUCCESS [  0.270 s]
08:03:39 [INFO] Eclipse Ditto :: Services :: Utils :: Tracing Utils  SUCCESS [  2.040 s]
08:03:39 [INFO] Eclipse Ditto :: Services :: Utils :: Cache Utils .. SUCCESS [  4.523 s]
08:03:39 [INFO] Eclipse Ditto :: Services :: Utils :: Test Utils ... SUCCESS [  1.303 s]
08:03:39 [INFO] Eclipse Ditto :: Services :: Utils :: Persistence Utils SUCCESS [ 11.009 s]
08:03:39 [INFO] Eclipse Ditto :: Services :: Base .................. SUCCESS [  6.565 s]
08:03:39 [INFO] Eclipse Ditto :: Services :: Concierge ............. SUCCESS [  0.019 s]
08:03:39 [INFO] Eclipse Ditto :: Services :: Concierge :: Common ... SUCCESS [  4.204 s]
08:03:39 [INFO] Eclipse Ditto :: Services :: Utils :: Distributed Data SUCCESS [  3.898 s]
08:03:39 [INFO] Eclipse Ditto :: Services :: Utils :: Pub-Sub ...... SUCCESS [01:44 min]
08:03:39 [INFO] Eclipse Ditto :: Services :: Models :: Things ...... SUCCESS [  3.333 s]
08:03:39 [INFO] Eclipse Ditto :: Services :: Models :: Policies .... SUCCESS [  3.395 s]
08:03:39 [INFO] Eclipse Ditto :: Services :: Models :: Things Search SUCCESS [  3.727 s]
08:03:39 [INFO] Eclipse Ditto :: Services :: Models :: Connectivity  SUCCESS [  6.049 s]
08:03:39 [INFO] Eclipse Ditto :: Services :: Models :: Concierge ... SUCCESS [  0.262 s]
08:03:39 [INFO] Eclipse Ditto :: Services :: Concierge :: Actors ... SUCCESS [  4.943 s]
08:03:39 [INFO] Eclipse Ditto :: Services :: Utils :: Cache Loaders  SUCCESS [  4.011 s]
08:03:39 [INFO] Eclipse Ditto :: Services :: Concierge :: Enforcement SUCCESS [ 17.288 s]
08:03:39 [INFO] Eclipse Ditto :: Services :: Utils :: Namespaces ... SUCCESS [  6.512 s]
08:03:39 [INFO] Eclipse Ditto :: Services :: Concierge :: Starter .. SUCCESS [  7.795 s]
08:03:39 [INFO] Eclipse Ditto :: Services :: Utils :: Protocol ..... SUCCESS [  4.487 s]
08:03:39 [INFO] Eclipse Ditto :: Services :: Models :: ACKs ........ SUCCESS [  6.487 s]
08:03:39 [INFO] Eclipse Ditto :: Services :: Models :: Signal Enrichment SUCCESS [ 19.660 s]
08:03:39 [INFO] Eclipse Ditto :: Services :: Connectivity .......... SUCCESS [  0.025 s]
08:03:39 [INFO] Eclipse Ditto :: Services :: Connectivity :: Common  SUCCESS [  5.220 s]
08:03:39 [INFO] Eclipse Ditto :: Services :: Connectivity :: Util .. SUCCESS [  0.074 s]
08:03:39 [INFO] Eclipse Ditto :: Services :: Connectivity :: Mapping SUCCESS [ 24.682 s]
08:03:39 [INFO] Eclipse Ditto :: Services :: Utils :: Conditional Header Utils SUCCESS [  1.665 s]
08:03:39 [INFO] Eclipse Ditto :: Services :: Utils :: Persistent Actors SUCCESS [  5.239 s]
08:03:39 [INFO] Eclipse Ditto :: Services :: Utils :: Search ....... SUCCESS [  5.676 s]
08:03:39 [INFO] Eclipse Ditto :: Services :: Utils :: Aggregator ... SUCCESS [  3.353 s]
08:03:39 [INFO] Eclipse Ditto :: Services :: Connectivity :: Messaging SUCCESS [04:05 min]
08:03:39 [INFO] Eclipse Ditto :: Services :: Connectivity :: Starter SUCCESS [  7.903 s]
08:03:39 [INFO] Eclipse Ditto :: Services :: Gateway ............... SUCCESS [  0.016 s]
08:03:39 [INFO] Eclipse Ditto :: Services :: Gateway :: Util ....... SUCCESS [  6.884 s]
08:03:39 [INFO] Eclipse Ditto :: Services :: Utils :: JWT .......... SUCCESS [  1.437 s]
08:03:39 [INFO] Eclipse Ditto :: Services :: Gateway :: Security ... SUCCESS [  9.237 s]
08:03:39 [INFO] Eclipse Ditto :: Services :: Gateway :: Health ..... SUCCESS [  0.425 s]
08:03:39 [INFO] Eclipse Ditto :: Services :: Gateway :: Streaming .. FAILURE [  8.000 s]
08:03:39 [INFO] Eclipse Ditto :: Services :: Gateway :: Endpoints .. SKIPPED
08:03:39 [INFO] Eclipse Ditto :: Services :: Gateway :: Proxy ...... SKIPPED
08:03:39 [INFO] Eclipse Ditto :: Services :: Gateway :: Starter .... SKIPPED
08:03:39 [INFO] Eclipse Ditto :: Services :: Policies .............. SKIPPED
08:03:39 [INFO] Eclipse Ditto :: Services :: Policies :: Common .... SKIPPED
08:03:39 [INFO] Eclipse Ditto :: Services :: Policies :: Persistence SKIPPED
08:03:39 [INFO] Eclipse Ditto :: Services :: Policies :: Starter ... SKIPPED
08:03:39 [INFO] Eclipse Ditto :: Services :: Things ................ SKIPPED
08:03:39 [INFO] Eclipse Ditto :: Services :: Things :: Common ...... SKIPPED
08:03:39 [INFO] Eclipse Ditto :: Services :: Things :: Persistence . SKIPPED
08:03:39 [INFO] Eclipse Ditto :: Services :: Things :: Starter ..... SKIPPED
08:03:39 [INFO] Eclipse Ditto :: Services :: Thing Search .......... SKIPPED
08:03:39 [INFO] Eclipse Ditto :: Services :: Thing Search :: Common  SKIPPED
08:03:39 [INFO] Eclipse Ditto :: Services :: Thing Search :: Persistence SKIPPED
08:03:39 [INFO] Eclipse Ditto :: Services :: Thing Search :: Updater Actors SKIPPED
08:03:39 [INFO] Eclipse Ditto :: Services :: Thing Search :: Starter SKIPPED
08:03:39 [INFO] Eclipse Ditto :: Services :: Legal ................. SKIPPED
08:03:39 [INFO] ------------------------------------------------------------------------
08:03:39 [INFO] BUILD FAILURE
08:03:39 [INFO] ------------------------------------------------------------------------
08:03:39 [INFO] Total time:  14:29 min
08:03:39 [INFO] Finished at: 2020-12-10T13:03:39Z
08:03:39 [INFO] ------------------------------------------------------------------------
08:03:39 [ERROR] Failed to execute goal org.apache.maven.plugins:maven-surefire-plugin:3.0.0-M4:test (default-test) on project ditto-services-gateway-streaming: There are test failures.
08:03:39 [ERROR] 
08:03:39 [ERROR] Please refer to /home/jenkins/agent/workspace/ditto-ci/services/gateway/streaming/target/surefire-reports for the individual test results.
08:03:39 [ERROR] Please refer to dump files (if any exist) [date].dump, [date]-jvmRun[N].dump and [date].dumpstream.
08:03:39 [ERROR] The forked VM terminated without properly saying goodbye. VM crash or System.exit called?
08:03:39 [ERROR] Command was /bin/sh -c cd /home/jenkins/agent/workspace/ditto-ci/services/gateway/streaming && /opt/tools/java/openjdk/jdk-11/11.0.2+9/bin/java -javaagent:/home/jenkins/.m2/repository/org/jacoco/org.jacoco.agent/0.8.5/org.jacoco.agent-0.8.5-runtime.jar=destfile=/home/jenkins/agent/workspace/ditto-ci/services/gateway/streaming/target/jacoco.exec -Dfile.encoding=UTF-8 -jar /home/jenkins/agent/workspace/ditto-ci/services/gateway/streaming/target/surefire/surefirebooter6368932194999342089.jar /home/jenkins/agent/workspace/ditto-ci/services/gateway/streaming/target/surefire 2020-12-10T12-49-58_729-jvmRun1 surefire8900003337655949967tmp surefire_353202598159938551528tmp
08:03:39 [ERROR] Error occurred in starting fork, check output in log
08:03:39 [ERROR] Process Exit Code: 143
08:03:39 [ERROR] Crashed tests:
08:03:39 [ERROR] org.eclipse.ditto.services.gateway.streaming.StopStreamingTest
08:03:39 [ERROR] org.apache.maven.surefire.booter.SurefireBooterForkException: The forked VM terminated without properly saying goodbye. VM crash or System.exit called?
08:03:39 [ERROR] Command was /bin/sh -c cd /home/jenkins/agent/workspace/ditto-ci/services/gateway/streaming && /opt/tools/java/openjdk/jdk-11/11.0.2+9/bin/java -javaagent:/home/jenkins/.m2/repository/org/jacoco/org.jacoco.agent/0.8.5/org.jacoco.agent-0.8.5-runtime.jar=destfile=/home/jenkins/agent/workspace/ditto-ci/services/gateway/streaming/target/jacoco.exec -Dfile.encoding=UTF-8 -jar /home/jenkins/agent/workspace/ditto-ci/services/gateway/streaming/target/surefire/surefirebooter6368932194999342089.jar /home/jenkins/agent/workspace/ditto-ci/services/gateway/streaming/target/surefire 2020-12-10T12-49-58_729-jvmRun1 surefire8900003337655949967tmp surefire_353202598159938551528tmp
08:03:39 [ERROR] Error occurred in starting fork, check output in log
08:03:39 [ERROR] Process Exit Code: 143
08:03:39 [ERROR] Crashed tests:
08:03:39 [ERROR] org.eclipse.ditto.services.gateway.streaming.StopStreamingTest
08:03:39 [ERROR] 	at org.apache.maven.plugin.surefire.booterclient.ForkStarter.fork(ForkStarter.java:690)
08:03:39 [ERROR] 	at org.apache.maven.plugin.surefire.booterclient.ForkStarter.run(ForkStarter.java:285)
08:03:39 [ERROR] 	at org.apache.maven.plugin.surefire.booterclient.ForkStarter.run(ForkStarter.java:248)
08:03:39 [ERROR] 	at org.apache.maven.plugin.surefire.AbstractSurefireMojo.executeProvider(AbstractSurefireMojo.java:1217)
08:03:39 [ERROR] 	at org.apache.maven.plugin.surefire.AbstractSurefireMojo.executeAfterPreconditionsChecked(AbstractSurefireMojo.java:1063)
08:03:39 [ERROR] 	at org.apache.maven.plugin.surefire.AbstractSurefireMojo.execute(AbstractSurefireMojo.java:889)
08:03:39 [ERROR] 	at org.apache.maven.plugin.DefaultBuildPluginManager.executeMojo(DefaultBuildPluginManager.java:137)
08:03:39 [ERROR] 	at org.apache.maven.lifecycle.internal.MojoExecutor.execute(MojoExecutor.java:210)
08:03:39 [ERROR] 	at org.apache.maven.lifecycle.internal.MojoExecutor.execute(MojoExecutor.java:156)
08:03:39 [ERROR] 	at org.apache.maven.lifecycle.internal.MojoExecutor.execute(MojoExecutor.java:148)
08:03:39 [ERROR] 	at org.apache.maven.lifecycle.internal.LifecycleModuleBuilder.buildProject(LifecycleModuleBuilder.java:117)
08:03:39 [ERROR] 	at org.apache.maven.lifecycle.internal.LifecycleModuleBuilder.buildProject(LifecycleModuleBuilder.java:81)
08:03:39 [ERROR] 	at org.apache.maven.lifecycle.internal.builder.singlethreaded.SingleThreadedBuilder.build(SingleThreadedBuilder.java:56)
08:03:39 [ERROR] 	at org.apache.maven.lifecycle.internal.LifecycleStarter.execute(LifecycleStarter.java:128)
08:03:39 [ERROR] 	at org.apache.maven.DefaultMaven.doExecute(DefaultMaven.java:305)
08:03:39 [ERROR] 	at org.apache.maven.DefaultMaven.doExecute(DefaultMaven.java:192)
08:03:39 [ERROR] 	at org.apache.maven.DefaultMaven.execute(DefaultMaven.java:105)
08:03:39 [ERROR] 	at org.apache.maven.cli.MavenCli.execute(MavenCli.java:957)
08:03:39 [ERROR] 	at org.apache.maven.cli.MavenCli.doMain(MavenCli.java:289)
08:03:39 [ERROR] 	at org.apache.maven.cli.MavenCli.main(MavenCli.java:193)
08:03:39 [ERROR] 	at java.base/jdk.internal.reflect.NativeMethodAccessorImpl.invoke0(Native Method)
08:03:39 [ERROR] 	at java.base/jdk.internal.reflect.NativeMethodAccessorImpl.invoke(NativeMethodAccessorImpl.java:62)
08:03:39 [ERROR] 	at java.base/jdk.internal.reflect.DelegatingMethodAccessorImpl.invoke(DelegatingMethodAccessorImpl.java:43)
08:03:39 [ERROR] 	at java.base/java.lang.reflect.Method.invoke(Method.java:566)
08:03:39 [ERROR] 	at org.codehaus.plexus.classworlds.launcher.Launcher.launchEnhanced(Launcher.java:282)
08:03:39 [ERROR] 	at org.codehaus.plexus.classworlds.launcher.Launcher.launch(Launcher.java:225)
08:03:39 [ERROR] 	at org.codehaus.plexus.classworlds.launcher.Launcher.mainWithExitCode(Launcher.java:406)
08:03:39 [ERROR] 	at org.codehaus.plexus.classworlds.launcher.Launcher.main(Launcher.java:347)
08:03:39 [ERROR] -> [Help 1]
08:03:39 org.apache.maven.lifecycle.LifecycleExecutionException: Failed to execute goal org.apache.maven.plugins:maven-surefire-plugin:3.0.0-M4:test (default-test) on project ditto-services-gateway-streaming: There are test failures.
08:03:39 
08:03:39 Please refer to /home/jenkins/agent/workspace/ditto-ci/services/gateway/streaming/target/surefire-reports for the individual test results.
08:03:39 Please refer to dump files (if any exist) [date].dump, [date]-jvmRun[N].dump and [date].dumpstream.
08:03:39 The forked VM terminated without properly saying goodbye. VM crash or System.exit called?
08:03:39 Command was /bin/sh -c cd /home/jenkins/agent/workspace/ditto-ci/services/gateway/streaming && /opt/tools/java/openjdk/jdk-11/11.0.2+9/bin/java -javaagent:/home/jenkins/.m2/repository/org/jacoco/org.jacoco.agent/0.8.5/org.jacoco.agent-0.8.5-runtime.jar=destfile=/home/jenkins/agent/workspace/ditto-ci/services/gateway/streaming/target/jacoco.exec -Dfile.encoding=UTF-8 -jar /home/jenkins/agent/workspace/ditto-ci/services/gateway/streaming/target/surefire/surefirebooter6368932194999342089.jar /home/jenkins/agent/workspace/ditto-ci/services/gateway/streaming/target/surefire 2020-12-10T12-49-58_729-jvmRun1 surefire8900003337655949967tmp surefire_353202598159938551528tmp
08:03:39 Error occurred in starting fork, check output in log
08:03:39 Process Exit Code: 143
08:03:39 Crashed tests:
08:03:39 org.eclipse.ditto.services.gateway.streaming.StopStreamingTest
08:03:39 org.apache.maven.surefire.booter.SurefireBooterForkException: The forked VM terminated without properly saying goodbye. VM crash or System.exit called?
08:03:39 Command was /bin/sh -c cd /home/jenkins/agent/workspace/ditto-ci/services/gateway/streaming && /opt/tools/java/openjdk/jdk-11/11.0.2+9/bin/java -javaagent:/home/jenkins/.m2/repository/org/jacoco/org.jacoco.agent/0.8.5/org.jacoco.agent-0.8.5-runtime.jar=destfile=/home/jenkins/agent/workspace/ditto-ci/services/gateway/streaming/target/jacoco.exec -Dfile.encoding=UTF-8 -jar /home/jenkins/agent/workspace/ditto-ci/services/gateway/streaming/target/surefire/surefirebooter6368932194999342089.jar /home/jenkins/agent/workspace/ditto-ci/services/gateway/streaming/target/surefire 2020-12-10T12-49-58_729-jvmRun1 surefire8900003337655949967tmp surefire_353202598159938551528tmp
08:03:39 Error occurred in starting fork, check output in log
08:03:39 Process Exit Code: 143
08:03:39 Crashed tests:
08:03:39 org.eclipse.ditto.services.gateway.streaming.StopStreamingTest
08:03:39 	at org.apache.maven.plugin.surefire.booterclient.ForkStarter.fork(ForkStarter.java:690)
08:03:39 	at org.apache.maven.plugin.surefire.booterclient.ForkStarter.run(ForkStarter.java:285)
08:03:39 	at org.apache.maven.plugin.surefire.booterclient.ForkStarter.run(ForkStarter.java:248)
08:03:39 	at org.apache.maven.plugin.surefire.AbstractSurefireMojo.executeProvider(AbstractSurefireMojo.java:1217)
08:03:39 	at org.apache.maven.plugin.surefire.AbstractSurefireMojo.executeAfterPreconditionsChecked(AbstractSurefireMojo.java:1063)
08:03:39 	at org.apache.maven.plugin.surefire.AbstractSurefireMojo.execute(AbstractSurefireMojo.java:889)
08:03:39 	at org.apache.maven.plugin.DefaultBuildPluginManager.executeMojo(DefaultBuildPluginManager.java:137)
08:03:39 	at org.apache.maven.lifecycle.internal.MojoExecutor.execute(MojoExecutor.java:210)
08:03:39 	at org.apache.maven.lifecycle.internal.MojoExecutor.execute(MojoExecutor.java:156)
08:03:39 	at org.apache.maven.lifecycle.internal.MojoExecutor.execute(MojoExecutor.java:148)
08:03:39 	at org.apache.maven.lifecycle.internal.LifecycleModuleBuilder.buildProject(LifecycleModuleBuilder.java:117)
08:03:39 	at org.apache.maven.lifecycle.internal.LifecycleModuleBuilder.buildProject(LifecycleModuleBuilder.java:81)
08:03:39 	at org.apache.maven.lifecycle.internal.builder.singlethreaded.SingleThreadedBuilder.build(SingleThreadedBuilder.java:56)
08:03:39 	at org.apache.maven.lifecycle.internal.LifecycleStarter.execute(LifecycleStarter.java:128)
08:03:39 	at org.apache.maven.DefaultMaven.doExecute(DefaultMaven.java:305)
08:03:39 	at org.apache.maven.DefaultMaven.doExecute(DefaultMaven.java:192)
08:03:39 	at org.apache.maven.DefaultMaven.execute(DefaultMaven.java:105)
08:03:39 	at org.apache.maven.cli.MavenCli.execute(MavenCli.java:957)
08:03:39 	at org.apache.maven.cli.MavenCli.doMain(MavenCli.java:289)
08:03:39 	at org.apache.maven.cli.MavenCli.main(MavenCli.java:193)
08:03:39 	at java.base/jdk.internal.reflect.NativeMethodAccessorImpl.invoke0(Native Method)
08:03:39 	at java.base/jdk.internal.reflect.NativeMethodAccessorImpl.invoke(NativeMethodAccessorImpl.java:62)
08:03:39 	at java.base/jdk.internal.reflect.DelegatingMethodAccessorImpl.invoke(DelegatingMethodAccessorImpl.java:43)
08:03:39 	at java.base/java.lang.reflect.Method.invoke(Method.java:566)
08:03:39 	at org.codehaus.plexus.classworlds.launcher.Launcher.launchEnhanced(Launcher.java:282)
08:03:39 	at org.codehaus.plexus.classworlds.launcher.Launcher.launch(Launcher.java:225)
08:03:39 	at org.codehaus.plexus.classworlds.launcher.Launcher.mainWithExitCode(Launcher.java:406)
08:03:39 	at org.codehaus.plexus.classworlds.launcher.Launcher.main(Launcher.java:347)
08:03:39 
08:03:39     at org.apache.maven.lifecycle.internal.MojoExecutor.execute (MojoExecutor.java:215)
08:03:39     at org.apache.maven.lifecycle.internal.MojoExecutor.execute (MojoExecutor.java:156)
08:03:39     at org.apache.maven.lifecycle.internal.MojoExecutor.execute (MojoExecutor.java:148)
08:03:39     at org.apache.maven.lifecycle.internal.LifecycleModuleBuilder.buildProject (LifecycleModuleBuilder.java:117)
08:03:39     at org.apache.maven.lifecycle.internal.LifecycleModuleBuilder.buildProject (LifecycleModuleBuilder.java:81)
08:03:39     at org.apache.maven.lifecycle.internal.builder.singlethreaded.SingleThreadedBuilder.build (SingleThreadedBuilder.java:56)
08:03:39     at org.apache.maven.lifecycle.internal.LifecycleStarter.execute (LifecycleStarter.java:128)
08:03:39     at org.apache.maven.DefaultMaven.doExecute (DefaultMaven.java:305)
08:03:39     at org.apache.maven.DefaultMaven.doExecute (DefaultMaven.java:192)
08:03:39     at org.apache.maven.DefaultMaven.execute (DefaultMaven.java:105)
08:03:39     at org.apache.maven.cli.MavenCli.execute (MavenCli.java:957)
08:03:39     at org.apache.maven.cli.MavenCli.doMain (MavenCli.java:289)
08:03:39     at org.apache.maven.cli.MavenCli.main (MavenCli.java:193)
08:03:39     at jdk.internal.reflect.NativeMethodAccessorImpl.invoke0 (Native Method)
08:03:39     at jdk.internal.reflect.NativeMethodAccessorImpl.invoke (NativeMethodAccessorImpl.java:62)
08:03:39     at jdk.internal.reflect.DelegatingMethodAccessorImpl.invoke (DelegatingMethodAccessorImpl.java:43)
08:03:39     at java.lang.reflect.Method.invoke (Method.java:566)
08:03:39     at org.codehaus.plexus.classworlds.launcher.Launcher.launchEnhanced (Launcher.java:282)
08:03:39     at org.codehaus.plexus.classworlds.launcher.Launcher.launch (Launcher.java:225)
08:03:39     at org.codehaus.plexus.classworlds.launcher.Launcher.mainWithExitCode (Launcher.java:406)
08:03:39     at org.codehaus.plexus.classworlds.launcher.Launcher.main (Launcher.java:347)
08:03:39 Caused by: org.apache.maven.plugin.MojoExecutionException: There are test failures.
08:03:39 
08:03:39 Please refer to /home/jenkins/agent/workspace/ditto-ci/services/gateway/streaming/target/surefire-reports for the individual test results.
08:03:39 Please refer to dump files (if any exist) [date].dump, [date]-jvmRun[N].dump and [date].dumpstream.
08:03:39 The forked VM terminated without properly saying goodbye. VM crash or System.exit called?
08:03:39 Command was /bin/sh -c cd /home/jenkins/agent/workspace/ditto-ci/services/gateway/streaming && /opt/tools/java/openjdk/jdk-11/11.0.2+9/bin/java -javaagent:/home/jenkins/.m2/repository/org/jacoco/org.jacoco.agent/0.8.5/org.jacoco.agent-0.8.5-runtime.jar=destfile=/home/jenkins/agent/workspace/ditto-ci/services/gateway/streaming/target/jacoco.exec -Dfile.encoding=UTF-8 -jar /home/jenkins/agent/workspace/ditto-ci/services/gateway/streaming/target/surefire/surefirebooter6368932194999342089.jar /home/jenkins/agent/workspace/ditto-ci/services/gateway/streaming/target/surefire 2020-12-10T12-49-58_729-jvmRun1 surefire8900003337655949967tmp surefire_353202598159938551528tmp
08:03:39 Error occurred in starting fork, check output in log
08:03:39 Process Exit Code: 143
08:03:39 Crashed tests:
08:03:39 org.eclipse.ditto.services.gateway.streaming.StopStreamingTest
08:03:39 org.apache.maven.surefire.booter.SurefireBooterForkException: The forked VM terminated without properly saying goodbye. VM crash or System.exit called?
08:03:39 Command was /bin/sh -c cd /home/jenkins/agent/workspace/ditto-ci/services/gateway/streaming && /opt/tools/java/openjdk/jdk-11/11.0.2+9/bin/java -javaagent:/home/jenkins/.m2/repository/org/jacoco/org.jacoco.agent/0.8.5/org.jacoco.agent-0.8.5-runtime.jar=destfile=/home/jenkins/agent/workspace/ditto-ci/services/gateway/streaming/target/jacoco.exec -Dfile.encoding=UTF-8 -jar /home/jenkins/agent/workspace/ditto-ci/services/gateway/streaming/target/surefire/surefirebooter6368932194999342089.jar /home/jenkins/agent/workspace/ditto-ci/services/gateway/streaming/target/surefire 2020-12-10T12-49-58_729-jvmRun1 surefire8900003337655949967tmp surefire_353202598159938551528tmp
08:03:39 Error occurred in starting fork, check output in log
08:03:39 Process Exit Code: 143
08:03:39 Crashed tests:
08:03:39 org.eclipse.ditto.services.gateway.streaming.StopStreamingTest
08:03:39 	at org.apache.maven.plugin.surefire.booterclient.ForkStarter.fork(ForkStarter.java:690)
08:03:39 	at org.apache.maven.plugin.surefire.booterclient.ForkStarter.run(ForkStarter.java:285)
08:03:39 	at org.apache.maven.plugin.surefire.booterclient.ForkStarter.run(ForkStarter.java:248)
08:03:39 	at org.apache.maven.plugin.surefire.AbstractSurefireMojo.executeProvider(AbstractSurefireMojo.java:1217)
08:03:39 	at org.apache.maven.plugin.surefire.AbstractSurefireMojo.executeAfterPreconditionsChecked(AbstractSurefireMojo.java:1063)
08:03:39 	at org.apache.maven.plugin.surefire.AbstractSurefireMojo.execute(AbstractSurefireMojo.java:889)
08:03:39 	at org.apache.maven.plugin.DefaultBuildPluginManager.executeMojo(DefaultBuildPluginManager.java:137)
08:03:39 	at org.apache.maven.lifecycle.internal.MojoExecutor.execute(MojoExecutor.java:210)
08:03:39 	at org.apache.maven.lifecycle.internal.MojoExecutor.execute(MojoExecutor.java:156)
08:03:39 	at org.apache.maven.lifecycle.internal.MojoExecutor.execute(MojoExecutor.java:148)
08:03:39 	at org.apache.maven.lifecycle.internal.LifecycleModuleBuilder.buildProject(LifecycleModuleBuilder.java:117)
08:03:39 	at org.apache.maven.lifecycle.internal.LifecycleModuleBuilder.buildProject(LifecycleModuleBuilder.java:81)
08:03:39 	at org.apache.maven.lifecycle.internal.builder.singlethreaded.SingleThreadedBuilder.build(SingleThreadedBuilder.java:56)
08:03:39 	at org.apache.maven.lifecycle.internal.LifecycleStarter.execute(LifecycleStarter.java:128)
08:03:39 	at org.apache.maven.DefaultMaven.doExecute(DefaultMaven.java:305)
08:03:39 	at org.apache.maven.DefaultMaven.doExecute(DefaultMaven.java:192)
08:03:39 	at org.apache.maven.DefaultMaven.execute(DefaultMaven.java:105)
08:03:39 	at org.apache.maven.cli.MavenCli.execute(MavenCli.java:957)
08:03:39 	at org.apache.maven.cli.MavenCli.doMain(MavenCli.java:289)
08:03:39 	at org.apache.maven.cli.MavenCli.main(MavenCli.java:193)
08:03:39 	at java.base/jdk.internal.reflect.NativeMethodAccessorImpl.invoke0(Native Method)
08:03:39 	at java.base/jdk.internal.reflect.NativeMethodAccessorImpl.invoke(NativeMethodAccessorImpl.java:62)
08:03:39 	at java.base/jdk.internal.reflect.DelegatingMethodAccessorImpl.invoke(DelegatingMethodAccessorImpl.java:43)
08:03:39 	at java.base/java.lang.reflect.Method.invoke(Method.java:566)
08:03:39 	at org.codehaus.plexus.classworlds.launcher.Launcher.launchEnhanced(Launcher.java:282)
08:03:39 	at org.codehaus.plexus.classworlds.launcher.Launcher.launch(Launcher.java:225)
08:03:39 	at org.codehaus.plexus.classworlds.launcher.Launcher.mainWithExitCode(Launcher.java:406)
08:03:39 	at org.codehaus.plexus.classworlds.launcher.Launcher.main(Launcher.java:347)
08:03:39 
08:03:39     at org.apache.maven.plugin.surefire.SurefireHelper.throwException (SurefireHelper.java:266)
08:03:39     at org.apache.maven.plugin.surefire.SurefireHelper.reportExecution (SurefireHelper.java:159)
08:03:39     at org.apache.maven.plugin.surefire.SurefirePlugin.handleSummary (SurefirePlugin.java:435)
08:03:39     at org.apache.maven.plugin.surefire.AbstractSurefireMojo.executeAfterPreconditionsChecked (AbstractSurefireMojo.java:1079)
08:03:39     at org.apache.maven.plugin.surefire.AbstractSurefireMojo.execute (AbstractSurefireMojo.java:889)
08:03:39     at org.apache.maven.plugin.DefaultBuildPluginManager.executeMojo (DefaultBuildPluginManager.java:137)
08:03:39     at org.apache.maven.lifecycle.internal.MojoExecutor.execute (MojoExecutor.java:210)
08:03:39     at org.apache.maven.lifecycle.internal.MojoExecutor.execute (MojoExecutor.java:156)
08:03:39     at org.apache.maven.lifecycle.internal.MojoExecutor.execute (MojoExecutor.java:148)
08:03:39     at org.apache.maven.lifecycle.internal.LifecycleModuleBuilder.buildProject (LifecycleModuleBuilder.java:117)
08:03:39     at org.apache.maven.lifecycle.internal.LifecycleModuleBuilder.buildProject (LifecycleModuleBuilder.java:81)
08:03:39     at org.apache.maven.lifecycle.internal.builder.singlethreaded.SingleThreadedBuilder.build (SingleThreadedBuilder.java:56)
08:03:39     at org.apache.maven.lifecycle.internal.LifecycleStarter.execute (LifecycleStarter.java:128)
08:03:39     at org.apache.maven.DefaultMaven.doExecute (DefaultMaven.java:305)
08:03:39     at org.apache.maven.DefaultMaven.doExecute (DefaultMaven.java:192)
08:03:39     at org.apache.maven.DefaultMaven.execute (DefaultMaven.java:105)
08:03:39     at org.apache.maven.cli.MavenCli.execute (MavenCli.java:957)
08:03:39     at org.apache.maven.cli.MavenCli.doMain (MavenCli.java:289)
08:03:39     at org.apache.maven.cli.MavenCli.main (MavenCli.java:193)
08:03:39     at jdk.internal.reflect.NativeMethodAccessorImpl.invoke0 (Native Method)
08:03:39     at jdk.internal.reflect.NativeMethodAccessorImpl.invoke (NativeMethodAccessorImpl.java:62)
08:03:39     at jdk.internal.reflect.DelegatingMethodAccessorImpl.invoke (DelegatingMethodAccessorImpl.java:43)
08:03:39     at java.lang.reflect.Method.invoke (Method.java:566)
08:03:39     at org.codehaus.plexus.classworlds.launcher.Launcher.launchEnhanced (Launcher.java:282)
08:03:39     at org.codehaus.plexus.classworlds.launcher.Launcher.launch (Launcher.java:225)
08:03:39     at org.codehaus.plexus.classworlds.launcher.Launcher.mainWithExitCode (Launcher.java:406)
08:03:39     at org.codehaus.plexus.classworlds.launcher.Launcher.main (Launcher.java:347)
08:03:39 Caused by: org.apache.maven.surefire.booter.SurefireBooterForkException: The forked VM terminated without properly saying goodbye. VM crash or System.exit called?
08:03:39 Command was /bin/sh -c cd /home/jenkins/agent/workspace/ditto-ci/services/gateway/streaming && /opt/tools/java/openjdk/jdk-11/11.0.2+9/bin/java -javaagent:/home/jenkins/.m2/repository/org/jacoco/org.jacoco.agent/0.8.5/org.jacoco.agent-0.8.5-runtime.jar=destfile=/home/jenkins/agent/workspace/ditto-ci/services/gateway/streaming/target/jacoco.exec -Dfile.encoding=UTF-8 -jar /home/jenkins/agent/workspace/ditto-ci/services/gateway/streaming/target/surefire/surefirebooter6368932194999342089.jar /home/jenkins/agent/workspace/ditto-ci/services/gateway/streaming/target/surefire 2020-12-10T12-49-58_729-jvmRun1 surefire8900003337655949967tmp surefire_353202598159938551528tmp
08:03:39 Error occurred in starting fork, check output in log
08:03:39 Process Exit Code: 143
08:03:39 Crashed tests:
08:03:39 org.eclipse.ditto.services.gateway.streaming.StopStreamingTest
08:03:39     at org.apache.maven.plugin.surefire.booterclient.ForkStarter.fork (ForkStarter.java:690)
08:03:39     at org.apache.maven.plugin.surefire.booterclient.ForkStarter.run (ForkStarter.java:285)
08:03:39     at org.apache.maven.plugin.surefire.booterclient.ForkStarter.run (ForkStarter.java:248)
08:03:39     at org.apache.maven.plugin.surefire.AbstractSurefireMojo.executeProvider (AbstractSurefireMojo.java:1217)
08:03:39     at org.apache.maven.plugin.surefire.AbstractSurefireMojo.executeAfterPreconditionsChecked (AbstractSurefireMojo.java:1063)
08:03:39     at org.apache.maven.plugin.surefire.AbstractSurefireMojo.execute (AbstractSurefireMojo.java:889)
08:03:39     at org.apache.maven.plugin.DefaultBuildPluginManager.executeMojo (DefaultBuildPluginManager.java:137)
08:03:39     at org.apache.maven.lifecycle.internal.MojoExecutor.execute (MojoExecutor.java:210)
08:03:39     at org.apache.maven.lifecycle.internal.MojoExecutor.execute (MojoExecutor.java:156)
08:03:39     at org.apache.maven.lifecycle.internal.MojoExecutor.execute (MojoExecutor.java:148)
08:03:39     at org.apache.maven.lifecycle.internal.LifecycleModuleBuilder.buildProject (LifecycleModuleBuilder.java:117)
08:03:39     at org.apache.maven.lifecycle.internal.LifecycleModuleBuilder.buildProject (LifecycleModuleBuilder.java:81)
08:03:39     at org.apache.maven.lifecycle.internal.builder.singlethreaded.SingleThreadedBuilder.build (SingleThreadedBuilder.java:56)
08:03:39     at org.apache.maven.lifecycle.internal.LifecycleStarter.execute (LifecycleStarter.java:128)
08:03:39     at org.apache.maven.DefaultMaven.doExecute (DefaultMaven.java:305)
08:03:39     at org.apache.maven.DefaultMaven.doExecute (DefaultMaven.java:192)
08:03:39     at org.apache.maven.DefaultMaven.execute (DefaultMaven.java:105)
08:03:39     at org.apache.maven.cli.MavenCli.execute (MavenCli.java:957)
08:03:39     at org.apache.maven.cli.MavenCli.doMain (MavenCli.java:289)
08:03:39     at org.apache.maven.cli.MavenCli.main (MavenCli.java:193)
08:03:39     at jdk.internal.reflect.NativeMethodAccessorImpl.invoke0 (Native Method)
08:03:39     at jdk.internal.reflect.NativeMethodAccessorImpl.invoke (NativeMethodAccessorImpl.java:62)
08:03:39     at jdk.internal.reflect.DelegatingMethodAccessorImpl.invoke (DelegatingMethodAccessorImpl.java:43)
08:03:39     at java.lang.reflect.Method.invoke (Method.java:566)
08:03:39     at org.codehaus.plexus.classworlds.launcher.Launcher.launchEnhanced (Launcher.java:282)
08:03:39     at org.codehaus.plexus.classworlds.launcher.Launcher.launch (Launcher.java:225)
08:03:39     at org.codehaus.plexus.classworlds.launcher.Launcher.mainWithExitCode (Launcher.java:406)
08:03:39     at org.codehaus.plexus.classworlds.launcher.Launcher.main (Launcher.java:347)
08:03:39 [ERROR] 
08:03:39 [ERROR] Re-run Maven using the -X switch to enable full debug logging.
08:03:39 [ERROR] 
08:03:39 [ERROR] For more information about the errors and possible solutions, please read the following articles:
08:03:39 [ERROR] [Help 1] http://cwiki.apache.org/confluence/display/MAVEN/MojoExecutionException
08:03:39 [ERROR] 
08:03:39 [ERROR] After correcting the problems, you can resume the build with the command
08:03:39 [ERROR]   mvn <args> -rf :ditto-services-gateway-streaming
08:03:39 Finished: ABORTED