FailedConsole Output

Skipping 1,276 KB.. Full Log
[INFO] Using 'UTF-8' encoding to copy filtered resources.
04:13:36 [INFO] skip non existing resourceDirectory /home/jenkins/agent/workspace/ditto-ci/services/utils/search/src/main/resources
04:13:36 [INFO] Copying 0 resource
04:13:36 [INFO] 
04:13:36 [INFO] --- flatten-maven-plugin:1.0.1:flatten (flatten) @ ditto-services-utils-search ---
04:13:36 [INFO] Generating flattened POM of project org.eclipse.ditto:ditto-services-utils-search:jar:0-SNAPSHOT...
04:13:36 [INFO] 
04:13:36 [INFO] --- maven-compiler-plugin:3.8.1:compile (default-compile) @ ditto-services-utils-search ---
04:13:36 [INFO] Changes detected - recompiling the module!
04:13:36 [INFO] Compiling 5 source files to /home/jenkins/agent/workspace/ditto-ci/services/utils/search/target/classes
04:13:36 [INFO] /home/jenkins/agent/workspace/ditto-ci/services/utils/search/src/main/java/org/eclipse/ditto/services/utils/search/SearchSource.java: Some input files use or override a deprecated API.
04:13:36 [INFO] /home/jenkins/agent/workspace/ditto-ci/services/utils/search/src/main/java/org/eclipse/ditto/services/utils/search/SearchSource.java: Recompile with -Xlint:deprecation for details.
04:13:36 [INFO] /home/jenkins/agent/workspace/ditto-ci/services/utils/search/src/main/java/org/eclipse/ditto/services/utils/search/SearchSource.java: /home/jenkins/agent/workspace/ditto-ci/services/utils/search/src/main/java/org/eclipse/ditto/services/utils/search/SearchSource.java uses unchecked or unsafe operations.
04:13:36 [INFO] /home/jenkins/agent/workspace/ditto-ci/services/utils/search/src/main/java/org/eclipse/ditto/services/utils/search/SearchSource.java: Recompile with -Xlint:unchecked for details.
04:13:36 [INFO] 
04:13:36 [INFO] --- maven-resources-plugin:3.1.0:testResources (default-testResources) @ ditto-services-utils-search ---
04:13:36 [INFO] Using 'UTF-8' encoding to copy filtered resources.
04:13:36 [INFO] skip non existing resourceDirectory /home/jenkins/agent/workspace/ditto-ci/services/utils/search/src/test/resources
04:13:36 [INFO] 
04:13:36 [INFO] --- maven-compiler-plugin:3.8.1:testCompile (default-testCompile) @ ditto-services-utils-search ---
04:13:36 [INFO] Changes detected - recompiling the module!
04:13:36 [INFO] Compiling 4 source files to /home/jenkins/agent/workspace/ditto-ci/services/utils/search/target/test-classes
04:13:36 [INFO] /home/jenkins/agent/workspace/ditto-ci/services/utils/search/src/test/java/org/eclipse/ditto/services/utils/search/SubscriptionActorTest.java: /home/jenkins/agent/workspace/ditto-ci/services/utils/search/src/test/java/org/eclipse/ditto/services/utils/search/SubscriptionActorTest.java uses or overrides a deprecated API.
04:13:36 [INFO] /home/jenkins/agent/workspace/ditto-ci/services/utils/search/src/test/java/org/eclipse/ditto/services/utils/search/SubscriptionActorTest.java: Recompile with -Xlint:deprecation for details.
04:13:36 [INFO] /home/jenkins/agent/workspace/ditto-ci/services/utils/search/src/test/java/org/eclipse/ditto/services/utils/search/SearchSourceTest.java: /home/jenkins/agent/workspace/ditto-ci/services/utils/search/src/test/java/org/eclipse/ditto/services/utils/search/SearchSourceTest.java uses unchecked or unsafe operations.
04:13:36 [INFO] /home/jenkins/agent/workspace/ditto-ci/services/utils/search/src/test/java/org/eclipse/ditto/services/utils/search/SearchSourceTest.java: Recompile with -Xlint:unchecked for details.
04:13:36 [INFO] 
04:13:36 [INFO] --- maven-surefire-plugin:3.0.0-M4:test (default-test) @ ditto-services-utils-search ---
04:13:36 [INFO] Surefire report directory: /home/jenkins/agent/workspace/ditto-ci/services/utils/search/target/surefire-reports
04:13:36 [INFO] 
04:13:36 [INFO] -------------------------------------------------------
04:13:36 [INFO]  T E S T S
04:13:36 [INFO] -------------------------------------------------------
04:13:36 [INFO] Running org.eclipse.ditto.services.utils.search.SearchSourceTest
04:13:37 SLF4J: Class path contains multiple SLF4J bindings.
04:13:39 SLF4J: Found binding in [jar:file:/home/jenkins/.m2/repository/ch/qos/logback/logback-classic/1.2.3/logback-classic-1.2.3.jar!/org/slf4j/impl/StaticLoggerBinder.class]
04:13:39 SLF4J: Found binding in [jar:file:/home/jenkins/.m2/repository/org/slf4j/slf4j-simple/1.7.28/slf4j-simple-1.7.28.jar!/org/slf4j/impl/StaticLoggerBinder.class]
04:13:39 SLF4J: See http://www.slf4j.org/codes.html#multiple_bindings for an explanation.
04:13:39 SLF4J: Actual binding is of type [ch.qos.logback.classic.util.ContextSelectorStaticBinder]
04:13:39 [INFO] [10/27/2020 08:13:39.697] [default-akka.actor.default-dispatcher-5] [akka.stream.Log(akka://default/system/Materializers/StreamSupervisor-0)] [resume-source-errors-flow] Upstream failed, cause: InvalidRqlExpressionException: null
04:13:39 08:13:40.246 [default-akka.actor.default-dispatcher-6] INFO org.eclipse.ditto.services.utils.search.SearchSource - Resuming from: akka.stream.RemoteStreamRefActorTerminatedException: [SourceRef-0] Remote stream (akka://default/system/Materializers/StreamSupervisor-2/$$a-SinkRef-0) failed, reason: mock cursor-not-found error
04:13:40 [WARN] [10/27/2020 08:13:40.473] [default-akka.actor.default-dispatcher-6] [SinkRefStageImpl(akka://default)] [SinkRef-0] Stream already completed before remote side materialized, failing now.
04:13:40 [INFO] Tests run: 5, Failures: 0, Errors: 0, Skipped: 0, Time elapsed: 2.912 s - in org.eclipse.ditto.services.utils.search.SearchSourceTest
04:13:40 [INFO] Running org.eclipse.ditto.services.utils.search.SearchSourceBuilderTest
04:13:40 [INFO] Tests run: 9, Failures: 0, Errors: 0, Skipped: 0, Time elapsed: 0.235 s - in org.eclipse.ditto.services.utils.search.SearchSourceBuilderTest
04:13:40 [INFO] Running org.eclipse.ditto.services.utils.search.SubscriptionActorTest
04:13:40 [INFO] [10/27/2020 08:13:40.814] [SubscriptionActorTest0-akka.actor.default-dispatcher-6] [akka://SubscriptionActorTest0/user/-2147483648] Stopping due to idle timeout
04:13:40 [INFO] [10/27/2020 08:13:40.817] [SubscriptionActorTest0-akka.actor.default-dispatcher-6] [akka://SubscriptionActorTest0/user/-2147483648] Ignoring as zombie: <ReceiveTimeout>
04:13:40 [INFO] [10/27/2020 08:13:40.817] [SubscriptionActorTest0-akka.actor.default-dispatcher-6] [akka://SubscriptionActorTest0/user/-2147483648] Ignoring as zombie: <ReceiveTimeout>
04:13:40 [INFO] [10/27/2020 08:13:40.817] [SubscriptionActorTest0-akka.actor.default-dispatcher-6] [akka://SubscriptionActorTest0/user/-2147483648] Ignoring as zombie: <ReceiveTimeout>
04:13:40 [INFO] [10/27/2020 08:13:40.818] [SubscriptionActorTest0-akka.actor.default-dispatcher-8] [akka://SubscriptionActorTest0/user/-2147483648] Ignoring as zombie: <ReceiveTimeout>
04:13:40 [INFO] [10/27/2020 08:13:40.819] [SubscriptionActorTest0-akka.actor.default-dispatcher-8] [akka://SubscriptionActorTest0/user/-2147483648] Ignoring as zombie: <ReceiveTimeout>
04:13:40 [INFO] [10/27/2020 08:13:40.819] [SubscriptionActorTest0-akka.actor.default-dispatcher-8] [akka://SubscriptionActorTest0/user/-2147483648] Ignoring as zombie: <ReceiveTimeout>
04:13:40 [INFO] [10/27/2020 08:13:40.819] [SubscriptionActorTest0-akka.actor.default-dispatcher-8] [akka://SubscriptionActorTest0/user/-2147483648] Ignoring as zombie: <ReceiveTimeout>
04:13:40 [INFO] [10/27/2020 08:13:40.819] [SubscriptionActorTest0-akka.actor.default-dispatcher-8] [akka://SubscriptionActorTest0/user/-2147483648] Ignoring as zombie: <ReceiveTimeout>
04:13:40 [INFO] [10/27/2020 08:13:40.819] [SubscriptionActorTest0-akka.actor.default-dispatcher-8] [akka://SubscriptionActorTest0/user/-2147483648] Ignoring as zombie: <ReceiveTimeout>
04:13:40 [INFO] [10/27/2020 08:13:40.819] [SubscriptionActorTest0-akka.actor.default-dispatcher-8] [akka://SubscriptionActorTest0/user/-2147483648] Ignoring as zombie: <ReceiveTimeout>
04:13:40 [INFO] [10/27/2020 08:13:40.819] [SubscriptionActorTest0-akka.actor.default-dispatcher-8] [akka://SubscriptionActorTest0/user/-2147483648] Ignoring as zombie: <ReceiveTimeout>
04:13:40 [INFO] [10/27/2020 08:13:40.819] [SubscriptionActorTest0-akka.actor.default-dispatcher-8] [akka://SubscriptionActorTest0/user/-2147483648] Ignoring as zombie: <ReceiveTimeout>
04:13:40 [INFO] [10/27/2020 08:13:40.819] [SubscriptionActorTest0-akka.actor.default-dispatcher-8] [akka://SubscriptionActorTest0/user/-2147483648] Ignoring as zombie: <ReceiveTimeout>
04:13:40 [INFO] [10/27/2020 08:13:40.819] [SubscriptionActorTest0-akka.actor.default-dispatcher-8] [akka://SubscriptionActorTest0/user/-2147483648] Ignoring as zombie: <ReceiveTimeout>
04:13:40 [INFO] [10/27/2020 08:13:40.819] [SubscriptionActorTest0-akka.actor.default-dispatcher-8] [akka://SubscriptionActorTest0/user/-2147483648] Ignoring as zombie: <ReceiveTimeout>
04:13:40 [INFO] [10/27/2020 08:13:40.820] [SubscriptionActorTest0-akka.actor.default-dispatcher-8] [akka://SubscriptionActorTest0/user/-2147483648] Ignoring as zombie: <ReceiveTimeout>
04:13:40 [INFO] [10/27/2020 08:13:40.820] [SubscriptionActorTest0-akka.actor.default-dispatcher-8] [akka://SubscriptionActorTest0/user/-2147483648] Ignoring as zombie: <ReceiveTimeout>
04:13:40 [INFO] [10/27/2020 08:13:40.820] [SubscriptionActorTest0-akka.actor.default-dispatcher-8] [akka://SubscriptionActorTest0/user/-2147483648] Ignoring as zombie: <ReceiveTimeout>
04:13:40 [INFO] [10/27/2020 08:13:40.820] [SubscriptionActorTest0-akka.actor.default-dispatcher-8] [akka://SubscriptionActorTest0/user/-2147483648] Ignoring as zombie: <ReceiveTimeout>
04:13:40 [INFO] [10/27/2020 08:13:40.820] [SubscriptionActorTest0-akka.actor.default-dispatcher-8] [akka://SubscriptionActorTest0/user/-2147483648] Ignoring as zombie: <ReceiveTimeout>
04:13:40 [INFO] [10/27/2020 08:13:40.820] [SubscriptionActorTest0-akka.actor.default-dispatcher-8] [akka://SubscriptionActorTest0/user/-2147483648] Ignoring as zombie: <ReceiveTimeout>
04:13:40 [INFO] [10/27/2020 08:13:40.820] [SubscriptionActorTest0-akka.actor.default-dispatcher-8] [akka://SubscriptionActorTest0/user/-2147483648] Ignoring as zombie: <ReceiveTimeout>
04:13:40 [INFO] [10/27/2020 08:13:40.820] [SubscriptionActorTest0-akka.actor.default-dispatcher-8] [akka://SubscriptionActorTest0/user/-2147483648] Ignoring as zombie: <ReceiveTimeout>
04:13:40 [INFO] [10/27/2020 08:13:40.820] [SubscriptionActorTest0-akka.actor.default-dispatcher-8] [akka://SubscriptionActorTest0/user/-2147483648] Ignoring as zombie: <ReceiveTimeout>
04:13:40 [INFO] [10/27/2020 08:13:40.820] [SubscriptionActorTest0-akka.actor.default-dispatcher-8] [akka://SubscriptionActorTest0/user/-2147483648] Ignoring as zombie: <ReceiveTimeout>
04:13:40 [INFO] [10/27/2020 08:13:40.820] [SubscriptionActorTest0-akka.actor.default-dispatcher-8] [akka://SubscriptionActorTest0/user/-2147483648] Ignoring as zombie: <ReceiveTimeout>
04:13:40 [INFO] [10/27/2020 08:13:40.820] [SubscriptionActorTest0-akka.actor.default-dispatcher-8] [akka://SubscriptionActorTest0/user/-2147483648] Ignoring as zombie: <ReceiveTimeout>
04:13:40 [INFO] [10/27/2020 08:13:40.820] [SubscriptionActorTest0-akka.actor.default-dispatcher-8] [akka://SubscriptionActorTest0/user/-2147483648] Ignoring as zombie: <ReceiveTimeout>
04:13:40 [INFO] [10/27/2020 08:13:40.820] [SubscriptionActorTest0-akka.actor.default-dispatcher-8] [akka://SubscriptionActorTest0/user/-2147483648] Ignoring as zombie: <ReceiveTimeout>
04:13:40 [INFO] [10/27/2020 08:13:40.821] [SubscriptionActorTest0-akka.actor.default-dispatcher-8] [akka://SubscriptionActorTest0/user/-2147483648] Ignoring as zombie: <ReceiveTimeout>
04:13:40 [INFO] [10/27/2020 08:13:40.822] [SubscriptionActorTest0-akka.actor.default-dispatcher-8] [akka://SubscriptionActorTest0/user/-2147483648] Ignoring as zombie: <ReceiveTimeout>
04:13:40 [INFO] [10/27/2020 08:13:40.822] [SubscriptionActorTest0-akka.actor.default-dispatcher-8] [akka://SubscriptionActorTest0/user/-2147483648] Ignoring as zombie: <ReceiveTimeout>
04:13:40 [INFO] [10/27/2020 08:13:40.822] [SubscriptionActorTest0-akka.actor.default-dispatcher-8] [akka://SubscriptionActorTest0/user/-2147483648] Ignoring as zombie: <ReceiveTimeout>
04:13:40 [INFO] [10/27/2020 08:13:40.822] [SubscriptionActorTest0-akka.actor.default-dispatcher-8] [akka://SubscriptionActorTest0/user/-2147483648] Ignoring as zombie: <ReceiveTimeout>
04:13:40 [INFO] [10/27/2020 08:13:40.822] [SubscriptionActorTest0-akka.actor.default-dispatcher-8] [akka://SubscriptionActorTest0/user/-2147483648] Ignoring as zombie: <ReceiveTimeout>
04:13:40 [INFO] [10/27/2020 08:13:40.822] [SubscriptionActorTest0-akka.actor.default-dispatcher-8] [akka://SubscriptionActorTest0/user/-2147483648] Ignoring as zombie: <ReceiveTimeout>
04:13:40 [INFO] [10/27/2020 08:13:40.822] [SubscriptionActorTest0-akka.actor.default-dispatcher-8] [akka://SubscriptionActorTest0/user/-2147483648] Ignoring as zombie: <ReceiveTimeout>
04:13:40 [INFO] [10/27/2020 08:13:40.823] [SubscriptionActorTest0-akka.actor.default-dispatcher-8] [akka://SubscriptionActorTest0/user/-2147483648] Ignoring as zombie: <ReceiveTimeout>
04:13:40 [INFO] [10/27/2020 08:13:40.823] [SubscriptionActorTest0-akka.actor.default-dispatcher-8] [akka://SubscriptionActorTest0/user/-2147483648] Ignoring as zombie: <ReceiveTimeout>
04:13:40 [INFO] [10/27/2020 08:13:40.823] [SubscriptionActorTest0-akka.actor.default-dispatcher-8] [akka://SubscriptionActorTest0/user/-2147483648] Ignoring as zombie: <ReceiveTimeout>
04:13:40 [INFO] [10/27/2020 08:13:40.824] [SubscriptionActorTest0-akka.actor.default-dispatcher-10] [akka://SubscriptionActorTest0/user/-2147483648] Ignoring as zombie: <ReceiveTimeout>
04:13:40 [INFO] [10/27/2020 08:13:40.824] [SubscriptionActorTest0-akka.actor.default-dispatcher-8] [akka://SubscriptionActorTest0/user/-2147483648] Ignoring as zombie: <ReceiveTimeout>
04:13:40 [INFO] [10/27/2020 08:13:40.824] [SubscriptionActorTest0-akka.actor.default-dispatcher-8] [akka://SubscriptionActorTest0/user/-2147483648] Ignoring as zombie: <ReceiveTimeout>
04:13:40 [INFO] [10/27/2020 08:13:40.824] [SubscriptionActorTest0-akka.actor.default-dispatcher-8] [akka://SubscriptionActorTest0/user/-2147483648] Ignoring as zombie: <ReceiveTimeout>
04:13:40 [INFO] [10/27/2020 08:13:40.824] [SubscriptionActorTest0-akka.actor.default-dispatcher-8] [akka://SubscriptionActorTest0/user/-2147483648] Ignoring as zombie: <ReceiveTimeout>
04:13:40 [INFO] [10/27/2020 08:13:40.824] [SubscriptionActorTest0-akka.actor.default-dispatcher-8] [akka://SubscriptionActorTest0/user/-2147483648] Ignoring as zombie: <ReceiveTimeout>
04:13:40 [INFO] [10/27/2020 08:13:40.824] [SubscriptionActorTest0-akka.actor.default-dispatcher-8] [akka://SubscriptionActorTest0/user/-2147483648] Ignoring as zombie: <ReceiveTimeout>
04:13:40 [INFO] [10/27/2020 08:13:40.825] [SubscriptionActorTest0-akka.actor.default-dispatcher-8] [akka://SubscriptionActorTest0/user/-2147483648] Ignoring as zombie: <ReceiveTimeout>
04:13:40 [INFO] [10/27/2020 08:13:40.825] [SubscriptionActorTest0-akka.actor.default-dispatcher-8] [akka://SubscriptionActorTest0/user/-2147483648] Ignoring as zombie: <ReceiveTimeout>
04:13:40 [INFO] [10/27/2020 08:13:40.825] [SubscriptionActorTest0-akka.actor.default-dispatcher-8] [akka://SubscriptionActorTest0/user/-2147483648] Ignoring as zombie: <ReceiveTimeout>
04:13:40 [INFO] [10/27/2020 08:13:40.825] [SubscriptionActorTest0-akka.actor.default-dispatcher-8] [akka://SubscriptionActorTest0/user/-2147483648] Ignoring as zombie: <ReceiveTimeout>
04:13:40 [INFO] [10/27/2020 08:13:40.825] [SubscriptionActorTest0-akka.actor.default-dispatcher-8] [akka://SubscriptionActorTest0/user/-2147483648] Ignoring as zombie: <ReceiveTimeout>
04:13:40 [INFO] [10/27/2020 08:13:40.825] [SubscriptionActorTest0-akka.actor.default-dispatcher-8] [akka://SubscriptionActorTest0/user/-2147483648] Ignoring as zombie: <ReceiveTimeout>
04:13:40 [INFO] [10/27/2020 08:13:40.825] [SubscriptionActorTest0-akka.actor.default-dispatcher-8] [akka://SubscriptionActorTest0/user/-2147483648] Ignoring as zombie: <ReceiveTimeout>
04:13:40 [INFO] [10/27/2020 08:13:40.825] [SubscriptionActorTest0-akka.actor.default-dispatcher-8] [akka://SubscriptionActorTest0/user/-2147483648] Ignoring as zombie: <ReceiveTimeout>
04:13:40 [INFO] [10/27/2020 08:13:40.825] [SubscriptionActorTest0-akka.actor.default-dispatcher-8] [akka://SubscriptionActorTest0/user/-2147483648] Ignoring as zombie: <ReceiveTimeout>
04:13:40 [INFO] [10/27/2020 08:13:40.826] [SubscriptionActorTest0-akka.actor.default-dispatcher-8] [akka://SubscriptionActorTest0/user/-2147483648] Ignoring as zombie: <ReceiveTimeout>
04:13:40 [INFO] [10/27/2020 08:13:40.826] [SubscriptionActorTest0-akka.actor.default-dispatcher-8] [akka://SubscriptionActorTest0/user/-2147483648] Ignoring as zombie: <ReceiveTimeout>
04:13:40 [INFO] [10/27/2020 08:13:40.826] [SubscriptionActorTest0-akka.actor.default-dispatcher-8] [akka://SubscriptionActorTest0/user/-2147483648] Ignoring as zombie: <ReceiveTimeout>
04:13:40 [INFO] [10/27/2020 08:13:40.826] [SubscriptionActorTest0-akka.actor.default-dispatcher-8] [akka://SubscriptionActorTest0/user/-2147483648] Ignoring as zombie: <ReceiveTimeout>
04:13:40 [INFO] [10/27/2020 08:13:40.826] [SubscriptionActorTest0-akka.actor.default-dispatcher-8] [akka://SubscriptionActorTest0/user/-2147483648] Ignoring as zombie: <ReceiveTimeout>
04:13:40 [INFO] [10/27/2020 08:13:40.826] [SubscriptionActorTest0-akka.actor.default-dispatcher-8] [akka://SubscriptionActorTest0/user/-2147483648] Ignoring as zombie: <ReceiveTimeout>
04:13:40 [INFO] [10/27/2020 08:13:40.826] [SubscriptionActorTest0-akka.actor.default-dispatcher-8] [akka://SubscriptionActorTest0/user/-2147483648] Ignoring as zombie: <ReceiveTimeout>
04:13:40 [INFO] [10/27/2020 08:13:40.826] [SubscriptionActorTest0-akka.actor.default-dispatcher-8] [akka://SubscriptionActorTest0/user/-2147483648] Ignoring as zombie: <ReceiveTimeout>
04:13:40 [INFO] [10/27/2020 08:13:40.827] [SubscriptionActorTest0-akka.actor.default-dispatcher-8] [akka://SubscriptionActorTest0/user/-2147483648] Ignoring as zombie: <ReceiveTimeout>
04:13:40 [INFO] [10/27/2020 08:13:40.827] [SubscriptionActorTest0-akka.actor.default-dispatcher-8] [akka://SubscriptionActorTest0/user/-2147483648] Ignoring as zombie: <ReceiveTimeout>
04:13:40 [INFO] [10/27/2020 08:13:40.827] [SubscriptionActorTest0-akka.actor.default-dispatcher-8] [akka://SubscriptionActorTest0/user/-2147483648] Ignoring as zombie: <ReceiveTimeout>
04:13:40 [INFO] [10/27/2020 08:13:40.827] [SubscriptionActorTest0-akka.actor.default-dispatcher-8] [akka://SubscriptionActorTest0/user/-2147483648] Ignoring as zombie: <ReceiveTimeout>
04:13:40 [INFO] [10/27/2020 08:13:40.827] [SubscriptionActorTest0-akka.actor.default-dispatcher-8] [akka://SubscriptionActorTest0/user/-2147483648] Ignoring as zombie: <ReceiveTimeout>
04:13:40 [INFO] [10/27/2020 08:13:40.827] [SubscriptionActorTest0-akka.actor.default-dispatcher-8] [akka://SubscriptionActorTest0/user/-2147483648] Ignoring as zombie: <ReceiveTimeout>
04:13:40 [INFO] [10/27/2020 08:13:40.827] [SubscriptionActorTest0-akka.actor.default-dispatcher-8] [akka://SubscriptionActorTest0/user/-2147483648] Ignoring as zombie: <ReceiveTimeout>
04:13:40 [INFO] [10/27/2020 08:13:40.827] [SubscriptionActorTest0-akka.actor.default-dispatcher-8] [akka://SubscriptionActorTest0/user/-2147483648] Ignoring as zombie: <ReceiveTimeout>
04:13:40 [INFO] [10/27/2020 08:13:40.828] [SubscriptionActorTest0-akka.actor.default-dispatcher-8] [akka://SubscriptionActorTest0/user/-2147483648] Ignoring as zombie: <ReceiveTimeout>
04:13:40 [INFO] [10/27/2020 08:13:40.828] [SubscriptionActorTest0-akka.actor.default-dispatcher-8] [akka://SubscriptionActorTest0/user/-2147483648] Ignoring as zombie: <ReceiveTimeout>
04:13:40 [INFO] [10/27/2020 08:13:40.828] [SubscriptionActorTest0-akka.actor.default-dispatcher-8] [akka://SubscriptionActorTest0/user/-2147483648] Ignoring as zombie: <ReceiveTimeout>
04:13:40 [INFO] [10/27/2020 08:13:40.828] [SubscriptionActorTest0-akka.actor.default-dispatcher-8] [akka://SubscriptionActorTest0/user/-2147483648] Ignoring as zombie: <ReceiveTimeout>
04:13:40 [INFO] [10/27/2020 08:13:40.828] [SubscriptionActorTest0-akka.actor.default-dispatcher-10] [akka://SubscriptionActorTest0/user/-2147483648] Ignoring as zombie: <ReceiveTimeout>
04:13:40 [INFO] [10/27/2020 08:13:40.828] [SubscriptionActorTest0-akka.actor.default-dispatcher-10] [akka://SubscriptionActorTest0/user/-2147483648] Ignoring as zombie: <ReceiveTimeout>
04:13:40 [INFO] [10/27/2020 08:13:40.828] [SubscriptionActorTest0-akka.actor.default-dispatcher-10] [akka://SubscriptionActorTest0/user/-2147483648] Ignoring as zombie: <ReceiveTimeout>
04:13:40 [INFO] [10/27/2020 08:13:40.828] [SubscriptionActorTest0-akka.actor.default-dispatcher-10] [akka://SubscriptionActorTest0/user/-2147483648] Ignoring as zombie: <ReceiveTimeout>
04:13:40 [INFO] [10/27/2020 08:13:40.828] [SubscriptionActorTest0-akka.actor.default-dispatcher-10] [akka://SubscriptionActorTest0/user/-2147483648] Ignoring as zombie: <ReceiveTimeout>
04:13:40 [INFO] [10/27/2020 08:13:40.829] [SubscriptionActorTest0-akka.actor.default-dispatcher-10] [akka://SubscriptionActorTest0/user/-2147483648] Ignoring as zombie: <ReceiveTimeout>
04:13:40 [INFO] [10/27/2020 08:13:40.829] [SubscriptionActorTest0-akka.actor.default-dispatcher-10] [akka://SubscriptionActorTest0/user/-2147483648] Ignoring as zombie: <ReceiveTimeout>
04:13:40 [INFO] [10/27/2020 08:13:40.829] [SubscriptionActorTest0-akka.actor.default-dispatcher-10] [akka://SubscriptionActorTest0/user/-2147483648] Ignoring as zombie: <ReceiveTimeout>
04:13:40 [INFO] [10/27/2020 08:13:40.829] [SubscriptionActorTest0-akka.actor.default-dispatcher-10] [akka://SubscriptionActorTest0/user/-2147483648] Ignoring as zombie: <ReceiveTimeout>
04:13:40 [INFO] [10/27/2020 08:13:40.829] [SubscriptionActorTest0-akka.actor.default-dispatcher-10] [akka://SubscriptionActorTest0/user/-2147483648] Ignoring as zombie: <ReceiveTimeout>
04:13:40 [INFO] [10/27/2020 08:13:40.829] [SubscriptionActorTest0-akka.actor.default-dispatcher-10] [akka://SubscriptionActorTest0/user/-2147483648] Ignoring as zombie: <ReceiveTimeout>
04:13:40 [INFO] [10/27/2020 08:13:40.829] [SubscriptionActorTest0-akka.actor.default-dispatcher-10] [akka://SubscriptionActorTest0/user/-2147483648] Ignoring as zombie: <ReceiveTimeout>
04:13:40 [INFO] [10/27/2020 08:13:40.829] [SubscriptionActorTest0-akka.actor.default-dispatcher-10] [akka://SubscriptionActorTest0/user/-2147483648] Ignoring as zombie: <ReceiveTimeout>
04:13:40 [INFO] [10/27/2020 08:13:40.829] [SubscriptionActorTest0-akka.actor.default-dispatcher-10] [akka://SubscriptionActorTest0/user/-2147483648] Ignoring as zombie: <ReceiveTimeout>
04:13:40 [INFO] [10/27/2020 08:13:40.830] [SubscriptionActorTest0-akka.actor.default-dispatcher-10] [akka://SubscriptionActorTest0/user/-2147483648] Ignoring as zombie: <ReceiveTimeout>
04:13:40 [INFO] [10/27/2020 08:13:40.830] [SubscriptionActorTest0-akka.actor.default-dispatcher-10] [akka://SubscriptionActorTest0/user/-2147483648] Ignoring as zombie: <ReceiveTimeout>
04:13:40 [INFO] [10/27/2020 08:13:40.830] [SubscriptionActorTest0-akka.actor.default-dispatcher-10] [akka://SubscriptionActorTest0/user/-2147483648] Ignoring as zombie: <ReceiveTimeout>
04:13:40 [INFO] [10/27/2020 08:13:40.831] [SubscriptionActorTest0-akka.actor.default-dispatcher-10] [akka://SubscriptionActorTest0/user/-2147483648] Ignoring as zombie: <ReceiveTimeout>
04:13:40 [INFO] [10/27/2020 08:13:40.831] [SubscriptionActorTest0-akka.actor.default-dispatcher-10] [akka://SubscriptionActorTest0/user/-2147483648] Ignoring as zombie: <ReceiveTimeout>
04:13:40 [INFO] [10/27/2020 08:13:40.831] [SubscriptionActorTest0-akka.actor.default-dispatcher-10] [akka://SubscriptionActorTest0/user/-2147483648] Ignoring as zombie: <ReceiveTimeout>
04:13:40 [INFO] [10/27/2020 08:13:40.831] [SubscriptionActorTest0-akka.actor.default-dispatcher-10] [akka://SubscriptionActorTest0/user/-2147483648] Ignoring as zombie: <ReceiveTimeout>
04:13:40 [INFO] [10/27/2020 08:13:40.831] [SubscriptionActorTest0-akka.actor.default-dispatcher-10] [akka://SubscriptionActorTest0/user/-2147483648] Ignoring as zombie: <ReceiveTimeout>
04:13:40 [INFO] [10/27/2020 08:13:40.831] [SubscriptionActorTest0-akka.actor.default-dispatcher-10] [akka://SubscriptionActorTest0/user/-2147483648] Ignoring as zombie: <ReceiveTimeout>
04:13:40 [INFO] [10/27/2020 08:13:40.831] [SubscriptionActorTest0-akka.actor.default-dispatcher-10] [akka://SubscriptionActorTest0/user/-2147483648] Ignoring as zombie: <ReceiveTimeout>
04:13:40 [INFO] [10/27/2020 08:13:40.831] [SubscriptionActorTest0-akka.actor.default-dispatcher-10] [akka://SubscriptionActorTest0/user/-2147483648] Ignoring as zombie: <ReceiveTimeout>
04:13:40 [INFO] [10/27/2020 08:13:40.831] [SubscriptionActorTest0-akka.actor.default-dispatcher-10] [akka://SubscriptionActorTest0/user/-2147483648] Ignoring as zombie: <ReceiveTimeout>
04:13:40 [INFO] [10/27/2020 08:13:40.832] [SubscriptionActorTest0-akka.actor.default-dispatcher-10] [akka://SubscriptionActorTest0/user/-2147483648] Ignoring as zombie: <ReceiveTimeout>
04:13:40 [INFO] [10/27/2020 08:13:40.832] [SubscriptionActorTest0-akka.actor.default-dispatcher-7] [akka://SubscriptionActorTest0/user/-2147483648] Ignoring as zombie: <ReceiveTimeout>
04:13:40 [INFO] [10/27/2020 08:13:40.832] [SubscriptionActorTest0-akka.actor.default-dispatcher-7] [akka://SubscriptionActorTest0/user/-2147483648] Ignoring as zombie: <ReceiveTimeout>
04:13:40 [INFO] [10/27/2020 08:13:40.832] [SubscriptionActorTest0-akka.actor.default-dispatcher-6] [akka://SubscriptionActorTest0/user/-2147483648] Ignoring as zombie: <ReceiveTimeout>
04:13:40 [INFO] [10/27/2020 08:13:40.929] [SubscriptionActorTest0-akka.actor.default-dispatcher-6] [akka://SubscriptionActorTest0/user/-2147483648] Processing <CancelSubscription[type=thing-search.commands:cancel, dittoHeaders=ImmutableDittoHeaders [{}], subscriptionId=-2147483648]>
04:13:40 [INFO] [10/27/2020 08:13:41.040] [SubscriptionActorTest0-akka.actor.default-dispatcher-7] [akka://SubscriptionActorTest0/user/-2147483648] SubscriptionComplete [type=thing-search.subscription.events:complete, subscriptionId=-2147483648, dittoHeaders=ImmutableDittoHeaders [{}]]
04:13:41 [INFO] [10/27/2020 08:13:41.122] [SubscriptionActorTest0-akka.actor.default-dispatcher-6] [akka://SubscriptionActorTest0/user/-2147483648] SubscriptionComplete [type=thing-search.subscription.events:complete, subscriptionId=-2147483648, dittoHeaders=ImmutableDittoHeaders [{}]]
04:13:41 [INFO] Tests run: 6, Failures: 0, Errors: 0, Skipped: 0, Time elapsed: 0.406 s - in org.eclipse.ditto.services.utils.search.SubscriptionActorTest
04:13:41 [INFO] Running org.eclipse.ditto.services.utils.search.SubscriptionManagerTest
04:13:41 [INFO] [10/27/2020 08:13:41.232] [default-akka.actor.default-dispatcher-6] [akka://default/user/$a] SubscriptionID not found, responding with SubscriptionFailed: <RequestFromSubscription[type=thing-search.commands:request, dittoHeaders=ImmutableDittoHeaders [{}], subscriptionId=nonexistentSid, demand=1]>
04:13:41 08:13:41.351 [default-akka.actor.default-dispatcher-9] ERROR org.eclipse.ditto.services.utils.search.SearchSource - Unexpected error
04:13:41 akka.pattern.AskTimeoutException: mock error
04:13:41 [INFO] [10/27/2020 08:13:41.676] [default-akka.actor.default-dispatcher-5] [akka://default/user/$a] Processing <CreateSubscription[type=thing-search.commands:subscribe, dittoHeaders=ImmutableDittoHeaders [{}], filter=null, options=size(0), fields=null, namespaces=null, prefix=null]>
04:13:41 [INFO] [10/27/2020 08:13:41.681] [default-akka.actor.default-dispatcher-4] [akka://default/user/$a/0] SubscriptionFailed [type=thing-search.subscription.events:failed, subscriptionId=0, dittoHeaders=ImmutableDittoHeaders [{}], error=org.eclipse.ditto.signals.commands.thingsearch.exceptions.InvalidOptionException [message='Invalid option: 'size(0)'', errorCode=thing-search:search.option.invalid, statusCode=BAD_REQUEST, description='size(n) -- n must be between 1 and 200', href=null, dittoHeaders=ImmutableDittoHeaders [{}]]]
04:13:41 [INFO] [10/27/2020 08:13:41.735] [default-akka.actor.default-dispatcher-5] [akka://default/user/$a] Processing <CreateSubscription[type=thing-search.commands:subscribe, dittoHeaders=ImmutableDittoHeaders [{}], filter=exists(attributes/tag1), options=size(1), fields=/thingId, namespaces=null, prefix=null]>
04:13:41 [INFO] [10/27/2020 08:13:41.741] [default-akka.actor.default-dispatcher-6] [akka://default/user/$a/0] SubscriptionFailed [type=thing-search.subscription.events:failed, subscriptionId=0, dittoHeaders=ImmutableDittoHeaders [{}], error=org.eclipse.ditto.signals.commands.thingsearch.exceptions.SubscriptionProtocolErrorException [message='The number of requested elements must be > 0 (see reactive-streams specification, rule 3.9)', errorCode=thing-search:subscription.protocol.error, statusCode=BAD_REQUEST, description='null', href=null, dittoHeaders=ImmutableDittoHeaders [{}]]]
04:13:41 [INFO] Tests run: 4, Failures: 0, Errors: 0, Skipped: 0, Time elapsed: 0.615 s - in org.eclipse.ditto.services.utils.search.SubscriptionManagerTest
04:13:41 [INFO] 
04:13:42 [INFO] Results:
04:13:42 [INFO] 
04:13:42 [INFO] Tests run: 24, Failures: 0, Errors: 0, Skipped: 0
04:13:42 [INFO] 
04:13:42 [INFO] 
04:13:42 [INFO] --- maven-dependency-plugin:3.0.2:unpack-dependencies (copy-legal-docs) @ ditto-services-utils-search ---
04:13:42 [INFO] Unpacking /home/jenkins/agent/workspace/ditto-ci/legal/target/ditto-legal-0-SNAPSHOT.jar to /home/jenkins/agent/workspace/ditto-ci/services/utils/search/target/classes/META-INF with includes "" and excludes "NOTICE-THIRD-PARTY.md,3rd-party-dependencies/**,META-INF/**"
04:13:42 [INFO] 
04:13:42 [INFO] --- maven-jar-plugin:3.0.2:jar (default-jar) @ ditto-services-utils-search ---
04:13:42 [INFO] Building jar: /home/jenkins/agent/workspace/ditto-ci/services/utils/search/target/ditto-services-utils-search-0-SNAPSHOT.jar
04:13:42 [INFO] 
04:13:42 [INFO] --- maven-failsafe-plugin:3.0.0-M4:integration-test (integration-test) @ ditto-services-utils-search ---
04:13:42 [INFO] Tests are skipped.
04:13:42 [INFO] 
04:13:42 [INFO] --- maven-failsafe-plugin:3.0.0-M4:verify (verify) @ ditto-services-utils-search ---
04:13:42 [INFO] Tests are skipped.
04:13:42 [INFO] 
04:13:42 [INFO] --- jacoco-maven-plugin:0.8.5:report (report) @ ditto-services-utils-search ---
04:13:42 [INFO] Loading execution data file /home/jenkins/agent/workspace/ditto-ci/services/utils/search/target/jacoco.exec
04:13:42 [INFO] Analyzed bundle 'Eclipse Ditto :: Services :: Utils :: Search' with 5 classes
04:13:42 [INFO] 
04:13:42 [INFO] --- maven-install-plugin:2.5.2:install (default-install) @ ditto-services-utils-search ---
04:13:42 [INFO] Installing /home/jenkins/agent/workspace/ditto-ci/services/utils/search/target/ditto-services-utils-search-0-SNAPSHOT.jar to /home/jenkins/.m2/repository/org/eclipse/ditto/ditto-services-utils-search/0-SNAPSHOT/ditto-services-utils-search-0-SNAPSHOT.jar
04:13:42 [INFO] Installing /home/jenkins/agent/workspace/ditto-ci/services/utils/search/.flattened-pom.xml to /home/jenkins/.m2/repository/org/eclipse/ditto/ditto-services-utils-search/0-SNAPSHOT/ditto-services-utils-search-0-SNAPSHOT.pom
04:13:42 [INFO] 
04:13:42 [INFO] ---------< org.eclipse.ditto:ditto-services-utils-aggregator >----------
04:13:42 [INFO] Building Eclipse Ditto :: Services :: Utils :: Aggregator 0-SNAPSHOT [86/113]
04:13:42 [INFO] --------------------------------[ jar ]---------------------------------
04:13:42 [INFO] 
04:13:42 [INFO] --- maven-clean-plugin:2.5:clean (default-clean) @ ditto-services-utils-aggregator ---
04:13:42 [INFO] 
04:13:42 [INFO] --- flatten-maven-plugin:1.0.1:clean (flatten.clean) @ ditto-services-utils-aggregator ---
04:13:42 [INFO] 
04:13:42 [INFO] --- jacoco-maven-plugin:0.8.5:prepare-agent (prepare-agent) @ ditto-services-utils-aggregator ---
04:13:42 [INFO] argLine set to -javaagent:/home/jenkins/.m2/repository/org/jacoco/org.jacoco.agent/0.8.5/org.jacoco.agent-0.8.5-runtime.jar=destfile=/home/jenkins/agent/workspace/ditto-ci/services/utils/aggregator/target/jacoco.exec -Dfile.encoding=UTF-8
04:13:42 [INFO] 
04:13:42 [INFO] --- license-maven-plugin:1.17:add-third-party (default-cli) @ ditto-services-utils-aggregator ---
04:13:42 [WARNING] 
04:13:42 [WARNING] !!! licenseMergesFile is deprecated, use now licenseMergesUrl !!!
04:13:42 [WARNING] 
04:13:42 [WARNING] licenseMerges will be overridden by licenseMergesFile.
04:13:42 [WARNING] 
04:13:42 [INFO] Writing third-party file to /home/jenkins/agent/workspace/ditto-ci/services/utils/aggregator/target/classes/META-INF/NOTICE-THIRD-PARTY.md
04:13:42 [INFO] 
04:13:42 [INFO] --- maven-resources-plugin:3.1.0:resources (default-resources) @ ditto-services-utils-aggregator ---
04:13:42 [INFO] Using 'UTF-8' encoding to copy filtered resources.
04:13:42 [INFO] skip non existing resourceDirectory /home/jenkins/agent/workspace/ditto-ci/services/utils/aggregator/src/main/resources
04:13:42 [INFO] Copying 0 resource
04:13:42 [INFO] 
04:13:42 [INFO] --- flatten-maven-plugin:1.0.1:flatten (flatten) @ ditto-services-utils-aggregator ---
04:13:42 [INFO] Generating flattened POM of project org.eclipse.ditto:ditto-services-utils-aggregator:jar:0-SNAPSHOT...
04:13:42 [INFO] 
04:13:42 [INFO] --- maven-compiler-plugin:3.8.1:compile (default-compile) @ ditto-services-utils-aggregator ---
04:13:42 [INFO] Changes detected - recompiling the module!
04:13:42 [INFO] Compiling 1 source file to /home/jenkins/agent/workspace/ditto-ci/services/utils/aggregator/target/classes
04:13:42 [INFO] 
04:13:42 [INFO] --- maven-resources-plugin:3.1.0:testResources (default-testResources) @ ditto-services-utils-aggregator ---
04:13:42 [INFO] Using 'UTF-8' encoding to copy filtered resources.
04:13:42 [INFO] skip non existing resourceDirectory /home/jenkins/agent/workspace/ditto-ci/services/utils/aggregator/src/test/resources
04:13:42 [INFO] 
04:13:42 [INFO] --- maven-compiler-plugin:3.8.1:testCompile (default-testCompile) @ ditto-services-utils-aggregator ---
04:13:42 [INFO] Changes detected - recompiling the module!
04:13:42 [INFO] Compiling 1 source file to /home/jenkins/agent/workspace/ditto-ci/services/utils/aggregator/target/test-classes
04:13:42 [INFO] 
04:13:42 [INFO] --- maven-surefire-plugin:3.0.0-M4:test (default-test) @ ditto-services-utils-aggregator ---
04:13:42 [INFO] Surefire report directory: /home/jenkins/agent/workspace/ditto-ci/services/utils/aggregator/target/surefire-reports
04:13:42 [INFO] 
04:13:42 [INFO] -------------------------------------------------------
04:13:42 [INFO]  T E S T S
04:13:42 [INFO] -------------------------------------------------------
04:13:42 [INFO] Running org.eclipse.ditto.services.utils.aggregator.ThingsAggregatorProxyActorTest
04:13:42 [INFO] [10/27/2020 08:13:44.630] [AkkaTestSystem-akka.actor.default-dispatcher-4] [akka://AkkaTestSystem/user/$a][x-correlation-id:454ac094-17c0-43f7-8cd5-d2e74f74ab23] Got 'RetrieveThings' message. Retrieving requested '1' Things..
04:13:44 [INFO] [10/27/2020 08:13:44.665] [AkkaTestSystem-akka.actor.default-dispatcher-4] [akka://AkkaTestSystem/user/$b][x-correlation-id:454ac094-17c0-43f7-8cd5-d2e74f74ab23] Got 'RetrieveThings' message. Retrieving requested '1' Things..
04:13:44 [INFO] Tests run: 2, Failures: 0, Errors: 0, Skipped: 0, Time elapsed: 1.883 s - in org.eclipse.ditto.services.utils.aggregator.ThingsAggregatorProxyActorTest
04:13:44 [INFO] 
04:13:45 [INFO] Results:
04:13:45 [INFO] 
04:13:45 [INFO] Tests run: 2, Failures: 0, Errors: 0, Skipped: 0
04:13:45 [INFO] 
04:13:45 [INFO] 
04:13:45 [INFO] --- maven-dependency-plugin:3.0.2:unpack-dependencies (copy-legal-docs) @ ditto-services-utils-aggregator ---
04:13:45 [INFO] Unpacking /home/jenkins/agent/workspace/ditto-ci/legal/target/ditto-legal-0-SNAPSHOT.jar to /home/jenkins/agent/workspace/ditto-ci/services/utils/aggregator/target/classes/META-INF with includes "" and excludes "NOTICE-THIRD-PARTY.md,3rd-party-dependencies/**,META-INF/**"
04:13:45 [INFO] 
04:13:45 [INFO] --- maven-jar-plugin:3.0.2:jar (default-jar) @ ditto-services-utils-aggregator ---
04:13:45 [INFO] Building jar: /home/jenkins/agent/workspace/ditto-ci/services/utils/aggregator/target/ditto-services-utils-aggregator-0-SNAPSHOT.jar
04:13:45 [INFO] 
04:13:45 [INFO] --- maven-failsafe-plugin:3.0.0-M4:integration-test (integration-test) @ ditto-services-utils-aggregator ---
04:13:45 [INFO] Tests are skipped.
04:13:45 [INFO] 
04:13:45 [INFO] --- maven-failsafe-plugin:3.0.0-M4:verify (verify) @ ditto-services-utils-aggregator ---
04:13:45 [INFO] Tests are skipped.
04:13:45 [INFO] 
04:13:45 [INFO] --- jacoco-maven-plugin:0.8.5:report (report) @ ditto-services-utils-aggregator ---
04:13:45 [INFO] Loading execution data file /home/jenkins/agent/workspace/ditto-ci/services/utils/aggregator/target/jacoco.exec
04:13:45 [INFO] Analyzed bundle 'Eclipse Ditto :: Services :: Utils :: Aggregator' with 2 classes
04:13:45 [INFO] 
04:13:45 [INFO] --- maven-install-plugin:2.5.2:install (default-install) @ ditto-services-utils-aggregator ---
04:13:45 [INFO] Installing /home/jenkins/agent/workspace/ditto-ci/services/utils/aggregator/target/ditto-services-utils-aggregator-0-SNAPSHOT.jar to /home/jenkins/.m2/repository/org/eclipse/ditto/ditto-services-utils-aggregator/0-SNAPSHOT/ditto-services-utils-aggregator-0-SNAPSHOT.jar
04:13:45 [INFO] Installing /home/jenkins/agent/workspace/ditto-ci/services/utils/aggregator/.flattened-pom.xml to /home/jenkins/.m2/repository/org/eclipse/ditto/ditto-services-utils-aggregator/0-SNAPSHOT/ditto-services-utils-aggregator-0-SNAPSHOT.pom
04:13:45 [INFO] 
04:13:45 [INFO] ------------< org.eclipse.ditto:ditto-services-models-acks >------------
04:13:45 [INFO] Building Eclipse Ditto :: Services :: Models :: ACKs 0-SNAPSHOT [87/113]
04:13:45 [INFO] --------------------------------[ jar ]---------------------------------
04:13:45 [INFO] 
04:13:45 [INFO] --- maven-clean-plugin:2.5:clean (default-clean) @ ditto-services-models-acks ---
04:13:45 [INFO] 
04:13:45 [INFO] --- flatten-maven-plugin:1.0.1:clean (flatten.clean) @ ditto-services-models-acks ---
04:13:45 [INFO] 
04:13:45 [INFO] --- jacoco-maven-plugin:0.8.5:prepare-agent (prepare-agent) @ ditto-services-models-acks ---
04:13:45 [INFO] argLine set to -javaagent:/home/jenkins/.m2/repository/org/jacoco/org.jacoco.agent/0.8.5/org.jacoco.agent-0.8.5-runtime.jar=destfile=/home/jenkins/agent/workspace/ditto-ci/services/models/acks/target/jacoco.exec -Dfile.encoding=UTF-8
04:13:45 [INFO] 
04:13:45 [INFO] --- license-maven-plugin:1.17:add-third-party (default-cli) @ ditto-services-models-acks ---
04:13:45 [WARNING] 
04:13:45 [WARNING] !!! licenseMergesFile is deprecated, use now licenseMergesUrl !!!
04:13:45 [WARNING] 
04:13:45 [WARNING] licenseMerges will be overridden by licenseMergesFile.
04:13:45 [WARNING] 
04:13:45 [INFO] Writing third-party file to /home/jenkins/agent/workspace/ditto-ci/services/models/acks/target/classes/META-INF/NOTICE-THIRD-PARTY.md
04:13:45 [INFO] 
04:13:45 [INFO] --- maven-resources-plugin:3.1.0:resources (default-resources) @ ditto-services-models-acks ---
04:13:45 [INFO] Using 'UTF-8' encoding to copy filtered resources.
04:13:45 [INFO] skip non existing resourceDirectory /home/jenkins/agent/workspace/ditto-ci/services/models/acks/src/main/resources
04:13:45 [INFO] Copying 0 resource
04:13:45 [INFO] 
04:13:45 [INFO] --- flatten-maven-plugin:1.0.1:flatten (flatten) @ ditto-services-models-acks ---
04:13:45 [INFO] Generating flattened POM of project org.eclipse.ditto:ditto-services-models-acks:jar:0-SNAPSHOT...
04:13:45 [INFO] 
04:13:45 [INFO] --- maven-compiler-plugin:3.8.1:compile (default-compile) @ ditto-services-models-acks ---
04:13:45 [INFO] Changes detected - recompiling the module!
04:13:45 [INFO] Compiling 9 source files to /home/jenkins/agent/workspace/ditto-ci/services/models/acks/target/classes
04:13:45 [INFO] /home/jenkins/agent/workspace/ditto-ci/services/models/acks/src/main/java/org/eclipse/ditto/services/models/acks/AcknowledgementForwarderActorStarter.java: /home/jenkins/agent/workspace/ditto-ci/services/models/acks/src/main/java/org/eclipse/ditto/services/models/acks/AcknowledgementForwarderActorStarter.java uses unchecked or unsafe operations.
04:13:45 [INFO] /home/jenkins/agent/workspace/ditto-ci/services/models/acks/src/main/java/org/eclipse/ditto/services/models/acks/AcknowledgementForwarderActorStarter.java: Recompile with -Xlint:unchecked for details.
04:13:45 [INFO] 
04:13:45 [INFO] --- maven-resources-plugin:3.1.0:testResources (default-testResources) @ ditto-services-models-acks ---
04:13:45 [INFO] Using 'UTF-8' encoding to copy filtered resources.
04:13:45 [INFO] Copying 3 resources
04:13:45 [INFO] 
04:13:45 [INFO] --- maven-compiler-plugin:3.8.1:testCompile (default-testCompile) @ ditto-services-models-acks ---
04:13:45 [INFO] Changes detected - recompiling the module!
04:13:45 [INFO] Compiling 5 source files to /home/jenkins/agent/workspace/ditto-ci/services/models/acks/target/test-classes
04:13:45 [INFO] /home/jenkins/agent/workspace/ditto-ci/services/models/acks/src/test/java/org/eclipse/ditto/services/models/acks/AcknowledgementForwarderActorTest.java: Some input files use or override a deprecated API.
04:13:45 [INFO] /home/jenkins/agent/workspace/ditto-ci/services/models/acks/src/test/java/org/eclipse/ditto/services/models/acks/AcknowledgementForwarderActorTest.java: Recompile with -Xlint:deprecation for details.
04:13:45 [INFO] 
04:13:45 [INFO] --- maven-surefire-plugin:3.0.0-M4:test (default-test) @ ditto-services-models-acks ---
04:13:45 [INFO] Surefire report directory: /home/jenkins/agent/workspace/ditto-ci/services/models/acks/target/surefire-reports
04:13:45 [INFO] 
04:13:45 [INFO] -------------------------------------------------------
04:13:45 [INFO]  T E S T S
04:13:45 [INFO] -------------------------------------------------------
04:13:45 [INFO] Running org.eclipse.ditto.services.models.acks.AcknowledgementAggregatorTest
04:13:46 [INFO] Tests run: 19, Failures: 0, Errors: 0, Skipped: 0, Time elapsed: 1.326 s - in org.eclipse.ditto.services.models.acks.AcknowledgementAggregatorTest
04:13:47 [INFO] Running org.eclipse.ditto.services.models.acks.AcknowledgementForwarderActorTest
04:13:47 [INFO] Tests run: 4, Failures: 0, Errors: 0, Skipped: 0, Time elapsed: 2.307 s - in org.eclipse.ditto.services.models.acks.AcknowledgementForwarderActorTest
04:13:49 [INFO] Running org.eclipse.ditto.services.models.acks.AcknowledgementAggregatorActorTest
04:13:49 [INFO] [10/27/2020 08:13:49.899] [default-akka.actor.default-dispatcher-6] [akka://default/system/testProbe-2/$a][x-correlation-id:singleResponseLive] Starting to wait for all requested acknowledgements <[live-response]> for a maximum duration of <PT1M5S>.
04:13:49 [INFO] [10/27/2020 08:13:49.951] [default-akka.actor.default-dispatcher-5] [akka://default/system/testProbe-3/$a][x-correlation-id:keepCommandHeaders] Starting to wait for all requested acknowledgements <[ack1, ack2]> for a maximum duration of <PT1M5S>.
04:13:49 [INFO] [10/27/2020 08:13:50.018] [default-akka.actor.default-dispatcher-7] [akka://default/system/testProbe-4/$a][x-correlation-id:errorResponseLive] Starting to wait for all requested acknowledgements <[live-response]> for a maximum duration of <PT0.001S>.
04:13:50 [INFO] [10/27/2020 08:13:50.045] [default-akka.actor.default-dispatcher-7] [akka://default/system/testProbe-4/$a][x-correlation-id:errorResponseLive] Timed out waiting for all requested acknowledgements, completing Acknowledgements with timeouts...
04:13:50 [INFO] [10/27/2020 08:13:50.205] [default-akka.actor.default-dispatcher-6] [akka://default/system/testProbe-5/$a][x-correlation-id:errorResponseTwin] Starting to wait for all requested acknowledgements <[twin-persisted]> for a maximum duration of <PT0.001S>.
04:13:50 [INFO] [10/27/2020 08:13:50.230] [default-akka.actor.default-dispatcher-7] [akka://default/system/testProbe-5/$a][x-correlation-id:errorResponseTwin] Timed out waiting for all requested acknowledgements, completing Acknowledgements with timeouts...
04:13:50 [INFO] [10/27/2020 08:13:50.268] [default-akka.actor.default-dispatcher-6] [akka://default/system/testProbe-6/$a][x-correlation-id:discardDuplicateAndUnsolicitedAcknowledgements] Starting to wait for all requested acknowledgements <[ack1, ack2]> for a maximum duration of <PT1M5S>.
04:13:50 [INFO] [10/27/2020 08:13:50.317] [default-akka.actor.default-dispatcher-4] [akka://default/system/testProbe-7/$a][x-correlation-id:singleResponseLive] Starting to wait for all requested acknowledgements <[live-response]> for a maximum duration of <PT1M5S>.
04:13:50 [INFO] [10/27/2020 08:13:50.360] [default-akka.actor.default-dispatcher-6] [akka://default/system/testProbe-8/$a][x-correlation-id:singleResponseTwin] Starting to wait for all requested acknowledgements <[twin-persisted]> for a maximum duration of <PT1M5S>.
04:13:50 [INFO] Tests run: 7, Failures: 0, Errors: 0, Skipped: 0, Time elapsed: 0.576 s - in org.eclipse.ditto.services.models.acks.AcknowledgementAggregatorActorTest
04:13:50 [INFO] Running org.eclipse.ditto.services.models.acks.AcknowledgementForwarderActorStarterTest
04:13:50 [INFO] Tests run: 3, Failures: 0, Errors: 0, Skipped: 0, Time elapsed: 0.464 s - in org.eclipse.ditto.services.models.acks.AcknowledgementForwarderActorStarterTest
04:13:50 [INFO] Running org.eclipse.ditto.services.models.acks.config.DefaultAcknowledgementConfigTest
04:13:50 [INFO] Tests run: 4, Failures: 0, Errors: 0, Skipped: 0, Time elapsed: 0.59 s - in org.eclipse.ditto.services.models.acks.config.DefaultAcknowledgementConfigTest
04:13:51 [INFO] 
04:13:51 [INFO] Results:
04:13:51 [INFO] 
04:13:51 [INFO] Tests run: 37, Failures: 0, Errors: 0, Skipped: 0
04:13:51 [INFO] 
04:13:51 [INFO] 
04:13:51 [INFO] --- maven-dependency-plugin:3.0.2:unpack-dependencies (copy-legal-docs) @ ditto-services-models-acks ---
04:13:51 [INFO] Unpacking /home/jenkins/agent/workspace/ditto-ci/legal/target/ditto-legal-0-SNAPSHOT.jar to /home/jenkins/agent/workspace/ditto-ci/services/models/acks/target/classes/META-INF with includes "" and excludes "NOTICE-THIRD-PARTY.md,3rd-party-dependencies/**,META-INF/**"
04:13:51 [INFO] 
04:13:51 [INFO] --- maven-jar-plugin:3.0.2:jar (default-jar) @ ditto-services-models-acks ---
04:13:51 [INFO] Building jar: /home/jenkins/agent/workspace/ditto-ci/services/models/acks/target/ditto-services-models-acks-0-SNAPSHOT.jar
04:13:51 [INFO] 
04:13:51 [INFO] --- maven-failsafe-plugin:3.0.0-M4:integration-test (integration-test) @ ditto-services-models-acks ---
04:13:51 [INFO] Tests are skipped.
04:13:51 [INFO] 
04:13:51 [INFO] --- maven-failsafe-plugin:3.0.0-M4:verify (verify) @ ditto-services-models-acks ---
04:13:51 [INFO] Tests are skipped.
04:13:51 [INFO] 
04:13:51 [INFO] --- jacoco-maven-plugin:0.8.5:report (report) @ ditto-services-models-acks ---
04:13:51 [INFO] Loading execution data file /home/jenkins/agent/workspace/ditto-ci/services/models/acks/target/jacoco.exec
04:13:51 [INFO] Analyzed bundle 'Eclipse Ditto :: Services :: Models :: ACKs' with 7 classes
04:13:51 [INFO] 
04:13:51 [INFO] --- maven-install-plugin:2.5.2:install (default-install) @ ditto-services-models-acks ---
04:13:51 [INFO] Installing /home/jenkins/agent/workspace/ditto-ci/services/models/acks/target/ditto-services-models-acks-0-SNAPSHOT.jar to /home/jenkins/.m2/repository/org/eclipse/ditto/ditto-services-models-acks/0-SNAPSHOT/ditto-services-models-acks-0-SNAPSHOT.jar
04:13:51 [INFO] Installing /home/jenkins/agent/workspace/ditto-ci/services/models/acks/.flattened-pom.xml to /home/jenkins/.m2/repository/org/eclipse/ditto/ditto-services-models-acks/0-SNAPSHOT/ditto-services-models-acks-0-SNAPSHOT.pom
04:13:51 [INFO] 
04:13:51 [INFO] ----------< org.eclipse.ditto:ditto-services-utils-protocol >-----------
04:13:51 [INFO] Building Eclipse Ditto :: Services :: Utils :: Protocol 0-SNAPSHOT [88/113]
04:13:51 [INFO] --------------------------------[ jar ]---------------------------------
04:13:51 [INFO] 
04:13:51 [INFO] --- maven-clean-plugin:2.5:clean (default-clean) @ ditto-services-utils-protocol ---
04:13:51 [INFO] 
04:13:51 [INFO] --- flatten-maven-plugin:1.0.1:clean (flatten.clean) @ ditto-services-utils-protocol ---
04:13:51 [INFO] 
04:13:51 [INFO] --- jacoco-maven-plugin:0.8.5:prepare-agent (prepare-agent) @ ditto-services-utils-protocol ---
04:13:51 [INFO] argLine set to -javaagent:/home/jenkins/.m2/repository/org/jacoco/org.jacoco.agent/0.8.5/org.jacoco.agent-0.8.5-runtime.jar=destfile=/home/jenkins/agent/workspace/ditto-ci/services/utils/protocol/target/jacoco.exec -Dfile.encoding=UTF-8
04:13:51 [INFO] 
04:13:51 [INFO] --- license-maven-plugin:1.17:add-third-party (default-cli) @ ditto-services-utils-protocol ---
04:13:51 [WARNING] 
04:13:51 [WARNING] !!! licenseMergesFile is deprecated, use now licenseMergesUrl !!!
04:13:51 [WARNING] 
04:13:51 [WARNING] licenseMerges will be overridden by licenseMergesFile.
04:13:51 [WARNING] 
04:13:51 [INFO] Writing third-party file to /home/jenkins/agent/workspace/ditto-ci/services/utils/protocol/target/classes/META-INF/NOTICE-THIRD-PARTY.md
04:13:51 [INFO] 
04:13:51 [INFO] --- maven-resources-plugin:3.1.0:resources (default-resources) @ ditto-services-utils-protocol ---
04:13:51 [INFO] Using 'UTF-8' encoding to copy filtered resources.
04:13:51 [INFO] skip non existing resourceDirectory /home/jenkins/agent/workspace/ditto-ci/services/utils/protocol/src/main/resources
04:13:51 [INFO] Copying 0 resource
04:13:51 [INFO] 
04:13:51 [INFO] --- flatten-maven-plugin:1.0.1:flatten (flatten) @ ditto-services-utils-protocol ---
04:13:51 [INFO] Generating flattened POM of project org.eclipse.ditto:ditto-services-utils-protocol:jar:0-SNAPSHOT...
04:13:51 [INFO] 
04:13:51 [INFO] --- maven-compiler-plugin:3.8.1:compile (default-compile) @ ditto-services-utils-protocol ---
04:13:51 [INFO] Changes detected - recompiling the module!
04:13:51 [INFO] Compiling 6 source files to /home/jenkins/agent/workspace/ditto-ci/services/utils/protocol/target/classes
04:13:51 [INFO] /home/jenkins/agent/workspace/ditto-ci/services/utils/protocol/src/main/java/org/eclipse/ditto/services/utils/protocol/ProtocolAdapterProvider.java: /home/jenkins/agent/workspace/ditto-ci/services/utils/protocol/src/main/java/org/eclipse/ditto/services/utils/protocol/ProtocolAdapterProvider.java uses or overrides a deprecated API.
04:13:52 [INFO] /home/jenkins/agent/workspace/ditto-ci/services/utils/protocol/src/main/java/org/eclipse/ditto/services/utils/protocol/ProtocolAdapterProvider.java: Recompile with -Xlint:deprecation for details.
04:13:52 [INFO] 
04:13:52 [INFO] --- maven-resources-plugin:3.1.0:testResources (default-testResources) @ ditto-services-utils-protocol ---
04:13:52 [INFO] Using 'UTF-8' encoding to copy filtered resources.
04:13:52 [INFO] Copying 1 resource
04:13:52 [INFO] 
04:13:52 [INFO] --- maven-compiler-plugin:3.8.1:testCompile (default-testCompile) @ ditto-services-utils-protocol ---
04:13:52 [INFO] Changes detected - recompiling the module!
04:13:52 [INFO] Compiling 2 source files to /home/jenkins/agent/workspace/ditto-ci/services/utils/protocol/target/test-classes
04:13:52 [INFO] 
04:13:52 [INFO] --- maven-surefire-plugin:3.0.0-M4:test (default-test) @ ditto-services-utils-protocol ---
04:13:52 [INFO] Surefire report directory: /home/jenkins/agent/workspace/ditto-ci/services/utils/protocol/target/surefire-reports
04:13:52 [INFO] 
04:13:52 [INFO] -------------------------------------------------------
04:13:52 [INFO]  T E S T S
04:13:52 [INFO] -------------------------------------------------------
04:13:52 [INFO] Running org.eclipse.ditto.services.utils.protocol.config.DefaultProtocolConfigTest
04:13:52 [INFO] Tests run: 4, Failures: 0, Errors: 0, Skipped: 0, Time elapsed: 1.985 s - in org.eclipse.ditto.services.utils.protocol.config.DefaultProtocolConfigTest
04:13:54 [INFO] Running org.eclipse.ditto.services.utils.protocol.ProtocolAdapterProviderTest
04:13:54 [INFO] Tests run: 1, Failures: 0, Errors: 0, Skipped: 0, Time elapsed: 1.188 s - in org.eclipse.ditto.services.utils.protocol.ProtocolAdapterProviderTest
04:13:55 [INFO] 
04:13:56 [INFO] Results:
04:13:56 [INFO] 
04:13:56 [INFO] Tests run: 5, Failures: 0, Errors: 0, Skipped: 0
04:13:56 [INFO] 
04:13:56 [INFO] 
04:13:56 [INFO] --- maven-dependency-plugin:3.0.2:unpack-dependencies (copy-legal-docs) @ ditto-services-utils-protocol ---
04:13:56 [INFO] Unpacking /home/jenkins/agent/workspace/ditto-ci/legal/target/ditto-legal-0-SNAPSHOT.jar to /home/jenkins/agent/workspace/ditto-ci/services/utils/protocol/target/classes/META-INF with includes "" and excludes "NOTICE-THIRD-PARTY.md,3rd-party-dependencies/**,META-INF/**"
04:13:56 [INFO] 
04:13:56 [INFO] --- maven-jar-plugin:3.0.2:jar (default-jar) @ ditto-services-utils-protocol ---
04:13:56 [INFO] Building jar: /home/jenkins/agent/workspace/ditto-ci/services/utils/protocol/target/ditto-services-utils-protocol-0-SNAPSHOT.jar
04:13:56 [INFO] 
04:13:56 [INFO] --- maven-failsafe-plugin:3.0.0-M4:integration-test (integration-test) @ ditto-services-utils-protocol ---
04:13:56 [INFO] Tests are skipped.
04:13:56 [INFO] 
04:13:56 [INFO] --- maven-failsafe-plugin:3.0.0-M4:verify (verify) @ ditto-services-utils-protocol ---
04:13:56 [INFO] Tests are skipped.
04:13:56 [INFO] 
04:13:56 [INFO] --- jacoco-maven-plugin:0.8.5:report (report) @ ditto-services-utils-protocol ---
04:13:56 [INFO] Loading execution data file /home/jenkins/agent/workspace/ditto-ci/services/utils/protocol/target/jacoco.exec
04:13:56 [INFO] Analyzed bundle 'Eclipse Ditto :: Services :: Utils :: Protocol' with 5 classes
04:13:56 [INFO] 
04:13:56 [INFO] --- maven-install-plugin:2.5.2:install (default-install) @ ditto-services-utils-protocol ---
04:13:56 [INFO] Installing /home/jenkins/agent/workspace/ditto-ci/services/utils/protocol/target/ditto-services-utils-protocol-0-SNAPSHOT.jar to /home/jenkins/.m2/repository/org/eclipse/ditto/ditto-services-utils-protocol/0-SNAPSHOT/ditto-services-utils-protocol-0-SNAPSHOT.jar
04:13:56 [INFO] Installing /home/jenkins/agent/workspace/ditto-ci/services/utils/protocol/.flattened-pom.xml to /home/jenkins/.m2/repository/org/eclipse/ditto/ditto-services-utils-protocol/0-SNAPSHOT/ditto-services-utils-protocol-0-SNAPSHOT.pom
04:13:56 [INFO] 
04:13:56 [INFO] ------< org.eclipse.ditto:ditto-services-connectivity-messaging >-------
04:13:56 [INFO] Building Eclipse Ditto :: Services :: Connectivity :: Messaging 0-SNAPSHOT [89/113]
04:13:56 [INFO] --------------------------------[ jar ]---------------------------------
04:13:56 [INFO] 
04:14:01 [INFO] --- maven-clean-plugin:2.5:clean (default-clean) @ ditto-services-connectivity-messaging ---
04:14:01 [INFO] 
04:14:01 [INFO] --- flatten-maven-plugin:1.0.1:clean (flatten.clean) @ ditto-services-connectivity-messaging ---
04:14:01 [INFO] 
04:14:01 [INFO] --- jacoco-maven-plugin:0.8.5:prepare-agent (prepare-agent) @ ditto-services-connectivity-messaging ---
04:14:01 [INFO] argLine set to -javaagent:/home/jenkins/.m2/repository/org/jacoco/org.jacoco.agent/0.8.5/org.jacoco.agent-0.8.5-runtime.jar=destfile=/home/jenkins/agent/workspace/ditto-ci/services/connectivity/messaging/target/jacoco.exec -Dfile.encoding=UTF-8
04:14:01 [INFO] 
04:14:01 [INFO] --- license-maven-plugin:1.17:add-third-party (default-cli) @ ditto-services-connectivity-messaging ---
04:14:01 [WARNING] 
04:14:01 [WARNING] !!! licenseMergesFile is deprecated, use now licenseMergesUrl !!!
04:14:01 [WARNING] 
04:14:01 [WARNING] licenseMerges will be overridden by licenseMergesFile.
04:14:01 [WARNING] 
04:14:01 [INFO] Writing third-party file to /home/jenkins/agent/workspace/ditto-ci/services/connectivity/messaging/target/classes/META-INF/NOTICE-THIRD-PARTY.md
04:14:01 [INFO] 
04:14:01 [INFO] --- maven-resources-plugin:3.1.0:resources (default-resources) @ ditto-services-connectivity-messaging ---
04:14:01 [INFO] Using 'UTF-8' encoding to copy filtered resources.
04:14:01 [INFO] skip non existing resourceDirectory /home/jenkins/agent/workspace/ditto-ci/services/connectivity/messaging/src/main/resources
04:14:01 [INFO] Copying 0 resource
04:14:01 [INFO] 
04:14:01 [INFO] --- flatten-maven-plugin:1.0.1:flatten (flatten) @ ditto-services-connectivity-messaging ---
04:14:01 [INFO] Generating flattened POM of project org.eclipse.ditto:ditto-services-connectivity-messaging:jar:0-SNAPSHOT...
04:14:01 [INFO] 
04:14:01 [INFO] --- maven-compiler-plugin:3.8.1:compile (default-compile) @ ditto-services-connectivity-messaging ---
04:14:01 [INFO] Changes detected - recompiling the module!
04:14:01 [INFO] Compiling 242 source files to /home/jenkins/agent/workspace/ditto-ci/services/connectivity/messaging/target/classes
04:14:01 [WARNING] /home/jenkins/agent/workspace/ditto-ci/services/connectivity/messaging/src/main/java/org/eclipse/ditto/services/connectivity/messaging/internal/ssl/DittoTrustManager.java:[24,25] sun.security.util.HostnameChecker is internal proprietary API and may be removed in a future release
04:14:02 [WARNING] /home/jenkins/agent/workspace/ditto-ci/services/connectivity/messaging/src/main/java/org/eclipse/ditto/services/connectivity/messaging/internal/ssl/DittoTrustManager.java:[24,25] sun.security.util.HostnameChecker is internal proprietary API and may be removed in a future release
04:14:02 [WARNING] /home/jenkins/agent/workspace/ditto-ci/services/connectivity/messaging/src/main/java/org/eclipse/ditto/services/connectivity/messaging/internal/ssl/DittoTrustManager.java:[24,25] sun.security.util.HostnameChecker is internal proprietary API and may be removed in a future release
04:14:02 [WARNING] /home/jenkins/agent/workspace/ditto-ci/services/connectivity/messaging/src/main/java/org/eclipse/ditto/services/connectivity/messaging/internal/ssl/DittoTrustManager.java:[32,26] sun.security.util.HostnameChecker is internal proprietary API and may be removed in a future release
04:14:02 [WARNING] /home/jenkins/agent/workspace/ditto-ci/services/connectivity/messaging/src/main/java/org/eclipse/ditto/services/connectivity/messaging/internal/ssl/DittoTrustManager.java:[32,26] sun.security.util.HostnameChecker is internal proprietary API and may be removed in a future release
04:14:02 [WARNING] /home/jenkins/agent/workspace/ditto-ci/services/connectivity/messaging/src/main/java/org/eclipse/ditto/services/connectivity/messaging/internal/ssl/DittoTrustManager.java:[32,26] sun.security.util.HostnameChecker is internal proprietary API and may be removed in a future release
04:14:02 [WARNING] /home/jenkins/agent/workspace/ditto-ci/services/connectivity/messaging/src/main/java/org/eclipse/ditto/services/connectivity/messaging/internal/ssl/DittoTrustManager.java:[32,89] sun.security.util.HostnameChecker is internal proprietary API and may be removed in a future release
04:14:02 [WARNING] /home/jenkins/agent/workspace/ditto-ci/services/connectivity/messaging/src/main/java/org/eclipse/ditto/services/connectivity/messaging/internal/ssl/DittoTrustManager.java:[32,61] sun.security.util.HostnameChecker is internal proprietary API and may be removed in a future release
04:14:02 [INFO] /home/jenkins/agent/workspace/ditto-ci/services/connectivity/messaging/src/main/java/org/eclipse/ditto/services/connectivity/messaging/BaseClientActor.java: Some input files use or override a deprecated API.
04:14:02 [INFO] /home/jenkins/agent/workspace/ditto-ci/services/connectivity/messaging/src/main/java/org/eclipse/ditto/services/connectivity/messaging/BaseClientActor.java: Recompile with -Xlint:deprecation for details.
04:14:02 [INFO] /home/jenkins/agent/workspace/ditto-ci/services/connectivity/messaging/src/main/java/org/eclipse/ditto/services/connectivity/messaging/persistence/stages/StagedCommand.java: Some input files use unchecked or unsafe operations.
04:14:02 [INFO] /home/jenkins/agent/workspace/ditto-ci/services/connectivity/messaging/src/main/java/org/eclipse/ditto/services/connectivity/messaging/persistence/stages/StagedCommand.java: Recompile with -Xlint:unchecked for details.
04:14:02 [INFO] 
04:14:02 [INFO] --- maven-resources-plugin:3.1.0:testResources (default-testResources) @ ditto-services-connectivity-messaging ---
04:14:02 [INFO] Using 'UTF-8' encoding to copy filtered resources.
04:14:02 [INFO] Copying 22 resources
04:14:02 [INFO] 
04:14:02 [INFO] --- maven-compiler-plugin:3.8.1:testCompile (default-testCompile) @ ditto-services-connectivity-messaging ---
04:14:02 [INFO] Changes detected - recompiling the module!
04:14:02 [INFO] Compiling 99 source files to /home/jenkins/agent/workspace/ditto-ci/services/connectivity/messaging/target/test-classes
04:14:02 [INFO] /home/jenkins/agent/workspace/ditto-ci/services/connectivity/messaging/src/test/java/org/eclipse/ditto/services/connectivity/messaging/TestConstants.java: Some input files use or override a deprecated API.
04:14:05 [INFO] /home/jenkins/agent/workspace/ditto-ci/services/connectivity/messaging/src/test/java/org/eclipse/ditto/services/connectivity/messaging/TestConstants.java: Recompile with -Xlint:deprecation for details.
04:14:05 [INFO] /home/jenkins/agent/workspace/ditto-ci/services/connectivity/messaging/src/test/java/org/eclipse/ditto/services/connectivity/messaging/TestConstants.java: Some input files use unchecked or unsafe operations.
04:14:05 [INFO] /home/jenkins/agent/workspace/ditto-ci/services/connectivity/messaging/src/test/java/org/eclipse/ditto/services/connectivity/messaging/TestConstants.java: Recompile with -Xlint:unchecked for details.
04:14:05 [INFO] 
04:14:05 [INFO] --- maven-surefire-plugin:3.0.0-M4:test (default-test) @ ditto-services-connectivity-messaging ---
04:14:05 [INFO] Surefire report directory: /home/jenkins/agent/workspace/ditto-ci/services/connectivity/messaging/target/surefire-reports
04:14:05 [INFO] 
04:14:05 [INFO] -------------------------------------------------------
04:14:05 [INFO]  T E S T S
04:14:05 [INFO] -------------------------------------------------------
04:14:05 [INFO] Running org.eclipse.ditto.services.connectivity.messaging.mqtt.hivemq.HiveMqtt3PublisherActorTest
04:14:06 ImmutableAcknowledgement [label=please-verify, entityId=ditto:thing, statusCode=OK, payload=null, dittoHeaders=ImmutableDittoHeaders [{ditto-connection-id=connection-95385e83-104b-4a31-b943-3aca4932dff5, device_id=ditto:thing, response-required=false, correlation-id=cid, requested-acks=["please-verify"]}]]
04:14:11 [INFO] Tests run: 3, Failures: 0, Errors: 0, Skipped: 0, Time elapsed: 6.164 s - in org.eclipse.ditto.services.connectivity.messaging.mqtt.hivemq.HiveMqtt3PublisherActorTest
04:14:12 [INFO] Running org.eclipse.ditto.services.connectivity.messaging.mqtt.hivemq.HiveMqtt5ConsumerActorTest
04:14:12 [INFO] Tests run: 13, Failures: 0, Errors: 0, Skipped: 0, Time elapsed: 2.746 s - in org.eclipse.ditto.services.connectivity.messaging.mqtt.hivemq.HiveMqtt5ConsumerActorTest
04:14:15 [INFO] Running org.eclipse.ditto.services.connectivity.messaging.mqtt.hivemq.HiveMqtt5PublisherActorTest
04:14:15 ImmutableAcknowledgement [label=please-verify, entityId=ditto:thing, statusCode=OK, payload=null, dittoHeaders=ImmutableDittoHeaders [{ditto-connection-id=connection-31c14029-3130-4fa6-bd26-af4aa1922a6e, device_id=ditto:thing, response-required=false, correlation-id=cid, requested-acks=["please-verify"]}]]
04:14:15 [INFO] Tests run: 3, Failures: 0, Errors: 0, Skipped: 0, Time elapsed: 0.755 s - in org.eclipse.ditto.services.connectivity.messaging.mqtt.hivemq.HiveMqtt5PublisherActorTest
04:14:15 [INFO] Running org.eclipse.ditto.services.connectivity.messaging.mqtt.hivemq.HiveMqtt5ClientActorTest
04:14:15 [INFO] Tests run: 19, Failures: 0, Errors: 0, Skipped: 0, Time elapsed: 15.219 s - in org.eclipse.ditto.services.connectivity.messaging.mqtt.hivemq.HiveMqtt5ClientActorTest
04:14:31 [INFO] Running org.eclipse.ditto.services.connectivity.messaging.mqtt.hivemq.HiveMqtt3ConsumerActorTest
04:14:31 [INFO] Tests run: 13, Failures: 0, Errors: 0, Skipped: 0, Time elapsed: 0.758 s - in org.eclipse.ditto.services.connectivity.messaging.mqtt.hivemq.HiveMqtt3ConsumerActorTest
04:14:31 [INFO] Running org.eclipse.ditto.services.connectivity.messaging.mqtt.hivemq.HiveMqtt3ClientActorTest
04:14:31 [INFO] Tests run: 19, Failures: 0, Errors: 0, Skipped: 0, Time elapsed: 13.098 s - in org.eclipse.ditto.services.connectivity.messaging.mqtt.hivemq.HiveMqtt3ClientActorTest
04:14:44 [INFO] Running org.eclipse.ditto.services.connectivity.messaging.mqtt.Mqtt5ValidatorTest
04:14:44 [INFO] Tests run: 11, Failures: 0, Errors: 0, Skipped: 0, Time elapsed: 0.354 s - in org.eclipse.ditto.services.connectivity.messaging.mqtt.Mqtt5ValidatorTest
04:14:45 [INFO] Running org.eclipse.ditto.services.connectivity.messaging.mqtt.Mqtt3ValidatorTest
04:14:45 [INFO] Tests run: 12, Failures: 0, Errors: 0, Skipped: 0, Time elapsed: 0.075 s - in org.eclipse.ditto.services.connectivity.messaging.mqtt.Mqtt3ValidatorTest
04:14:45 [INFO] Running org.eclipse.ditto.services.connectivity.messaging.mqtt.MqttSpecificConfigTest
04:14:45 [INFO] Tests run: 2, Failures: 0, Errors: 0, Skipped: 0, Time elapsed: 0.001 s - in org.eclipse.ditto.services.connectivity.messaging.mqtt.MqttSpecificConfigTest
04:14:45 [INFO] Running org.eclipse.ditto.services.connectivity.messaging.mqtt.MqttPublishTargetTest
04:14:45 [INFO] Tests run: 5, Failures: 0, Errors: 0, Skipped: 0, Time elapsed: 0.245 s - in org.eclipse.ditto.services.connectivity.messaging.mqtt.MqttPublishTargetTest
04:14:45 [INFO] Running org.eclipse.ditto.services.connectivity.messaging.monitoring.metrics.DefaultConnectionMetricsCounterTest
04:14:45 [INFO] Tests run: 1, Failures: 0, Errors: 0, Skipped: 0, Time elapsed: 0.001 s - in org.eclipse.ditto.services.connectivity.messaging.monitoring.metrics.DefaultConnectionMetricsCounterTest
04:14:45 [INFO] Running org.eclipse.ditto.services.connectivity.messaging.monitoring.metrics.SlidingWindowCounterTest
04:14:45 [INFO] Tests run: 2, Failures: 0, Errors: 0, Skipped: 0, Time elapsed: 0.061 s - in org.eclipse.ditto.services.connectivity.messaging.monitoring.metrics.SlidingWindowCounterTest
04:14:45 [INFO] Running org.eclipse.ditto.services.connectivity.messaging.monitoring.metrics.ConnectivityCounterRegistryTest
04:14:45 [INFO] Tests run: 4, Failures: 0, Errors: 0, Skipped: 0, Time elapsed: 0.034 s - in org.eclipse.ditto.services.connectivity.messaging.monitoring.metrics.ConnectivityCounterRegistryTest
04:14:45 [INFO] Running org.eclipse.ditto.services.connectivity.messaging.monitoring.DefaultConnectionMonitorRegistryTest
04:14:45 [INFO] Tests run: 2, Failures: 0, Errors: 0, Skipped: 0, Time elapsed: 0.211 s - in org.eclipse.ditto.services.connectivity.messaging.monitoring.DefaultConnectionMonitorRegistryTest
04:14:45 [INFO] Running org.eclipse.ditto.services.connectivity.messaging.monitoring.logs.EvictingConnectionLoggerTest
04:14:45 [INFO] Tests run: 20, Failures: 0, Errors: 0, Skipped: 0, Time elapsed: 0.151 s - in org.eclipse.ditto.services.connectivity.messaging.monitoring.logs.EvictingConnectionLoggerTest
04:14:46 [INFO] Running org.eclipse.ditto.services.connectivity.messaging.monitoring.logs.ConnectivityHeadersTest
04:14:46 [INFO] Tests run: 6, Failures: 0, Errors: 0, Skipped: 0, Time elapsed: 0.001 s - in org.eclipse.ditto.services.connectivity.messaging.monitoring.logs.ConnectivityHeadersTest
04:14:46 [INFO] Running org.eclipse.ditto.services.connectivity.messaging.monitoring.logs.ImmutableInfoProviderTest
04:14:46 [INFO] Tests run: 1, Failures: 0, Errors: 0, Skipped: 0, Time elapsed: 0 s - in org.eclipse.ditto.services.connectivity.messaging.monitoring.logs.ImmutableInfoProviderTest
04:14:46 [INFO] Running org.eclipse.ditto.services.connectivity.messaging.monitoring.logs.InfoProviderFactoryTest
04:14:46 [INFO] Tests run: 11, Failures: 0, Errors: 0, Skipped: 0, Time elapsed: 0.001 s - in org.eclipse.ditto.services.connectivity.messaging.monitoring.logs.InfoProviderFactoryTest
04:14:46 [INFO] Running org.eclipse.ditto.services.connectivity.messaging.monitoring.logs.DefaultEvictingQueueTest
04:14:46 [INFO] Tests run: 2, Failures: 0, Errors: 0, Skipped: 0, Time elapsed: 0.018 s - in org.eclipse.ditto.services.connectivity.messaging.monitoring.logs.DefaultEvictingQueueTest
04:14:46 [INFO] Running org.eclipse.ditto.services.connectivity.messaging.monitoring.logs.ConnectionLoggerRegistryTest
04:14:46 [INFO] Tests run: 19, Failures: 0, Errors: 0, Skipped: 0, Time elapsed: 0.188 s - in org.eclipse.ditto.services.connectivity.messaging.monitoring.logs.ConnectionLoggerRegistryTest
04:14:46 [INFO] Running org.eclipse.ditto.services.connectivity.messaging.monitoring.logs.RetrieveConnectionLogsAggregatorActorTest
04:14:46 [INFO] Tests run: 5, Failures: 0, Errors: 0, Skipped: 0, Time elapsed: 5.433 s - in org.eclipse.ditto.services.connectivity.messaging.monitoring.logs.RetrieveConnectionLogsAggregatorActorTest
04:14:51 [INFO] Running org.eclipse.ditto.services.connectivity.messaging.monitoring.logs.DefaultMuteableConnectionLoggerTest
04:14:51 [INFO] Tests run: 12, Failures: 0, Errors: 0, Skipped: 0, Time elapsed: 0.278 s - in org.eclipse.ditto.services.connectivity.messaging.monitoring.logs.DefaultMuteableConnectionLoggerTest
04:14:52 [INFO] Running org.eclipse.ditto.services.connectivity.messaging.monitoring.logs.ConnectionLoggerFactoryTest
04:14:52 [INFO] Tests run: 1, Failures: 0, Errors: 0, Skipped: 0, Time elapsed: 0.001 s - in org.eclipse.ditto.services.connectivity.messaging.monitoring.logs.ConnectionLoggerFactoryTest
04:14:52 [INFO] Running org.eclipse.ditto.services.connectivity.messaging.monitoring.DefaultConnectionMonitorTest
04:14:52 [INFO] Tests run: 4, Failures: 0, Errors: 0, Skipped: 0, Time elapsed: 0.091 s - in org.eclipse.ditto.services.connectivity.messaging.monitoring.DefaultConnectionMonitorTest
04:14:52 [INFO] Running org.eclipse.ditto.services.connectivity.messaging.ConnectionPersistenceActorRecoveryTest
04:14:52 08:14:52.716 [WARN ] [AkkaTestSystem-akka.actor.default-dispatcher-6] akka.serialization.Serialization(akka://AkkaTestSystem) a.s.Serialization(akka://AkkaTestSystem) - Using the Java serializer for class [org.bson.BsonDocument] which is not recommended because of performance implications. Use another serializer or disable this warning using the setting 'akka.actor.warn-about-java-serializer-usage'
04:14:52 [INFO] Tests run: 2, Failures: 0, Errors: 0, Skipped: 0, Time elapsed: 3.071 s - in org.eclipse.ditto.services.connectivity.messaging.ConnectionPersistenceActorRecoveryTest
04:14:55 [INFO] Running org.eclipse.ditto.services.connectivity.messaging.BaseClientActorTest
04:14:55 [INFO] Tests run: 10, Failures: 0, Errors: 0, Skipped: 0, Time elapsed: 6.095 s - in org.eclipse.ditto.services.connectivity.messaging.BaseClientActorTest
04:15:01 [INFO] Running org.eclipse.ditto.services.connectivity.messaging.MessageMappingProcessorActorHeaderInteractionTest
04:15:01 [INFO] Tests run: 16, Failures: 0, Errors: 0, Skipped: 0, Time elapsed: 2.769 s - in org.eclipse.ditto.services.connectivity.messaging.MessageMappingProcessorActorHeaderInteractionTest
04:15:04 [INFO] Running org.eclipse.ditto.services.connectivity.messaging.config.DefaultReconnectConfigTest
04:15:04 [INFO] Tests run: 4, Failures: 0, Errors: 0, Skipped: 0, Time elapsed: 0.946 s - in org.eclipse.ditto.services.connectivity.messaging.config.DefaultReconnectConfigTest
04:15:05 [INFO] Running org.eclipse.ditto.services.connectivity.messaging.config.DefaultClientConfigTest
04:15:05 [INFO] Tests run: 4, Failures: 0, Errors: 0, Skipped: 0, Time elapsed: 0.053 s - in org.eclipse.ditto.services.connectivity.messaging.config.DefaultClientConfigTest
04:15:05 [INFO] Running org.eclipse.ditto.services.connectivity.messaging.config.DefaultConnectionConfigTest
04:15:05 [INFO] Tests run: 3, Failures: 0, Errors: 0, Skipped: 0, Time elapsed: 0.514 s - in org.eclipse.ditto.services.connectivity.messaging.config.DefaultConnectionConfigTest
04:15:05 [INFO] Running org.eclipse.ditto.services.connectivity.messaging.config.DefaultAmqp10ConfigTest
04:15:05 [INFO] Tests run: 4, Failures: 0, Errors: 0, Skipped: 0, Time elapsed: 0.109 s - in org.eclipse.ditto.services.connectivity.messaging.config.DefaultAmqp10ConfigTest
04:15:05 [INFO] Running org.eclipse.ditto.services.connectivity.messaging.config.DefaultMonitoringConfigTest
04:15:05 [INFO] Tests run: 3, Failures: 0, Errors: 0, Skipped: 0, Time elapsed: 0.023 s - in org.eclipse.ditto.services.connectivity.messaging.config.DefaultMonitoringConfigTest
04:15:05 [INFO] Running org.eclipse.ditto.services.connectivity.messaging.persistence.SignalFilterTest
04:15:05 [INFO] Tests run: 89, Failures: 0, Errors: 0, Skipped: 0, Time elapsed: 0.171 s - in org.eclipse.ditto.services.connectivity.messaging.persistence.SignalFilterTest
04:15:05 [INFO] Running org.eclipse.ditto.services.connectivity.messaging.persistence.ConnectionMigrationUtilTest
04:15:05 [INFO] Tests run: 5, Failures: 0, Errors: 0, Skipped: 0, Time elapsed: 0.003 s - in org.eclipse.ditto.services.connectivity.messaging.persistence.ConnectionMigrationUtilTest
04:15:05 [INFO] Running org.eclipse.ditto.services.connectivity.messaging.persistence.ConnectionPersistenceActorTest
04:15:05 08:15:06.143 [WARN ] [ConnectionPersistenceActorTest-akka.actor.default-dispatcher-11] akka.serialization.Serialization(akka://ConnectionPersistenceActorTest) a.s.Serialization(akka://ConnectionPersistenceActorTest) - Using the Java serializer for class [org.bson.BsonDocument] which is not recommended because of performance implications. Use another serializer or disable this warning using the setting 'akka.actor.warn-about-java-serializer-usage'
04:15:06 08:15:06.493 [WARN ] [ConnectionPersistenceActorTest-akka.actor.default-dispatcher-6] akka.serialization.Serialization(akka://ConnectionPersistenceActorTest) a.s.Serialization(akka://ConnectionPersistenceActorTest) - Using the Java serializer for class [org.bson.BsonDocument] which is not recommended because of performance implications. Use another serializer or disable this warning using the setting 'akka.actor.warn-about-java-serializer-usage'
04:15:06 08:15:06.793 [WARN ] [ConnectionPersistenceActorTestWithBlocklist-akka.actor.default-dispatcher-13] akka.serialization.Serialization(akka://ConnectionPersistenceActorTestWithBlocklist) a.s.Serialization(akka://ConnectionPersistenceActorTestWithBlocklist) - Using the Java serializer for class [org.bson.BsonDocument] which is not recommended because of performance implications. Use another serializer or disable this warning using the setting 'akka.actor.warn-about-java-serializer-usage'
04:15:06 08:15:06.963 [WARN ] [ConnectionPersistenceActorTest-akka.actor.default-dispatcher-12] akka.serialization.Serialization(akka://ConnectionPersistenceActorTest) a.s.Serialization(akka://ConnectionPersistenceActorTest) - Using the Java serializer for class [org.bson.BsonDocument] which is not recommended because of performance implications. Use another serializer or disable this warning using the setting 'akka.actor.warn-about-java-serializer-usage'
04:15:06 08:15:07.130 [WARN ] [ConnectionPersistenceActorTest-akka.actor.default-dispatcher-15] akka.serialization.Serialization(akka://ConnectionPersistenceActorTest) a.s.Serialization(akka://ConnectionPersistenceActorTest) - Using the Java serializer for class [org.bson.BsonDocument] which is not recommended because of performance implications. Use another serializer or disable this warning using the setting 'akka.actor.warn-about-java-serializer-usage'
04:15:07 08:15:09.392 [WARN ] [ConnectionPersistenceActorTest-akka.actor.default-dispatcher-8] akka.serialization.Serialization(akka://ConnectionPersistenceActorTest) a.s.Serialization(akka://ConnectionPersistenceActorTest) - Using the Java serializer for class [org.bson.BsonDocument] which is not recommended because of performance implications. Use another serializer or disable this warning using the setting 'akka.actor.warn-about-java-serializer-usage'
04:15:09 08:15:09.637 [WARN ] [ConnectionPersistenceActorTest-akka.actor.default-dispatcher-16] akka.serialization.Serialization(akka://ConnectionPersistenceActorTest) a.s.Serialization(akka://ConnectionPersistenceActorTest) - Using the Java serializer for class [org.bson.BsonDocument] which is not recommended because of performance implications. Use another serializer or disable this warning using the setting 'akka.actor.warn-about-java-serializer-usage'
04:15:09 08:15:09.748 [WARN ] [ConnectionPersistenceActorTestWithBlocklist-akka.actor.default-dispatcher-14] akka.serialization.Serialization(akka://ConnectionPersistenceActorTestWithBlocklist) a.s.Serialization(akka://ConnectionPersistenceActorTestWithBlocklist) - Using the Java serializer for class [org.bson.BsonDocument] which is not recommended because of performance implications. Use another serializer or disable this warning using the setting 'akka.actor.warn-about-java-serializer-usage'
04:15:09 08:15:09.926 [WARN ] [ConnectionPersistenceActorTest-akka.actor.default-dispatcher-14] akka.serialization.Serialization(akka://ConnectionPersistenceActorTest) a.s.Serialization(akka://ConnectionPersistenceActorTest) - Using the Java serializer for class [org.bson.BsonDocument] which is not recommended because of performance implications. Use another serializer or disable this warning using the setting 'akka.actor.warn-about-java-serializer-usage'
04:15:09 08:15:10.095 [WARN ] [ConnectionPersistenceActorTest-akka.actor.default-dispatcher-11] akka.serialization.Serialization(akka://ConnectionPersistenceActorTest) a.s.Serialization(akka://ConnectionPersistenceActorTest) - Using the Java serializer for class [org.bson.BsonDocument] which is not recommended because of performance implications. Use another serializer or disable this warning using the setting 'akka.actor.warn-about-java-serializer-usage'
04:15:10 08:15:10.243 [WARN ] [ConnectionPersistenceActorTest-akka.actor.default-dispatcher-8] akka.serialization.Serialization(akka://ConnectionPersistenceActorTest) a.s.Serialization(akka://ConnectionPersistenceActorTest) - Using the Java serializer for class [org.bson.BsonDocument] which is not recommended because of performance implications. Use another serializer or disable this warning using the setting 'akka.actor.warn-about-java-serializer-usage'
04:15:10 08:15:10.321 [WARN ] [ConnectionPersistenceActorTest-akka.actor.default-dispatcher-8] akka.serialization.Serialization(akka://ConnectionPersistenceActorTest) a.s.Serialization(akka://ConnectionPersistenceActorTest) - Using the Java serializer for class [org.bson.BsonDocument] which is not recommended because of performance implications. Use another serializer or disable this warning using the setting 'akka.actor.warn-about-java-serializer-usage'
04:15:10 08:15:12.437 [WARN ] [ConnectionPersistenceActorTest-akka.actor.default-dispatcher-13] akka.serialization.Serialization(akka://ConnectionPersistenceActorTest) a.s.Serialization(akka://ConnectionPersistenceActorTest) - Using the Java serializer for class [org.bson.BsonDocument] which is not recommended because of performance implications. Use another serializer or disable this warning using the setting 'akka.actor.warn-about-java-serializer-usage'
04:15:12 08:15:12.531 [WARN ] [ConnectionPersistenceActorTest-akka.actor.default-dispatcher-6] akka.serialization.Serialization(akka://ConnectionPersistenceActorTest) a.s.Serialization(akka://ConnectionPersistenceActorTest) - Using the Java serializer for class [org.bson.BsonDocument] which is not recommended because of performance implications. Use another serializer or disable this warning using the setting 'akka.actor.warn-about-java-serializer-usage'
04:15:12 08:15:12.712 [WARN ] [ConnectionPersistenceActorTest-akka.actor.default-dispatcher-12] akka.serialization.Serialization(akka://ConnectionPersistenceActorTest) a.s.Serialization(akka://ConnectionPersistenceActorTest) - Using the Java serializer for class [org.bson.BsonDocument] which is not recommended because of performance implications. Use another serializer or disable this warning using the setting 'akka.actor.warn-about-java-serializer-usage'
04:15:12 08:15:13.139 [WARN ] [ConnectionPersistenceActorTest-akka.actor.default-dispatcher-12] akka.serialization.Serialization(akka://ConnectionPersistenceActorTest) a.s.Serialization(akka://ConnectionPersistenceActorTest) - Using the Java serializer for class [org.bson.BsonDocument] which is not recommended because of performance implications. Use another serializer or disable this warning using the setting 'akka.actor.warn-about-java-serializer-usage'
04:15:13 08:15:13.458 [WARN ] [ConnectionPersistenceActorTest-akka.actor.default-dispatcher-14] akka.serialization.Serialization(akka://ConnectionPersistenceActorTest) a.s.Serialization(akka://ConnectionPersistenceActorTest) - Using the Java serializer for class [org.bson.BsonDocument] which is not recommended because of performance implications. Use another serializer or disable this warning using the setting 'akka.actor.warn-about-java-serializer-usage'
04:15:13 08:15:13.590 [WARN ] [ConnectionPersistenceActorTest-akka.actor.default-dispatcher-8] akka.serialization.Serialization(akka://ConnectionPersistenceActorTest) a.s.Serialization(akka://ConnectionPersistenceActorTest) - Using the Java serializer for class [org.bson.BsonDocument] which is not recommended because of performance implications. Use another serializer or disable this warning using the setting 'akka.actor.warn-about-java-serializer-usage'
04:15:13 08:15:13.686 [WARN ] [ConnectionPersistenceActorTest-akka.actor.default-dispatcher-6] akka.serialization.Serialization(akka://ConnectionPersistenceActorTest) a.s.Serialization(akka://ConnectionPersistenceActorTest) - Using the Java serializer for class [org.bson.BsonDocument] which is not recommended because of performance implications. Use another serializer or disable this warning using the setting 'akka.actor.warn-about-java-serializer-usage'
04:15:13 08:15:13.805 [WARN ] [ConnectionPersistenceActorTest-akka.actor.default-dispatcher-12] akka.serialization.Serialization(akka://ConnectionPersistenceActorTest) a.s.Serialization(akka://ConnectionPersistenceActorTest) - Using the Java serializer for class [org.bson.BsonDocument] which is not recommended because of performance implications. Use another serializer or disable this warning using the setting 'akka.actor.warn-about-java-serializer-usage'
04:15:13 08:15:15.011 [WARN ] [ConnectionPersistenceActorTest-akka.actor.default-dispatcher-20] akka.serialization.Serialization(akka://ConnectionPersistenceActorTest) a.s.Serialization(akka://ConnectionPersistenceActorTest) - Using the Java serializer for class [org.bson.BsonDocument] which is not recommended because of performance implications. Use another serializer or disable this warning using the setting 'akka.actor.warn-about-java-serializer-usage'
04:15:15 08:15:18.040 [WARN ] [ConnectionPersistenceActorTest-akka.actor.default-dispatcher-6] akka.stream.Log(akka://ConnectionPersistenceActorTest/system/Materializers/StreamSupervisor-573) a.s.Materializer - [outbound connection to [akka://ConnectionPersistenceActorTest@127.0.0.1:45969], control stream] Upstream failed, cause: StreamTcpException: The connection has been aborted
04:15:18 08:15:18.040 [WARN ] [ConnectionPersistenceActorTest-akka.actor.default-dispatcher-6] akka.stream.Log(akka://ConnectionPersistenceActorTest/system/Materializers/StreamSupervisor-573) a.s.Materializer - [outbound connection to [akka://ConnectionPersistenceActorTest@127.0.0.1:45969], message stream] Upstream failed, cause: StreamTcpException: The connection has been aborted
04:15:18 08:15:19.115 [WARN ] [ConnectionPersistenceActorTest-akka.actor.default-dispatcher-13] akka.serialization.Serialization(akka://ConnectionPersistenceActorTest) a.s.Serialization(akka://ConnectionPersistenceActorTest) - Using the Java serializer for class [org.bson.BsonDocument] which is not recommended because of performance implications. Use another serializer or disable this warning using the setting 'akka.actor.warn-about-java-serializer-usage'
04:15:19 08:15:19.382 [WARN ] [ConnectionPersistenceActorTest-akka.actor.default-dispatcher-15] akka.serialization.Serialization(akka://ConnectionPersistenceActorTest) a.s.Serialization(akka://ConnectionPersistenceActorTest) - Using the Java serializer for class [org.bson.BsonDocument] which is not recommended because of performance implications. Use another serializer or disable this warning using the setting 'akka.actor.warn-about-java-serializer-usage'
04:15:19 08:15:19.460 [WARN ] [ConnectionPersistenceActorTest-akka.actor.default-dispatcher-13] akka.serialization.Serialization(akka://ConnectionPersistenceActorTest) a.s.Serialization(akka://ConnectionPersistenceActorTest) - Using the Java serializer for class [org.bson.BsonDocument] which is not recommended because of performance implications. Use another serializer or disable this warning using the setting 'akka.actor.warn-about-java-serializer-usage'
04:15:19 08:15:19.616 [WARN ] [ConnectionPersistenceActorTest-akka.actor.default-dispatcher-15] akka.serialization.Serialization(akka://ConnectionPersistenceActorTest) a.s.Serialization(akka://ConnectionPersistenceActorTest) - Using the Java serializer for class [org.bson.BsonDocument] which is not recommended because of performance implications. Use another serializer or disable this warning using the setting 'akka.actor.warn-about-java-serializer-usage'
04:15:19 08:15:19.716 [WARN ] [ConnectionPersistenceActorTest-akka.actor.default-dispatcher-11] akka.serialization.Serialization(akka://ConnectionPersistenceActorTest) a.s.Serialization(akka://ConnectionPersistenceActorTest) - Using the Java serializer for class [org.bson.BsonDocument] which is not recommended because of performance implications. Use another serializer or disable this warning using the setting 'akka.actor.warn-about-java-serializer-usage'
04:15:19 08:15:19.781 [WARN ] [ConnectionPersistenceActorTest-akka.actor.default-dispatcher-14] akka.serialization.Serialization(akka://ConnectionPersistenceActorTest) a.s.Serialization(akka://ConnectionPersistenceActorTest) - Using the Java serializer for class [org.bson.BsonDocument] which is not recommended because of performance implications. Use another serializer or disable this warning using the setting 'akka.actor.warn-about-java-serializer-usage'
04:15:19 08:15:19.956 [WARN ] [ConnectionPersistenceActorTest-akka.actor.default-dispatcher-11] akka.serialization.Serialization(akka://ConnectionPersistenceActorTest) a.s.Serialization(akka://ConnectionPersistenceActorTest) - Using the Java serializer for class [org.bson.BsonDocument] which is not recommended because of performance implications. Use another serializer or disable this warning using the setting 'akka.actor.warn-about-java-serializer-usage'
04:15:19 08:15:20.468 [WARN ] [ConnectionPersistenceActorTest-akka.actor.default-dispatcher-11] akka.serialization.Serialization(akka://ConnectionPersistenceActorTest) a.s.Serialization(akka://ConnectionPersistenceActorTest) - Using the Java serializer for class [org.bson.BsonDocument] which is not recommended because of performance implications. Use another serializer or disable this warning using the setting 'akka.actor.warn-about-java-serializer-usage'
04:15:20 08:15:21.182 [WARN ] [ConnectionPersistenceActorTest-akka.actor.default-dispatcher-6] akka.serialization.Serialization(akka://ConnectionPersistenceActorTest) a.s.Serialization(akka://ConnectionPersistenceActorTest) - Using the Java serializer for class [org.bson.BsonDocument] which is not recommended because of performance implications. Use another serializer or disable this warning using the setting 'akka.actor.warn-about-java-serializer-usage'
04:15:21 08:15:21.288 [WARN ] [ConnectionPersistenceActorTest-akka.actor.default-dispatcher-8] akka.serialization.Serialization(akka://ConnectionPersistenceActorTest) a.s.Serialization(akka://ConnectionPersistenceActorTest) - Using the Java serializer for class [org.bson.BsonDocument] which is not recommended because of performance implications. Use another serializer or disable this warning using the setting 'akka.actor.warn-about-java-serializer-usage'
04:15:21 08:15:21.386 [WARN ] [ConnectionPersistenceActorTest-akka.actor.default-dispatcher-11] akka.serialization.Serialization(akka://ConnectionPersistenceActorTest) a.s.Serialization(akka://ConnectionPersistenceActorTest) - Using the Java serializer for class [org.bson.BsonDocument] which is not recommended because of performance implications. Use another serializer or disable this warning using the setting 'akka.actor.warn-about-java-serializer-usage'
04:15:21 08:15:23.594 [WARN ] [ConnectionPersistenceActorTest-akka.actor.default-dispatcher-12] akka.serialization.Serialization(akka://ConnectionPersistenceActorTest) a.s.Serialization(akka://ConnectionPersistenceActorTest) - Using the Java serializer for class [org.bson.BsonDocument] which is not recommended because of performance implications. Use another serializer or disable this warning using the setting 'akka.actor.warn-about-java-serializer-usage'
04:15:23 [INFO] Tests run: 43, Failures: 0, Errors: 0, Skipped: 0, Time elapsed: 17.706 s - in org.eclipse.ditto.services.connectivity.messaging.persistence.ConnectionPersistenceActorTest
04:15:23 [INFO] Running org.eclipse.ditto.services.connectivity.messaging.persistence.SignalFilterWithFilterTest
04:15:23 [INFO] Tests run: 3, Failures: 0, Errors: 0, Skipped: 0, Time elapsed: 0.011 s - in org.eclipse.ditto.services.connectivity.messaging.persistence.SignalFilterWithFilterTest
04:15:23 [INFO] Running org.eclipse.ditto.services.connectivity.messaging.DefaultClientActorPropsFactoryTest
04:15:23 08:15:23.809 [WARN ] [AkkaTestSystem-akka.actor.default-dispatcher-6] akka.serialization.Serialization(akka://AkkaTestSystem) a.s.Serialization(akka://AkkaTestSystem) - Using the Java serializer for class [org.eclipse.ditto.services.connectivity.messaging.kafka.DefaultKafkaPublisherActorFactory] which is not recommended because of performance implications. Use another serializer or disable this warning using the setting 'akka.actor.warn-about-java-serializer-usage'
04:15:23 [INFO] Tests run: 5, Failures: 0, Errors: 0, Skipped: 0, Time elapsed: 0.559 s - in org.eclipse.ditto.services.connectivity.messaging.DefaultClientActorPropsFactoryTest
04:15:24 [INFO] Running org.eclipse.ditto.services.connectivity.messaging.kafka.KafkaClientActorTest
04:15:24 [INFO] Tests run: 12, Failures: 0, Errors: 0, Skipped: 0, Time elapsed: 1.078 s - in org.eclipse.ditto.services.connectivity.messaging.kafka.KafkaClientActorTest
04:15:25 [INFO] Running org.eclipse.ditto.services.connectivity.messaging.kafka.KafkaAuthenticationSpecificConfigTest
04:15:25 [INFO] Tests run: 12, Failures: 0, Errors: 0, Skipped: 0, Time elapsed: 0.002 s - in org.eclipse.ditto.services.connectivity.messaging.kafka.KafkaAuthenticationSpecificConfigTest
04:15:25 [INFO] Running org.eclipse.ditto.services.connectivity.messaging.kafka.KafkaBootstrapServerSpecificConfigTest
04:15:25 [INFO] Tests run: 11, Failures: 0, Errors: 0, Skipped: 0, Time elapsed: 0.004 s - in org.eclipse.ditto.services.connectivity.messaging.kafka.KafkaBootstrapServerSpecificConfigTest
04:15:25 [INFO] Running org.eclipse.ditto.services.connectivity.messaging.kafka.DefaultKafkaPublisherActorFactoryTest
04:15:25 [INFO] Tests run: 2, Failures: 0, Errors: 0, Skipped: 0, Time elapsed: 0.001 s - in org.eclipse.ditto.services.connectivity.messaging.kafka.DefaultKafkaPublisherActorFactoryTest
04:15:25 [INFO] Running org.eclipse.ditto.services.connectivity.messaging.kafka.KafkaPublishTargetTest
04:15:25 [INFO] Tests run: 11, Failures: 0, Errors: 0, Skipped: 0, Time elapsed: 0.021 s - in org.eclipse.ditto.services.connectivity.messaging.kafka.KafkaPublishTargetTest
04:15:25 [INFO] Running org.eclipse.ditto.services.connectivity.messaging.kafka.KafkaPublisherActorTest
04:15:25 [INFO] Tests run: 6, Failures: 0, Errors: 0, Skipped: 0, Time elapsed: 1.006 s - in org.eclipse.ditto.services.connectivity.messaging.kafka.KafkaPublisherActorTest
04:15:26 [INFO] Running org.eclipse.ditto.services.connectivity.messaging.kafka.ProducerPropertiesFactoryTest
04:15:26 [INFO] Tests run: 1, Failures: 0, Errors: 0, Skipped: 0, Time elapsed: 0.002 s - in org.eclipse.ditto.services.connectivity.messaging.kafka.ProducerPropertiesFactoryTest
04:15:26 [INFO] Running org.eclipse.ditto.services.connectivity.messaging.kafka.KafkaValidatorTest
04:15:26 [INFO] Tests run: 6, Failures: 0, Errors: 0, Skipped: 0, Time elapsed: 0.061 s - in org.eclipse.ditto.services.connectivity.messaging.kafka.KafkaValidatorTest
04:15:26 [INFO] Running org.eclipse.ditto.services.connectivity.messaging.validation.HostValidatorTest
04:15:26 [INFO] Tests run: 5, Failures: 0, Errors: 0, Skipped: 0, Time elapsed: 0.771 s - in org.eclipse.ditto.services.connectivity.messaging.validation.HostValidatorTest
04:15:27 [INFO] Running org.eclipse.ditto.services.connectivity.messaging.validation.ConnectionValidatorTest
04:15:27 [INFO] Tests run: 22, Failures: 0, Errors: 0, Skipped: 0, Time elapsed: 0.312 s - in org.eclipse.ditto.services.connectivity.messaging.validation.ConnectionValidatorTest
04:15:27 [INFO] Running org.eclipse.ditto.services.connectivity.messaging.httppush.HttpPushFactoryTest
04:15:27 [WARN] [10/27/2020 08:15:27.695] [HttpPushFactoryTest-akka.actor.default-dispatcher-11] [HttpPushFactoryTest/Pool(shared->http://127.0.0.1:35708)] [0 (WaitingForResponse)]Ongoing request [PUT /path/prefix/path/appendage/ Empty] was dropped because pool is shutting down
04:15:27 08:15:28.078 [ERROR] [HttpPushFactoryTest-akka.actor.default-dispatcher-12] akka.actor.ActorSystemImpl(HttpPushFactoryTest) a.a.ActorSystemImpl - Internal server error, sending 500 response
04:15:28 akka.stream.SubscriptionWithCancelException$StageWasCompleted$: null
04:15:28 08:15:28.196 [WARN ] [HttpPushFactoryTest-akka.actor.default-dispatcher-13] akka.actor.ActorSystemImpl(HttpPushFactoryTest) a.a.ActorSystemImpl - Illegal request, responding with status '400 Bad Request': Illegal character '\r' in header name
04:15:28 08:15:28.204 [WARN ] [HttpPushFactoryTest-akka.actor.default-dispatcher-8] akka.actor.ActorSystemImpl(HttpPushFactoryTest) a.a.ActorSystemImpl - Illegal request, responding with status '400 Bad Request': Illegal character '\r' in header name
04:15:28 08:15:28.209 [WARN ] [HttpPushFactoryTest-akka.actor.default-dispatcher-11] akka.actor.ActorSystemImpl(HttpPushFactoryTest) a.a.ActorSystemImpl - Illegal request, responding with status '400 Bad Request': Illegal character '\r' in header name
04:15:28 08:15:28.215 [WARN ] [HttpPushFactoryTest-akka.actor.default-dispatcher-13] akka.actor.ActorSystemImpl(HttpPushFactoryTest) a.a.ActorSystemImpl - Illegal request, responding with status '400 Bad Request': Illegal character '\r' in header name
04:15:28 08:15:28.219 [WARN ] [HttpPushFactoryTest-akka.actor.default-dispatcher-13] akka.actor.ActorSystemImpl(HttpPushFactoryTest) a.a.ActorSystemImpl - Illegal request, responding with status '400 Bad Request': Illegal character '\r' in header name
04:15:28 08:15:28.224 [WARN ] [HttpPushFactoryTest-akka.actor.default-dispatcher-8] akka.actor.ActorSystemImpl(HttpPushFactoryTest) a.a.ActorSystemImpl - Illegal request, responding with status '400 Bad Request': Illegal character '\r' in header name
04:15:28 [INFO] Tests run: 4, Failures: 0, Errors: 0, Skipped: 0, Time elapsed: 0.745 s - in org.eclipse.ditto.services.connectivity.messaging.httppush.HttpPushFactoryTest
04:15:28 [INFO] Running org.eclipse.ditto.services.connectivity.messaging.httppush.HttpPublisherErrorTest
04:15:28 [ERROR] [10/27/2020 08:15:28.993] [HttpPublisherErrorTest-akka.actor.default-dispatcher-11] [akka://HttpPublisherErrorTest@127.0.0.1:40328/system/pool-master] connection pool for Pool(shared->http://127.0.0.1:33424) has shut down unexpectedly
04:15:28 java.lang.IllegalStateException: Pool shutdown unexpectedly
04:15:28 	at akka.http.impl.engine.client.PoolInterface$Logic.postStop(PoolInterface.scala:206)
04:15:28 	at akka.stream.impl.fusing.GraphInterpreter.finalizeStage(GraphInterpreter.scala:599)
04:15:28 	at akka.stream.impl.fusing.GraphInterpreter.finish(GraphInterpreter.scala:324)
04:15:28 	at akka.stream.impl.fusing.GraphInterpreterShell.tryAbort(ActorGraphInterpreter.scala:664)
04:15:28 	at akka.stream.impl.fusing.ActorGraphInterpreter.$anonfun$postStop$1(ActorGraphInterpreter.scala:802)
04:15:28 	at akka.stream.impl.fusing.ActorGraphInterpreter.$anonfun$postStop$1$adapted(ActorGraphInterpreter.scala:802)
04:15:28 	at scala.collection.immutable.Set$Set2.foreach(Set.scala:201)
04:15:28 	at akka.stream.impl.fusing.ActorGraphInterpreter.postStop(ActorGraphInterpreter.scala:802)
04:15:28 	at akka.actor.Actor.aroundPostStop(Actor.scala:556)
04:15:28 	at akka.actor.Actor.aroundPostStop$(Actor.scala:556)
04:15:28 	at akka.stream.impl.fusing.ActorGraphInterpreter.aroundPostStop(ActorGraphInterpreter.scala:691)
04:15:28 	at akka.actor.dungeon.FaultHandling.finishTerminate(FaultHandling.scala:240)
04:15:28 	at akka.actor.dungeon.FaultHandling.terminate(FaultHandling.scala:197)
04:15:28 	at akka.actor.dungeon.FaultHandling.terminate$(FaultHandling.scala:167)
04:15:28 	at akka.actor.ActorCell.terminate(ActorCell.scala:410)
04:15:28 	at akka.actor.ActorCell.invokeAll$1(ActorCell.scala:519)
04:15:28 	at akka.actor.ActorCell.systemInvoke(ActorCell.scala:535)
04:15:28 	at akka.dispatch.Mailbox.processAllSystemMessages(Mailbox.scala:295)
04:15:28 	at akka.dispatch.Mailbox.run(Mailbox.scala:230)
04:15:28 	at akka.dispatch.Mailbox.exec(Mailbox.scala:243)
04:15:28 	at java.base/java.util.concurrent.ForkJoinTask.doExec(ForkJoinTask.java:290)
04:15:28 	at java.base/java.util.concurrent.ForkJoinPool$WorkQueue.topLevelExec(ForkJoinPool.java:1020)
04:15:28 	at java.base/java.util.concurrent.ForkJoinPool.scan(ForkJoinPool.java:1656)
04:15:28 	at java.base/java.util.concurrent.ForkJoinPool.runWorker(ForkJoinPool.java:1594)
04:15:28 	at java.base/java.util.concurrent.ForkJoinWorkerThread.run(ForkJoinWorkerThread.java:177)
04:15:28 
04:15:28 [INFO] Tests run: 2, Failures: 0, Errors: 0, Skipped: 0, Time elapsed: 0.763 s - in org.eclipse.ditto.services.connectivity.messaging.httppush.HttpPublisherErrorTest
04:15:29 [INFO] Running org.eclipse.ditto.services.connectivity.messaging.httppush.HttpPublisherActorTest
04:15:29 [INFO] Tests run: 10, Failures: 0, Errors: 0, Skipped: 0, Time elapsed: 0.637 s - in org.eclipse.ditto.services.connectivity.messaging.httppush.HttpPublisherActorTest
04:15:29 [INFO] Running org.eclipse.ditto.services.connectivity.messaging.httppush.HttpPushValidatorTest
04:15:29 [INFO] Tests run: 4, Failures: 0, Errors: 0, Skipped: 0, Time elapsed: 0.055 s - in org.eclipse.ditto.services.connectivity.messaging.httppush.HttpPushValidatorTest
04:15:29 [INFO] Running org.eclipse.ditto.services.connectivity.messaging.httppush.HttpPushClientActorTest
04:15:29 08:15:31.286 [WARN ] [HttpPushClientActorTest-akka.actor.default-dispatcher-16] akka.actor.ActorSystemImpl(HttpPushClientActorTest) a.a.ActorSystemImpl - Illegal request, responding with status '400 Bad Request': Unsupported HTTP method
04:15:31 [INFO] Tests run: 14, Failures: 0, Errors: 0, Skipped: 0, Time elapsed: 1.933 s - in org.eclipse.ditto.services.connectivity.messaging.httppush.HttpPushClientActorTest
04:15:31 [INFO] Running org.eclipse.ditto.services.connectivity.messaging.ConnectivityProxyActorTest
04:15:31 [INFO] [10/27/2020 08:15:32.236] [AkkaTestSystem-akka.actor.default-dispatcher-6] [akka://AkkaTestSystem/user/$b/aggregatorProxy][x-correlation-id:e2a6e4e0-35a1-483a-9dc8-b1a37e26f88b] Got 'RetrieveThings' message. Retrieving requested '10' Things..
04:15:32 [INFO] Tests run: 2, Failures: 0, Errors: 0, Skipped: 0, Time elapsed: 0.664 s - in org.eclipse.ditto.services.connectivity.messaging.ConnectivityProxyActorTest
04:15:32 [INFO] Running org.eclipse.ditto.services.connectivity.messaging.internal.ssl.CustomSSLContextTest
04:15:32 [INFO] Tests run: 10, Failures: 0, Errors: 0, Skipped: 0, Time elapsed: 1.695 s - in org.eclipse.ditto.services.connectivity.messaging.internal.ssl.CustomSSLContextTest
04:15:34 [INFO] Running org.eclipse.ditto.services.connectivity.messaging.internal.ssl.SSLContextCreatorTest
04:15:34 [INFO] Tests run: 10, Failures: 0, Errors: 0, Skipped: 0, Time elapsed: 1.758 s - in org.eclipse.ditto.services.connectivity.messaging.internal.ssl.SSLContextCreatorTest
04:15:35 [INFO] Running org.eclipse.ditto.services.connectivity.messaging.amqp.AmqpConsumerActorTest
04:15:35 [INFO] Tests run: 17, Failures: 0, Errors: 0, Skipped: 0, Time elapsed: 2.154 s - in org.eclipse.ditto.services.connectivity.messaging.amqp.AmqpConsumerActorTest
04:15:37 [INFO] Running org.eclipse.ditto.services.connectivity.messaging.amqp.AmqpPublisherActorTest
04:15:37 ImmutableAcknowledgement [label=please-verify, entityId=ditto:thing, statusCode=OK, payload=null, dittoHeaders=ImmutableDittoHeaders [{ditto-connection-id=connection-31e29eb2-7582-4b01-93d0-f3212f84f392, device_id=ditto:thing, response-required=false, correlation-id=cid, requested-acks=["please-verify"]}]]
04:15:57 [ERROR] Tests run: 7, Failures: 1, Errors: 0, Skipped: 0, Time elapsed: 19.667 s <<< FAILURE! - in org.eclipse.ditto.services.connectivity.messaging.amqp.AmqpPublisherActorTest
04:15:57 [ERROR] org.eclipse.ditto.services.connectivity.messaging.amqp.AmqpPublisherActorTest.testMsgPublishedOntoFullQueueShallBeDropped  Time elapsed: 0.762 s  <<< FAILURE!
04:15:57 org.mockito.exceptions.verification.TooFewActualInvocations: 
04:15:57 
04:15:57 messageProducer.send(
04:15:57     <any org.apache.qpid.jms.message.JmsMessage>,
04:15:57     <any javax.jms.CompletionListener>
04:15:57 );
04:15:57 Wanted 4 times:
04:15:57 -> at org.eclipse.ditto.services.connectivity.messaging.amqp.AmqpPublisherActorTest$2.<init>(AmqpPublisherActorTest.java:154)
04:15:57 But was 1 time:
04:15:57 -> at org.eclipse.ditto.services.connectivity.messaging.amqp.AmqpPublisherActor.lambda$newContextWithProducer$5(AmqpPublisherActor.java:325)
04:15:57 
04:15:57 	at org.eclipse.ditto.services.connectivity.messaging.amqp.AmqpPublisherActorTest.testMsgPublishedOntoFullQueueShallBeDropped(AmqpPublisherActorTest.java:115)
04:15:57 
04:15:57 [INFO] Running org.eclipse.ditto.services.connectivity.messaging.amqp.AmqpTargetTest
04:15:57 [INFO] Tests run: 5, Failures: 0, Errors: 0, Skipped: 0, Time elapsed: 0.016 s - in org.eclipse.ditto.services.connectivity.messaging.amqp.AmqpTargetTest
04:15:57 [INFO] Running org.eclipse.ditto.services.connectivity.messaging.amqp.AmqpClientActorTest
04:15:57 08:16:00.820 [ERROR] [AkkaTestSystem-akka.actor.default-dispatcher-6] akka://AkkaTestSystem/user/$$a/jmsConnectionHandling-connection-dd3de213-08ef-4cb3-ba39-317602d346d8-connect1 a.a.OneForOneStrategy - expected exception
04:16:00 java.lang.IllegalStateException: expected exception
04:16:00 	at org.apache.qpid.jms.JmsSession.createConsumer(JmsSession.java:458)
04:16:00 	at org.eclipse.ditto.services.connectivity.messaging.amqp.JMSConnectionHandlingActor.createJmsConsumer(JMSConnectionHandlingActor.java:341)
04:16:00 	at org.eclipse.ditto.services.connectivity.messaging.amqp.JMSConnectionHandlingActor.createMessageConsumer(JMSConnectionHandlingActor.java:149)
04:16:00 	at akka.japi.pf.UnitCaseStatement.apply(CaseStatements.scala:24)
04:16:00 	at akka.japi.pf.UnitCaseStatement.apply(CaseStatements.scala:20)
04:16:00 	at scala.PartialFunction.applyOrElse(PartialFunction.scala:187)
04:16:00 	at scala.PartialFunction.applyOrElse$(PartialFunction.scala:186)
04:16:00 	at akka.japi.pf.UnitCaseStatement.applyOrElse(CaseStatements.scala:20)
04:16:00 	at scala.PartialFunction$OrElse.applyOrElse(PartialFunction.scala:241)
04:16:00 	at scala.PartialFunction$OrElse.applyOrElse(PartialFunction.scala:242)
04:16:00 	at scala.PartialFunction$OrElse.applyOrElse(PartialFunction.scala:242)
04:16:00 	at scala.PartialFunction$OrElse.applyOrElse(PartialFunction.scala:242)
04:16:00 	at scala.PartialFunction$OrElse.applyOrElse(PartialFunction.scala:242)
04:16:00 	at akka.actor.Actor.aroundReceive(Actor.scala:537)
04:16:00 	at akka.actor.Actor.aroundReceive$(Actor.scala:535)
04:16:00 	at akka.actor.AbstractActor.aroundReceive(AbstractActor.scala:220)
04:16:00 	at akka.actor.ActorCell.receiveMessage(ActorCell.scala:577)
04:16:00 	at akka.actor.ActorCell.invoke(ActorCell.scala:547)
04:16:00 	at akka.dispatch.Mailbox.processMailbox(Mailbox.scala:270)
04:16:00 	at akka.dispatch.Mailbox.run(Mailbox.scala:231)
04:16:00 	at java.base/java.util.concurrent.ThreadPoolExecutor.runWorker(ThreadPoolExecutor.java:1128)
04:16:00 	at java.base/java.util.concurrent.ThreadPoolExecutor$Worker.run(ThreadPoolExecutor.java:628)
04:16:00 	at java.base/java.lang.Thread.run(Thread.java:834)
04:16:00 08:16:01.464 [ERROR] [AkkaTestSystem-jms-connection-handling-dispatcher-106]  o.a.q.j.JmsConnection - Failed to connect to remote at: amqps://127.0.0.1:36811
04:16:01 [INFO] Tests run: 33, Failures: 0, Errors: 0, Skipped: 0, Time elapsed: 4.148 s - in org.eclipse.ditto.services.connectivity.messaging.amqp.AmqpClientActorTest
04:16:01 [INFO] Running org.eclipse.ditto.services.connectivity.messaging.amqp.AmqpValidatorTest
04:16:01 [INFO] Tests run: 8, Failures: 0, Errors: 0, Skipped: 0, Time elapsed: 0.008 s - in org.eclipse.ditto.services.connectivity.messaging.amqp.AmqpValidatorTest
04:16:01 [INFO] Running org.eclipse.ditto.services.connectivity.messaging.amqp.JmsConnectionHandlingActorTest
04:16:01 [INFO] Tests run: 7, Failures: 0, Errors: 0, Skipped: 0, Time elapsed: 0.184 s - in org.eclipse.ditto.services.connectivity.messaging.amqp.JmsConnectionHandlingActorTest
04:16:01 [INFO] Running org.eclipse.ditto.services.connectivity.messaging.backoff.DefaultTimeoutConfigTest
04:16:01 [INFO] Tests run: 3, Failures: 0, Errors: 0, Skipped: 0, Time elapsed: 0.021 s - in org.eclipse.ditto.services.connectivity.messaging.backoff.DefaultTimeoutConfigTest
04:16:01 [INFO] Running org.eclipse.ditto.services.connectivity.messaging.backoff.DefaultBackOffConfigTest
04:16:01 [INFO] Tests run: 3, Failures: 0, Errors: 0, Skipped: 0, Time elapsed: 0.007 s - in org.eclipse.ditto.services.connectivity.messaging.backoff.DefaultBackOffConfigTest
04:16:01 [INFO] Running org.eclipse.ditto.services.connectivity.messaging.backoff.DuplicationRetryTimeoutStrategyTest
04:16:01 [INFO] Tests run: 4, Failures: 0, Errors: 0, Skipped: 0, Time elapsed: 0.001 s - in org.eclipse.ditto.services.connectivity.messaging.backoff.DuplicationRetryTimeoutStrategyTest
04:16:01 [INFO] Running org.eclipse.ditto.services.connectivity.messaging.backoff.BackOffActorTest
04:16:01 [INFO] Tests run: 5, Failures: 0, Errors: 0, Skipped: 0, Time elapsed: 36.387 s - in org.eclipse.ditto.services.connectivity.messaging.backoff.BackOffActorTest
04:16:38 [INFO] Running org.eclipse.ditto.services.connectivity.messaging.rabbitmq.RabbitMQValidatorTest
04:16:38 [INFO] Tests run: 9, Failures: 0, Errors: 0, Skipped: 0, Time elapsed: 0.032 s - in org.eclipse.ditto.services.connectivity.messaging.rabbitmq.RabbitMQValidatorTest
04:16:38 [INFO] Running org.eclipse.ditto.services.connectivity.messaging.rabbitmq.RabbitMQConsumerActorTest
04:16:38 [INFO] Tests run: 13, Failures: 0, Errors: 0, Skipped: 0, Time elapsed: 1.064 s - in org.eclipse.ditto.services.connectivity.messaging.rabbitmq.RabbitMQConsumerActorTest
04:16:39 [INFO] Running org.eclipse.ditto.services.connectivity.messaging.rabbitmq.RabbitMQClientActorTest
04:16:39 08:16:39.987 [INFO ] [AkkaTestSystem-akka.actor.default-dispatcher-15] akka://AkkaTestSystem@127.0.0.1:44178/user/$a/rmq-connection1 c.n.a.r.ConnectionActor - akka://AkkaTestSystem/user/$a/rmq-connection1 connected to amqp://null@null:0/null
04:16:39 08:16:39.993 [INFO ] [AkkaTestSystem-akka.actor.default-dispatcher-8] akka://AkkaTestSystem@127.0.0.1:44178/user/$a/rmq-connection1/publisher-channel c.n.a.r.ChannelActor - akka://AkkaTestSystem/user/$a/rmq-connection1/publisher-channel connected
04:16:39 08:16:40.994 [INFO ] [AkkaTestSystem-akka.actor.default-dispatcher-8] akka://AkkaTestSystem@127.0.0.1:44178/user/$a/rmq-connection1/consumer-channel c.n.a.r.ChannelActor - akka://AkkaTestSystem/user/$a/rmq-connection1/consumer-channel connected
04:16:40 08:16:40.997 [INFO ] [AkkaTestSystem-akka.actor.default-dispatcher-14] akka://AkkaTestSystem@127.0.0.1:44178/user/$a/rmq-connection1 c.n.a.r.ConnectionActor - closing connection to amqp://null@null:0/null
04:16:40 08:16:41.011 [INFO ] [AkkaTestSystem-akka.actor.default-dispatcher-8] akka://AkkaTestSystem@127.0.0.1:44178/user/$b/rmq-connection1 c.n.a.r.ConnectionActor - akka://AkkaTestSystem/user/$b/rmq-connection1 connected to amqp://null@null:0/null
04:16:41 08:16:41.012 [INFO ] [AkkaTestSystem-akka.actor.default-dispatcher-6] akka://AkkaTestSystem@127.0.0.1:44178/user/$b/rmq-connection1/publisher-channel c.n.a.r.ChannelActor - akka://AkkaTestSystem/user/$b/rmq-connection1/publisher-channel connected
04:16:41 08:16:42.012 [INFO ] [AkkaTestSystem-akka.actor.default-dispatcher-20] akka://AkkaTestSystem@127.0.0.1:44178/user/$b/rmq-connection1/consumer-channel c.n.a.r.ChannelActor - akka://AkkaTestSystem/user/$b/rmq-connection1/consumer-channel connected
04:16:42 08:16:42.042 [INFO ] [AkkaTestSystem-akka.actor.default-dispatcher-20] akka://AkkaTestSystem@127.0.0.1:44178/user/$d/rmq-connection1 c.n.a.r.ConnectionActor - akka://AkkaTestSystem/user/$d/rmq-connection1 connected to amqp://null@null:0/null
04:16:42 08:16:42.043 [INFO ] [AkkaTestSystem-akka.actor.default-dispatcher-14] akka://AkkaTestSystem@127.0.0.1:44178/user/$d/rmq-connection1/publisher-channel c.n.a.r.ChannelActor - akka://AkkaTestSystem/user/$d/rmq-connection1/publisher-channel connected
04:16:42 08:16:43.044 [INFO ] [AkkaTestSystem-akka.actor.default-dispatcher-14] akka://AkkaTestSystem@127.0.0.1:44178/user/$d/rmq-connection1/consumer-channel c.n.a.r.ChannelActor - akka://AkkaTestSystem/user/$d/rmq-connection1/consumer-channel connected
04:16:43 08:16:43.067 [INFO ] [AkkaTestSystem-akka.actor.default-dispatcher-14] akka://AkkaTestSystem@127.0.0.1:44178/user/$d/rmq-connection1 c.n.a.r.ConnectionActor - akka://AkkaTestSystem/user/$d/rmq-connection1 in Connected received AmqpShutdownSignal(com.rabbitmq.client.ShutdownSignalException: clean connection shutdown): reconnecting to amqp://null@null:0/null in 5 seconds
04:16:43 08:16:43.068 [WARN ] [AkkaTestSystem-akka.actor.default-dispatcher-15] akka://AkkaTestSystem@127.0.0.1:44178/user/$d/rmq-connection1 c.n.a.r.ConnectionActor - akka://AkkaTestSystem/user/$d/rmq-connection1 lost connection to amqp://null@null:0/null
04:16:43 08:16:43.068 [WARN ] [AkkaTestSystem-akka.actor.default-dispatcher-15] akka://AkkaTestSystem@127.0.0.1:44178/user/$d/rmq-connection1/consumer-channel c.n.a.r.ChannelActor - akka://AkkaTestSystem/user/$d/rmq-connection1/consumer-channel disconnected
04:16:43 08:16:43.068 [WARN ] [AkkaTestSystem-akka.actor.default-dispatcher-15] akka://AkkaTestSystem@127.0.0.1:44178/user/$d/rmq-connection1/publisher-channel c.n.a.r.ChannelActor - akka://AkkaTestSystem/user/$d/rmq-connection1/publisher-channel disconnected
04:16:43 08:16:48.082 [INFO ] [AkkaTestSystem-akka.actor.default-dispatcher-14] akka://AkkaTestSystem@127.0.0.1:44178/user/$d/rmq-connection1 c.n.a.r.ConnectionActor - akka://AkkaTestSystem/user/$d/rmq-connection1 connected to amqp://null@null:0/null
04:16:48 08:16:48.083 [INFO ] [AkkaTestSystem-akka.actor.default-dispatcher-20] akka://AkkaTestSystem@127.0.0.1:44178/user/$d/rmq-connection1/publisher-channel c.n.a.r.ChannelActor - akka://AkkaTestSystem/user/$d/rmq-connection1/publisher-channel connected
04:16:48 08:16:48.084 [INFO ] [AkkaTestSystem-akka.actor.default-dispatcher-8] akka://AkkaTestSystem@127.0.0.1:44178/user/$d/rmq-connection1/consumer-channel c.n.a.r.ChannelActor - akka://AkkaTestSystem/user/$d/rmq-connection1/consumer-channel connected
04:16:48 08:16:48.104 [INFO ] [AkkaTestSystem-akka.actor.default-dispatcher-20] akka://AkkaTestSystem@127.0.0.1:44178/user/$d/rmq-connection1 c.n.a.r.ConnectionActor - closing connection to amqp://null@null:0/null
04:16:48 08:16:48.120 [INFO ] [AkkaTestSystem-akka.actor.default-dispatcher-6] akka://AkkaTestSystem@127.0.0.1:44178/user/$e/rmq-connection1 c.n.a.r.ConnectionActor - akka://AkkaTestSystem/user/$e/rmq-connection1 connected to amqp://null@null:0/null
04:16:48 08:16:48.121 [INFO ] [AkkaTestSystem-akka.actor.default-dispatcher-14] akka://AkkaTestSystem@127.0.0.1:44178/user/$e/rmq-connection1/publisher-channel c.n.a.r.ChannelActor - akka://AkkaTestSystem/user/$e/rmq-connection1/publisher-channel connected
04:16:48 08:16:49.122 [INFO ] [AkkaTestSystem-akka.actor.default-dispatcher-15] akka://AkkaTestSystem@127.0.0.1:44178/user/$e/rmq-connection1/consumer-channel c.n.a.r.ChannelActor - akka://AkkaTestSystem/user/$e/rmq-connection1/consumer-channel connected
04:16:49 08:16:49.123 [INFO ] [AkkaTestSystem-akka.actor.default-dispatcher-20] akka://AkkaTestSystem@127.0.0.1:44178/user/$e/rmq-connection1 c.n.a.r.ConnectionActor - closing connection to amqp://null@null:0/null
04:16:49 08:16:49.139 [INFO ] [AkkaTestSystem-akka.actor.default-dispatcher-14] akka://AkkaTestSystem@127.0.0.1:44178/user/$f/rmq-connection1 c.n.a.r.ConnectionActor - akka://AkkaTestSystem/user/$f/rmq-connection1 connected to amqp://null@null:0/null
04:16:49 08:16:49.139 [INFO ] [AkkaTestSystem-akka.actor.default-dispatcher-14] akka://AkkaTestSystem@127.0.0.1:44178/user/$f/rmq-connection1/publisher-channel c.n.a.r.ChannelActor - akka://AkkaTestSystem/user/$f/rmq-connection1/publisher-channel connected
04:16:49 08:16:50.140 [INFO ] [AkkaTestSystem-akka.actor.default-dispatcher-9] akka://AkkaTestSystem@127.0.0.1:44178/user/$f/rmq-connection1/consumer-channel c.n.a.r.ChannelActor - akka://AkkaTestSystem/user/$f/rmq-connection1/consumer-channel connected
04:16:50 08:16:50.141 [INFO ] [AkkaTestSystem-akka.actor.default-dispatcher-9] akka://AkkaTestSystem@127.0.0.1:44178/user/$f/rmq-connection1 c.n.a.r.ConnectionActor - closing connection to amqp://null@null:0/null
04:16:50 08:16:50.142 [INFO ] [AkkaTestSystem-akka.actor.default-dispatcher-14] akka://AkkaTestSystem@127.0.0.1:44178/user/$f/rmq-connection5 c.n.a.r.ConnectionActor - akka://AkkaTestSystem/user/$f/rmq-connection5 connected to amqp://null@null:0/null
04:16:50 08:16:50.142 [INFO ] [AkkaTestSystem-akka.actor.default-dispatcher-9] akka://AkkaTestSystem@127.0.0.1:44178/user/$f/rmq-connection5/publisher-channel c.n.a.r.ChannelActor - akka://AkkaTestSystem/user/$f/rmq-connection5/publisher-channel connected
04:16:50 08:16:51.144 [INFO ] [AkkaTestSystem-akka.actor.default-dispatcher-6] akka://AkkaTestSystem@127.0.0.1:44178/user/$f/rmq-connection5/consumer-channel c.n.a.r.ChannelActor - akka://AkkaTestSystem/user/$f/rmq-connection5/consumer-channel connected
04:16:51 08:16:51.145 [INFO ] [AkkaTestSystem-akka.actor.default-dispatcher-8] akka://AkkaTestSystem@127.0.0.1:44178/user/$f/rmq-connection5 c.n.a.r.ConnectionActor - closing connection to amqp://null@null:0/null
04:16:51 08:16:51.147 [INFO ] [AkkaTestSystem-akka.actor.default-dispatcher-6] akka://AkkaTestSystem@127.0.0.1:44178/user/$f/rmq-connection9 c.n.a.r.ConnectionActor - akka://AkkaTestSystem/user/$f/rmq-connection9 connected to amqp://null@null:0/null
04:16:51 08:16:51.148 [INFO ] [AkkaTestSystem-akka.actor.default-dispatcher-14] akka://AkkaTestSystem@127.0.0.1:44178/user/$f/rmq-connection9/publisher-channel c.n.a.r.ChannelActor - akka://AkkaTestSystem/user/$f/rmq-connection9/publisher-channel connected
04:16:51 08:16:52.148 [INFO ] [AkkaTestSystem-akka.actor.default-dispatcher-14] akka://AkkaTestSystem@127.0.0.1:44178/user/$f/rmq-connection9/consumer-channel c.n.a.r.ChannelActor - akka://AkkaTestSystem/user/$f/rmq-connection9/consumer-channel connected
04:16:52 08:16:52.150 [INFO ] [AkkaTestSystem-akka.actor.default-dispatcher-14] akka://AkkaTestSystem@127.0.0.1:44178/user/$f/rmq-connection9 c.n.a.r.ConnectionActor - closing connection to amqp://null@null:0/null
04:16:52 08:16:52.165 [INFO ] [AkkaTestSystem-akka.actor.default-dispatcher-15] akka://AkkaTestSystem@127.0.0.1:44178/user/$g/rmq-connection1 c.n.a.r.ConnectionActor - akka://AkkaTestSystem/user/$g/rmq-connection1 connected to amqp://null@null:0/null
04:16:52 08:16:52.165 [INFO ] [AkkaTestSystem-akka.actor.default-dispatcher-6] akka://AkkaTestSystem@127.0.0.1:44178/user/$g/rmq-connection1/publisher-channel c.n.a.r.ChannelActor - akka://AkkaTestSystem/user/$g/rmq-connection1/publisher-channel connected
04:16:52 08:16:53.166 [INFO ] [AkkaTestSystem-akka.actor.default-dispatcher-8] akka://AkkaTestSystem@127.0.0.1:44178/user/$g/rmq-connection1/consumer-channel c.n.a.r.ChannelActor - akka://AkkaTestSystem/user/$g/rmq-connection1/consumer-channel connected
04:16:53 08:16:53.167 [INFO ] [AkkaTestSystem-akka.actor.default-dispatcher-8] akka://AkkaTestSystem@127.0.0.1:44178/user/$g/rmq-connection1 c.n.a.r.ConnectionActor - closing connection to amqp://null@null:0/null
04:16:53 08:16:53.183 [INFO ] [AkkaTestSystem-akka.actor.default-dispatcher-14] akka://AkkaTestSystem@127.0.0.1:44178/user/$h/rmq-connection1 c.n.a.r.ConnectionActor - akka://AkkaTestSystem/user/$h/rmq-connection1 connected to amqp://null@null:0/null
04:16:53 08:16:53.183 [INFO ] [AkkaTestSystem-akka.actor.default-dispatcher-6] akka://AkkaTestSystem@127.0.0.1:44178/user/$h/rmq-connection1/publisher-channel c.n.a.r.ChannelActor - akka://AkkaTestSystem/user/$h/rmq-connection1/publisher-channel connected
04:16:53 08:16:54.184 [INFO ] [AkkaTestSystem-akka.actor.default-dispatcher-9] akka://AkkaTestSystem@127.0.0.1:44178/user/$h/rmq-connection1/consumer-channel c.n.a.r.ChannelActor - akka://AkkaTestSystem/user/$h/rmq-connection1/consumer-channel connected
04:16:54 08:16:54.455 [ERROR] [AkkaTestSystem-jms-connection-handling-dispatcher-21]  o.a.q.j.JmsConnection - Failed to connect to remote at: amqps://127.0.0.1:43844
04:16:54 08:16:54.703 [INFO ] [AkkaTestSystem-akka.actor.default-dispatcher-6] akka://AkkaTestSystem@127.0.0.1:44178/user/$b/rmq-connection1 c.n.a.r.ConnectionActor - closing connection to amqp://null@null:0/null
04:16:54 08:16:54.703 [INFO ] [AkkaTestSystem-akka.actor.default-dispatcher-6] akka://AkkaTestSystem@127.0.0.1:44178/user/$h/rmq-connection1 c.n.a.r.ConnectionActor - closing connection to amqp://null@null:0/null
04:16:54 [INFO] Tests run: 17, Failures: 0, Errors: 0, Skipped: 0, Time elapsed: 15.23 s - in org.eclipse.ditto.services.connectivity.messaging.rabbitmq.RabbitMQClientActorTest
04:16:54 [INFO] Running org.eclipse.ditto.services.connectivity.messaging.rabbitmq.RabbitMQPublisherActorTest
04:16:54 [INFO] Tests run: 4, Failures: 0, Errors: 0, Skipped: 0, Time elapsed: 0.226 s - in org.eclipse.ditto.services.connectivity.messaging.rabbitmq.RabbitMQPublisherActorTest
04:16:54 [INFO] Running org.eclipse.ditto.services.connectivity.messaging.ResponseCollectorActorTest
04:16:54 [INFO] Tests run: 4, Failures: 0, Errors: 0, Skipped: 0, Time elapsed: 0.132 s - in org.eclipse.ditto.services.connectivity.messaging.ResponseCollectorActorTest
04:16:55 [INFO] Running org.eclipse.ditto.services.connectivity.messaging.DroppedTest
04:16:55 [INFO] Tests run: 2, Failures: 0, Errors: 0, Skipped: 0, Time elapsed: 0.377 s - in org.eclipse.ditto.services.connectivity.messaging.DroppedTest
04:16:55 [INFO] Running org.eclipse.ditto.services.connectivity.messaging.SendingTest
04:16:55 [INFO] Tests run: 10, Failures: 0, Errors: 0, Skipped: 0, Time elapsed: 0.485 s - in org.eclipse.ditto.services.connectivity.messaging.SendingTest
04:16:55 [INFO] Running org.eclipse.ditto.services.connectivity.messaging.MessageMappingProcessorActorTest
04:16:55 [INFO] Tests run: 21, Failures: 0, Errors: 0, Skipped: 0, Time elapsed: 1.612 s - in org.eclipse.ditto.services.connectivity.messaging.MessageMappingProcessorActorTest
04:16:57 [INFO] Running org.eclipse.ditto.services.connectivity.messaging.OutboundSignalToExternalMessageTest
04:16:57 [INFO] Tests run: 1, Failures: 0, Errors: 0, Skipped: 0, Time elapsed: 0.001 s - in org.eclipse.ditto.services.connectivity.messaging.OutboundSignalToExternalMessageTest
04:16:57 [INFO] Running org.eclipse.ditto.services.connectivity.messaging.OutboundMappingProcessorTest
04:16:57 [INFO] Tests run: 10, Failures: 0, Errors: 0, Skipped: 0, Time elapsed: 0.464 s - in org.eclipse.ditto.services.connectivity.messaging.OutboundMappingProcessorTest
04:16:58 [INFO] Running org.eclipse.ditto.services.connectivity.messaging.ErrorHandlingActorTest
04:16:58 08:16:58.083 [WARN ] [AkkaTestSystem-akka.actor.default-dispatcher-5] akka.serialization.Serialization(akka://AkkaTestSystem) a.s.Serialization(akka://AkkaTestSystem) - Using the Java serializer for class [org.bson.BsonDocument] which is not recommended because of performance implications. Use another serializer or disable this warning using the setting 'akka.actor.warn-about-java-serializer-usage'
04:16:58 [INFO] Tests run: 4, Failures: 0, Errors: 0, Skipped: 0, Time elapsed: 0.124 s - in org.eclipse.ditto.services.connectivity.messaging.ErrorHandlingActorTest
04:16:58 [INFO] Running org.eclipse.ditto.services.connectivity.messaging.DefaultExceptionToAcknowledgementConverterTest
04:16:58 [INFO] Tests run: 11, Failures: 0, Errors: 0, Skipped: 0, Time elapsed: 0.005 s - in org.eclipse.ditto.services.connectivity.messaging.DefaultExceptionToAcknowledgementConverterTest
04:16:58 [INFO] Running org.eclipse.ditto.services.connectivity.messaging.ReconnectActorTest
04:16:58 [INFO] Tests run: 3, Failures: 0, Errors: 0, Skipped: 0, Time elapsed: 2.252 s - in org.eclipse.ditto.services.connectivity.messaging.ReconnectActorTest
04:17:00 [INFO] Running org.eclipse.ditto.services.connectivity.messaging.InboundMappingProcessorTest
04:17:00 [INFO] Tests run: 11, Failures: 0, Errors: 0, Skipped: 0, Time elapsed: 0.183 s - in org.eclipse.ditto.services.connectivity.messaging.InboundMappingProcessorTest
04:17:00 [INFO] 
04:17:01 [INFO] Results:
04:17:01 [INFO] 
04:17:01 [ERROR] Failures: 
04:17:01 [ERROR]   AmqpPublisherActorTest.testMsgPublishedOntoFullQueueShallBeDropped:115 
04:17:01 messageProducer.send(
04:17:01     <any org.apache.qpid.jms.message.JmsMessage>,
04:17:01     <any javax.jms.CompletionListener>
04:17:01 );
04:17:01 Wanted 4 times:
04:17:01 -> at org.eclipse.ditto.services.connectivity.messaging.amqp.AmqpPublisherActorTest$2.<init>(AmqpPublisherActorTest.java:154)
04:17:01 But was 1 time:
04:17:01 -> at org.eclipse.ditto.services.connectivity.messaging.amqp.AmqpPublisherActor.lambda$newContextWithProducer$5(AmqpPublisherActor.java:325)
04:17:01 
04:17:01 [INFO] 
04:17:01 [ERROR] Tests run: 737, Failures: 1, Errors: 0, Skipped: 0
04:17:01 [INFO] 
04:17:01 [INFO] ------------------------------------------------------------------------
04:17:01 [INFO] Reactor Summary for Eclipse Ditto 0-SNAPSHOT:
04:17:01 [INFO] 
04:17:01 [INFO] Eclipse Ditto ...................................... SUCCESS [ 43.990 s]
04:17:01 [INFO] Eclipse Ditto :: Legal ............................. SUCCESS [ 10.699 s]
04:17:01 [INFO] Eclipse Ditto :: BOM ............................... SUCCESS [  0.084 s]
04:17:01 [INFO] Eclipse Ditto :: Documentation ..................... SUCCESS [  0.273 s]
04:17:01 [INFO] Eclipse Ditto :: Utils ............................. SUCCESS [  8.121 s]
04:17:01 [INFO] Eclipse Ditto :: Utils :: JSR-305 Extensions ....... SUCCESS [ 10.305 s]
04:17:01 [INFO] Eclipse Ditto :: JSON .............................. SUCCESS [ 13.096 s]
04:17:01 [INFO] Eclipse Ditto :: JSON :: CBOR ...................... SUCCESS [  3.906 s]
04:17:01 [INFO] Eclipse Ditto :: Model ............................. SUCCESS [  1.449 s]
04:17:01 [INFO] Eclipse Ditto :: Model :: Base ..................... SUCCESS [  8.357 s]
04:17:01 [INFO] Eclipse Ditto :: Model :: Policies ................. SUCCESS [  4.090 s]
04:17:01 [INFO] Eclipse Ditto :: Model :: Things ................... SUCCESS [  6.824 s]
04:17:01 [INFO] Eclipse Ditto :: Model :: Connectivity ............. SUCCESS [  5.308 s]
04:17:01 [INFO] Eclipse Ditto :: Model :: DevOps ................... SUCCESS [  0.889 s]
04:17:01 [INFO] Eclipse Ditto :: Model :: Messages ................. SUCCESS [  4.101 s]
04:17:01 [INFO] Eclipse Ditto :: Model :: Namespaces ............... SUCCESS [  1.925 s]
04:17:01 [INFO] Eclipse Ditto :: Model :: Enforcers ................ SUCCESS [ 34.965 s]
04:17:01 [INFO] Eclipse Ditto :: Model :: JWT ...................... SUCCESS [  2.690 s]
04:17:01 [INFO] Eclipse Ditto :: Model :: Thing Search ............. SUCCESS [  3.419 s]
04:17:01 [INFO] Eclipse Ditto :: Model :: RQL ...................... SUCCESS [  2.422 s]
04:17:01 [INFO] Eclipse Ditto :: Model :: RQL parser ............... SUCCESS [ 38.423 s]
04:17:01 [INFO] Eclipse Ditto :: Model :: Thing Search Parser ...... SUCCESS [  8.783 s]
04:17:01 [INFO] Eclipse Ditto :: Model :: Query .................... SUCCESS [  3.686 s]
04:17:01 [INFO] Eclipse Ditto :: Signals ........................... SUCCESS [  0.022 s]
04:17:01 [INFO] Eclipse Ditto :: Signals :: Base ................... SUCCESS [  2.423 s]
04:17:01 [INFO] Eclipse Ditto :: Signals :: Commands ............... SUCCESS [  0.025 s]
04:17:01 [INFO] Eclipse Ditto :: Signals :: Commands :: Base ....... SUCCESS [  2.088 s]
04:17:01 [INFO] Eclipse Ditto :: Signals :: ACKs ................... SUCCESS [  0.024 s]
04:17:01 [INFO] Eclipse Ditto :: Signals :: ACKs :: Base ........... SUCCESS [  4.318 s]
04:17:01 [INFO] Eclipse Ditto :: Signals :: ACKs :: Things ......... SUCCESS [  3.426 s]
04:17:01 [INFO] Eclipse Ditto :: Signals :: Commands :: Policies ... SUCCESS [  5.653 s]
04:17:01 [INFO] Eclipse Ditto :: Signals :: Commands :: Things ..... SUCCESS [  9.723 s]
04:17:01 [INFO] Eclipse Ditto :: Signals :: Commands :: Thing Search SUCCESS [  2.900 s]
04:17:01 [INFO] Eclipse Ditto :: Signals :: Commands :: Messages ... SUCCESS [  5.068 s]
04:17:01 [INFO] Eclipse Ditto :: Signals :: Events ................. SUCCESS [  0.023 s]
04:17:01 [INFO] Eclipse Ditto :: Signals :: Events :: Base ......... SUCCESS [  1.675 s]
04:17:01 [INFO] Eclipse Ditto :: Signals :: Events :: Policies ..... SUCCESS [  4.095 s]
04:17:01 [INFO] Eclipse Ditto :: Signals :: Events :: Things ....... SUCCESS [  4.858 s]
04:17:01 [INFO] Eclipse Ditto :: Signals :: Events :: Thing Search . SUCCESS [  2.599 s]
04:17:01 [INFO] Eclipse Ditto :: Protocol Adapter .................. SUCCESS [ 11.598 s]
04:17:01 [INFO] Eclipse Ditto :: Model :: Placeholders ............. SUCCESS [  3.802 s]
04:17:01 [INFO] Eclipse Ditto :: Signals :: Commands :: Common ..... SUCCESS [  3.597 s]
04:17:01 [INFO] Eclipse Ditto :: Signals :: Commands :: Connectivity SUCCESS [  4.370 s]
04:17:01 [INFO] Eclipse Ditto :: Signals :: Commands :: DevOps ..... SUCCESS [  2.999 s]
04:17:01 [INFO] Eclipse Ditto :: Signals :: Commands :: Live ....... SUCCESS [  6.679 s]
04:17:01 [INFO] Eclipse Ditto :: Signals :: Commands :: Namespaces . SUCCESS [  2.638 s]
04:17:01 [INFO] Eclipse Ditto :: Signals :: Commands :: Cleanup .... SUCCESS [  2.305 s]
04:17:01 [INFO] Eclipse Ditto :: Signals :: Events :: Connectivity . SUCCESS [  2.547 s]
04:17:01 [INFO] Eclipse Ditto :: Services .......................... SUCCESS [  0.017 s]
04:17:01 [INFO] Eclipse Ditto :: Services :: Models ................ SUCCESS [  0.017 s]
04:17:01 [INFO] Eclipse Ditto :: Services :: Models :: Base ........ SUCCESS [  0.100 s]
04:17:01 [INFO] Eclipse Ditto :: Services :: Utils ................. SUCCESS [  0.018 s]
04:17:01 [INFO] Eclipse Ditto :: Services :: Utils :: Config Utils . SUCCESS [  6.408 s]
04:17:01 [INFO] Eclipse Ditto :: Services :: Utils :: Metrics ...... SUCCESS [  7.864 s]
04:17:01 [INFO] Eclipse Ditto :: Services :: Models :: Streaming ... SUCCESS [  2.564 s]
04:17:01 [INFO] Eclipse Ditto :: Services :: Utils :: Akka Utils ... SUCCESS [ 23.329 s]
04:17:01 [INFO] Eclipse Ditto :: Services :: Utils :: Health Utils . SUCCESS [  5.120 s]
04:17:01 [INFO] Eclipse Ditto :: Services :: Utils :: Cluster Utils  SUCCESS [  7.055 s]
04:17:01 [INFO] Eclipse Ditto :: Services :: Utils :: DevOps ....... SUCCESS [  0.277 s]
04:17:01 [INFO] Eclipse Ditto :: Services :: Utils :: Tracing Utils  SUCCESS [  2.366 s]
04:17:01 [INFO] Eclipse Ditto :: Services :: Utils :: Cache Utils .. SUCCESS [  4.721 s]
04:17:01 [INFO] Eclipse Ditto :: Services :: Utils :: Test Utils ... SUCCESS [  0.696 s]
04:17:01 [INFO] Eclipse Ditto :: Services :: Utils :: Persistence Utils SUCCESS [ 11.784 s]
04:17:01 [INFO] Eclipse Ditto :: Services :: Base .................. SUCCESS [  6.619 s]
04:17:01 [INFO] Eclipse Ditto :: Services :: Concierge ............. SUCCESS [  0.016 s]
04:17:01 [INFO] Eclipse Ditto :: Services :: Concierge :: Common ... SUCCESS [  3.967 s]
04:17:01 [INFO] Eclipse Ditto :: Services :: Utils :: Distributed Data SUCCESS [  3.590 s]
04:17:01 [INFO] Eclipse Ditto :: Services :: Utils :: Pub-Sub ...... SUCCESS [ 49.272 s]
04:17:01 [INFO] Eclipse Ditto :: Services :: Models :: Things ...... SUCCESS [  3.299 s]
04:17:01 [INFO] Eclipse Ditto :: Services :: Models :: Policies .... SUCCESS [  2.825 s]
04:17:01 [INFO] Eclipse Ditto :: Services :: Models :: Things Search SUCCESS [  3.518 s]
04:17:01 [INFO] Eclipse Ditto :: Services :: Models :: Connectivity  SUCCESS [  3.481 s]
04:17:01 [INFO] Eclipse Ditto :: Services :: Models :: Concierge ... SUCCESS [  0.298 s]
04:17:01 [INFO] Eclipse Ditto :: Services :: Concierge :: Actors ... SUCCESS [  5.409 s]
04:17:01 [INFO] Eclipse Ditto :: Services :: Utils :: Cache Loaders  SUCCESS [  3.597 s]
04:17:01 [INFO] Eclipse Ditto :: Services :: Concierge :: Enforcement SUCCESS [ 16.689 s]
04:17:01 [INFO] Eclipse Ditto :: Services :: Utils :: Namespaces ... SUCCESS [  6.618 s]
04:17:01 [INFO] Eclipse Ditto :: Services :: Concierge :: Starter .. SUCCESS [ 10.123 s]
04:17:01 [INFO] Eclipse Ditto :: Services :: Connectivity .......... SUCCESS [  0.017 s]
04:17:01 [INFO] Eclipse Ditto :: Services :: Connectivity :: Util .. SUCCESS [  1.855 s]
04:17:01 [INFO] Eclipse Ditto :: Services :: Models :: Signal Enrichment SUCCESS [ 19.655 s]
04:17:01 [INFO] Eclipse Ditto :: Services :: Connectivity :: Mapping SUCCESS [ 28.476 s]
04:17:01 [INFO] Eclipse Ditto :: Services :: Utils :: Conditional Header Utils SUCCESS [  2.016 s]
04:17:01 [INFO] Eclipse Ditto :: Services :: Utils :: Persistent Actors SUCCESS [  5.399 s]
04:17:01 [INFO] Eclipse Ditto :: Services :: Utils :: Search ....... SUCCESS [  6.123 s]
04:17:01 [INFO] Eclipse Ditto :: Services :: Utils :: Aggregator ... SUCCESS [  2.956 s]
04:17:01 [INFO] Eclipse Ditto :: Services :: Models :: ACKs ........ SUCCESS [  6.780 s]
04:17:01 [INFO] Eclipse Ditto :: Services :: Utils :: Protocol ..... SUCCESS [  4.194 s]
04:17:01 [INFO] Eclipse Ditto :: Services :: Connectivity :: Messaging FAILURE [03:04 min]
04:17:01 [INFO] Eclipse Ditto :: Services :: Connectivity :: Starter SKIPPED
04:17:01 [INFO] Eclipse Ditto :: Services :: Gateway ............... SKIPPED
04:17:01 [INFO] Eclipse Ditto :: Services :: Gateway :: Util ....... SKIPPED
04:17:01 [INFO] Eclipse Ditto :: Services :: Utils :: JWT .......... SKIPPED
04:17:01 [INFO] Eclipse Ditto :: Services :: Gateway :: Security ... SKIPPED
04:17:01 [INFO] Eclipse Ditto :: Services :: Gateway :: Health ..... SKIPPED
04:17:01 [INFO] Eclipse Ditto :: Services :: Gateway :: Streaming .. SKIPPED
04:17:01 [INFO] Eclipse Ditto :: Services :: Gateway :: Endpoints .. SKIPPED
04:17:01 [INFO] Eclipse Ditto :: Services :: Gateway :: Proxy ...... SKIPPED
04:17:01 [INFO] Eclipse Ditto :: Services :: Gateway :: Starter .... SKIPPED
04:17:01 [INFO] Eclipse Ditto :: Services :: Policies .............. SKIPPED
04:17:01 [INFO] Eclipse Ditto :: Services :: Policies :: Common .... SKIPPED
04:17:01 [INFO] Eclipse Ditto :: Services :: Policies :: Persistence SKIPPED
04:17:01 [INFO] Eclipse Ditto :: Services :: Policies :: Starter ... SKIPPED
04:17:01 [INFO] Eclipse Ditto :: Services :: Things ................ SKIPPED
04:17:01 [INFO] Eclipse Ditto :: Services :: Things :: Common ...... SKIPPED
04:17:01 [INFO] Eclipse Ditto :: Services :: Things :: Persistence . SKIPPED
04:17:01 [INFO] Eclipse Ditto :: Services :: Things :: Starter ..... SKIPPED
04:17:01 [INFO] Eclipse Ditto :: Services :: Thing Search .......... SKIPPED
04:17:01 [INFO] Eclipse Ditto :: Services :: Thing Search :: Common  SKIPPED
04:17:01 [INFO] Eclipse Ditto :: Services :: Thing Search :: Persistence SKIPPED
04:17:01 [INFO] Eclipse Ditto :: Services :: Thing Search :: Updater Actors SKIPPED
04:17:01 [INFO] Eclipse Ditto :: Services :: Thing Search :: Starter SKIPPED
04:17:01 [INFO] Eclipse Ditto :: Services :: Legal ................. SKIPPED
04:17:01 [INFO] ------------------------------------------------------------------------
04:17:01 [INFO] BUILD FAILURE
04:17:01 [INFO] ------------------------------------------------------------------------
04:17:01 [INFO] Total time:  13:08 min
04:17:01 [INFO] Finished at: 2020-10-27T08:17:01Z
04:17:01 [INFO] ------------------------------------------------------------------------
04:17:01 [ERROR] Failed to execute goal org.apache.maven.plugins:maven-surefire-plugin:3.0.0-M4:test (default-test) on project ditto-services-connectivity-messaging: There are test failures.
04:17:01 [ERROR] 
04:17:01 [ERROR] Please refer to /home/jenkins/agent/workspace/ditto-ci/services/connectivity/messaging/target/surefire-reports for the individual test results.
04:17:01 [ERROR] Please refer to dump files (if any exist) [date].dump, [date]-jvmRun[N].dump and [date].dumpstream.
04:17:01 [ERROR] -> [Help 1]
04:17:01 org.apache.maven.lifecycle.LifecycleExecutionException: Failed to execute goal org.apache.maven.plugins:maven-surefire-plugin:3.0.0-M4:test (default-test) on project ditto-services-connectivity-messaging: There are test failures.
04:17:01 
04:17:01 Please refer to /home/jenkins/agent/workspace/ditto-ci/services/connectivity/messaging/target/surefire-reports for the individual test results.
04:17:01 Please refer to dump files (if any exist) [date].dump, [date]-jvmRun[N].dump and [date].dumpstream.
04:17:01     at org.apache.maven.lifecycle.internal.MojoExecutor.execute (MojoExecutor.java:215)
04:17:01     at org.apache.maven.lifecycle.internal.MojoExecutor.execute (MojoExecutor.java:156)
04:17:01     at org.apache.maven.lifecycle.internal.MojoExecutor.execute (MojoExecutor.java:148)
04:17:01     at org.apache.maven.lifecycle.internal.LifecycleModuleBuilder.buildProject (LifecycleModuleBuilder.java:117)
04:17:01     at org.apache.maven.lifecycle.internal.LifecycleModuleBuilder.buildProject (LifecycleModuleBuilder.java:81)
04:17:01     at org.apache.maven.lifecycle.internal.builder.singlethreaded.SingleThreadedBuilder.build (SingleThreadedBuilder.java:56)
04:17:01     at org.apache.maven.lifecycle.internal.LifecycleStarter.execute (LifecycleStarter.java:128)
04:17:01     at org.apache.maven.DefaultMaven.doExecute (DefaultMaven.java:305)
04:17:01     at org.apache.maven.DefaultMaven.doExecute (DefaultMaven.java:192)
04:17:01     at org.apache.maven.DefaultMaven.execute (DefaultMaven.java:105)
04:17:01     at org.apache.maven.cli.MavenCli.execute (MavenCli.java:957)
04:17:01     at org.apache.maven.cli.MavenCli.doMain (MavenCli.java:289)
04:17:01     at org.apache.maven.cli.MavenCli.main (MavenCli.java:193)
04:17:01     at jdk.internal.reflect.NativeMethodAccessorImpl.invoke0 (Native Method)
04:17:01     at jdk.internal.reflect.NativeMethodAccessorImpl.invoke (NativeMethodAccessorImpl.java:62)
04:17:01     at jdk.internal.reflect.DelegatingMethodAccessorImpl.invoke (DelegatingMethodAccessorImpl.java:43)
04:17:01     at java.lang.reflect.Method.invoke (Method.java:566)
04:17:01     at org.codehaus.plexus.classworlds.launcher.Launcher.launchEnhanced (Launcher.java:282)
04:17:01     at org.codehaus.plexus.classworlds.launcher.Launcher.launch (Launcher.java:225)
04:17:01     at org.codehaus.plexus.classworlds.launcher.Launcher.mainWithExitCode (Launcher.java:406)
04:17:01     at org.codehaus.plexus.classworlds.launcher.Launcher.main (Launcher.java:347)
04:17:01 Caused by: org.apache.maven.plugin.MojoFailureException: There are test failures.
04:17:01 
04:17:01 Please refer to /home/jenkins/agent/workspace/ditto-ci/services/connectivity/messaging/target/surefire-reports for the individual test results.
04:17:01 Please refer to dump files (if any exist) [date].dump, [date]-jvmRun[N].dump and [date].dumpstream.
04:17:01     at org.apache.maven.plugin.surefire.SurefireHelper.throwException (SurefireHelper.java:271)
04:17:01     at org.apache.maven.plugin.surefire.SurefireHelper.reportExecution (SurefireHelper.java:159)
04:17:01     at org.apache.maven.plugin.surefire.SurefirePlugin.handleSummary (SurefirePlugin.java:435)
04:17:01     at org.apache.maven.plugin.surefire.AbstractSurefireMojo.executeAfterPreconditionsChecked (AbstractSurefireMojo.java:1079)
04:17:01     at org.apache.maven.plugin.surefire.AbstractSurefireMojo.execute (AbstractSurefireMojo.java:889)
04:17:01     at org.apache.maven.plugin.DefaultBuildPluginManager.executeMojo (DefaultBuildPluginManager.java:137)
04:17:01     at org.apache.maven.lifecycle.internal.MojoExecutor.execute (MojoExecutor.java:210)
04:17:01     at org.apache.maven.lifecycle.internal.MojoExecutor.execute (MojoExecutor.java:156)
04:17:01     at org.apache.maven.lifecycle.internal.MojoExecutor.execute (MojoExecutor.java:148)
04:17:01     at org.apache.maven.lifecycle.internal.LifecycleModuleBuilder.buildProject (LifecycleModuleBuilder.java:117)
04:17:01     at org.apache.maven.lifecycle.internal.LifecycleModuleBuilder.buildProject (LifecycleModuleBuilder.java:81)
04:17:01     at org.apache.maven.lifecycle.internal.builder.singlethreaded.SingleThreadedBuilder.build (SingleThreadedBuilder.java:56)
04:17:01     at org.apache.maven.lifecycle.internal.LifecycleStarter.execute (LifecycleStarter.java:128)
04:17:01     at org.apache.maven.DefaultMaven.doExecute (DefaultMaven.java:305)
04:17:01     at org.apache.maven.DefaultMaven.doExecute (DefaultMaven.java:192)
04:17:01     at org.apache.maven.DefaultMaven.execute (DefaultMaven.java:105)
04:17:01     at org.apache.maven.cli.MavenCli.execute (MavenCli.java:957)
04:17:01     at org.apache.maven.cli.MavenCli.doMain (MavenCli.java:289)
04:17:01     at org.apache.maven.cli.MavenCli.main (MavenCli.java:193)
04:17:01     at jdk.internal.reflect.NativeMethodAccessorImpl.invoke0 (Native Method)
04:17:01     at jdk.internal.reflect.NativeMethodAccessorImpl.invoke (NativeMethodAccessorImpl.java:62)
04:17:01     at jdk.internal.reflect.DelegatingMethodAccessorImpl.invoke (DelegatingMethodAccessorImpl.java:43)
04:17:01     at java.lang.reflect.Method.invoke (Method.java:566)
04:17:01     at org.codehaus.plexus.classworlds.launcher.Launcher.launchEnhanced (Launcher.java:282)
04:17:01     at org.codehaus.plexus.classworlds.launcher.Launcher.launch (Launcher.java:225)
04:17:01     at org.codehaus.plexus.classworlds.launcher.Launcher.mainWithExitCode (Launcher.java:406)
04:17:01     at org.codehaus.plexus.classworlds.launcher.Launcher.main (Launcher.java:347)
04:17:01 [ERROR] 
04:17:01 [ERROR] Re-run Maven using the -X switch to enable full debug logging.
04:17:01 [ERROR] 
04:17:01 [ERROR] For more information about the errors and possible solutions, please read the following articles:
04:17:01 [ERROR] [Help 1] http://cwiki.apache.org/confluence/display/MAVEN/MojoFailureException
04:17:01 [ERROR] 
04:17:01 [ERROR] After correcting the problems, you can resume the build with the command
04:17:01 [ERROR]   mvn <args> -rf :ditto-services-connectivity-messaging
04:17:01 Build step 'Invoke top-level Maven targets' marked build as failure
04:17:01 Recording test results
04:17:01 Finished: FAILURE