FailedConsole Output

Skipping 536 KB.. Full Log
+V'
16:17:40.640 DEBUG [main][MenuItemLookup] Found menu:'Delete	Delete'
16:17:40.640 DEBUG [main][MenuItemLookup] Item match:Delete	Delete
16:17:40.640 DEBUG [WorkbenchTestable][MenuItemHandler] Queried MenuItem text:"&Delete	Delete"
16:17:40.641 INFO [WorkbenchTestable][AbstractMenuItem] Select menu item with text Delete	Delete
16:17:40.641 INFO [main][MenuItemHandler] Select menu item: &Delete	Delete
16:17:40.844 DEBUG [WorkbenchTestable][AbstractWait] Waiting until shell matching Matcher matching when all matchers match: [Matcher matching widget which text matches: "Delete Resources"] is available....

(Eclipse:619): Gtk-CRITICAL **: 16:17:41.233: gtk_box_gadget_distribute: assertion 'size >= 0' failed in GtkScrollbar

(Eclipse:619): Gtk-CRITICAL **: 16:17:41.233: gtk_box_gadget_distribute: assertion 'size >= 0' failed in GtkScrollbar

(Eclipse:619): Gtk-CRITICAL **: 16:17:41.237: gtk_box_gadget_distribute: assertion 'size >= 0' failed in GtkScrollbar

(Eclipse:619): Gtk-CRITICAL **: 16:17:41.262: gtk_box_gadget_distribute: assertion 'size >= 0' failed in GtkScrollbar

(Eclipse:619): Gtk-CRITICAL **: 16:17:41.304: gtk_box_gadget_distribute: assertion 'size >= 0' failed in GtkScrollbar
16:17:41.811 DEBUG [WorkbenchTestable][AbstractWait] Waiting until shell matching Matcher matching when all matchers match: [Matcher matching widget which text matches: "Delete Resources"] is available. finished successfully
16:17:41.812 DEBUG [WorkbenchTestable][AbstractShell] Set focus to Shell Delete Resources
16:17:41.812 DEBUG [WorkbenchTestable][AbstractWait] Waiting until shell is active...
16:17:41.816 DEBUG [WorkbenchTestable][AbstractWait] Waiting until shell is active finished successfully
16:17:41.816 DEBUG [WorkbenchTestable][WidgetLookup] Looking up active widget with class type org.eclipse.swt.widgets.Button with no referenced composite specified, index 0 and following matchers specified (Widget matcher matching widgets with style: 32)
16:17:41.816 DEBUG [WorkbenchTestable][WidgetLookup] No parent specified, finding one
16:17:41.817 DEBUG [WorkbenchTestable][AbstractWait] Waiting until active shell exists...
16:17:41.817 DEBUG [WorkbenchTestable][AbstractWait] Waiting until active shell exists finished successfully
16:17:41.817 TRACE [WorkbenchTestable][WidgetLookup] Setting active shell with title "Delete Resources" as the parent
16:17:41.817 DEBUG [WorkbenchTestable][WidgetLookup] Parent found successfully
16:17:41.817 DEBUG [WorkbenchTestable][AbstractWait] Waiting until widget is found...
16:17:41.817 TRACE [WorkbenchTestable][WidgetLookup] Looking up widget with index 0 with specified parent and matchers
16:17:41.818 TRACE [WorkbenchTestable][WidgetLookup] widget with index 0 is found
16:17:41.818 DEBUG [WorkbenchTestable][AbstractWait] Waiting until widget is found finished successfully
16:17:41.818 DEBUG [WorkbenchTestable][WidgetLookup] Active widget with class type org.eclipse.swt.widgets.Button and index 0 was found
16:17:41.818 INFO [WorkbenchTestable][CheckBox] Select checkbox &Delete project contents on disk (cannot be undone)
16:17:41.819 INFO [WorkbenchTestable][CheckBox] Check checkbox &Delete project contents on disk (cannot be undone)
16:17:41.819 INFO [WorkbenchTestable][AbstractButton] Click button &Delete project contents on disk (cannot be undone)
16:17:41.819 DEBUG [WorkbenchTestable][AbstractWait] Waiting until control is enabled...
16:17:41.819 DEBUG [WorkbenchTestable][AbstractWait] Waiting until control is enabled finished successfully
16:17:41.819 TRACE [WorkbenchTestable][WidgetHandler] Notify Button with event 13
16:17:41.819 TRACE [WorkbenchTestable][WidgetHandler] Wait for synchronization
16:17:41.820 DEBUG [WorkbenchTestable][WidgetLookup] Looking up active widget with class type org.eclipse.swt.widgets.Button with no referenced composite specified, index 0 and following matchers specified (Widget matcher matching widgets with style: 8, Matcher matching widgets with text that without mnenomic matches: is "OK")
16:17:41.820 DEBUG [WorkbenchTestable][WidgetLookup] No parent specified, finding one
16:17:41.820 DEBUG [WorkbenchTestable][AbstractWait] Waiting until active shell exists...
16:17:41.820 DEBUG [WorkbenchTestable][AbstractWait] Waiting until active shell exists finished successfully
16:17:41.820 TRACE [WorkbenchTestable][WidgetLookup] Setting active shell with title "Delete Resources" as the parent
16:17:41.820 DEBUG [WorkbenchTestable][WidgetLookup] Parent found successfully
16:17:41.820 DEBUG [WorkbenchTestable][AbstractWait] Waiting until widget is found...
16:17:41.820 TRACE [WorkbenchTestable][WidgetLookup] Looking up widget with index 0 with specified parent and matchers
16:17:41.822 TRACE [WorkbenchTestable][WidgetLookup] widget with index 0 is found
16:17:41.822 DEBUG [WorkbenchTestable][AbstractWait] Waiting until widget is found finished successfully
16:17:41.822 DEBUG [WorkbenchTestable][WidgetLookup] Active widget with class type org.eclipse.swt.widgets.Button and index 0 was found
16:17:41.823 INFO [WorkbenchTestable][AbstractButton] Click button OK
16:17:41.823 DEBUG [WorkbenchTestable][AbstractWait] Waiting until control is enabled...
16:17:41.823 DEBUG [WorkbenchTestable][AbstractWait] Waiting until control is enabled finished successfully
16:17:41.823 TRACE [WorkbenchTestable][WidgetHandler] Notify Button with event 13
16:17:41.823 TRACE [WorkbenchTestable][WidgetHandler] Wait for synchronization
16:17:41.894 DEBUG [WorkbenchTestable][AbstractWait] Waiting until Shell has children or is not available....
16:17:41.901 DEBUG [WorkbenchTestable][ShellHasChildrenOrIsNotAvailable] number of child shells: 0
16:17:42.445 DEBUG [WorkbenchTestable][AbstractWait] Waiting until Shell has children or is not available. finished successfully
16:17:42.446 DEBUG [WorkbenchTestable][DeleteUtils] Delete shell is disposed.
16:17:42.446 DEBUG [WorkbenchTestable][AbstractWait] Waiting while at least one job is running...
16:17:42.446 DEBUG [WorkbenchTestable][JobIsRunning]   job 'Building' is not running, skipped
16:17:42.446 DEBUG [WorkbenchTestable][JobIsRunning]   job 'Flushing content description cache.' is a system job, skipped
16:17:42.447 DEBUG [WorkbenchTestable][JobIsRunning]   job 'Compacting resource model' is a system job, skipped
16:17:42.447 DEBUG [WorkbenchTestable][JobIsRunning]   job 'Workbench Auto-Save Job' is a system job, skipped
16:17:42.447 DEBUG [WorkbenchTestable][AbstractWait] Waiting while at least one job is running finished successfully
16:17:42.447 INFO [WorkbenchTestable][AbstractView] Activate view Project Explorer
16:17:42.447 INFO [WorkbenchTestable][AbstractCTabItem] Activate Project Explorer
16:17:42.449 DEBUG [WorkbenchTestable][WorkbenchPartHandler] Active workbench control=Class=org.eclipse.e4.ui.workbench.renderers.swt.ContributedPartRenderer$1 Text=<unavailable> TooltipText=null
16:17:42.449 DEBUG [WorkbenchTestable][WorkbenchPartHandler] Focused control=Class=org.eclipse.swt.widgets.Link Text=There are no projects in your workspace.
To add a project: TooltipText=null
16:17:42.449 DEBUG [WorkbenchTestable][RunIAfterTestExtensions] Run after test extensions for test class org.eclipse.dartboard.test.project.DartProjectTest
16:17:42.449 DEBUG [WorkbenchTestable][RunIAfterTestExtensions] Run method runAfterTest() of class org.eclipse.reddeer.junit.extension.after.test.impl.CloseAllShellsExt
16:17:42.449 INFO [WorkbenchTestable][WorkbenchShellHandler] Closing all shells...
16:17:42.450 DEBUG [WorkbenchTestable][AbstractWait] Waiting until active shell exists...
16:17:42.450 DEBUG [WorkbenchTestable][AbstractWait] Waiting until active shell exists finished successfully
16:17:42.450 DEBUG [WorkbenchTestable][RunIAfterTestExtensions] Run method runAfterTest() of class org.eclipse.reddeer.junit.extension.log.collector.AftersLogCollector
16:17:42.501 INFO [WorkbenchTestable][RequirementsRunner] Finished test: projectWizard__NewDartProjectWithStagehand__CreatesNewProjectWithTemplate no-configuration(org.eclipse.dartboard.test.project.DartProjectTest)
16:17:42.501 DEBUG [WorkbenchTestable][RequirementsRunner] Injecting fulfilled requirements into test instance: org.eclipse.reddeer.junit.internal.requirement.Requirements
16:17:42.501 INFO [WorkbenchTestable][RequirementsRunner] Started test: projectWizard__NewDartProject__CreatesNewProject no-configuration(org.eclipse.dartboard.test.project.DartProjectTest)
16:17:42.501 DEBUG [WorkbenchTestable][RunIBeforeTestExtensions] Run before test extensions for test class org.eclipse.dartboard.test.project.DartProjectTest
16:17:42.501 DEBUG [WorkbenchTestable][RunIBeforeTestExtensions] Run method runBeforeTest() of class org.eclipse.reddeer.junit.extension.before.test.impl.DisableAERI
16:17:42.501 DEBUG [WorkbenchTestable][RunIBeforeTestExtensions] Run method runBeforeTest() of class org.eclipse.reddeer.junit.extension.before.test.impl.CloseWelcomeScreenExt
16:17:42.501 DEBUG [WorkbenchTestable][RunIBeforeTestExtensions] Run method runBeforeTest() of class org.eclipse.reddeer.junit.extension.before.test.impl.SetOpenAssociatedPerspectiveExt
16:17:42.501 DEBUG [WorkbenchTestable][RunIBeforeTestExtensions] Run method runBeforeTest() of class org.eclipse.reddeer.junit.extension.before.test.impl.DoNotDownloadMavenIndexesExt
16:17:42.502 DEBUG [WorkbenchTestable][AbstractWait] Waiting until active shell exists...
16:17:42.502 DEBUG [WorkbenchTestable][AbstractWait] Waiting until active shell exists finished successfully
16:17:42.502 INFO [WorkbenchTestable][ShellHandler] Getting Menu Bar of shell 'data - Eclipse Platform'
16:17:42.502 DEBUG [main][MenuItemLookup] Found menu:'File'
16:17:42.503 DEBUG [main][MenuItemLookup] Item match:File
16:17:42.504 DEBUG [main][MenuItemLookup] Found menu:'New	Shift+Alt+N'
16:17:42.504 DEBUG [main][MenuItemLookup] Item match:New	Shift+Alt+N
16:17:42.514 DEBUG [main][MenuItemLookup] Found menu:'Dart Project'
16:17:42.514 DEBUG [main][MenuItemLookup] Item match:Dart Project
16:17:42.535 DEBUG [WorkbenchTestable][MenuItemHandler] Queried MenuItem text:"Dart Project"
16:17:42.535 INFO [WorkbenchTestable][AbstractMenuItem] Select menu item with text Dart Project
16:17:42.535 INFO [main][MenuItemHandler] Select menu item: Dart Project
16:17:42.720 DEBUG [WorkbenchTestable][AbstractWait] Waiting until shell matching Matcher matching when all matchers match: [Matcher matching widget which text matches: "New Dart Project"] is active...
16:17:42.724 DEBUG [WorkbenchTestable][AbstractWait] Waiting until shell matching Matcher matching when all matchers match: [Matcher matching widget which text matches: "New Dart Project"] is active finished successfully
16:17:42.724 DEBUG [WorkbenchTestable][AbstractWait] Waiting while at least one job is running...
16:17:42.724 DEBUG [WorkbenchTestable][JobIsRunning]   job 'Animation start' is a system job, skipped
16:17:42.724 DEBUG [WorkbenchTestable][JobIsRunning]   job 'Flushing content description cache.' is a system job, skipped
16:17:42.724 DEBUG [WorkbenchTestable][JobIsRunning]   job 'Compacting resource model' is a system job, skipped
16:17:42.724 DEBUG [WorkbenchTestable][JobIsRunning]   job 'Workbench Auto-Save Job' is a system job, skipped
16:17:42.724 DEBUG [WorkbenchTestable][AbstractWait] Waiting while at least one job is running finished successfully
16:17:42.724 DEBUG [WorkbenchTestable][WidgetLookup] Looking up active widget with class type org.eclipse.swt.widgets.Text with no referenced composite specified, index 0 and following matchers specified (Matcher matching widget with label:
is "Project name:")
16:17:42.724 DEBUG [WorkbenchTestable][WidgetLookup] No parent specified, finding one
16:17:42.724 DEBUG [WorkbenchTestable][AbstractWait] Waiting until active shell exists...
16:17:42.724 DEBUG [WorkbenchTestable][AbstractWait] Waiting until active shell exists finished successfully
16:17:42.725 TRACE [WorkbenchTestable][WidgetLookup] Setting active shell with title "New Dart Project" as the parent
16:17:42.725 DEBUG [WorkbenchTestable][WidgetLookup] Parent found successfully
16:17:42.725 DEBUG [WorkbenchTestable][AbstractWait] Waiting until widget is found...
16:17:42.725 TRACE [WorkbenchTestable][WidgetLookup] Looking up widget with index 0 with specified parent and matchers
16:17:42.728 TRACE [WorkbenchTestable][WidgetLookup] widget with index 0 is found
16:17:42.728 DEBUG [WorkbenchTestable][AbstractWait] Waiting until widget is found finished successfully
16:17:42.728 DEBUG [WorkbenchTestable][WidgetLookup] Active widget with class type org.eclipse.swt.widgets.Text and index 0 was found
16:17:42.728 DEBUG [WorkbenchTestable][AbstractText] Set focus to Text
16:17:42.728 INFO [WorkbenchTestable][AbstractText] Text set to: some-random-project
16:17:42.729 DEBUG [WorkbenchTestable][WidgetLookup] Looking up active widget with class type org.eclipse.swt.widgets.Button with no referenced composite specified, index 0 and following matchers specified (Widget matcher matching widgets with style: 8, Matcher matching widgets with text that without mnenomic matches: is "Finish", Widget matcher matching widgets with style: 8)
16:17:42.729 DEBUG [WorkbenchTestable][WidgetLookup] No parent specified, finding one
16:17:42.729 DEBUG [WorkbenchTestable][AbstractWait] Waiting until active shell exists...
16:17:42.730 DEBUG [WorkbenchTestable][AbstractWait] Waiting until active shell exists finished successfully
16:17:42.730 TRACE [WorkbenchTestable][WidgetLookup] Setting active shell with title "New Dart Project" as the parent
16:17:42.730 DEBUG [WorkbenchTestable][WidgetLookup] Parent found successfully
16:17:42.730 DEBUG [WorkbenchTestable][AbstractWait] Waiting until widget is found...
16:17:42.730 TRACE [WorkbenchTestable][WidgetLookup] Looking up widget with index 0 with specified parent and matchers
16:17:42.731 TRACE [WorkbenchTestable][WidgetLookup] widget with index 0 is found
16:17:42.731 DEBUG [WorkbenchTestable][AbstractWait] Waiting until widget is found finished successfully
16:17:42.731 DEBUG [WorkbenchTestable][WidgetLookup] Active widget with class type org.eclipse.swt.widgets.Button and index 0 was found
16:17:42.733 INFO [WorkbenchTestable][AbstractButton] Click button &Finish
16:17:42.733 DEBUG [WorkbenchTestable][AbstractWait] Waiting until control is enabled...
16:17:42.733 DEBUG [WorkbenchTestable][AbstractWait] Waiting until control is enabled finished successfully
16:17:42.733 TRACE [WorkbenchTestable][WidgetHandler] Notify Button with event 13
16:17:42.733 TRACE [WorkbenchTestable][WidgetHandler] Wait for synchronization
16:17:42.819 DEBUG [WorkbenchTestable][AbstractWait] Waiting until Project some-random-project exists....
16:17:42.907 TRACE [WorkbenchTestable][WidgetLookup] Looking up widget with index 0 with specified parent and matchers
16:17:43.002 TRACE [WorkbenchTestable][WidgetLookup] widget with index 0 is found
16:17:43.002 INFO [WorkbenchTestable][AbstractView] View 'Matcher matching widget which text matches: Matcher matching text to regular expression '\*?\QPackage Explorer\E'' is already open. Activate.
16:17:43.002 TRACE [WorkbenchTestable][WidgetLookup] Looking up widget with index 0 with specified parent and matchers
16:17:43.007 TRACE [WorkbenchTestable][WidgetLookup] widget with index 0 is found
16:17:43.007 DEBUG [WorkbenchTestable][AbstractShell] Set focus to Shell data - Eclipse Platform
16:17:43.007 DEBUG [WorkbenchTestable][AbstractWait] Waiting until shell is active...
16:17:43.007 DEBUG [WorkbenchTestable][AbstractWait] Waiting until shell is active finished successfully
16:17:43.008 DEBUG [WorkbenchTestable][WorkbenchShell] Workbench shell has title 'data - Eclipse Platform'
16:17:43.008 DEBUG [WorkbenchTestable][WidgetLookup] Looking up active widget with class type org.eclipse.swt.custom.CTabItem with referenced composite class org.eclipse.reddeer.workbench.impl.shell.WorkbenchShell, index 0 and following matchers specified (Matcher matching widget which text matches: Matcher matching text to regular expression '\*?\QPackage Explorer\E')
16:17:43.008 DEBUG [WorkbenchTestable][AbstractWait] Waiting until widget is found...
16:17:43.008 TRACE [WorkbenchTestable][WidgetLookup] Looking up widget with index 0 with specified parent and matchers
16:17:43.037 ERROR [WorkbenchTestable][RunTestMethod] Test org.eclipse.dartboard.test.project.DartProjectTest.projectWizard__NewDartProject__CreatesNewProject throws exception: 
org.eclipse.reddeer.common.exception.RedDeerException: Exception during sync execution in UI thread
	at org.eclipse.reddeer.common.util.Display.handleErrorOccured(Display.java:112)
	at org.eclipse.reddeer.common.util.Display.syncExec(Display.java:84)
	at org.eclipse.reddeer.core.lookup.WidgetLookup.visible(WidgetLookup.java:462)
	at org.eclipse.reddeer.core.lookup.WidgetLookup.findControlUI(WidgetLookup.java:394)
	at org.eclipse.reddeer.core.lookup.WidgetLookup.findControlUI(WidgetLookup.java:443)
	at org.eclipse.reddeer.core.lookup.WidgetLookup.findControlUI(WidgetLookup.java:417)
	at org.eclipse.reddeer.core.lookup.WidgetLookup.findControlUI(WidgetLookup.java:443)
	at org.eclipse.reddeer.core.lookup.WidgetLookup.findControlUI(WidgetLookup.java:417)
	at org.eclipse.reddeer.core.lookup.WidgetLookup.findControlUI(WidgetLookup.java:443)
	at org.eclipse.reddeer.core.lookup.WidgetLookup.findControlUI(WidgetLookup.java:417)
	at org.eclipse.reddeer.core.lookup.WidgetLookup.findControlUI(WidgetLookup.java:443)
	at org.eclipse.reddeer.core.lookup.WidgetLookup.findControlUI(WidgetLookup.java:417)
	at org.eclipse.reddeer.core.lookup.WidgetLookup.findControlUI(WidgetLookup.java:443)
	at org.eclipse.reddeer.core.lookup.WidgetLookup.findControlUI(WidgetLookup.java:417)
	at org.eclipse.reddeer.core.lookup.WidgetLookup.findControlUI(WidgetLookup.java:443)
	at org.eclipse.reddeer.core.lookup.WidgetLookup.findControlUI(WidgetLookup.java:417)
	at org.eclipse.reddeer.core.lookup.WidgetLookup.findControlUI(WidgetLookup.java:443)
	at org.eclipse.reddeer.core.lookup.WidgetLookup.findControlUI(WidgetLookup.java:417)
	at org.eclipse.reddeer.core.lookup.WidgetLookup.findControlUI(WidgetLookup.java:443)
	at org.eclipse.reddeer.core.lookup.WidgetLookup.findControlUI(WidgetLookup.java:417)
	at org.eclipse.reddeer.core.lookup.WidgetLookup.findControlUI(WidgetLookup.java:443)
	at org.eclipse.reddeer.core.lookup.WidgetLookup.findControlUI(WidgetLookup.java:417)
	at org.eclipse.reddeer.core.lookup.WidgetLookup.findControlUI(WidgetLookup.java:443)
	at org.eclipse.reddeer.core.lookup.WidgetLookup.findControlUI(WidgetLookup.java:417)
	at org.eclipse.reddeer.core.lookup.WidgetLookup.findControlUI(WidgetLookup.java:443)
	at org.eclipse.reddeer.core.lookup.WidgetLookup.findControlUI(WidgetLookup.java:417)
	at org.eclipse.reddeer.core.lookup.WidgetLookup.findControlUI(WidgetLookup.java:443)
	at org.eclipse.reddeer.core.lookup.WidgetLookup.findControlUI(WidgetLookup.java:417)
	at org.eclipse.reddeer.core.lookup.WidgetLookup.findControlUI(WidgetLookup.java:443)
	at org.eclipse.reddeer.core.lookup.WidgetLookup.findControlUI(WidgetLookup.java:417)
	at org.eclipse.reddeer.core.lookup.WidgetLookup.findControl(WidgetLookup.java:306)
	at org.eclipse.reddeer.core.lookup.WidgetLookup.activeWidget(WidgetLookup.java:206)
	at org.eclipse.reddeer.core.condition.WidgetIsFound.test(WidgetIsFound.java:97)
	at org.eclipse.reddeer.common.wait.WaitUntil.stopWaiting(WaitUntil.java:103)
	at org.eclipse.reddeer.common.wait.AbstractWait.wait(AbstractWait.java:147)
	at org.eclipse.reddeer.common.wait.AbstractWait.<init>(AbstractWait.java:132)
	at org.eclipse.reddeer.common.wait.AbstractWait.<init>(AbstractWait.java:97)
	at org.eclipse.reddeer.common.wait.AbstractWait.<init>(AbstractWait.java:64)
	at org.eclipse.reddeer.common.wait.WaitUntil.<init>(WaitUntil.java:50)
	at org.eclipse.reddeer.core.lookup.WidgetLookup.activeWidget(WidgetLookup.java:109)
	at org.eclipse.reddeer.core.lookup.WidgetLookup.activeWidget(WidgetLookup.java:87)
	at org.eclipse.reddeer.swt.widgets.AbstractWidget.<init>(AbstractWidget.java:76)
	at org.eclipse.reddeer.swt.widgets.AbstractItem.<init>(AbstractItem.java:32)
	at org.eclipse.reddeer.swt.impl.ctab.AbstractCTabItem.<init>(AbstractCTabItem.java:39)
	at org.eclipse.reddeer.swt.impl.ctab.DefaultCTabItem.<init>(DefaultCTabItem.java:98)
	at org.eclipse.reddeer.swt.impl.ctab.DefaultCTabItem.<init>(DefaultCTabItem.java:77)
	at org.eclipse.reddeer.workbench.impl.view.AbstractView.checkOpen(AbstractView.java:181)
	at org.eclipse.reddeer.workbench.impl.view.AbstractView.activate(AbstractView.java:90)
	at org.eclipse.reddeer.workbench.impl.view.AbstractView.open(AbstractView.java:136)
	at org.eclipse.reddeer.eclipse.condition.ProjectExists.test(ProjectExists.java:53)
	at org.eclipse.reddeer.common.wait.WaitUntil.stopWaiting(WaitUntil.java:103)
	at org.eclipse.reddeer.common.wait.AbstractWait.wait(AbstractWait.java:147)
	at org.eclipse.reddeer.common.wait.AbstractWait.<init>(AbstractWait.java:132)
	at org.eclipse.reddeer.common.wait.AbstractWait.<init>(AbstractWait.java:97)
	at org.eclipse.reddeer.common.wait.AbstractWait.<init>(AbstractWait.java:64)
	at org.eclipse.reddeer.common.wait.AbstractWait.<init>(AbstractWait.java:50)
	at org.eclipse.reddeer.common.wait.WaitUntil.<init>(WaitUntil.java:38)
	at org.eclipse.dartboard.test.project.DartProjectTest.projectWizard__NewDartProject__CreatesNewProject(DartProjectTest.java:72)
	at java.base/jdk.internal.reflect.NativeMethodAccessorImpl.invoke0(Native Method)
	at java.base/jdk.internal.reflect.NativeMethodAccessorImpl.invoke(NativeMethodAccessorImpl.java:62)
	at java.base/jdk.internal.reflect.DelegatingMethodAccessorImpl.invoke(DelegatingMethodAccessorImpl.java:43)
	at java.base/java.lang.reflect.Method.invoke(Method.java:566)
	at org.junit.runners.model.FrameworkMethod$1.runReflectiveCall(FrameworkMethod.java:50)
	at org.junit.internal.runners.model.ReflectiveCallable.run(ReflectiveCallable.java:12)
	at org.junit.runners.model.FrameworkMethod.invokeExplosively(FrameworkMethod.java:47)
	at org.eclipse.reddeer.junit.internal.runner.statement.RunTestMethod.evaluate(RunTestMethod.java:48)
	at org.eclipse.reddeer.junit.internal.runner.statement.RunBefores.evaluate(RunBefores.java:85)
	at org.eclipse.reddeer.junit.internal.runner.statement.RunIBeforeTestExtensions.evaluate(RunIBeforeTestExtensions.java:73)
	at org.eclipse.reddeer.junit.internal.runner.statement.RunAfters.evaluate(RunAfters.java:72)
	at org.eclipse.reddeer.junit.internal.runner.statement.RunIAfterTestExtensions.evaluate(RunIAfterTestExtensions.java:59)
	at org.junit.runners.ParentRunner.runLeaf(ParentRunner.java:325)
	at org.eclipse.reddeer.junit.internal.runner.RequirementsRunner.runChild(RequirementsRunner.java:171)
	at org.junit.runners.BlockJUnit4ClassRunner.runChild(BlockJUnit4ClassRunner.java:57)
	at org.junit.runners.ParentRunner$3.run(ParentRunner.java:290)
	at org.junit.runners.ParentRunner$1.schedule(ParentRunner.java:71)
	at org.junit.runners.ParentRunner.runChildren(ParentRunner.java:288)
	at org.junit.runners.ParentRunner.access$000(ParentRunner.java:58)
	at org.junit.runners.ParentRunner$2.evaluate(ParentRunner.java:268)
	at org.eclipse.reddeer.junit.internal.runner.statement.RunBeforeClasses.evaluate(RunBeforeClasses.java:81)
	at org.eclipse.reddeer.junit.internal.runner.statement.FulfillRequirementsStatement.evaluate(FulfillRequirementsStatement.java:46)
	at org.eclipse.reddeer.junit.internal.runner.statement.RunIBeforeClassExtensions.evaluate(RunIBeforeClassExtensions.java:72)
	at org.eclipse.reddeer.junit.internal.runner.statement.RunAfterClasses.evaluate(RunAfterClasses.java:68)
	at org.eclipse.reddeer.junit.internal.runner.statement.CleanUpRequirementStatement.evaluate(CleanUpRequirementStatement.java:45)
	at org.eclipse.reddeer.junit.internal.runner.statement.RunIAfterClassExtensions.evaluate(RunIAfterClassExtensions.java:57)
	at org.junit.runners.ParentRunner.run(ParentRunner.java:363)
	at org.eclipse.reddeer.junit.internal.runner.RequirementsRunner.run(RequirementsRunner.java:153)
	at org.junit.runners.Suite.runChild(Suite.java:128)
	at org.junit.runners.Suite.runChild(Suite.java:27)
	at org.junit.runners.ParentRunner$3.run(ParentRunner.java:290)
	at org.junit.runners.ParentRunner$1.schedule(ParentRunner.java:71)
	at org.junit.runners.ParentRunner.runChildren(ParentRunner.java:288)
	at org.junit.runners.ParentRunner.access$000(ParentRunner.java:58)
	at org.junit.runners.ParentRunner$2.evaluate(ParentRunner.java:268)
	at org.junit.runners.ParentRunner.run(ParentRunner.java:363)
	at org.junit.runners.Suite.runChild(Suite.java:128)
	at org.junit.runners.Suite.runChild(Suite.java:27)
	at org.junit.runners.ParentRunner$3.run(ParentRunner.java:290)
	at org.junit.runners.ParentRunner$1.schedule(ParentRunner.java:71)
	at org.junit.runners.ParentRunner.runChildren(ParentRunner.java:288)
	at org.junit.runners.ParentRunner.access$000(ParentRunner.java:58)
	at org.junit.runners.ParentRunner$2.evaluate(ParentRunner.java:268)
	at org.junit.runners.ParentRunner.run(ParentRunner.java:363)
	at org.apache.maven.surefire.junit4.JUnit4Provider.execute(JUnit4Provider.java:365)
	at org.apache.maven.surefire.junit4.JUnit4Provider.executeWithRerun(JUnit4Provider.java:273)
	at org.apache.maven.surefire.junit4.JUnit4Provider.executeTestSet(JUnit4Provider.java:238)
	at org.apache.maven.surefire.junit4.JUnit4Provider.invoke(JUnit4Provider.java:159)
	at java.base/jdk.internal.reflect.NativeMethodAccessorImpl.invoke0(Native Method)
	at java.base/jdk.internal.reflect.NativeMethodAccessorImpl.invoke(NativeMethodAccessorImpl.java:62)
	at java.base/jdk.internal.reflect.DelegatingMethodAccessorImpl.invoke(DelegatingMethodAccessorImpl.java:43)
	at java.base/java.lang.reflect.Method.invoke(Method.java:566)
	at org.apache.maven.surefire.util.ReflectionUtils.invokeMethodWithArray2(ReflectionUtils.java:206)
	at org.apache.maven.surefire.booter.ProviderFactory$ProviderProxy.invoke(ProviderFactory.java:161)
	at org.apache.maven.surefire.booter.ProviderFactory.invokeProvider(ProviderFactory.java:84)
	at org.eclipse.tycho.surefire.osgibooter.OsgiSurefireBooter.run(OsgiSurefireBooter.java:113)
	at org.eclipse.tycho.surefire.osgibooter.AbstractUITestApplication.runTests(AbstractUITestApplication.java:44)
	at org.eclipse.e4.ui.internal.workbench.swt.E4Testable.lambda$0(E4Testable.java:76)
	at java.base/java.lang.Thread.run(Thread.java:834)
Caused by: org.eclipse.swt.SWTException: Widget is disposed
	at org.eclipse.swt.SWT.error(SWT.java:4720)
	at org.eclipse.swt.SWT.error(SWT.java:4635)
	at org.eclipse.swt.SWT.error(SWT.java:4606)
	at org.eclipse.swt.widgets.Widget.error(Widget.java:550)
	at org.eclipse.swt.widgets.Widget.checkWidget(Widget.java:470)
	at org.eclipse.swt.widgets.Control.getVisible(Control.java:3360)
	at org.eclipse.reddeer.core.lookup.WidgetLookup$4.run(WidgetLookup.java:466)
	at org.eclipse.reddeer.core.lookup.WidgetLookup$4.run(WidgetLookup.java:1)
	at org.eclipse.reddeer.common.util.Display$ErrorHandlingRunnable.run(Display.java:162)
	at org.eclipse.swt.widgets.RunnableLock.run(RunnableLock.java:40)
	at org.eclipse.swt.widgets.Synchronizer.runAsyncMessages(Synchronizer.java:185)
	at org.eclipse.swt.widgets.Display.runAsyncMessages(Display.java:4975)
	at org.eclipse.swt.widgets.Display.readAndDispatch(Display.java:4496)
	at org.eclipse.e4.ui.internal.workbench.swt.PartRenderingEngine$5.run(PartRenderingEngine.java:1160)
	at org.eclipse.core.databinding.observable.Realm.runWithDefault(Realm.java:338)
	at org.eclipse.e4.ui.internal.workbench.swt.PartRenderingEngine.run(PartRenderingEngine.java:1049)
	at org.eclipse.e4.ui.internal.workbench.E4Workbench.createAndRunUI(E4Workbench.java:155)
	at org.eclipse.ui.internal.Workbench.lambda$3(Workbench.java:660)
	at org.eclipse.core.databinding.observable.Realm.runWithDefault(Realm.java:338)
	at org.eclipse.ui.internal.Workbench.createAndRunWorkbench(Workbench.java:559)
	at org.eclipse.ui.PlatformUI.createAndRunWorkbench(PlatformUI.java:154)
	at org.eclipse.ui.internal.ide.application.IDEApplication.start(IDEApplication.java:150)
	at org.eclipse.tycho.surefire.osgibooter.UITestApplication.runApplication(UITestApplication.java:31)
	at org.eclipse.tycho.surefire.osgibooter.AbstractUITestApplication.run(AbstractUITestApplication.java:120)
	at org.eclipse.tycho.surefire.osgibooter.UITestApplication.start(UITestApplication.java:37)
	at org.eclipse.equinox.internal.app.EclipseAppHandle.run(EclipseAppHandle.java:203)
	at org.eclipse.core.runtime.internal.adaptor.EclipseAppLauncher.runApplication(EclipseAppLauncher.java:137)
	at org.eclipse.core.runtime.internal.adaptor.EclipseAppLauncher.start(EclipseAppLauncher.java:107)
	at org.eclipse.core.runtime.adaptor.EclipseStarter.run(EclipseStarter.java:401)
	at org.eclipse.core.runtime.adaptor.EclipseStarter.run(EclipseStarter.java:255)
	at java.base/jdk.internal.reflect.NativeMethodAccessorImpl.invoke0(Native Method)
	at java.base/jdk.internal.reflect.NativeMethodAccessorImpl.invoke(NativeMethodAccessorImpl.java:62)
	at java.base/jdk.internal.reflect.DelegatingMethodAccessorImpl.invoke(DelegatingMethodAccessorImpl.java:43)
	at java.base/java.lang.reflect.Method.invoke(Method.java:566)
	at org.eclipse.equinox.launcher.Main.invokeFramework(Main.java:657)
	at org.eclipse.equinox.launcher.Main.basicRun(Main.java:594)
	at org.eclipse.equinox.launcher.Main.run(Main.java:1447)
	at org.eclipse.equinox.launcher.Main.main(Main.java:1420)
org.eclipse.swt.SWTException: Widget is disposed
	at org.eclipse.swt.SWT.error(SWT.java:4720)
	at org.eclipse.swt.SWT.error(SWT.java:4635)
	at org.eclipse.swt.SWT.error(SWT.java:4606)
	at org.eclipse.swt.widgets.Widget.error(Widget.java:550)
	at org.eclipse.swt.widgets.Widget.checkWidget(Widget.java:470)
	at org.eclipse.swt.widgets.Control.getVisible(Control.java:3360)
	at org.eclipse.reddeer.core.lookup.WidgetLookup$4.run(WidgetLookup.java:466)
	at org.eclipse.reddeer.core.lookup.WidgetLookup$4.run(WidgetLookup.java:1)
	at org.eclipse.reddeer.common.util.Display$ErrorHandlingRunnable.run(Display.java:162)
	at org.eclipse.swt.widgets.RunnableLock.run(RunnableLock.java:40)
	at org.eclipse.swt.widgets.Synchronizer.runAsyncMessages(Synchronizer.java:185)
	at org.eclipse.swt.widgets.Display.runAsyncMessages(Display.java:4975)
	at org.eclipse.swt.widgets.Display.readAndDispatch(Display.java:4496)
	at org.eclipse.e4.ui.internal.workbench.swt.PartRenderingEngine$5.run(PartRenderingEngine.java:1160)
	at org.eclipse.core.databinding.observable.Realm.runWithDefault(Realm.java:338)
	at org.eclipse.e4.ui.internal.workbench.swt.PartRenderingEngine.run(PartRenderingEngine.java:1049)
	at org.eclipse.e4.ui.internal.workbench.E4Workbench.createAndRunUI(E4Workbench.java:155)
	at org.eclipse.ui.internal.Workbench.lambda$3(Workbench.java:660)
	at org.eclipse.core.databinding.observable.Realm.runWithDefault(Realm.java:338)
	at org.eclipse.ui.internal.Workbench.createAndRunWorkbench(Workbench.java:559)
	at org.eclipse.ui.PlatformUI.createAndRunWorkbench(PlatformUI.java:154)
	at org.eclipse.ui.internal.ide.application.IDEApplication.start(IDEApplication.java:150)
	at org.eclipse.tycho.surefire.osgibooter.UITestApplication.runApplication(UITestApplication.java:31)
	at org.eclipse.tycho.surefire.osgibooter.AbstractUITestApplication.run(AbstractUITestApplication.java:120)
	at org.eclipse.tycho.surefire.osgibooter.UITestApplication.start(UITestApplication.java:37)
	at org.eclipse.equinox.internal.app.EclipseAppHandle.run(EclipseAppHandle.java:203)
	at org.eclipse.core.runtime.internal.adaptor.EclipseAppLauncher.runApplication(EclipseAppLauncher.java:137)
	at org.eclipse.core.runtime.internal.adaptor.EclipseAppLauncher.start(EclipseAppLauncher.java:107)
	at org.eclipse.core.runtime.adaptor.EclipseStarter.run(EclipseStarter.java:401)
	at org.eclipse.core.runtime.adaptor.EclipseStarter.run(EclipseStarter.java:255)
	at java.base/jdk.internal.reflect.NativeMethodAccessorImpl.invoke0(Native Method)
	at java.base/jdk.internal.reflect.NativeMethodAccessorImpl.invoke(NativeMethodAccessorImpl.java:62)
	at java.base/jdk.internal.reflect.DelegatingMethodAccessorImpl.invoke(DelegatingMethodAccessorImpl.java:43)
	at java.base/java.lang.reflect.Method.invoke(Method.java:566)
	at org.eclipse.equinox.launcher.Main.invokeFramework(Main.java:657)
	at org.eclipse.equinox.launcher.Main.basicRun(Main.java:594)
	at org.eclipse.equinox.launcher.Main.run(Main.java:1447)
	at org.eclipse.equinox.launcher.Main.main(Main.java:1420)
16:17:43.044 DEBUG [main][ScreenshotCapturer] Capturing Screenshot: ./target/screenshots/no-configuration/org.eclipse.dartboard.test.project.DartProjectTest.projectWizard__NewDartProject__CreatesNewProject.png
16:17:43.224 DEBUG [main][ScreenshotCapturer] Screenshot successfully captured. Saved in /home/jenkins/agent/workspace/release/org.eclipse.dartboard.test/./target/screenshots/no-configuration/org.eclipse.dartboard.test.project.DartProjectTest.projectWizard__NewDartProject__CreatesNewProject.png
16:17:43.225 TRACE [WorkbenchTestable][EditorHandler] Closing all editors
16:17:43.225 DEBUG [main][EditorHandler] 0 editor(s) found
16:17:43.225 TRACE [WorkbenchTestable][WidgetLookup] Looking up widget with index 0 with specified parent and matchers
16:17:43.227 TRACE [WorkbenchTestable][WidgetLookup] widget with index 0 is found
16:17:43.227 INFO [WorkbenchTestable][AbstractView] View 'Matcher matching widget which text matches: Matcher matching text to regular expression '\*?\QProject Explorer\E'' is already open. Activate.
16:17:43.227 TRACE [WorkbenchTestable][WidgetLookup] Looking up widget with index 0 with specified parent and matchers
16:17:43.229 TRACE [WorkbenchTestable][WidgetLookup] widget with index 0 is found
16:17:43.229 DEBUG [WorkbenchTestable][AbstractShell] Set focus to Shell data - Eclipse Platform
16:17:43.229 DEBUG [WorkbenchTestable][AbstractWait] Waiting until shell is active...
16:17:43.229 DEBUG [WorkbenchTestable][AbstractWait] Waiting until shell is active finished successfully
16:17:43.229 DEBUG [WorkbenchTestable][WorkbenchShell] Workbench shell has title 'data - Eclipse Platform'
16:17:43.229 DEBUG [WorkbenchTestable][WidgetLookup] Looking up active widget with class type org.eclipse.swt.custom.CTabItem with referenced composite class org.eclipse.reddeer.workbench.impl.shell.WorkbenchShell, index 0 and following matchers specified (Matcher matching widget which text matches: Matcher matching text to regular expression '\*?\QProject Explorer\E')
16:17:43.229 DEBUG [WorkbenchTestable][AbstractWait] Waiting until widget is found...
16:17:43.229 TRACE [WorkbenchTestable][WidgetLookup] Looking up widget with index 0 with specified parent and matchers
16:17:43.231 TRACE [WorkbenchTestable][WidgetLookup] widget with index 0 is found
16:17:43.231 DEBUG [WorkbenchTestable][AbstractWait] Waiting until widget is found finished successfully
16:17:43.231 DEBUG [WorkbenchTestable][WidgetLookup] Active widget with class type org.eclipse.swt.custom.CTabItem and index 0 was found
16:17:43.231 INFO [WorkbenchTestable][AbstractView] Activate view Project Explorer
16:17:43.231 INFO [WorkbenchTestable][AbstractCTabItem] Activate Project Explorer
16:17:43.232 DEBUG [WorkbenchTestable][WorkbenchPartHandler] Active workbench control=Class=org.eclipse.e4.ui.workbench.renderers.swt.ContributedPartRenderer$1 Text=<unavailable> TooltipText=null
16:17:43.232 DEBUG [WorkbenchTestable][WorkbenchPartHandler] Focused control=Class=org.eclipse.swt.widgets.Shell Text=data - Eclipse Platform TooltipText=null
16:17:43.232 DEBUG [WorkbenchTestable][WorkbenchPartHandler] No control in opened view has a focus!
16:17:43.232 DEBUG [WorkbenchTestable][WorkbenchPartHandler] Setting implicit focus...
16:17:43.234 INFO [WorkbenchTestable][AbstractView] Activate view Project Explorer
16:17:43.234 INFO [WorkbenchTestable][AbstractCTabItem] Activate Project Explorer
16:17:43.235 DEBUG [WorkbenchTestable][WorkbenchPartHandler] Active workbench control=Class=org.eclipse.e4.ui.workbench.renderers.swt.ContributedPartRenderer$1 Text=<unavailable> TooltipText=null
16:17:43.235 DEBUG [WorkbenchTestable][WorkbenchPartHandler] Focused control=Class=org.eclipse.swt.widgets.Tree Text=<unavailable> TooltipText=null
16:17:43.235 INFO [WorkbenchTestable][AbstractView] Activate view Project Explorer
16:17:43.235 INFO [WorkbenchTestable][AbstractCTabItem] Activate Project Explorer
16:17:43.236 DEBUG [WorkbenchTestable][WorkbenchPartHandler] Active workbench control=Class=org.eclipse.e4.ui.workbench.renderers.swt.ContributedPartRenderer$1 Text=<unavailable> TooltipText=null
16:17:43.236 DEBUG [WorkbenchTestable][WorkbenchPartHandler] Focused control=Class=org.eclipse.swt.widgets.Tree Text=<unavailable> TooltipText=null
16:17:43.237 DEBUG [WorkbenchTestable][AbstractWait] Waiting until widget is found...
16:17:43.237 TRACE [WorkbenchTestable][WidgetLookup] Looking up widget with index 0 with specified parent and matchers
16:17:43.237 TRACE [WorkbenchTestable][WidgetLookup] widget with index 0is not found
16:17:43.737 TRACE [WorkbenchTestable][WidgetLookup] Looking up widget with index 0 with specified parent and matchers
16:17:43.738 TRACE [WorkbenchTestable][WidgetLookup] widget with index 0is not found
16:17:44.239 TRACE [WorkbenchTestable][WidgetLookup] Looking up widget with index 0 with specified parent and matchers
16:17:44.239 TRACE [WorkbenchTestable][WidgetLookup] widget with index 0is not found
16:17:44.239 DEBUG [WorkbenchTestable][AbstractWait] Waiting until widget is found failed, NO exception will be thrown
16:17:44.240 INFO [WorkbenchTestable][AbstractView] Activate view Project Explorer
16:17:44.240 INFO [WorkbenchTestable][AbstractCTabItem] Activate Project Explorer
16:17:44.242 DEBUG [WorkbenchTestable][WorkbenchPartHandler] Active workbench control=Class=org.eclipse.e4.ui.workbench.renderers.swt.ContributedPartRenderer$1 Text=<unavailable> TooltipText=null
16:17:44.242 DEBUG [WorkbenchTestable][WorkbenchPartHandler] Focused control=Class=org.eclipse.swt.widgets.Tree Text=<unavailable> TooltipText=null
16:17:44.242 DEBUG [WorkbenchTestable][WidgetLookup] Looking up active widget with class type org.eclipse.swt.widgets.Tree with referenced composite class org.eclipse.reddeer.swt.impl.ctab.DefaultCTabItem, index 0 and no matchers specified
16:17:44.242 DEBUG [WorkbenchTestable][AbstractWait] Waiting until widget is found...
16:17:44.242 TRACE [WorkbenchTestable][WidgetLookup] Looking up widget with index 0 with specified parent and matchers
16:17:44.243 TRACE [WorkbenchTestable][WidgetLookup] widget with index 0 is found
16:17:44.243 DEBUG [WorkbenchTestable][AbstractWait] Waiting until widget is found finished successfully
16:17:44.243 DEBUG [WorkbenchTestable][WidgetLookup] Active widget with class type org.eclipse.swt.widgets.Tree and index 0 was found
16:17:44.243 DEBUG [WorkbenchTestable][AbstractExplorer] Getting project with name some-random-project
16:17:44.244 INFO [WorkbenchTestable][AbstractView] Activate view Project Explorer
16:17:44.244 INFO [WorkbenchTestable][AbstractCTabItem] Activate Project Explorer
16:17:44.245 DEBUG [WorkbenchTestable][WorkbenchPartHandler] Active workbench control=Class=org.eclipse.e4.ui.workbench.renderers.swt.ContributedPartRenderer$1 Text=<unavailable> TooltipText=null
16:17:44.245 DEBUG [WorkbenchTestable][WorkbenchPartHandler] Focused control=Class=org.eclipse.swt.widgets.Tree Text=<unavailable> TooltipText=null
16:17:44.245 DEBUG [WorkbenchTestable][AbstractWait] Waiting until widget is found...
16:17:44.245 TRACE [WorkbenchTestable][WidgetLookup] Looking up widget with index 0 with specified parent and matchers
16:17:44.245 TRACE [WorkbenchTestable][WidgetLookup] widget with index 0is not found
16:17:44.746 TRACE [WorkbenchTestable][WidgetLookup] Looking up widget with index 0 with specified parent and matchers
16:17:44.747 TRACE [WorkbenchTestable][WidgetLookup] widget with index 0is not found
16:17:45.247 TRACE [WorkbenchTestable][WidgetLookup] Looking up widget with index 0 with specified parent and matchers
16:17:45.248 TRACE [WorkbenchTestable][WidgetLookup] widget with index 0is not found
16:17:45.248 DEBUG [WorkbenchTestable][AbstractWait] Waiting until widget is found failed, NO exception will be thrown
16:17:45.248 INFO [WorkbenchTestable][AbstractView] Activate view Project Explorer
16:17:45.248 INFO [WorkbenchTestable][AbstractCTabItem] Activate Project Explorer
16:17:45.249 DEBUG [WorkbenchTestable][WorkbenchPartHandler] Active workbench control=Class=org.eclipse.e4.ui.workbench.renderers.swt.ContributedPartRenderer$1 Text=<unavailable> TooltipText=null
16:17:45.250 DEBUG [WorkbenchTestable][WorkbenchPartHandler] Focused control=Class=org.eclipse.swt.widgets.Tree Text=<unavailable> TooltipText=null
16:17:45.250 DEBUG [WorkbenchTestable][WidgetLookup] Looking up active widget with class type org.eclipse.swt.widgets.Tree with referenced composite class org.eclipse.reddeer.swt.impl.ctab.DefaultCTabItem, index 0 and no matchers specified
16:17:45.250 DEBUG [WorkbenchTestable][AbstractWait] Waiting until widget is found...
16:17:45.250 TRACE [WorkbenchTestable][WidgetLookup] Looking up widget with index 0 with specified parent and matchers
16:17:45.250 TRACE [WorkbenchTestable][WidgetLookup] widget with index 0 is found
16:17:45.250 DEBUG [WorkbenchTestable][AbstractWait] Waiting until widget is found finished successfully
16:17:45.250 DEBUG [WorkbenchTestable][WidgetLookup] Active widget with class type org.eclipse.swt.widgets.Tree and index 0 was found
16:17:45.251 DEBUG [WorkbenchTestable][AbstractExplorer] Getting project with name some-random-project
16:17:45.251 INFO [WorkbenchTestable][AbstractView] Activate view Project Explorer
16:17:45.251 INFO [WorkbenchTestable][AbstractCTabItem] Activate Project Explorer
16:17:45.252 DEBUG [WorkbenchTestable][WorkbenchPartHandler] Active workbench control=Class=org.eclipse.e4.ui.workbench.renderers.swt.ContributedPartRenderer$1 Text=<unavailable> TooltipText=null
16:17:45.252 DEBUG [WorkbenchTestable][WorkbenchPartHandler] Focused control=Class=org.eclipse.swt.widgets.Tree Text=<unavailable> TooltipText=null
16:17:45.253 DEBUG [WorkbenchTestable][WidgetLookup] Looking up active widget with class type org.eclipse.swt.widgets.Tree with referenced composite class org.eclipse.reddeer.swt.impl.ctab.DefaultCTabItem, index 0 and no matchers specified
16:17:45.253 DEBUG [WorkbenchTestable][AbstractWait] Waiting until widget is found...
16:17:45.253 TRACE [WorkbenchTestable][WidgetLookup] Looking up widget with index 0 with specified parent and matchers
16:17:45.253 TRACE [WorkbenchTestable][WidgetLookup] widget with index 0 is found
16:17:45.253 DEBUG [WorkbenchTestable][AbstractWait] Waiting until widget is found finished successfully
16:17:45.253 DEBUG [WorkbenchTestable][WidgetLookup] Active widget with class type org.eclipse.swt.widgets.Tree and index 0 was found
16:17:45.253 INFO [WorkbenchTestable][AbstractTree] Select specified tree items
16:17:45.253 INFO [WorkbenchTestable][TreeItemHandler] Select tree items: 
16:17:45.253 DEBUG [main][TreeItemHandler] Set Tree selection
16:17:45.254 DEBUG [main][TreeHandler] Notify Tree about selection event
16:17:45.271 DEBUG [WorkbenchTestable][TreeItemHandler] Selected Tree Items:
16:17:45.276 DEBUG [WorkbenchTestable][TreeItemHandler]   some-random-project
16:17:45.276 TRACE [WorkbenchTestable][WidgetHandler] Notify Tree with event 35
16:17:45.276 TRACE [WorkbenchTestable][WidgetHandler] Wait for synchronization
16:17:45.349 DEBUG [main][MenuItemLookup] Found menu:'New'
16:17:45.349 DEBUG [main][MenuItemLookup] Found menu:'Go Into'
16:17:45.349 DEBUG [main][MenuItemLookup] Found menu:''
16:17:45.349 DEBUG [main][MenuItemLookup] Found menu:'Show In	Shift+Alt+W'
16:17:45.349 DEBUG [main][MenuItemLookup] Found menu:''
16:17:45.349 DEBUG [main][MenuItemLookup] Found menu:'Copy	Ctrl+C'
16:17:45.349 DEBUG [main][MenuItemLookup] Found menu:'Paste	Ctrl+V'
16:17:45.349 DEBUG [main][MenuItemLookup] Found menu:'Delete	Delete'
16:17:45.350 DEBUG [main][MenuItemLookup] Found menu:'Move...'
16:17:45.350 DEBUG [main][MenuItemLookup] Found menu:'Rename...	F2'
16:17:45.350 DEBUG [main][MenuItemLookup] Found menu:''
16:17:45.350 DEBUG [main][MenuItemLookup] Found menu:'Import...'
16:17:45.350 DEBUG [main][MenuItemLookup] Found menu:'Export...'
16:17:45.350 DEBUG [main][MenuItemLookup] Found menu:''
16:17:45.350 DEBUG [main][MenuItemLookup] Found menu:'Refresh	F5'
16:17:45.350 DEBUG [main][MenuItemLookup] Item match:Refresh	F5
16:17:45.350 DEBUG [WorkbenchTestable][MenuItemHandler] Queried MenuItem text:"Re&fresh	F5"
16:17:45.350 INFO [WorkbenchTestable][AbstractMenuItem] Select menu item with text Refresh	F5
16:17:45.350 INFO [main][MenuItemHandler] Select menu item: Re&fresh	F5
16:17:45.351 DEBUG [WorkbenchTestable][AbstractWait] Waiting while at least one job is running...
16:17:45.351 DEBUG [WorkbenchTestable][JobIsRunning]   job 'Decoration Calculation' is a system job, skipped
16:17:45.351 DEBUG [WorkbenchTestable][JobIsRunning]   job 'refresh' has no excuses, wait for it
16:17:45.851 DEBUG [WorkbenchTestable][JobIsRunning]   job 'Compacting resource model' is a system job, skipped
16:17:45.851 DEBUG [WorkbenchTestable][JobIsRunning]   job 'Workbench Auto-Save Job' is a system job, skipped
16:17:45.852 DEBUG [WorkbenchTestable][JobIsRunning]   job 'Periodic workspace save.' is a system job, skipped
16:17:45.852 DEBUG [WorkbenchTestable][AbstractWait] Waiting while at least one job is running finished successfully
16:17:45.852 TRACE [WorkbenchTestable][WidgetHandler] Notify Tree with event 35
16:17:45.852 TRACE [WorkbenchTestable][WidgetHandler] Wait for synchronization
16:17:45.917 DEBUG [main][MenuItemLookup] Found menu:'New'
16:17:45.917 DEBUG [main][MenuItemLookup] Found menu:'Go Into'
16:17:45.917 DEBUG [main][MenuItemLookup] Found menu:''
16:17:45.917 DEBUG [main][MenuItemLookup] Found menu:'Show In	Shift+Alt+W'
16:17:45.917 DEBUG [main][MenuItemLookup] Found menu:''
16:17:45.917 DEBUG [main][MenuItemLookup] Found menu:'Copy	Ctrl+C'
16:17:45.917 DEBUG [main][MenuItemLookup] Found menu:'Paste	Ctrl+V'
16:17:45.917 DEBUG [main][MenuItemLookup] Found menu:'Delete	Delete'
16:17:45.917 DEBUG [main][MenuItemLookup] Item match:Delete	Delete
16:17:45.917 DEBUG [WorkbenchTestable][MenuItemHandler] Queried MenuItem text:"&Delete	Delete"
16:17:45.917 INFO [WorkbenchTestable][AbstractMenuItem] Select menu item with text Delete	Delete
16:17:45.917 INFO [main][MenuItemHandler] Select menu item: &Delete	Delete
16:17:46.017 DEBUG [WorkbenchTestable][AbstractWait] Waiting until shell matching Matcher matching when all matchers match: [Matcher matching widget which text matches: "Delete Resources"] is available....
16:17:46.708 DEBUG [WorkbenchTestable][AbstractWait] Waiting until shell matching Matcher matching when all matchers match: [Matcher matching widget which text matches: "Delete Resources"] is available. finished successfully
16:17:46.708 DEBUG [WorkbenchTestable][AbstractShell] Set focus to Shell Delete Resources
16:17:46.709 DEBUG [WorkbenchTestable][AbstractWait] Waiting until shell is active...
16:17:46.712 DEBUG [WorkbenchTestable][AbstractWait] Waiting until shell is active finished successfully
16:17:46.712 DEBUG [WorkbenchTestable][WidgetLookup] Looking up active widget with class type org.eclipse.swt.widgets.Button with no referenced composite specified, index 0 and following matchers specified (Widget matcher matching widgets with style: 32)
16:17:46.712 DEBUG [WorkbenchTestable][WidgetLookup] No parent specified, finding one
16:17:46.712 DEBUG [WorkbenchTestable][AbstractWait] Waiting until active shell exists...
16:17:46.712 DEBUG [WorkbenchTestable][AbstractWait] Waiting until active shell exists finished successfully
16:17:46.712 TRACE [WorkbenchTestable][WidgetLookup] Setting active shell with title "Delete Resources" as the parent
16:17:46.712 DEBUG [WorkbenchTestable][WidgetLookup] Parent found successfully
16:17:46.713 DEBUG [WorkbenchTestable][AbstractWait] Waiting until widget is found...
16:17:46.713 TRACE [WorkbenchTestable][WidgetLookup] Looking up widget with index 0 with specified parent and matchers
16:17:46.713 TRACE [WorkbenchTestable][WidgetLookup] widget with index 0 is found
16:17:46.713 DEBUG [WorkbenchTestable][AbstractWait] Waiting until widget is found finished successfully
16:17:46.713 DEBUG [WorkbenchTestable][WidgetLookup] Active widget with class type org.eclipse.swt.widgets.Button and index 0 was found
16:17:46.713 INFO [WorkbenchTestable][CheckBox] Select checkbox &Delete project contents on disk (cannot be undone)
16:17:46.714 INFO [WorkbenchTestable][CheckBox] Check checkbox &Delete project contents on disk (cannot be undone)
16:17:46.714 INFO [WorkbenchTestable][AbstractButton] Click button &Delete project contents on disk (cannot be undone)
16:17:46.714 DEBUG [WorkbenchTestable][AbstractWait] Waiting until control is enabled...
16:17:46.714 DEBUG [WorkbenchTestable][AbstractWait] Waiting until control is enabled finished successfully
16:17:46.714 TRACE [WorkbenchTestable][WidgetHandler] Notify Button with event 13
16:17:46.714 TRACE [WorkbenchTestable][WidgetHandler] Wait for synchronization
16:17:46.714 DEBUG [WorkbenchTestable][WidgetLookup] Looking up active widget with class type org.eclipse.swt.widgets.Button with no referenced composite specified, index 0 and following matchers specified (Widget matcher matching widgets with style: 8, Matcher matching widgets with text that without mnenomic matches: is "OK")
16:17:46.714 DEBUG [WorkbenchTestable][WidgetLookup] No parent specified, finding one
16:17:46.714 DEBUG [WorkbenchTestable][AbstractWait] Waiting until active shell exists...
16:17:46.714 DEBUG [WorkbenchTestable][AbstractWait] Waiting until active shell exists finished successfully
16:17:46.714 TRACE [WorkbenchTestable][WidgetLookup] Setting active shell with title "Delete Resources" as the parent
16:17:46.714 DEBUG [WorkbenchTestable][WidgetLookup] Parent found successfully
16:17:46.714 DEBUG [WorkbenchTestable][AbstractWait] Waiting until widget is found...
16:17:46.715 TRACE [WorkbenchTestable][WidgetLookup] Looking up widget with index 0 with specified parent and matchers
16:17:46.716 TRACE [WorkbenchTestable][WidgetLookup] widget with index 0 is found
16:17:46.716 DEBUG [WorkbenchTestable][AbstractWait] Waiting until widget is found finished successfully
16:17:46.716 DEBUG [WorkbenchTestable][WidgetLookup] Active widget with class type org.eclipse.swt.widgets.Button and index 0 was found
16:17:46.716 INFO [WorkbenchTestable][AbstractButton] Click button OK
16:17:46.716 DEBUG [WorkbenchTestable][AbstractWait] Waiting until control is enabled...
16:17:46.716 DEBUG [WorkbenchTestable][AbstractWait] Waiting until control is enabled finished successfully
16:17:46.716 TRACE [WorkbenchTestable][WidgetHandler] Notify Button with event 13
16:17:46.716 TRACE [WorkbenchTestable][WidgetHandler] Wait for synchronization
16:17:46.723 DEBUG [WorkbenchTestable][AbstractWait] Waiting until Shell has children or is not available....
16:17:46.723 DEBUG [WorkbenchTestable][ShellHasChildrenOrIsNotAvailable] number of child shells: 0
16:17:47.224 DEBUG [WorkbenchTestable][AbstractWait] Waiting until Shell has children or is not available. finished successfully
16:17:47.224 DEBUG [WorkbenchTestable][DeleteUtils] Delete shell is disposed.
16:17:47.224 DEBUG [WorkbenchTestable][AbstractWait] Waiting while at least one job is running...
16:17:47.224 DEBUG [WorkbenchTestable][JobIsRunning]   job 'Compacting resource model' is a system job, skipped
16:17:47.224 DEBUG [WorkbenchTestable][JobIsRunning]   job 'Workbench Auto-Save Job' is a system job, skipped
16:17:47.224 DEBUG [WorkbenchTestable][AbstractWait] Waiting while at least one job is running finished successfully
16:17:47.225 INFO [WorkbenchTestable][AbstractView] Activate view Project Explorer
16:17:47.225 INFO [WorkbenchTestable][AbstractCTabItem] Activate Project Explorer
16:17:47.226 DEBUG [WorkbenchTestable][WorkbenchPartHandler] Active workbench control=Class=org.eclipse.e4.ui.workbench.renderers.swt.ContributedPartRenderer$1 Text=<unavailable> TooltipText=null
16:17:47.226 DEBUG [WorkbenchTestable][WorkbenchPartHandler] Focused control=Class=org.eclipse.swt.widgets.Link Text=There are no projects in your workspace.
To add a project: TooltipText=null
16:17:47.226 DEBUG [WorkbenchTestable][RunIAfterTestExtensions] Run after test extensions for test class org.eclipse.dartboard.test.project.DartProjectTest
16:17:47.226 DEBUG [WorkbenchTestable][RunIAfterTestExtensions] Run method runAfterTest() of class org.eclipse.reddeer.junit.extension.after.test.impl.CloseAllShellsExt
16:17:47.227 INFO [WorkbenchTestable][WorkbenchShellHandler] Closing all shells...
16:17:47.227 DEBUG [WorkbenchTestable][AbstractWait] Waiting until active shell exists...
16:17:47.227 DEBUG [WorkbenchTestable][AbstractWait] Waiting until active shell exists finished successfully
16:17:47.228 ERROR [WorkbenchTestable][RequirementsRunner] Exception in test: projectWizard__NewDartProject__CreatesNewProject no-configuration(org.eclipse.dartboard.test.project.DartProjectTest)
org.eclipse.reddeer.common.exception.RedDeerException: Exception during sync execution in UI thread
	at org.eclipse.reddeer.common.util.Display.handleErrorOccured(Display.java:112)
	at org.eclipse.reddeer.common.util.Display.syncExec(Display.java:84)
	at org.eclipse.reddeer.core.lookup.WidgetLookup.visible(WidgetLookup.java:462)
	at org.eclipse.reddeer.core.lookup.WidgetLookup.findControlUI(WidgetLookup.java:394)
	at org.eclipse.reddeer.core.lookup.WidgetLookup.findControlUI(WidgetLookup.java:443)
	at org.eclipse.reddeer.core.lookup.WidgetLookup.findControlUI(WidgetLookup.java:417)
	at org.eclipse.reddeer.core.lookup.WidgetLookup.findControlUI(WidgetLookup.java:443)
	at org.eclipse.reddeer.core.lookup.WidgetLookup.findControlUI(WidgetLookup.java:417)
	at org.eclipse.reddeer.core.lookup.WidgetLookup.findControlUI(WidgetLookup.java:443)
	at org.eclipse.reddeer.core.lookup.WidgetLookup.findControlUI(WidgetLookup.java:417)
	at org.eclipse.reddeer.core.lookup.WidgetLookup.findControlUI(WidgetLookup.java:443)
	at org.eclipse.reddeer.core.lookup.WidgetLookup.findControlUI(WidgetLookup.java:417)
	at org.eclipse.reddeer.core.lookup.WidgetLookup.findControlUI(WidgetLookup.java:443)
	at org.eclipse.reddeer.core.lookup.WidgetLookup.findControlUI(WidgetLookup.java:417)
	at org.eclipse.reddeer.core.lookup.WidgetLookup.findControlUI(WidgetLookup.java:443)
	at org.eclipse.reddeer.core.lookup.WidgetLookup.findControlUI(WidgetLookup.java:417)
	at org.eclipse.reddeer.core.lookup.WidgetLookup.findControlUI(WidgetLookup.java:443)
	at org.eclipse.reddeer.core.lookup.WidgetLookup.findControlUI(WidgetLookup.java:417)
	at org.eclipse.reddeer.core.lookup.WidgetLookup.findControlUI(WidgetLookup.java:443)
	at org.eclipse.reddeer.core.lookup.WidgetLookup.findControlUI(WidgetLookup.java:417)
	at org.eclipse.reddeer.core.lookup.WidgetLookup.findControlUI(WidgetLookup.java:443)
	at org.eclipse.reddeer.core.lookup.WidgetLookup.findControlUI(WidgetLookup.java:417)
	at org.eclipse.reddeer.core.lookup.WidgetLookup.findControlUI(WidgetLookup.java:443)
	at org.eclipse.reddeer.core.lookup.WidgetLookup.findControlUI(WidgetLookup.java:417)
	at org.eclipse.reddeer.core.lookup.WidgetLookup.findControlUI(WidgetLookup.java:443)
	at org.eclipse.reddeer.core.lookup.WidgetLookup.findControlUI(WidgetLookup.java:417)
	at org.eclipse.reddeer.core.lookup.WidgetLookup.findControlUI(WidgetLookup.java:443)
	at org.eclipse.reddeer.core.lookup.WidgetLookup.findControlUI(WidgetLookup.java:417)
	at org.eclipse.reddeer.core.lookup.WidgetLookup.findControlUI(WidgetLookup.java:443)
	at org.eclipse.reddeer.core.lookup.WidgetLookup.findControlUI(WidgetLookup.java:417)
	at org.eclipse.reddeer.core.lookup.WidgetLookup.findControl(WidgetLookup.java:306)
	at org.eclipse.reddeer.core.lookup.WidgetLookup.activeWidget(WidgetLookup.java:206)
	at org.eclipse.reddeer.core.condition.WidgetIsFound.test(WidgetIsFound.java:97)
	at org.eclipse.reddeer.common.wait.WaitUntil.stopWaiting(WaitUntil.java:103)
	at org.eclipse.reddeer.common.wait.AbstractWait.wait(AbstractWait.java:147)
	at org.eclipse.reddeer.common.wait.AbstractWait.<init>(AbstractWait.java:132)
	at org.eclipse.reddeer.common.wait.AbstractWait.<init>(AbstractWait.java:97)
	at org.eclipse.reddeer.common.wait.AbstractWait.<init>(AbstractWait.java:64)
	at org.eclipse.reddeer.common.wait.WaitUntil.<init>(WaitUntil.java:50)
	at org.eclipse.reddeer.core.lookup.WidgetLookup.activeWidget(WidgetLookup.java:109)
	at org.eclipse.reddeer.core.lookup.WidgetLookup.activeWidget(WidgetLookup.java:87)
	at org.eclipse.reddeer.swt.widgets.AbstractWidget.<init>(AbstractWidget.java:76)
	at org.eclipse.reddeer.swt.widgets.AbstractItem.<init>(AbstractItem.java:32)
	at org.eclipse.reddeer.swt.impl.ctab.AbstractCTabItem.<init>(AbstractCTabItem.java:39)
	at org.eclipse.reddeer.swt.impl.ctab.DefaultCTabItem.<init>(DefaultCTabItem.java:98)
	at org.eclipse.reddeer.swt.impl.ctab.DefaultCTabItem.<init>(DefaultCTabItem.java:77)
	at org.eclipse.reddeer.workbench.impl.view.AbstractView.checkOpen(AbstractView.java:181)
	at org.eclipse.reddeer.workbench.impl.view.AbstractView.activate(AbstractView.java:90)
	at org.eclipse.reddeer.workbench.impl.view.AbstractView.open(AbstractView.java:136)
	at org.eclipse.reddeer.eclipse.condition.ProjectExists.test(ProjectExists.java:53)
	at org.eclipse.reddeer.common.wait.WaitUntil.stopWaiting(WaitUntil.java:103)
	at org.eclipse.reddeer.common.wait.AbstractWait.wait(AbstractWait.java:147)
	at org.eclipse.reddeer.common.wait.AbstractWait.<init>(AbstractWait.java:132)
	at org.eclipse.reddeer.common.wait.AbstractWait.<init>(AbstractWait.java:97)
	at org.eclipse.reddeer.common.wait.AbstractWait.<init>(AbstractWait.java:64)
	at org.eclipse.reddeer.common.wait.AbstractWait.<init>(AbstractWait.java:50)
	at org.eclipse.reddeer.common.wait.WaitUntil.<init>(WaitUntil.java:38)
	at org.eclipse.dartboard.test.project.DartProjectTest.projectWizard__NewDartProject__CreatesNewProject(DartProjectTest.java:72)
	at java.base/jdk.internal.reflect.NativeMethodAccessorImpl.invoke0(Native Method)
	at java.base/jdk.internal.reflect.NativeMethodAccessorImpl.invoke(NativeMethodAccessorImpl.java:62)
	at java.base/jdk.internal.reflect.DelegatingMethodAccessorImpl.invoke(DelegatingMethodAccessorImpl.java:43)
	at java.base/java.lang.reflect.Method.invoke(Method.java:566)
	at org.junit.runners.model.FrameworkMethod$1.runReflectiveCall(FrameworkMethod.java:50)
	at org.junit.internal.runners.model.ReflectiveCallable.run(ReflectiveCallable.java:12)
	at org.junit.runners.model.FrameworkMethod.invokeExplosively(FrameworkMethod.java:47)
	at org.eclipse.reddeer.junit.internal.runner.statement.RunTestMethod.evaluate(RunTestMethod.java:48)
	at org.eclipse.reddeer.junit.internal.runner.statement.RunBefores.evaluate(RunBefores.java:85)
	at org.eclipse.reddeer.junit.internal.runner.statement.RunIBeforeTestExtensions.evaluate(RunIBeforeTestExtensions.java:73)
	at org.eclipse.reddeer.junit.internal.runner.statement.RunAfters.evaluate(RunAfters.java:72)
	at org.eclipse.reddeer.junit.internal.runner.statement.RunIAfterTestExtensions.evaluate(RunIAfterTestExtensions.java:59)
	at org.junit.runners.ParentRunner.runLeaf(ParentRunner.java:325)
	at org.eclipse.reddeer.junit.internal.runner.RequirementsRunner.runChild(RequirementsRunner.java:171)
	at org.junit.runners.BlockJUnit4ClassRunner.runChild(BlockJUnit4ClassRunner.java:57)
	at org.junit.runners.ParentRunner$3.run(ParentRunner.java:290)
	at org.junit.runners.ParentRunner$1.schedule(ParentRunner.java:71)
	at org.junit.runners.ParentRunner.runChildren(ParentRunner.java:288)
	at org.junit.runners.ParentRunner.access$000(ParentRunner.java:58)
	at org.junit.runners.ParentRunner$2.evaluate(ParentRunner.java:268)
	at org.eclipse.reddeer.junit.internal.runner.statement.RunBeforeClasses.evaluate(RunBeforeClasses.java:81)
	at org.eclipse.reddeer.junit.internal.runner.statement.FulfillRequirementsStatement.evaluate(FulfillRequirementsStatement.java:46)
	at org.eclipse.reddeer.junit.internal.runner.statement.RunIBeforeClassExtensions.evaluate(RunIBeforeClassExtensions.java:72)
	at org.eclipse.reddeer.junit.internal.runner.statement.RunAfterClasses.evaluate(RunAfterClasses.java:68)
	at org.eclipse.reddeer.junit.internal.runner.statement.CleanUpRequirementStatement.evaluate(CleanUpRequirementStatement.java:45)
	at org.eclipse.reddeer.junit.internal.runner.statement.RunIAfterClassExtensions.evaluate(RunIAfterClassExtensions.java:57)
	at org.junit.runners.ParentRunner.run(ParentRunner.java:363)
	at org.eclipse.reddeer.junit.internal.runner.RequirementsRunner.run(RequirementsRunner.java:153)
	at org.junit.runners.Suite.runChild(Suite.java:128)
	at org.junit.runners.Suite.runChild(Suite.java:27)
	at org.junit.runners.ParentRunner$3.run(ParentRunner.java:290)
	at org.junit.runners.ParentRunner$1.schedule(ParentRunner.java:71)
	at org.junit.runners.ParentRunner.runChildren(ParentRunner.java:288)
	at org.junit.runners.ParentRunner.access$000(ParentRunner.java:58)
	at org.junit.runners.ParentRunner$2.evaluate(ParentRunner.java:268)
	at org.junit.runners.ParentRunner.run(ParentRunner.java:363)
	at org.junit.runners.Suite.runChild(Suite.java:128)
	at org.junit.runners.Suite.runChild(Suite.java:27)
	at org.junit.runners.ParentRunner$3.run(ParentRunner.java:290)
	at org.junit.runners.ParentRunner$1.schedule(ParentRunner.java:71)
	at org.junit.runners.ParentRunner.runChildren(ParentRunner.java:288)
	at org.junit.runners.ParentRunner.access$000(ParentRunner.java:58)
	at org.junit.runners.ParentRunner$2.evaluate(ParentRunner.java:268)
	at org.junit.runners.ParentRunner.run(ParentRunner.java:363)
	at org.apache.maven.surefire.junit4.JUnit4Provider.execute(JUnit4Provider.java:365)
	at org.apache.maven.surefire.junit4.JUnit4Provider.executeWithRerun(JUnit4Provider.java:273)
	at org.apache.maven.surefire.junit4.JUnit4Provider.executeTestSet(JUnit4Provider.java:238)
	at org.apache.maven.surefire.junit4.JUnit4Provider.invoke(JUnit4Provider.java:159)
	at java.base/jdk.internal.reflect.NativeMethodAccessorImpl.invoke0(Native Method)
	at java.base/jdk.internal.reflect.NativeMethodAccessorImpl.invoke(NativeMethodAccessorImpl.java:62)
	at java.base/jdk.internal.reflect.DelegatingMethodAccessorImpl.invoke(DelegatingMethodAccessorImpl.java:43)
	at java.base/java.lang.reflect.Method.invoke(Method.java:566)
	at org.apache.maven.surefire.util.ReflectionUtils.invokeMethodWithArray2(ReflectionUtils.java:206)
	at org.apache.maven.surefire.booter.ProviderFactory$ProviderProxy.invoke(ProviderFactory.java:161)
	at org.apache.maven.surefire.booter.ProviderFactory.invokeProvider(ProviderFactory.java:84)
	at org.eclipse.tycho.surefire.osgibooter.OsgiSurefireBooter.run(OsgiSurefireBooter.java:113)
	at org.eclipse.tycho.surefire.osgibooter.AbstractUITestApplication.runTests(AbstractUITestApplication.java:44)
	at org.eclipse.e4.ui.internal.workbench.swt.E4Testable.lambda$0(E4Testable.java:76)
	at java.base/java.lang.Thread.run(Thread.java:834)
Caused by: org.eclipse.swt.SWTException: Widget is disposed
	at org.eclipse.swt.SWT.error(SWT.java:4720)
	at org.eclipse.swt.SWT.error(SWT.java:4635)
	at org.eclipse.swt.SWT.error(SWT.java:4606)
	at org.eclipse.swt.widgets.Widget.error(Widget.java:550)
	at org.eclipse.swt.widgets.Widget.checkWidget(Widget.java:470)
	at org.eclipse.swt.widgets.Control.getVisible(Control.java:3360)
	at org.eclipse.reddeer.core.lookup.WidgetLookup$4.run(WidgetLookup.java:466)
	at org.eclipse.reddeer.core.lookup.WidgetLookup$4.run(WidgetLookup.java:1)
	at org.eclipse.reddeer.common.util.Display$ErrorHandlingRunnable.run(Display.java:162)
	at org.eclipse.swt.widgets.RunnableLock.run(RunnableLock.java:40)
	at org.eclipse.swt.widgets.Synchronizer.runAsyncMessages(Synchronizer.java:185)
	at org.eclipse.swt.widgets.Display.runAsyncMessages(Display.java:4975)
	at org.eclipse.swt.widgets.Display.readAndDispatch(Display.java:4496)
	at org.eclipse.e4.ui.internal.workbench.swt.PartRenderingEngine$5.run(PartRenderingEngine.java:1160)
	at org.eclipse.core.databinding.observable.Realm.runWithDefault(Realm.java:338)
	at org.eclipse.e4.ui.internal.workbench.swt.PartRenderingEngine.run(PartRenderingEngine.java:1049)
	at org.eclipse.e4.ui.internal.workbench.E4Workbench.createAndRunUI(E4Workbench.java:155)
	at org.eclipse.ui.internal.Workbench.lambda$3(Workbench.java:660)
	at org.eclipse.core.databinding.observable.Realm.runWithDefault(Realm.java:338)
	at org.eclipse.ui.internal.Workbench.createAndRunWorkbench(Workbench.java:559)
	at org.eclipse.ui.PlatformUI.createAndRunWorkbench(PlatformUI.java:154)
	at org.eclipse.ui.internal.ide.application.IDEApplication.start(IDEApplication.java:150)
	at org.eclipse.tycho.surefire.osgibooter.UITestApplication.runApplication(UITestApplication.java:31)
	at org.eclipse.tycho.surefire.osgibooter.AbstractUITestApplication.run(AbstractUITestApplication.java:120)
	at org.eclipse.tycho.surefire.osgibooter.UITestApplication.start(UITestApplication.java:37)
	at org.eclipse.equinox.internal.app.EclipseAppHandle.run(EclipseAppHandle.java:203)
	at org.eclipse.core.runtime.internal.adaptor.EclipseAppLauncher.runApplication(EclipseAppLauncher.java:137)
	at org.eclipse.core.runtime.internal.adaptor.EclipseAppLauncher.start(EclipseAppLauncher.java:107)
	at org.eclipse.core.runtime.adaptor.EclipseStarter.run(EclipseStarter.java:401)
	at org.eclipse.core.runtime.adaptor.EclipseStarter.run(EclipseStarter.java:255)
	at java.base/jdk.internal.reflect.NativeMethodAccessorImpl.invoke0(Native Method)
	at java.base/jdk.internal.reflect.NativeMethodAccessorImpl.invoke(NativeMethodAccessorImpl.java:62)
	at java.base/jdk.internal.reflect.DelegatingMethodAccessorImpl.invoke(DelegatingMethodAccessorImpl.java:43)
	at java.base/java.lang.reflect.Method.invoke(Method.java:566)
	at org.eclipse.equinox.launcher.Main.invokeFramework(Main.java:657)
	at org.eclipse.equinox.launcher.Main.basicRun(Main.java:594)
	at org.eclipse.equinox.launcher.Main.run(Main.java:1447)
	at org.eclipse.equinox.launcher.Main.main(Main.java:1420)
org.eclipse.swt.SWTException: Widget is disposed
	at org.eclipse.swt.SWT.error(SWT.java:4720)
	at org.eclipse.swt.SWT.error(SWT.java:4635)
	at org.eclipse.swt.SWT.error(SWT.java:4606)
	at org.eclipse.swt.widgets.Widget.error(Widget.java:550)
	at org.eclipse.swt.widgets.Widget.checkWidget(Widget.java:470)
	at org.eclipse.swt.widgets.Control.getVisible(Control.java:3360)
	at org.eclipse.reddeer.core.lookup.WidgetLookup$4.run(WidgetLookup.java:466)
	at org.eclipse.reddeer.core.lookup.WidgetLookup$4.run(WidgetLookup.java:1)
	at org.eclipse.reddeer.common.util.Display$ErrorHandlingRunnable.run(Display.java:162)
	at org.eclipse.swt.widgets.RunnableLock.run(RunnableLock.java:40)
	at org.eclipse.swt.widgets.Synchronizer.runAsyncMessages(Synchronizer.java:185)
	at org.eclipse.swt.widgets.Display.runAsyncMessages(Display.java:4975)
	at org.eclipse.swt.widgets.Display.readAndDispatch(Display.java:4496)
	at org.eclipse.e4.ui.internal.workbench.swt.PartRenderingEngine$5.run(PartRenderingEngine.java:1160)
	at org.eclipse.core.databinding.observable.Realm.runWithDefault(Realm.java:338)
	at org.eclipse.e4.ui.internal.workbench.swt.PartRenderingEngine.run(PartRenderingEngine.java:1049)
	at org.eclipse.e4.ui.internal.workbench.E4Workbench.createAndRunUI(E4Workbench.java:155)
	at org.eclipse.ui.internal.Workbench.lambda$3(Workbench.java:660)
	at org.eclipse.core.databinding.observable.Realm.runWithDefault(Realm.java:338)
	at org.eclipse.ui.internal.Workbench.createAndRunWorkbench(Workbench.java:559)
	at org.eclipse.ui.PlatformUI.createAndRunWorkbench(PlatformUI.java:154)
	at org.eclipse.ui.internal.ide.application.IDEApplication.start(IDEApplication.java:150)
	at org.eclipse.tycho.surefire.osgibooter.UITestApplication.runApplication(UITestApplication.java:31)
	at org.eclipse.tycho.surefire.osgibooter.AbstractUITestApplication.run(AbstractUITestApplication.java:120)
	at org.eclipse.tycho.surefire.osgibooter.UITestApplication.start(UITestApplication.java:37)
	at org.eclipse.equinox.internal.app.EclipseAppHandle.run(EclipseAppHandle.java:203)
	at org.eclipse.core.runtime.internal.adaptor.EclipseAppLauncher.runApplication(EclipseAppLauncher.java:137)
	at org.eclipse.core.runtime.internal.adaptor.EclipseAppLauncher.start(EclipseAppLauncher.java:107)
	at org.eclipse.core.runtime.adaptor.EclipseStarter.run(EclipseStarter.java:401)
	at org.eclipse.core.runtime.adaptor.EclipseStarter.run(EclipseStarter.java:255)
	at java.base/jdk.internal.reflect.NativeMethodAccessorImpl.invoke0(Native Method)
	at java.base/jdk.internal.reflect.NativeMethodAccessorImpl.invoke(NativeMethodAccessorImpl.java:62)
	at java.base/jdk.internal.reflect.DelegatingMethodAccessorImpl.invoke(DelegatingMethodAccessorImpl.java:43)
	at java.base/java.lang.reflect.Method.invoke(Method.java:566)
	at org.eclipse.equinox.launcher.Main.invokeFramework(Main.java:657)
	at org.eclipse.equinox.launcher.Main.basicRun(Main.java:594)
	at org.eclipse.equinox.launcher.Main.run(Main.java:1447)
	at org.eclipse.equinox.launcher.Main.main(Main.java:1420)
16:17:47.234 INFO [WorkbenchTestable][RequirementsRunner] Finished test: projectWizard__NewDartProject__CreatesNewProject no-configuration(org.eclipse.dartboard.test.project.DartProjectTest)
16:17:47.234 DEBUG [WorkbenchTestable][RequirementsRunner] Injecting fulfilled requirements into test instance: org.eclipse.reddeer.junit.internal.requirement.Requirements
16:17:47.234 INFO [WorkbenchTestable][RequirementsRunner] Started test: projectWizard__NewMenu__HasDartFileItem no-configuration(org.eclipse.dartboard.test.project.DartProjectTest)
16:17:47.234 DEBUG [WorkbenchTestable][RunIBeforeTestExtensions] Run before test extensions for test class org.eclipse.dartboard.test.project.DartProjectTest
16:17:47.234 DEBUG [WorkbenchTestable][RunIBeforeTestExtensions] Run method runBeforeTest() of class org.eclipse.reddeer.junit.extension.before.test.impl.DisableAERI
16:17:47.234 DEBUG [WorkbenchTestable][RunIBeforeTestExtensions] Run method runBeforeTest() of class org.eclipse.reddeer.junit.extension.before.test.impl.CloseWelcomeScreenExt
16:17:47.234 DEBUG [WorkbenchTestable][RunIBeforeTestExtensions] Run method runBeforeTest() of class org.eclipse.reddeer.junit.extension.before.test.impl.SetOpenAssociatedPerspectiveExt
16:17:47.234 DEBUG [WorkbenchTestable][RunIBeforeTestExtensions] Run method runBeforeTest() of class org.eclipse.reddeer.junit.extension.before.test.impl.DoNotDownloadMavenIndexesExt
16:17:47.235 DEBUG [WorkbenchTestable][AbstractWait] Waiting until active shell exists...
16:17:47.235 DEBUG [WorkbenchTestable][AbstractWait] Waiting until active shell exists finished successfully
16:17:47.235 INFO [WorkbenchTestable][ShellHandler] Getting Menu Bar of shell 'data - Eclipse Platform'
16:17:47.237 DEBUG [WorkbenchTestable][MenuItemHandler] Queried MenuItem text:"&File"
16:17:47.240 DEBUG [WorkbenchTestable][MenuItemHandler] Queried MenuItem text:"&New	Shift+Alt+N"
16:17:47.246 DEBUG [WorkbenchTestable][MenuItemHandler] Queried MenuItem text:"Dart Project"
16:17:47.246 DEBUG [WorkbenchTestable][MenuItemHandler] Queried MenuItem text:"P&roject..."
16:17:47.246 DEBUG [WorkbenchTestable][MenuItemHandler] Queried MenuItem text:""
16:17:47.246 DEBUG [WorkbenchTestable][MenuItemHandler] Queried MenuItem text:"Folder"
16:17:47.246 DEBUG [WorkbenchTestable][MenuItemHandler] Queried MenuItem text:"File"
16:17:47.247 DEBUG [WorkbenchTestable][MenuItemHandler] Queried MenuItem text:"Untitled Text File"
16:17:47.247 DEBUG [WorkbenchTestable][MenuItemHandler] Queried MenuItem text:"Dart File"
16:17:47.247 TRACE [WorkbenchTestable][EditorHandler] Closing all editors
16:17:47.247 DEBUG [main][EditorHandler] 0 editor(s) found
16:17:47.248 TRACE [WorkbenchTestable][WidgetLookup] Looking up widget with index 0 with specified parent and matchers
16:17:47.250 TRACE [WorkbenchTestable][WidgetLookup] widget with index 0 is found
16:17:47.250 INFO [WorkbenchTestable][AbstractView] View 'Matcher matching widget which text matches: Matcher matching text to regular expression '\*?\QProject Explorer\E'' is already open. Activate.
16:17:47.250 TRACE [WorkbenchTestable][WidgetLookup] Looking up widget with index 0 with specified parent and matchers
16:17:47.251 TRACE [WorkbenchTestable][WidgetLookup] widget with index 0 is found
16:17:47.252 DEBUG [WorkbenchTestable][AbstractShell] Set focus to Shell data - Eclipse Platform
16:17:47.252 DEBUG [WorkbenchTestable][AbstractWait] Waiting until shell is active...
16:17:47.252 DEBUG [WorkbenchTestable][AbstractWait] Waiting until shell is active finished successfully
16:17:47.252 DEBUG [WorkbenchTestable][WorkbenchShell] Workbench shell has title 'data - Eclipse Platform'
16:17:47.252 DEBUG [WorkbenchTestable][WidgetLookup] Looking up active widget with class type org.eclipse.swt.custom.CTabItem with referenced composite class org.eclipse.reddeer.workbench.impl.shell.WorkbenchShell, index 0 and following matchers specified (Matcher matching widget which text matches: Matcher matching text to regular expression '\*?\QProject Explorer\E')
16:17:47.252 DEBUG [WorkbenchTestable][AbstractWait] Waiting until widget is found...
16:17:47.252 TRACE [WorkbenchTestable][WidgetLookup] Looking up widget with index 0 with specified parent and matchers
16:17:47.254 TRACE [WorkbenchTestable][WidgetLookup] widget with index 0 is found
16:17:47.254 DEBUG [WorkbenchTestable][AbstractWait] Waiting until widget is found finished successfully
16:17:47.254 DEBUG [WorkbenchTestable][WidgetLookup] Active widget with class type org.eclipse.swt.custom.CTabItem and index 0 was found
16:17:47.254 INFO [WorkbenchTestable][AbstractView] Activate view Project Explorer
16:17:47.254 INFO [WorkbenchTestable][AbstractCTabItem] Activate Project Explorer
16:17:47.255 DEBUG [WorkbenchTestable][WorkbenchPartHandler] Active workbench control=Class=org.eclipse.e4.ui.workbench.renderers.swt.ContributedPartRenderer$1 Text=<unavailable> TooltipText=null
16:17:47.255 DEBUG [WorkbenchTestable][WorkbenchPartHandler] Focused control=Class=org.eclipse.swt.widgets.Shell Text=data - Eclipse Platform TooltipText=null
16:17:47.255 DEBUG [WorkbenchTestable][WorkbenchPartHandler] No control in opened view has a focus!
16:17:47.255 DEBUG [WorkbenchTestable][WorkbenchPartHandler] Setting implicit focus...
16:17:47.256 INFO [WorkbenchTestable][AbstractView] Activate view Project Explorer
16:17:47.256 INFO [WorkbenchTestable][AbstractCTabItem] Activate Project Explorer
16:17:47.270 DEBUG [WorkbenchTestable][WorkbenchPartHandler] Active workbench control=Class=org.eclipse.e4.ui.workbench.renderers.swt.ContributedPartRenderer$1 Text=<unavailable> TooltipText=null
16:17:47.270 DEBUG [WorkbenchTestable][WorkbenchPartHandler] Focused control=Class=org.eclipse.swt.widgets.Link Text=There are no projects in your workspace.
To add a project: TooltipText=null
16:17:47.271 INFO [WorkbenchTestable][AbstractView] Activate view Project Explorer
16:17:47.271 INFO [WorkbenchTestable][AbstractCTabItem] Activate Project Explorer
16:17:47.271 DEBUG [WorkbenchTestable][WorkbenchPartHandler] Active workbench control=Class=org.eclipse.e4.ui.workbench.renderers.swt.ContributedPartRenderer$1 Text=<unavailable> TooltipText=null
16:17:47.272 DEBUG [WorkbenchTestable][WorkbenchPartHandler] Focused control=Class=org.eclipse.swt.widgets.Link Text=There are no projects in your workspace.
To add a project: TooltipText=null
16:17:47.272 DEBUG [WorkbenchTestable][AbstractWait] Waiting until widget is found...
16:17:47.272 TRACE [WorkbenchTestable][WidgetLookup] Looking up widget with index 0 with specified parent and matchers
16:17:47.273 TRACE [WorkbenchTestable][WidgetLookup] widget with index 0 is found
16:17:47.273 DEBUG [WorkbenchTestable][AbstractWait] Waiting until widget is found finished successfully
16:17:47.273 INFO [WorkbenchTestable][AbstractView] Activate view Project Explorer
16:17:47.273 INFO [WorkbenchTestable][AbstractCTabItem] Activate Project Explorer
16:17:47.274 DEBUG [WorkbenchTestable][WorkbenchPartHandler] Active workbench control=Class=org.eclipse.e4.ui.workbench.renderers.swt.ContributedPartRenderer$1 Text=<unavailable> TooltipText=null
16:17:47.274 DEBUG [WorkbenchTestable][WorkbenchPartHandler] Focused control=Class=org.eclipse.swt.widgets.Link Text=There are no projects in your workspace.
To add a project: TooltipText=null
16:17:47.274 DEBUG [WorkbenchTestable][RunIAfterTestExtensions] Run after test extensions for test class org.eclipse.dartboard.test.project.DartProjectTest
16:17:47.274 DEBUG [WorkbenchTestable][RunIAfterTestExtensions] Run method runAfterTest() of class org.eclipse.reddeer.junit.extension.after.test.impl.CloseAllShellsExt
16:17:47.274 INFO [WorkbenchTestable][WorkbenchShellHandler] Closing all shells...
16:17:47.274 DEBUG [WorkbenchTestable][AbstractWait] Waiting until active shell exists...
16:17:47.274 DEBUG [WorkbenchTestable][AbstractWait] Waiting until active shell exists finished successfully
16:17:47.275 INFO [WorkbenchTestable][RequirementsRunner] Finished test: projectWizard__NewMenu__HasDartFileItem no-configuration(org.eclipse.dartboard.test.project.DartProjectTest)
16:17:47.275 DEBUG [WorkbenchTestable][RequirementsRunner] Injecting fulfilled requirements into test instance: org.eclipse.reddeer.junit.internal.requirement.Requirements
16:17:47.275 INFO [WorkbenchTestable][RequirementsRunner] Started test: projectWizard__NewMenu__HasDartProjectItem no-configuration(org.eclipse.dartboard.test.project.DartProjectTest)
16:17:47.275 DEBUG [WorkbenchTestable][RunIBeforeTestExtensions] Run before test extensions for test class org.eclipse.dartboard.test.project.DartProjectTest
16:17:47.275 DEBUG [WorkbenchTestable][RunIBeforeTestExtensions] Run method runBeforeTest() of class org.eclipse.reddeer.junit.extension.before.test.impl.DisableAERI
16:17:47.275 DEBUG [WorkbenchTestable][RunIBeforeTestExtensions] Run method runBeforeTest() of class org.eclipse.reddeer.junit.extension.before.test.impl.CloseWelcomeScreenExt
16:17:47.275 DEBUG [WorkbenchTestable][RunIBeforeTestExtensions] Run method runBeforeTest() of class org.eclipse.reddeer.junit.extension.before.test.impl.SetOpenAssociatedPerspectiveExt
16:17:47.275 DEBUG [WorkbenchTestable][RunIBeforeTestExtensions] Run method runBeforeTest() of class org.eclipse.reddeer.junit.extension.before.test.impl.DoNotDownloadMavenIndexesExt
16:17:47.275 DEBUG [WorkbenchTestable][AbstractWait] Waiting until active shell exists...
16:17:47.275 DEBUG [WorkbenchTestable][AbstractWait] Waiting until active shell exists finished successfully
16:17:47.275 INFO [WorkbenchTestable][ShellHandler] Getting Menu Bar of shell 'data - Eclipse Platform'
16:17:47.276 DEBUG [WorkbenchTestable][MenuItemHandler] Queried MenuItem text:"&File"
16:17:47.300 DEBUG [WorkbenchTestable][MenuItemHandler] Queried MenuItem text:"&New	Shift+Alt+N"
16:17:47.305 DEBUG [WorkbenchTestable][MenuItemHandler] Queried MenuItem text:"Dart Project"
16:17:47.305 TRACE [WorkbenchTestable][EditorHandler] Closing all editors
16:17:47.305 DEBUG [main][EditorHandler] 0 editor(s) found
16:17:47.306 TRACE [WorkbenchTestable][WidgetLookup] Looking up widget with index 0 with specified parent and matchers
16:17:47.308 TRACE [WorkbenchTestable][WidgetLookup] widget with index 0 is found
16:17:47.308 INFO [WorkbenchTestable][AbstractView] View 'Matcher matching widget which text matches: Matcher matching text to regular expression '\*?\QProject Explorer\E'' is already open. Activate.
16:17:47.308 TRACE [WorkbenchTestable][WidgetLookup] Looking up widget with index 0 with specified parent and matchers
16:17:47.309 TRACE [WorkbenchTestable][WidgetLookup] widget with index 0 is found
16:17:47.309 DEBUG [WorkbenchTestable][AbstractShell] Set focus to Shell data - Eclipse Platform
16:17:47.310 DEBUG [WorkbenchTestable][AbstractWait] Waiting until shell is active...
16:17:47.310 DEBUG [WorkbenchTestable][AbstractWait] Waiting until shell is active finished successfully
16:17:47.310 DEBUG [WorkbenchTestable][WorkbenchShell] Workbench shell has title 'data - Eclipse Platform'
16:17:47.310 DEBUG [WorkbenchTestable][WidgetLookup] Looking up active widget with class type org.eclipse.swt.custom.CTabItem with referenced composite class org.eclipse.reddeer.workbench.impl.shell.WorkbenchShell, index 0 and following matchers specified (Matcher matching widget which text matches: Matcher matching text to regular expression '\*?\QProject Explorer\E')
16:17:47.310 DEBUG [WorkbenchTestable][AbstractWait] Waiting until widget is found...
16:17:47.310 TRACE [WorkbenchTestable][WidgetLookup] Looking up widget with index 0 with specified parent and matchers
16:17:47.312 TRACE [WorkbenchTestable][WidgetLookup] widget with index 0 is found
16:17:47.312 DEBUG [WorkbenchTestable][AbstractWait] Waiting until widget is found finished successfully
16:17:47.312 DEBUG [WorkbenchTestable][WidgetLookup] Active widget with class type org.eclipse.swt.custom.CTabItem and index 0 was found
16:17:47.312 INFO [WorkbenchTestable][AbstractView] Activate view Project Explorer
16:17:47.312 INFO [WorkbenchTestable][AbstractCTabItem] Activate Project Explorer
16:17:47.313 DEBUG [WorkbenchTestable][WorkbenchPartHandler] Active workbench control=Class=org.eclipse.e4.ui.workbench.renderers.swt.ContributedPartRenderer$1 Text=<unavailable> TooltipText=null
16:17:47.313 DEBUG [WorkbenchTestable][WorkbenchPartHandler] Focused control=Class=org.eclipse.swt.widgets.Shell Text=data - Eclipse Platform TooltipText=null
16:17:47.313 DEBUG [WorkbenchTestable][WorkbenchPartHandler] No control in opened view has a focus!
16:17:47.313 DEBUG [WorkbenchTestable][WorkbenchPartHandler] Setting implicit focus...
16:17:47.314 INFO [WorkbenchTestable][AbstractView] Activate view Project Explorer
16:17:47.314 INFO [WorkbenchTestable][AbstractCTabItem] Activate Project Explorer
16:17:47.315 DEBUG [WorkbenchTestable][WorkbenchPartHandler] Active workbench control=Class=org.eclipse.e4.ui.workbench.renderers.swt.ContributedPartRenderer$1 Text=<unavailable> TooltipText=null
16:17:47.315 DEBUG [WorkbenchTestable][WorkbenchPartHandler] Focused control=Class=org.eclipse.swt.widgets.Link Text=There are no projects in your workspace.
To add a project: TooltipText=null
16:17:47.315 INFO [WorkbenchTestable][AbstractView] Activate view Project Explorer
16:17:47.315 INFO [WorkbenchTestable][AbstractCTabItem] Activate Project Explorer
16:17:47.316 DEBUG [WorkbenchTestable][WorkbenchPartHandler] Active workbench control=Class=org.eclipse.e4.ui.workbench.renderers.swt.ContributedPartRenderer$1 Text=<unavailable> TooltipText=null
16:17:47.316 DEBUG [WorkbenchTestable][WorkbenchPartHandler] Focused control=Class=org.eclipse.swt.widgets.Link Text=There are no projects in your workspace.
To add a project: TooltipText=null
16:17:47.316 DEBUG [WorkbenchTestable][AbstractWait] Waiting until widget is found...
16:17:47.316 TRACE [WorkbenchTestable][WidgetLookup] Looking up widget with index 0 with specified parent and matchers
16:17:47.317 TRACE [WorkbenchTestable][WidgetLookup] widget with index 0 is found
16:17:47.317 DEBUG [WorkbenchTestable][AbstractWait] Waiting until widget is found finished successfully
16:17:47.317 INFO [WorkbenchTestable][AbstractView] Activate view Project Explorer
16:17:47.317 INFO [WorkbenchTestable][AbstractCTabItem] Activate Project Explorer
16:17:47.318 DEBUG [WorkbenchTestable][WorkbenchPartHandler] Active workbench control=Class=org.eclipse.e4.ui.workbench.renderers.swt.ContributedPartRenderer$1 Text=<unavailable> TooltipText=null
16:17:47.318 DEBUG [WorkbenchTestable][WorkbenchPartHandler] Focused control=Class=org.eclipse.swt.widgets.Link Text=There are no projects in your workspace.
To add a project: TooltipText=null
16:17:47.318 DEBUG [WorkbenchTestable][RunIAfterTestExtensions] Run after test extensions for test class org.eclipse.dartboard.test.project.DartProjectTest
16:17:47.318 DEBUG [WorkbenchTestable][RunIAfterTestExtensions] Run method runAfterTest() of class org.eclipse.reddeer.junit.extension.after.test.impl.CloseAllShellsExt
16:17:47.318 INFO [WorkbenchTestable][WorkbenchShellHandler] Closing all shells...
16:17:47.318 DEBUG [WorkbenchTestable][AbstractWait] Waiting until active shell exists...
16:17:47.318 DEBUG [WorkbenchTestable][AbstractWait] Waiting until active shell exists finished successfully
16:17:47.319 INFO [WorkbenchTestable][RequirementsRunner] Finished test: projectWizard__NewMenu__HasDartProjectItem no-configuration(org.eclipse.dartboard.test.project.DartProjectTest)
16:17:47.319 DEBUG [WorkbenchTestable][RunIAfterClassExtensions] Run after class extensions for test class org.eclipse.dartboard.test.project.DartProjectTest
16:17:47.319 DEBUG [WorkbenchTestable][RunIAfterClassExtensions] Run method runAfterTestClass() of class org.eclipse.reddeer.junit.extension.after.test.impl.CloseAllShellsExt
16:17:47.319 INFO [WorkbenchTestable][WorkbenchShellHandler] Closing all shells...
16:17:47.319 DEBUG [WorkbenchTestable][AbstractWait] Waiting until active shell exists...
16:17:47.319 DEBUG [WorkbenchTestable][AbstractWait] Waiting until active shell exists finished successfully
Tests run: 4, Failures: 0, Errors: 1, Skipped: 0, Time elapsed: 95.209 s <<< FAILURE! - in org.eclipse.dartboard.test.project.DartProjectTest
projectWizard__NewDartProjectWithStagehand__CreatesNewProjectWithTemplate no-configuration(org.eclipse.dartboard.test.project.DartProjectTest)  Time elapsed: 89.977 s
projectWizard__NewDartProject__CreatesNewProject no-configuration(org.eclipse.dartboard.test.project.DartProjectTest)  Time elapsed: 4.726 s  <<< ERROR!
org.eclipse.reddeer.common.exception.RedDeerException: Exception during sync execution in UI thread
	at org.eclipse.dartboard.test.project.DartProjectTest.projectWizard__NewDartProject__CreatesNewProject(DartProjectTest.java:72)
Caused by: org.eclipse.swt.SWTException: Widget is disposed

projectWizard__NewMenu__HasDartFileItem no-configuration(org.eclipse.dartboard.test.project.DartProjectTest)  Time elapsed: 0.041 s
projectWizard__NewMenu__HasDartProjectItem no-configuration(org.eclipse.dartboard.test.project.DartProjectTest)  Time elapsed: 0.044 s
Running org.eclipse.dartboard.test.project.DartProjectConfiguratorTest
Tests run: 2, Failures: 0, Errors: 0, Skipped: 0, Time elapsed: 0.097 s - in org.eclipse.dartboard.test.project.DartProjectConfiguratorTest
findConfigurableLocations__6Projects__ReturnsAllProjects(org.eclipse.dartboard.test.project.DartProjectConfiguratorTest)  Time elapsed: 0.075 s
getFoldersToIgnore__ValidParameters__ReturnsEmptySet(org.eclipse.dartboard.test.project.DartProjectConfiguratorTest)  Time elapsed: 0 s
Running org.eclipse.dartboard.test.pub.PubGetHandlerTest
16:17:47.441 INFO [WorkbenchTestable][RequirementsRunnerBuilder] Found test class org.eclipse.dartboard.test.pub.PubGetHandlerTest
16:17:47.441 INFO [WorkbenchTestable][RedDeerSuite] RedDeer suite created
16:17:47.442 DEBUG [WorkbenchTestable][RequirementsRunner] Injecting fulfilled requirements into static fields of test class: org.eclipse.reddeer.junit.internal.requirement.Requirements
16:17:47.442 DEBUG [WorkbenchTestable][RunIBeforeClassExtensions] Run before class extensions for test class org.eclipse.dartboard.test.pub.PubGetHandlerTest
16:17:47.442 DEBUG [WorkbenchTestable][RunIBeforeClassExtensions] Run method runBeforeTestClass() of class org.eclipse.reddeer.junit.extension.before.test.impl.DisableAERI
16:17:47.442 INFO [WorkbenchTestable][PreferencesUtil] Setting the aeri reporting to never send.
16:17:47.442 DEBUG [WorkbenchTestable][RunIBeforeClassExtensions] Run method runBeforeTestClass() of class org.eclipse.reddeer.junit.extension.before.test.impl.CloseWelcomeScreenExt
16:17:47.442 DEBUG [WorkbenchTestable][CloseWelcomeScreenExt] Trying to close Welcome Screen
16:17:47.443 DEBUG [WorkbenchTestable][RunIBeforeClassExtensions] Run method runBeforeTestClass() of class org.eclipse.reddeer.junit.extension.before.test.impl.SetOpenAssociatedPerspectiveExt
16:17:47.443 DEBUG [WorkbenchTestable][SetOpenAssociatedPerspectiveExt] Setting open associated perspective to: 'never'
16:17:47.443 DEBUG [WorkbenchTestable][RunIBeforeClassExtensions] Run method runBeforeTestClass() of class org.eclipse.reddeer.junit.extension.before.test.impl.DoNotDownloadMavenIndexesExt
16:17:47.443 DEBUG [WorkbenchTestable][DoNotDownloadMavenIndexesExt] Trying to disable downloading maven repo indexes on startup via Windows > Preferences > Maven
16:17:47.443 DEBUG [WorkbenchTestable][WindowIsAvailable] Looking for Window matching Matcher matching when all matchers match: [Window matching class class org.eclipse.ui.internal.dialogs.WorkbenchPreferenceDialog, Matcher matching widget which text matches: Matcher matching text to regular expression 'Preferences.*']
16:17:47.443 DEBUG [WorkbenchTestable][WidgetHandler] Get widget data
16:17:47.444 DEBUG [WorkbenchTestable][WindowIsAvailable] Looking for Window matching Matcher matching when all matchers match: [Window matching class class org.eclipse.ui.internal.dialogs.WorkbenchPreferenceDialog, Matcher matching widget which text matches: Matcher matching text to regular expression 'Preferences.*']
16:17:47.444 DEBUG [WorkbenchTestable][WidgetHandler] Get widget data
16:17:47.444 DEBUG [WorkbenchTestable][WindowIsAvailable] Looking for Window matching Matcher matching when all matchers match: [Window matching class class org.eclipse.ui.internal.dialogs.WorkbenchPreferenceDialog, Matcher matching widget which text matches: Matcher matching text to regular expression 'Preferences.*']
16:17:47.444 DEBUG [WorkbenchTestable][WidgetHandler] Get widget data
16:17:47.444 DEBUG [WorkbenchTestable][AbstractShell] Set focus to Shell data - Eclipse Platform
16:17:47.445 DEBUG [WorkbenchTestable][AbstractWait] Waiting until shell is active...
16:17:47.445 DEBUG [WorkbenchTestable][AbstractWait] Waiting until shell is active finished successfully
16:17:47.445 DEBUG [WorkbenchTestable][WorkbenchShell] Workbench shell has title 'data - Eclipse Platform'
16:17:47.446 INFO [WorkbenchTestable][ShellHandler] Getting Menu Bar of shell 'data - Eclipse Platform'
16:17:47.446 DEBUG [main][MenuItemLookup] Found menu:'File'
16:17:47.447 DEBUG [main][MenuItemLookup] Found menu:'Edit'
16:17:47.447 DEBUG [main][MenuItemLookup] Found menu:'Navigate'
16:17:47.447 DEBUG [main][MenuItemLookup] Found menu:'Search'
16:17:47.447 DEBUG [main][MenuItemLookup] Found menu:'Project'
16:17:47.447 DEBUG [main][MenuItemLookup] Found menu:'Window'
16:17:47.447 DEBUG [main][MenuItemLookup] Item match:Window
16:17:47.450 DEBUG [main][MenuItemLookup] Found menu:'New Window'
16:17:47.450 DEBUG [main][MenuItemLookup] Found menu:'Editor'
16:17:47.450 DEBUG [main][MenuItemLookup] Found menu:'Appearance'
16:17:47.450 DEBUG [main][MenuItemLookup] Found menu:''
16:17:47.450 DEBUG [main][MenuItemLookup] Found menu:'Show View'
16:17:47.450 DEBUG [main][MenuItemLookup] Found menu:'Perspective'
16:17:47.450 DEBUG [main][MenuItemLookup] Found menu:''
16:17:47.450 DEBUG [main][MenuItemLookup] Found menu:'Navigation'
16:17:47.450 DEBUG [main][MenuItemLookup] Found menu:''
16:17:47.450 DEBUG [main][MenuItemLookup] Found menu:'Preferences'
16:17:47.450 DEBUG [main][MenuItemLookup] Item match:Preferences
16:17:47.451 DEBUG [WorkbenchTestable][MenuItemHandler] Queried MenuItem text:"&Preferences"
16:17:47.451 INFO [WorkbenchTestable][AbstractMenuItem] Select menu item with text Preferences
16:17:47.451 INFO [main][MenuItemHandler] Select menu item: &Preferences
16:17:47.635 DEBUG [WorkbenchTestable][AbstractWait] Waiting until shell matching Matcher matching when all matchers match: [Matcher matching widget which text matches: Matcher matching text to regular expression 'Preferences.*'] is available....
16:17:47.637 DEBUG [WorkbenchTestable][AbstractWait] Waiting until shell matching Matcher matching when all matchers match: [Matcher matching widget which text matches: Matcher matching text to regular expression 'Preferences.*'] is available. finished successfully
16:17:47.637 DEBUG [WorkbenchTestable][AbstractShell] Set focus to Shell Preferences
16:17:47.639 DEBUG [WorkbenchTestable][AbstractWait] Waiting until shell is active...
16:17:47.639 DEBUG [WorkbenchTestable][AbstractWait] Waiting until shell is active finished successfully
16:17:47.639 TRACE [WorkbenchTestable][WorkbenchPreferenceDialog] Shell Preferences is not null and is not disposed
16:17:47.640 DEBUG [WorkbenchTestable][WidgetHandler] Get widget data
16:17:47.640 DEBUG [WorkbenchTestable][WidgetLookup] Looking up active widget with class type org.eclipse.swt.widgets.Tree with referenced composite class org.eclipse.reddeer.workbench.ui.dialogs.WorkbenchPreferenceDialog, index 0 and no matchers specified
16:17:47.640 DEBUG [WorkbenchTestable][AbstractWait] Waiting until widget is found...
16:17:47.640 TRACE [WorkbenchTestable][WidgetLookup] Looking up widget with index 0 with specified parent and matchers
16:17:47.640 TRACE [WorkbenchTestable][WidgetLookup] widget with index 0 is found
16:17:47.641 DEBUG [WorkbenchTestable][AbstractWait] Waiting until widget is found finished successfully
16:17:47.641 DEBUG [WorkbenchTestable][WidgetLookup] Active widget with class type org.eclipse.swt.widgets.Tree and index 0 was found
16:17:47.642 DEBUG [WorkbenchTestable][AbstractWait] Waiting until tree has children...
16:17:47.642 DEBUG [WorkbenchTestable][AbstractWait] Waiting until tree has children finished successfully
16:17:47.643 DEBUG [WorkbenchTestable][WidgetLookup] Looking up active widget with class type org.eclipse.swt.widgets.Button with referenced composite class org.eclipse.reddeer.workbench.ui.dialogs.WorkbenchPreferenceDialog, index 0 and following matchers specified (Widget matcher matching widgets with style: 8, Matcher matching widgets with text that without mnenomic matches: is "Cancel", Widget matcher matching widgets with style: 8)
16:17:47.643 DEBUG [WorkbenchTestable][AbstractWait] Waiting until widget is found...
16:17:47.643 TRACE [WorkbenchTestable][WidgetLookup] Looking up widget with index 0 with specified parent and matchers
16:17:47.656 TRACE [WorkbenchTestable][WidgetLookup] widget with index 0 is found
16:17:47.656 DEBUG [WorkbenchTestable][AbstractWait] Waiting until widget is found finished successfully
16:17:47.656 DEBUG [WorkbenchTestable][WidgetLookup] Active widget with class type org.eclipse.swt.widgets.Button and index 0 was found
16:17:47.657 INFO [WorkbenchTestable][AbstractButton] Click button Cancel
16:17:47.657 DEBUG [WorkbenchTestable][AbstractWait] Waiting until control is enabled...
16:17:47.657 DEBUG [WorkbenchTestable][AbstractWait] Waiting until control is enabled finished successfully
16:17:47.657 TRACE [WorkbenchTestable][WidgetHandler] Notify Button with event 13
16:17:47.657 TRACE [WorkbenchTestable][WidgetHandler] Wait for synchronization
16:17:47.728 DEBUG [WorkbenchTestable][AbstractWait] Waiting while window is available...
16:17:47.729 DEBUG [WorkbenchTestable][AbstractWait] Waiting while window is available finished successfully
16:17:47.729 DEBUG [WorkbenchTestable][AbstractShell] Set focus to Shell data - Eclipse Platform
16:17:47.729 DEBUG [WorkbenchTestable][AbstractWait] Waiting until shell is active...
16:17:47.729 DEBUG [WorkbenchTestable][AbstractWait] Waiting until shell is active finished successfully
16:17:47.730 DEBUG [WorkbenchTestable][RequirementsRunner] Injecting fulfilled requirements into test instance: org.eclipse.reddeer.junit.internal.requirement.Requirements
16:17:47.730 INFO [WorkbenchTestable][RequirementsRunner] Started test: pubGetCommand__ExistingNonDartProject__CommandIsNotAvailable no-configuration(org.eclipse.dartboard.test.pub.PubGetHandlerTest)
16:17:47.730 DEBUG [WorkbenchTestable][RunIBeforeTestExtensions] Run before test extensions for test class org.eclipse.dartboard.test.pub.PubGetHandlerTest
16:17:47.730 DEBUG [WorkbenchTestable][RunIBeforeTestExtensions] Run method runBeforeTest() of class org.eclipse.reddeer.junit.extension.before.test.impl.DisableAERI
16:17:47.730 DEBUG [WorkbenchTestable][RunIBeforeTestExtensions] Run method runBeforeTest() of class org.eclipse.reddeer.junit.extension.before.test.impl.CloseWelcomeScreenExt
16:17:47.730 DEBUG [WorkbenchTestable][RunIBeforeTestExtensions] Run method runBeforeTest() of class org.eclipse.reddeer.junit.extension.before.test.impl.SetOpenAssociatedPerspectiveExt
16:17:47.730 DEBUG [WorkbenchTestable][RunIBeforeTestExtensions] Run method runBeforeTest() of class org.eclipse.reddeer.junit.extension.before.test.impl.DoNotDownloadMavenIndexesExt
16:17:47.743 DEBUG [WorkbenchTestable][AbstractWait] Waiting until Project JXlUfvGJ exists....
16:17:47.813 TRACE [WorkbenchTestable][WidgetLookup] Looking up widget with index 0 with specified parent and matchers
16:17:47.817 TRACE [WorkbenchTestable][WidgetLookup] widget with index 0 is found
16:17:47.817 INFO [WorkbenchTestable][AbstractView] View 'Matcher matching widget which text matches: Matcher matching text to regular expression '\*?\QPackage Explorer\E'' is already open. Activate.
16:17:47.817 TRACE [WorkbenchTestable][WidgetLookup] Looking up widget with index 0 with specified parent and matchers
16:17:47.821 TRACE [WorkbenchTestable][WidgetLookup] widget with index 0 is found
16:17:47.821 DEBUG [WorkbenchTestable][AbstractShell] Set focus to Shell data - Eclipse Platform
16:17:47.821 DEBUG [WorkbenchTestable][AbstractWait] Waiting until shell is active...
16:17:47.821 DEBUG [WorkbenchTestable][AbstractWait] Waiting until shell is active finished successfully
16:17:47.821 DEBUG [WorkbenchTestable][WorkbenchShell] Workbench shell has title 'data - Eclipse Platform'
16:17:47.821 DEBUG [WorkbenchTestable][WidgetLookup] Looking up active widget with class type org.eclipse.swt.custom.CTabItem with referenced composite class org.eclipse.reddeer.workbench.impl.shell.WorkbenchShell, index 0 and following matchers specified (Matcher matching widget which text matches: Matcher matching text to regular expression '\*?\QPackage Explorer\E')
16:17:47.821 DEBUG [WorkbenchTestable][AbstractWait] Waiting until widget is found...
16:17:47.821 TRACE [WorkbenchTestable][WidgetLookup] Looking up widget with index 0 with specified parent and matchers
16:17:47.826 TRACE [WorkbenchTestable][WidgetLookup] widget with index 0 is found
16:17:47.826 DEBUG [WorkbenchTestable][AbstractWait] Waiting until widget is found finished successfully
16:17:47.826 DEBUG [WorkbenchTestable][WidgetLookup] Active widget with class type org.eclipse.swt.custom.CTabItem and index 0 was found
16:17:47.826 INFO [WorkbenchTestable][AbstractView] Activate view Package Explorer
16:17:47.826 INFO [WorkbenchTestable][AbstractCTabItem] Activate Package Explorer
16:17:47.857 DEBUG [WorkbenchTestable][WorkbenchPartHandler] Active workbench control=Class=org.eclipse.e4.ui.workbench.renderers.swt.ContributedPartRenderer$1 Text=<unavailable> TooltipText=null
16:17:47.857 DEBUG [WorkbenchTestable][WorkbenchPartHandler] Focused control=Class=org.eclipse.swt.widgets.Shell Text=data - Eclipse Platform TooltipText=null
16:17:47.900 DEBUG [WorkbenchTestable][WorkbenchPartHandler] No control in opened view has a focus!
16:17:47.900 DEBUG [WorkbenchTestable][WorkbenchPartHandler] Setting implicit focus...
16:17:47.903 INFO [WorkbenchTestable][AbstractView] Activate view Package Explorer
16:17:47.903 INFO [WorkbenchTestable][AbstractCTabItem] Activate Package Explorer
16:17:47.918 DEBUG [WorkbenchTestable][WorkbenchPartHandler] Active workbench control=Class=org.eclipse.e4.ui.workbench.renderers.swt.ContributedPartRenderer$1 Text=<unavailable> TooltipText=null
16:17:47.918 DEBUG [WorkbenchTestable][WorkbenchPartHandler] Focused control=Class=org.eclipse.swt.widgets.Link Text=There are no projects in your workspace.
To add a project: TooltipText=null
16:17:47.919 INFO [WorkbenchTestable][AbstractView] Activate view Package Explorer
16:17:47.919 INFO [WorkbenchTestable][AbstractCTabItem] Activate Package Explorer
16:17:47.920 DEBUG [WorkbenchTestable][WorkbenchPartHandler] Active workbench control=Class=org.eclipse.e4.ui.workbench.renderers.swt.ContributedPartRenderer$1 Text=<unavailable> TooltipText=null
16:17:47.920 DEBUG [WorkbenchTestable][WorkbenchPartHandler] Focused control=Class=org.eclipse.swt.widgets.Link Text=There are no projects in your workspace.
To add a project: TooltipText=null
16:17:47.920 DEBUG [WorkbenchTestable][AbstractWait] Waiting until widget is found...
16:17:47.920 TRACE [WorkbenchTestable][WidgetLookup] Looking up widget with index 0 with specified parent and matchers
16:17:47.921 TRACE [WorkbenchTestable][WidgetLookup] widget with index 0 is found
16:17:47.921 DEBUG [WorkbenchTestable][AbstractWait] Waiting until widget is found finished successfully
16:17:48.421 INFO [WorkbenchTestable][AbstractView] View 'Matcher matching widget which text matches: Matcher matching text to regular expression '\*?\QPackage Explorer\E'' is already open. Activate.
16:17:48.422 INFO [WorkbenchTestable][AbstractView] Activate view Package Explorer
16:17:48.422 INFO [WorkbenchTestable][AbstractCTabItem] Activate Package Explorer
16:17:48.423 DEBUG [WorkbenchTestable][WorkbenchPartHandler] Active workbench control=Class=org.eclipse.e4.ui.workbench.renderers.swt.ContributedPartRenderer$1 Text=<unavailable> TooltipText=null
16:17:48.423 DEBUG [WorkbenchTestable][WorkbenchPartHandler] Focused control=Class=org.eclipse.swt.widgets.Composite Text=<unavailable> TooltipText=null
16:17:48.423 INFO [WorkbenchTestable][AbstractView] Activate view Package Explorer
16:17:48.423 INFO [WorkbenchTestable][AbstractCTabItem] Activate Package Explorer
16:17:48.424 DEBUG [WorkbenchTestable][WorkbenchPartHandler] Active workbench control=Class=org.eclipse.e4.ui.workbench.renderers.swt.ContributedPartRenderer$1 Text=<unavailable> TooltipText=null
16:17:48.424 DEBUG [WorkbenchTestable][WorkbenchPartHandler] Focused control=Class=org.eclipse.swt.widgets.Composite Text=<unavailable> TooltipText=null
16:17:48.425 INFO [WorkbenchTestable][AbstractView] Activate view Package Explorer
16:17:48.425 INFO [WorkbenchTestable][AbstractCTabItem] Activate Package Explorer
16:17:48.425 DEBUG [WorkbenchTestable][WorkbenchPartHandler] Active workbench control=Class=org.eclipse.e4.ui.workbench.renderers.swt.ContributedPartRenderer$1 Text=<unavailable> TooltipText=null
16:17:48.425 DEBUG [WorkbenchTestable][WorkbenchPartHandler] Focused control=Class=org.eclipse.swt.widgets.Composite Text=<unavailable> TooltipText=null
16:17:48.426 DEBUG [WorkbenchTestable][AbstractWait] Waiting until widget is found...
16:17:48.426 TRACE [WorkbenchTestable][WidgetLookup] Looking up widget with index 0 with specified parent and matchers
16:17:48.426 TRACE [WorkbenchTestable][WidgetLookup] widget with index 0is not found
16:17:48.926 TRACE [WorkbenchTestable][WidgetLookup] Looking up widget with index 0 with specified parent and matchers
16:17:48.927 TRACE [WorkbenchTestable][WidgetLookup] widget with index 0is not found
16:17:49.427 TRACE [WorkbenchTestable][WidgetLookup] Looking up widget with index 0 with specified parent and matchers
16:17:49.428 TRACE [WorkbenchTestable][WidgetLookup] widget with index 0is not found
16:17:49.428 DEBUG [WorkbenchTestable][AbstractWait] Waiting until widget is found failed, NO exception will be thrown
16:17:49.428 INFO [WorkbenchTestable][AbstractView] Activate view Package Explorer
16:17:49.428 INFO [WorkbenchTestable][AbstractCTabItem] Activate Package Explorer
16:17:49.429 DEBUG [WorkbenchTestable][WorkbenchPartHandler] Active workbench control=Class=org.eclipse.e4.ui.workbench.renderers.swt.ContributedPartRenderer$1 Text=<unavailable> TooltipText=null
16:17:49.429 DEBUG [WorkbenchTestable][WorkbenchPartHandler] Focused control=Class=org.eclipse.swt.widgets.Composite Text=<unavailable> TooltipText=null
16:17:49.430 DEBUG [WorkbenchTestable][WidgetLookup] Looking up active widget with class type org.eclipse.swt.widgets.Tree with referenced composite class org.eclipse.reddeer.swt.impl.ctab.DefaultCTabItem, index 0 and no matchers specified
16:17:49.430 DEBUG [WorkbenchTestable][AbstractWait] Waiting until widget is found...
16:17:49.430 TRACE [WorkbenchTestable][WidgetLookup] Looking up widget with index 0 with specified parent and matchers
16:17:49.430 TRACE [WorkbenchTestable][WidgetLookup] widget with index 0 is found
16:17:49.430 DEBUG [WorkbenchTestable][AbstractWait] Waiting until widget is found finished successfully
16:17:49.430 DEBUG [WorkbenchTestable][WidgetLookup] Active widget with class type org.eclipse.swt.widgets.Tree and index 0 was found
16:17:49.432 DEBUG [WorkbenchTestable][AbstractExplorer] Getting project with name JXlUfvGJ
16:17:49.432 DEBUG [WorkbenchTestable][AbstractWait] Waiting until Project JXlUfvGJ exists. finished successfully
16:17:49.433 TRACE [WorkbenchTestable][WidgetLookup] Looking up widget with index 0 with specified parent and matchers
16:17:49.433 TRACE [WorkbenchTestable][WidgetLookup] widget with index 0 is found
16:17:49.434 INFO [WorkbenchTestable][AbstractView] View 'Matcher matching widget which text matches: Matcher matching text to regular expression '\*?\QProject Explorer\E'' is already open. Activate.
16:17:49.434 TRACE [WorkbenchTestable][WidgetLookup] Looking up widget with index 0 with specified parent and matchers
16:17:49.439 TRACE [WorkbenchTestable][WidgetLookup] widget with index 0 is found
16:17:49.439 DEBUG [WorkbenchTestable][AbstractShell] Set focus to Shell data - Eclipse Platform
16:17:49.440 DEBUG [WorkbenchTestable][AbstractWait] Waiting until shell is active...
16:17:49.440 DEBUG [WorkbenchTestable][AbstractWait] Waiting until shell is active finished successfully
16:17:49.440 DEBUG [WorkbenchTestable][WorkbenchShell] Workbench shell has title 'data - Eclipse Platform'
16:17:49.441 DEBUG [WorkbenchTestable][WidgetLookup] Looking up active widget with class type org.eclipse.swt.custom.CTabItem with referenced composite class org.eclipse.reddeer.workbench.impl.shell.WorkbenchShell, index 0 and following matchers specified (Matcher matching widget which text matches: Matcher matching text to regular expression '\*?\QProject Explorer\E')
16:17:49.450 DEBUG [WorkbenchTestable][AbstractWait] Waiting until widget is found...
16:17:49.450 TRACE [WorkbenchTestable][WidgetLookup] Looking up widget with index 0 with specified parent and matchers
16:17:49.466 TRACE [WorkbenchTestable][WidgetLookup] widget with index 0 is found
16:17:49.466 DEBUG [WorkbenchTestable][AbstractWait] Waiting until widget is found finished successfully
16:17:49.466 DEBUG [WorkbenchTestable][WidgetLookup] Active widget with class type org.eclipse.swt.custom.CTabItem and index 0 was found
16:17:49.466 INFO [WorkbenchTestable][AbstractView] Activate view Project Explorer
16:17:49.466 INFO [WorkbenchTestable][AbstractCTabItem] Activate Project Explorer
16:17:49.503 DEBUG [WorkbenchTestable][WorkbenchPartHandler] Active workbench control=Class=org.eclipse.e4.ui.workbench.renderers.swt.ContributedPartRenderer$1 Text=<unavailable> TooltipText=null
16:17:49.504 DEBUG [WorkbenchTestable][WorkbenchPartHandler] Focused control=Class=org.eclipse.swt.widgets.Tree Text=<unavailable> TooltipText=null
16:17:49.505 INFO [WorkbenchTestable][AbstractView] Activate view Project Explorer
16:17:49.505 INFO [WorkbenchTestable][AbstractCTabItem] Activate Project Explorer
16:17:49.506 DEBUG [WorkbenchTestable][WorkbenchPartHandler] Active workbench control=Class=org.eclipse.e4.ui.workbench.renderers.swt.ContributedPartRenderer$1 Text=<unavailable> TooltipText=null
16:17:49.506 DEBUG [WorkbenchTestable][WorkbenchPartHandler] Focused control=Class=org.eclipse.swt.widgets.Tree Text=<unavailable> TooltipText=null
16:17:49.506 INFO [WorkbenchTestable][AbstractView] Activate view Project Explorer
16:17:49.507 INFO [WorkbenchTestable][AbstractCTabItem] Activate Project Explorer
16:17:49.507 DEBUG [WorkbenchTestable][WorkbenchPartHandler] Active workbench control=Class=org.eclipse.e4.ui.workbench.renderers.swt.ContributedPartRenderer$1 Text=<unavailable> TooltipText=null
16:17:49.507 DEBUG [WorkbenchTestable][WorkbenchPartHandler] Focused control=Class=org.eclipse.swt.widgets.Tree Text=<unavailable> TooltipText=null
16:17:49.507 DEBUG [WorkbenchTestable][AbstractWait] Waiting until widget is found...
16:17:49.508 TRACE [WorkbenchTestable][WidgetLookup] Looking up widget with index 0 with specified parent and matchers
16:17:49.508 TRACE [WorkbenchTestable][WidgetLookup] widget with index 0is not found
16:17:50.008 TRACE [WorkbenchTestable][WidgetLookup] Looking up widget with index 0 with specified parent and matchers
16:17:50.008 TRACE [WorkbenchTestable][WidgetLookup] widget with index 0is not found
16:17:50.508 TRACE [WorkbenchTestable][WidgetLookup] Looking up widget with index 0 with specified parent and matchers
16:17:50.509 TRACE [WorkbenchTestable][WidgetLookup] widget with index 0is not found
16:17:50.509 DEBUG [WorkbenchTestable][AbstractWait] Waiting until widget is found failed, NO exception will be thrown
16:17:50.509 INFO [WorkbenchTestable][AbstractView] Activate view Project Explorer
16:17:50.509 INFO [WorkbenchTestable][AbstractCTabItem] Activate Project Explorer
16:17:50.510 DEBUG [WorkbenchTestable][WorkbenchPartHandler] Active workbench control=Class=org.eclipse.e4.ui.workbench.renderers.swt.ContributedPartRenderer$1 Text=<unavailable> TooltipText=null
16:17:50.511 DEBUG [WorkbenchTestable][WorkbenchPartHandler] Focused control=Class=org.eclipse.swt.widgets.Tree Text=<unavailable> TooltipText=null
16:17:50.511 DEBUG [WorkbenchTestable][WidgetLookup] Looking up active widget with class type org.eclipse.swt.widgets.Tree with referenced composite class org.eclipse.reddeer.swt.impl.ctab.DefaultCTabItem, index 0 and no matchers specified
16:17:50.511 DEBUG [WorkbenchTestable][AbstractWait] Waiting until widget is found...
16:17:50.511 TRACE [WorkbenchTestable][WidgetLookup] Looking up widget with index 0 with specified parent and matchers
16:17:50.511 TRACE [WorkbenchTestable][WidgetLookup] widget with index 0 is found
16:17:50.511 DEBUG [WorkbenchTestable][AbstractWait] Waiting until widget is found finished successfully
16:17:50.511 DEBUG [WorkbenchTestable][WidgetLookup] Active widget with class type org.eclipse.swt.widgets.Tree and index 0 was found
16:17:50.511 DEBUG [WorkbenchTestable][AbstractExplorer] Getting project with name JXlUfvGJ
16:17:50.512 INFO [WorkbenchTestable][AbstractTreeItem] Select tree item JXlUfvGJ
16:17:50.512 DEBUG [main][TreeItemHandler] Selecting tree item: JXlUfvGJ
16:17:50.512 DEBUG [WorkbenchTestable][TreeItemHandler] Notify tree item JXlUfvGJ about selection
16:17:50.528 INFO [WorkbenchTestable][TreeItemHandler] Selected tree item: JXlUfvGJ
16:17:50.529 TRACE [WorkbenchTestable][WidgetHandler] Notify Tree with event 35
16:17:50.529 TRACE [WorkbenchTestable][WidgetHandler] Wait for synchronization
16:17:50.608 DEBUG [WorkbenchTestable][MenuItemHandler] Queried MenuItem text:"&New"
16:17:50.609 DEBUG [WorkbenchTestable][MenuItemHandler] Queried MenuItem text:"Go &Into"
16:17:50.609 DEBUG [WorkbenchTestable][MenuItemHandler] Queried MenuItem text:""
16:17:50.609 DEBUG [WorkbenchTestable][MenuItemHandler] Queried MenuItem text:"Sho&w In	Shift+Alt+W"
16:17:50.609 DEBUG [WorkbenchTestable][MenuItemHandler] Queried MenuItem text:""
16:17:50.609 DEBUG [WorkbenchTestable][MenuItemHandler] Queried MenuItem text:"Copy	Ctrl+C"
16:17:50.609 DEBUG [WorkbenchTestable][MenuItemHandler] Queried MenuItem text:"Paste	Ctrl+V"
16:17:50.610 DEBUG [WorkbenchTestable][MenuItemHandler] Queried MenuItem text:"&Delete	Delete"
16:17:50.610 DEBUG [WorkbenchTestable][MenuItemHandler] Queried MenuItem text:"Mo&ve..."
16:17:50.610 DEBUG [WorkbenchTestable][MenuItemHandler] Queried MenuItem text:"Rena&me...	F2"
16:17:50.610 DEBUG [WorkbenchTestable][MenuItemHandler] Queried MenuItem text:""
16:17:50.610 DEBUG [WorkbenchTestable][MenuItemHandler] Queried MenuItem text:"&Import..."
16:17:50.610 DEBUG [WorkbenchTestable][MenuItemHandler] Queried MenuItem text:"Exp&ort..."
16:17:50.610 DEBUG [WorkbenchTestable][MenuItemHandler] Queried MenuItem text:""
16:17:50.610 DEBUG [WorkbenchTestable][MenuItemHandler] Queried MenuItem text:"Re&fresh	F5"
16:17:50.610 DEBUG [WorkbenchTestable][MenuItemHandler] Queried MenuItem text:"Clo&se Project"
16:17:50.610 DEBUG [WorkbenchTestable][MenuItemHandler] Queried MenuItem text:"Close &Unrelated Project"
16:17:50.611 DEBUG [WorkbenchTestable][MenuItemHandler] Queried MenuItem text:""
16:17:50.611 DEBUG [WorkbenchTestable][MenuItemHandler] Queried MenuItem text:"&Run As"
16:17:50.611 DEBUG [WorkbenchTestable][MenuItemHandler] Queried MenuItem text:"&Debug As"
16:17:50.611 DEBUG [WorkbenchTestable][MenuItemHandler] Queried MenuItem text:"T&eam"
16:17:50.611 DEBUG [WorkbenchTestable][MenuItemHandler] Queried MenuItem text:"Comp&are With"
16:17:50.611 DEBUG [WorkbenchTestable][MenuItemHandler] Queried MenuItem text:"Restore from Local Histor&y..."
16:17:50.611 DEBUG [WorkbenchTestable][MenuItemHandler] Queried MenuItem text:"Confi&gure"
16:17:50.611 DEBUG [WorkbenchTestable][MenuItemHandler] Queried MenuItem text:""
16:17:50.611 DEBUG [WorkbenchTestable][MenuItemHandler] Queried MenuItem text:"P&roperties	Alt+Enter"
16:17:50.616 DEBUG [WorkbenchTestable][RunIAfterTestExtensions] Run after test extensions for test class org.eclipse.dartboard.test.pub.PubGetHandlerTest
16:17:50.616 DEBUG [WorkbenchTestable][RunIAfterTestExtensions] Run method runAfterTest() of class org.eclipse.reddeer.junit.extension.after.test.impl.CloseAllShellsExt
16:17:50.616 INFO [WorkbenchTestable][WorkbenchShellHandler] Closing all shells...
16:17:50.635 DEBUG [WorkbenchTestable][AbstractWait] Waiting until active shell exists...
16:17:50.636 DEBUG [WorkbenchTestable][AbstractWait] Waiting until active shell exists finished successfully
16:17:50.636 INFO [WorkbenchTestable][RequirementsRunner] Finished test: pubGetCommand__ExistingNonDartProject__CommandIsNotAvailable no-configuration(org.eclipse.dartboard.test.pub.PubGetHandlerTest)
16:17:50.636 DEBUG [WorkbenchTestable][RequirementsRunner] Injecting fulfilled requirements into test instance: org.eclipse.reddeer.junit.internal.requirement.Requirements
16:17:50.636 INFO [WorkbenchTestable][RequirementsRunner] Started test: pubGetCommand__ExistingDartProject__CommandIsAvailableAndRunsPubGet no-configuration(org.eclipse.dartboard.test.pub.PubGetHandlerTest)
16:17:50.636 DEBUG [WorkbenchTestable][RunIBeforeTestExtensions] Run before test extensions for test class org.eclipse.dartboard.test.pub.PubGetHandlerTest
16:17:50.637 DEBUG [WorkbenchTestable][RunIBeforeTestExtensions] Run method runBeforeTest() of class org.eclipse.reddeer.junit.extension.before.test.impl.DisableAERI
16:17:50.637 DEBUG [WorkbenchTestable][RunIBeforeTestExtensions] Run method runBeforeTest() of class org.eclipse.reddeer.junit.extension.before.test.impl.CloseWelcomeScreenExt
16:17:50.637 DEBUG [WorkbenchTestable][RunIBeforeTestExtensions] Run method runBeforeTest() of class org.eclipse.reddeer.junit.extension.before.test.impl.SetOpenAssociatedPerspectiveExt
16:17:50.637 DEBUG [WorkbenchTestable][RunIBeforeTestExtensions] Run method runBeforeTest() of class org.eclipse.reddeer.junit.extension.before.test.impl.DoNotDownloadMavenIndexesExt
16:17:50.637 DEBUG [WorkbenchTestable][WindowIsAvailable] Looking for Window matching Matcher matching when all matchers match: [Window matching class class org.eclipse.jface.wizard.WizardDialog, Matcher matching widget which text matches: "New Dart Project"]
16:17:50.640 DEBUG [WorkbenchTestable][WidgetHandler] Get widget data
16:17:50.640 DEBUG [WorkbenchTestable][WindowIsAvailable] Looking for Window matching Matcher matching when all matchers match: [Window matching class class org.eclipse.jface.wizard.WizardDialog, Matcher matching widget which text matches: "New Dart Project"]
16:17:50.641 DEBUG [WorkbenchTestable][WidgetHandler] Get widget data
16:17:50.641 DEBUG [WorkbenchTestable][AbstractShell] Set focus to Shell data - Eclipse Platform
16:17:50.642 DEBUG [WorkbenchTestable][AbstractWait] Waiting until shell is active...
16:17:50.642 DEBUG [WorkbenchTestable][AbstractWait] Waiting until shell is active finished successfully
16:17:50.642 DEBUG [WorkbenchTestable][WorkbenchShell] Workbench shell has title 'data - Eclipse Platform'
16:17:50.642 INFO [WorkbenchTestable][ShellHandler] Getting Menu Bar of shell 'data - Eclipse Platform'
16:17:50.642 DEBUG [main][MenuItemLookup] Found menu:'File'
16:17:50.643 DEBUG [main][MenuItemLookup] Item match:File
16:17:50.644 DEBUG [main][MenuItemLookup] Found menu:'New	Shift+Alt+N'
16:17:50.644 DEBUG [main][MenuItemLookup] Item match:New	Shift+Alt+N
16:17:50.649 DEBUG [main][MenuItemLookup] Found menu:'Dart Project'
16:17:50.649 DEBUG [main][MenuItemLookup] Item match:Dart Project
16:17:50.649 DEBUG [WorkbenchTestable][MenuItemHandler] Queried MenuItem text:"Dart Project"
16:17:50.649 INFO [WorkbenchTestable][AbstractMenuItem] Select menu item with text Dart Project
16:17:50.649 INFO [main][MenuItemHandler] Select menu item: Dart Project
16:17:50.908 DEBUG [WorkbenchTestable][AbstractWait] Waiting until shell matching Matcher matching when all matchers match: [Matcher matching widget which text matches: "New Dart Project"] is available....
16:17:50.912 DEBUG [WorkbenchTestable][AbstractWait] Waiting until shell matching Matcher matching when all matchers match: [Matcher matching widget which text matches: "New Dart Project"] is available. finished successfully
16:17:50.913 DEBUG [WorkbenchTestable][AbstractShell] Set focus to Shell New Dart Project
16:17:50.914 DEBUG [WorkbenchTestable][AbstractWait] Waiting until shell is active...
16:17:50.914 DEBUG [WorkbenchTestable][AbstractWait] Waiting until shell is active finished successfully
16:17:50.914 TRACE [WorkbenchTestable][DartProjectPage] Shell New Dart Project is not null and is not disposed
16:17:50.914 DEBUG [WorkbenchTestable][WidgetHandler] Get widget data
16:17:50.914 DEBUG [WorkbenchTestable][AbstractWait] Waiting until window matching Matcher matching when all matchers match: [Window matching class class org.eclipse.jface.wizard.WizardDialog, Matcher matching widget which text matches: "New Dart Project"] is available....
16:17:50.914 DEBUG [WorkbenchTestable][WindowIsAvailable] Looking for Window matching Matcher matching when all matchers match: [Window matching class class org.eclipse.jface.wizard.WizardDialog, Matcher matching widget which text matches: "New Dart Project"]
16:17:50.915 DEBUG [WorkbenchTestable][WidgetHandler] Get widget data
16:17:50.915 DEBUG [WorkbenchTestable][WidgetHandler] Get widget data
16:17:50.915 DEBUG [WorkbenchTestable][AbstractWait] Waiting until window matching Matcher matching when all matchers match: [Window matching class class org.eclipse.jface.wizard.WizardDialog, Matcher matching widget which text matches: "New Dart Project"] is available. finished successfully
16:17:50.915 DEBUG [WorkbenchTestable][AbstractShell] Set focus to Shell New Dart Project
16:17:50.915 DEBUG [WorkbenchTestable][AbstractWait] Waiting until shell is active...
16:17:50.915 DEBUG [WorkbenchTestable][AbstractWait] Waiting until shell is active finished successfully
16:17:50.915 TRACE [WorkbenchTestable][DartProjectPage] Shell New Dart Project is not null and is not disposed
16:17:50.915 DEBUG [WorkbenchTestable][WidgetHandler] Get widget data
16:17:50.915 DEBUG [WorkbenchTestable][WidgetLookup] Looking up active widget with class type org.eclipse.swt.widgets.Text with no referenced composite specified, index 0 and following matchers specified (Matcher matching widget with label:
is "Project name:")
16:17:50.915 DEBUG [WorkbenchTestable][WidgetLookup] No parent specified, finding one
16:17:50.915 DEBUG [WorkbenchTestable][AbstractWait] Waiting until active shell exists...
16:17:50.915 DEBUG [WorkbenchTestable][AbstractWait] Waiting until active shell exists finished successfully
16:17:50.916 TRACE [WorkbenchTestable][WidgetLookup] Setting active shell with title "New Dart Project" as the parent
16:17:50.916 DEBUG [WorkbenchTestable][WidgetLookup] Parent found successfully
16:17:50.916 DEBUG [WorkbenchTestable][AbstractWait] Waiting until widget is found...
16:17:50.916 TRACE [WorkbenchTestable][WidgetLookup] Looking up widget with index 0 with specified parent and matchers
16:17:50.918 TRACE [WorkbenchTestable][WidgetLookup] widget with index 0 is found
16:17:50.918 DEBUG [WorkbenchTestable][AbstractWait] Waiting until widget is found finished successfully
16:17:50.918 DEBUG [WorkbenchTestable][WidgetLookup] Active widget with class type org.eclipse.swt.widgets.Text and index 0 was found
16:17:50.918 DEBUG [WorkbenchTestable][AbstractText] Set focus to Text
16:17:50.919 INFO [WorkbenchTestable][AbstractText] Text set to: xZPsFphc
16:17:50.920 DEBUG [WorkbenchTestable][WidgetLookup] Looking up active widget with class type org.eclipse.swt.widgets.Button with no referenced composite specified, index 0 and following matchers specified (Widget matcher matching widgets with style: 8, Matcher matching widgets with text that without mnenomic matches: is "Finish", Widget matcher matching widgets with style: 8)
16:17:50.920 DEBUG [WorkbenchTestable][WidgetLookup] No parent specified, finding one
16:17:50.930 DEBUG [WorkbenchTestable][AbstractWait] Waiting until active shell exists...
16:17:50.930 DEBUG [WorkbenchTestable][AbstractWait] Waiting until active shell exists finished successfully
16:17:50.930 TRACE [WorkbenchTestable][WidgetLookup] Setting active shell with title "New Dart Project" as the parent
16:17:50.930 DEBUG [WorkbenchTestable][WidgetLookup] Parent found successfully
16:17:50.930 DEBUG [WorkbenchTestable][AbstractWait] Waiting until widget is found...
16:17:50.931 TRACE [WorkbenchTestable][WidgetLookup] Looking up widget with index 0 with specified parent and matchers
16:17:50.932 TRACE [WorkbenchTestable][WidgetLookup] widget with index 0 is found
16:17:50.932 DEBUG [WorkbenchTestable][AbstractWait] Waiting until widget is found finished successfully
16:17:50.932 DEBUG [WorkbenchTestable][WidgetLookup] Active widget with class type org.eclipse.swt.widgets.Button and index 0 was found
16:17:50.934 INFO [WorkbenchTestable][AbstractButton] Click button &Finish
16:17:50.934 DEBUG [WorkbenchTestable][AbstractWait] Waiting until control is enabled...
16:17:50.934 DEBUG [WorkbenchTestable][AbstractWait] Waiting until control is enabled finished successfully
16:17:50.934 TRACE [WorkbenchTestable][WidgetHandler] Notify Button with event 13
16:17:50.934 TRACE [WorkbenchTestable][WidgetHandler] Wait for synchronization
16:17:51.010 DEBUG [WorkbenchTestable][AbstractWait] Waiting until Project xZPsFphc exists....
16:17:51.057 TRACE [WorkbenchTestable][WidgetLookup] Looking up widget with index 0 with specified parent and matchers
16:17:51.113 TRACE [WorkbenchTestable][WidgetLookup] widget with index 0 is found
16:17:51.113 INFO [WorkbenchTestable][AbstractView] View 'Matcher matching widget which text matches: Matcher matching text to regular expression '\*?\QPackage Explorer\E'' is already open. Activate.
16:17:51.113 TRACE [WorkbenchTestable][WidgetLookup] Looking up widget with index 0 with specified parent and matchers
16:17:51.118 TRACE [WorkbenchTestable][WidgetLookup] widget with index 0 is found
16:17:51.118 DEBUG [WorkbenchTestable][AbstractShell] Set focus to Shell data - Eclipse Platform
16:17:51.118 DEBUG [WorkbenchTestable][AbstractWait] Waiting until shell is active...
16:17:51.118 DEBUG [WorkbenchTestable][AbstractWait] Waiting until shell is active finished successfully
16:17:51.118 DEBUG [WorkbenchTestable][WorkbenchShell] Workbench shell has title 'data - Eclipse Platform'
16:17:51.118 DEBUG [WorkbenchTestable][WidgetLookup] Looking up active widget with class type org.eclipse.swt.custom.CTabItem with referenced composite class org.eclipse.reddeer.workbench.impl.shell.WorkbenchShell, index 0 and following matchers specified (Matcher matching widget which text matches: Matcher matching text to regular expression '\*?\QPackage Explorer\E')
16:17:51.118 DEBUG [WorkbenchTestable][AbstractWait] Waiting until widget is found...
16:17:51.118 TRACE [WorkbenchTestable][WidgetLookup] Looking up widget with index 0 with specified parent and matchers
16:17:51.123 TRACE [WorkbenchTestable][WidgetLookup] widget with index 0 is found
16:17:51.123 DEBUG [WorkbenchTestable][AbstractWait] Waiting until widget is found finished successfully
16:17:51.123 DEBUG [WorkbenchTestable][WidgetLookup] Active widget with class type org.eclipse.swt.custom.CTabItem and index 0 was found
16:17:51.123 INFO [WorkbenchTestable][AbstractView] Activate view Package Explorer
16:17:51.123 INFO [WorkbenchTestable][AbstractCTabItem] Activate Package Explorer
16:17:51.158 DEBUG [WorkbenchTestable][WorkbenchPartHandler] Active workbench control=Class=org.eclipse.e4.ui.workbench.renderers.swt.ContributedPartRenderer$1 Text=<unavailable> TooltipText=null
16:17:51.159 DEBUG [WorkbenchTestable][WorkbenchPartHandler] Focused control=Class=org.eclipse.swt.widgets.Shell Text=data - Eclipse Platform TooltipText=null
16:17:51.159 DEBUG [WorkbenchTestable][WorkbenchPartHandler] No control in opened view has a focus!
16:17:51.159 DEBUG [WorkbenchTestable][WorkbenchPartHandler] Setting implicit focus...
16:17:51.160 INFO [WorkbenchTestable][AbstractView] Activate view Package Explorer
16:17:51.160 INFO [WorkbenchTestable][AbstractCTabItem] Activate Package Explorer
16:17:51.161 DEBUG [WorkbenchTestable][WorkbenchPartHandler] Active workbench control=Class=org.eclipse.e4.ui.workbench.renderers.swt.ContributedPartRenderer$1 Text=<unavailable> TooltipText=null
16:17:51.161 DEBUG [WorkbenchTestable][WorkbenchPartHandler] Focused control=Class=org.eclipse.swt.widgets.Link Text=There are no projects in your workspace.
To add a project: TooltipText=null
16:17:51.161 INFO [WorkbenchTestable][AbstractView] Activate view Package Explorer
16:17:51.161 INFO [WorkbenchTestable][AbstractCTabItem] Activate Package Explorer
16:17:51.162 DEBUG [WorkbenchTestable][WorkbenchPartHandler] Active workbench control=Class=org.eclipse.e4.ui.workbench.renderers.swt.ContributedPartRenderer$1 Text=<unavailable> TooltipText=null
16:17:51.162 DEBUG [WorkbenchTestable][WorkbenchPartHandler] Focused control=Class=org.eclipse.swt.widgets.Link Text=There are no projects in your workspace.
To add a project: TooltipText=null
16:17:51.162 DEBUG [WorkbenchTestable][AbstractWait] Waiting until widget is found...
16:17:51.162 TRACE [WorkbenchTestable][WidgetLookup] Looking up widget with index 0 with specified parent and matchers
16:17:51.163 TRACE [WorkbenchTestable][WidgetLookup] widget with index 0 is found
16:17:51.163 DEBUG [WorkbenchTestable][AbstractWait] Waiting until widget is found finished successfully
16:17:51.664 INFO [WorkbenchTestable][AbstractView] View 'Matcher matching widget which text matches: Matcher matching text to regular expression '\*?\QPackage Explorer\E'' is already open. Activate.
16:17:51.665 INFO [WorkbenchTestable][AbstractView] Activate view Package Explorer
16:17:51.665 INFO [WorkbenchTestable][AbstractCTabItem] Activate Package Explorer
16:17:51.667 DEBUG [WorkbenchTestable][WorkbenchPartHandler] Active workbench control=Class=org.eclipse.e4.ui.workbench.renderers.swt.ContributedPartRenderer$1 Text=<unavailable> TooltipText=null
16:17:51.667 DEBUG [WorkbenchTestable][WorkbenchPartHandler] Focused control=Class=org.eclipse.swt.widgets.Composite Text=<unavailable> TooltipText=null
16:17:51.667 INFO [WorkbenchTestable][AbstractView] Activate view Package Explorer
16:17:51.667 INFO [WorkbenchTestable][AbstractCTabItem] Activate Package Explorer
16:17:51.668 DEBUG [WorkbenchTestable][WorkbenchPartHandler] Active workbench control=Class=org.eclipse.e4.ui.workbench.renderers.swt.ContributedPartRenderer$1 Text=<unavailable> TooltipText=null
16:17:51.668 DEBUG [WorkbenchTestable][WorkbenchPartHandler] Focused control=Class=org.eclipse.swt.widgets.Composite Text=<unavailable> TooltipText=null
16:17:51.668 INFO [WorkbenchTestable][AbstractView] Activate view Package Explorer
16:17:51.668 INFO [WorkbenchTestable][AbstractCTabItem] Activate Package Explorer
16:17:51.669 DEBUG [WorkbenchTestable][WorkbenchPartHandler] Active workbench control=Class=org.eclipse.e4.ui.workbench.renderers.swt.ContributedPartRenderer$1 Text=<unavailable> TooltipText=null
16:17:51.669 DEBUG [WorkbenchTestable][WorkbenchPartHandler] Focused control=Class=org.eclipse.swt.widgets.Composite Text=<unavailable> TooltipText=null
16:17:51.669 DEBUG [WorkbenchTestable][AbstractWait] Waiting until widget is found...
16:17:51.669 TRACE [WorkbenchTestable][WidgetLookup] Looking up widget with index 0 with specified parent and matchers
16:17:51.670 TRACE [WorkbenchTestable][WidgetLookup] widget with index 0is not found
16:17:52.170 TRACE [WorkbenchTestable][WidgetLookup] Looking up widget with index 0 with specified parent and matchers
16:17:52.170 TRACE [WorkbenchTestable][WidgetLookup] widget with index 0is not found
16:17:52.670 TRACE [WorkbenchTestable][WidgetLookup] Looking up widget with index 0 with specified parent and matchers
16:17:52.671 TRACE [WorkbenchTestable][WidgetLookup] widget with index 0is not found
16:17:52.671 DEBUG [WorkbenchTestable][AbstractWait] Waiting until widget is found failed, NO exception will be thrown
16:17:52.671 INFO [WorkbenchTestable][AbstractView] Activate view Package Explorer
16:17:52.671 INFO [WorkbenchTestable][AbstractCTabItem] Activate Package Explorer
16:17:52.672 DEBUG [WorkbenchTestable][WorkbenchPartHandler] Active workbench control=Class=org.eclipse.e4.ui.workbench.renderers.swt.ContributedPartRenderer$1 Text=<unavailable> TooltipText=null
16:17:52.672 DEBUG [WorkbenchTestable][WorkbenchPartHandler] Focused control=Class=org.eclipse.swt.widgets.Composite Text=<unavailable> TooltipText=null
16:17:52.672 DEBUG [WorkbenchTestable][WidgetLookup] Looking up active widget with class type org.eclipse.swt.widgets.Tree with referenced composite class org.eclipse.reddeer.swt.impl.ctab.DefaultCTabItem, index 0 and no matchers specified
16:17:52.672 DEBUG [WorkbenchTestable][AbstractWait] Waiting until widget is found...
16:17:52.672 TRACE [WorkbenchTestable][WidgetLookup] Looking up widget with index 0 with specified parent and matchers
16:17:52.673 TRACE [WorkbenchTestable][WidgetLookup] widget with index 0 is found
16:17:52.673 DEBUG [WorkbenchTestable][AbstractWait] Waiting until widget is found finished successfully
16:17:52.673 DEBUG [WorkbenchTestable][WidgetLookup] Active widget with class type org.eclipse.swt.widgets.Tree and index 0 was found
16:17:52.674 DEBUG [WorkbenchTestable][AbstractExplorer] Getting project with name xZPsFphc
16:17:52.674 DEBUG [WorkbenchTestable][AbstractWait] Waiting until Project xZPsFphc exists. finished successfully
16:17:52.675 TRACE [WorkbenchTestable][WidgetLookup] Looking up widget with index 0 with specified parent and matchers
16:17:52.676 TRACE [WorkbenchTestable][WidgetLookup] widget with index 0 is found
16:17:52.676 INFO [WorkbenchTestable][AbstractView] View 'Matcher matching widget which text matches: Matcher matching text to regular expression '\*?\QProject Explorer\E'' is already open. Activate.
16:17:52.676 TRACE [WorkbenchTestable][WidgetLookup] Looking up widget with index 0 with specified parent and matchers
16:17:52.677 TRACE [WorkbenchTestable][WidgetLookup] widget with index 0 is found
16:17:52.677 DEBUG [WorkbenchTestable][AbstractShell] Set focus to Shell data - Eclipse Platform
16:17:52.677 DEBUG [WorkbenchTestable][AbstractWait] Waiting until shell is active...
16:17:52.678 DEBUG [WorkbenchTestable][AbstractWait] Waiting until shell is active finished successfully
16:17:52.678 DEBUG [WorkbenchTestable][WorkbenchShell] Workbench shell has title 'data - Eclipse Platform'
16:17:52.678 DEBUG [WorkbenchTestable][WidgetLookup] Looking up active widget with class type org.eclipse.swt.custom.CTabItem with referenced composite class org.eclipse.reddeer.workbench.impl.shell.WorkbenchShell, index 0 and following matchers specified (Matcher matching widget which text matches: Matcher matching text to regular expression '\*?\QProject Explorer\E')
16:17:52.678 DEBUG [WorkbenchTestable][AbstractWait] Waiting until widget is found...
16:17:52.678 TRACE [WorkbenchTestable][WidgetLookup] Looking up widget with index 0 with specified parent and matchers
16:17:52.679 TRACE [WorkbenchTestable][WidgetLookup] widget with index 0 is found
16:17:52.679 DEBUG [WorkbenchTestable][AbstractWait] Waiting until widget is found finished successfully
16:17:52.679 DEBUG [WorkbenchTestable][WidgetLookup] Active widget with class type org.eclipse.swt.custom.CTabItem and index 0 was found
16:17:52.679 INFO [WorkbenchTestable][AbstractView] Activate view Project Explorer
16:17:52.679 INFO [WorkbenchTestable][AbstractCTabItem] Activate Project Explorer
16:17:52.710 DEBUG [WorkbenchTestable][WorkbenchPartHandler] Active workbench control=Class=org.eclipse.e4.ui.workbench.renderers.swt.ContributedPartRenderer$1 Text=<unavailable> TooltipText=null
16:17:52.710 DEBUG [WorkbenchTestable][WorkbenchPartHandler] Focused control=Class=org.eclipse.swt.widgets.Tree Text=<unavailable> TooltipText=null
16:17:52.710 INFO [WorkbenchTestable][AbstractView] Activate view Project Explorer
16:17:52.711 INFO [WorkbenchTestable][AbstractCTabItem] Activate Project Explorer
16:17:52.712 DEBUG [WorkbenchTestable][WorkbenchPartHandler] Active workbench control=Class=org.eclipse.e4.ui.workbench.renderers.swt.ContributedPartRenderer$1 Text=<unavailable> TooltipText=null
16:17:52.712 DEBUG [WorkbenchTestable][WorkbenchPartHandler] Focused control=Class=org.eclipse.swt.widgets.Tree Text=<unavailable> TooltipText=null
16:17:52.712 INFO [WorkbenchTestable][AbstractView] Activate view Project Explorer
16:17:52.712 INFO [WorkbenchTestable][AbstractCTabItem] Activate Project Explorer
16:17:52.713 DEBUG [WorkbenchTestable][WorkbenchPartHandler] Active workbench control=Class=org.eclipse.e4.ui.workbench.renderers.swt.ContributedPartRenderer$1 Text=<unavailable> TooltipText=null
16:17:52.713 DEBUG [WorkbenchTestable][WorkbenchPartHandler] Focused control=Class=org.eclipse.swt.widgets.Tree Text=<unavailable> TooltipText=null
16:17:52.713 DEBUG [WorkbenchTestable][AbstractWait] Waiting until widget is found...
16:17:52.713 TRACE [WorkbenchTestable][WidgetLookup] Looking up widget with index 0 with specified parent and matchers
16:17:52.713 TRACE [WorkbenchTestable][WidgetLookup] widget with index 0is not found
16:17:53.214 TRACE [WorkbenchTestable][WidgetLookup] Looking up widget with index 0 with specified parent and matchers
16:17:53.215 TRACE [WorkbenchTestable][WidgetLookup] widget with index 0is not found
16:17:53.715 TRACE [WorkbenchTestable][WidgetLookup] Looking up widget with index 0 with specified parent and matchers
16:17:53.716 TRACE [WorkbenchTestable][WidgetLookup] widget with index 0is not found
16:17:53.716 DEBUG [WorkbenchTestable][AbstractWait] Waiting until widget is found failed, NO exception will be thrown
16:17:53.716 INFO [WorkbenchTestable][AbstractView] Activate view Project Explorer
16:17:53.716 INFO [WorkbenchTestable][AbstractCTabItem] Activate Project Explorer
16:17:53.717 DEBUG [WorkbenchTestable][WorkbenchPartHandler] Active workbench control=Class=org.eclipse.e4.ui.workbench.renderers.swt.ContributedPartRenderer$1 Text=<unavailable> TooltipText=null
16:17:53.717 DEBUG [WorkbenchTestable][WorkbenchPartHandler] Focused control=Class=org.eclipse.swt.widgets.Tree Text=<unavailable> TooltipText=null
16:17:53.717 DEBUG [WorkbenchTestable][WidgetLookup] Looking up active widget with class type org.eclipse.swt.widgets.Tree with referenced composite class org.eclipse.reddeer.swt.impl.ctab.DefaultCTabItem, index 0 and no matchers specified
16:17:53.717 DEBUG [WorkbenchTestable][AbstractWait] Waiting until widget is found...
16:17:53.717 TRACE [WorkbenchTestable][WidgetLookup] Looking up widget with index 0 with specified parent and matchers
16:17:53.718 TRACE [WorkbenchTestable][WidgetLookup] widget with index 0 is found
16:17:53.718 DEBUG [WorkbenchTestable][AbstractWait] Waiting until widget is found finished successfully
16:17:53.718 DEBUG [WorkbenchTestable][WidgetLookup] Active widget with class type org.eclipse.swt.widgets.Tree and index 0 was found
16:17:53.718 DEBUG [WorkbenchTestable][AbstractExplorer] Getting project with name xZPsFphc
16:17:53.718 INFO [WorkbenchTestable][AbstractTreeItem] Select tree item xZPsFphc
16:17:53.718 DEBUG [main][TreeItemHandler] Selecting tree item: xZPsFphc
16:17:53.718 DEBUG [WorkbenchTestable][TreeItemHandler] Notify tree item xZPsFphc about selection
16:17:53.734 INFO [WorkbenchTestable][TreeItemHandler] Selected tree item: xZPsFphc
16:17:53.734 TRACE [WorkbenchTestable][WidgetHandler] Notify Tree with event 35
16:17:53.734 TRACE [WorkbenchTestable][WidgetHandler] Wait for synchronization
16:17:53.777 DEBUG [main][MenuItemLookup] Found menu:'New'
16:17:53.777 DEBUG [main][MenuItemLookup] Found menu:'Go Into'
16:17:53.777 DEBUG [main][MenuItemLookup] Found menu:''
16:17:53.777 DEBUG [main][MenuItemLookup] Found menu:'Show In	Shift+Alt+W'
16:17:53.777 DEBUG [main][MenuItemLookup] Found menu:''
16:17:53.777 DEBUG [main][MenuItemLookup] Found menu:'Copy	Ctrl+C'
16:17:53.777 DEBUG [main][MenuItemLookup] Found menu:'Paste	Ctrl+V'
16:17:53.777 DEBUG [main][MenuItemLookup] Found menu:'Delete	Delete'
16:17:53.777 DEBUG [main][MenuItemLookup] Found menu:'Move...'
16:17:53.778 DEBUG [main][MenuItemLookup] Found menu:'Rename...	F2'
16:17:53.778 DEBUG [main][MenuItemLookup] Found menu:''
16:17:53.778 DEBUG [main][MenuItemLookup] Found menu:'Import...'
16:17:53.778 DEBUG [main][MenuItemLookup] Found menu:'Export...'
16:17:53.778 DEBUG [main][MenuItemLookup] Found menu:''
16:17:53.778 DEBUG [main][MenuItemLookup] Found menu:'Refresh	F5'
16:17:53.778 DEBUG [main][MenuItemLookup] Found menu:'Close Project'
16:17:53.778 DEBUG [main][MenuItemLookup] Found menu:'Close Unrelated Project'
16:17:53.778 DEBUG [main][MenuItemLookup] Found menu:''
16:17:53.778 DEBUG [main][MenuItemLookup] Found menu:'Run As'
16:17:53.778 DEBUG [main][MenuItemLookup] Found menu:'Debug As'
16:17:53.778 DEBUG [main][MenuItemLookup] Found menu:'Team'
16:17:53.778 DEBUG [main][MenuItemLookup] Found menu:'Compare With'
16:17:53.778 DEBUG [main][MenuItemLookup] Found menu:'Restore from Local History...'
16:17:53.778 DEBUG [main][MenuItemLookup] Found menu:'Pub'
16:17:53.778 DEBUG [main][MenuItemLookup] Item match:Pub
16:17:53.804 DEBUG [main][MenuItemLookup] Found menu:'Get dependencies'
16:17:53.804 DEBUG [main][MenuItemLookup] Item match:Get dependencies
16:17:53.805 DEBUG [WorkbenchTestable][MenuItemHandler] Queried MenuItem text:"Get dependencies"
16:17:53.805 INFO [WorkbenchTestable][AbstractMenuItem] Select menu item with text Get dependencies
16:17:53.805 INFO [main][MenuItemHandler] Select menu item: Get dependencies
16:17:53.806 DEBUG [WorkbenchTestable][AbstractWait] Waiting while at least one job is running...
16:17:53.806 DEBUG [WorkbenchTestable][JobIsRunning]   job 'Decoration Calculation' is a system job, skipped
16:17:53.806 DEBUG [WorkbenchTestable][JobIsRunning]   job 'Update for Decoration Completion' is a system job, skipped
16:17:53.806 DEBUG [WorkbenchTestable][JobIsRunning]   job 'Resolving pub dependencies of xZPsFphc' is not running, skipped
16:17:53.806 DEBUG [WorkbenchTestable][JobIsRunning]   job 'Compacting resource model' is a system job, skipped
16:17:53.807 DEBUG [WorkbenchTestable][JobIsRunning]   job 'Workbench Auto-Save Job' is a system job, skipped
16:17:53.807 DEBUG [WorkbenchTestable][JobIsRunning]   job 'Periodic workspace save.' is a system job, skipped
16:17:53.807 DEBUG [WorkbenchTestable][AbstractWait] Waiting while at least one job is running finished successfully
16:17:53.810 DEBUG [WorkbenchTestable][RunIAfterTestExtensions] Run after test extensions for test class org.eclipse.dartboard.test.pub.PubGetHandlerTest
16:17:53.810 DEBUG [WorkbenchTestable][RunIAfterTestExtensions] Run method runAfterTest() of class org.eclipse.reddeer.junit.extension.after.test.impl.CloseAllShellsExt
16:17:53.810 INFO [WorkbenchTestable][WorkbenchShellHandler] Closing all shells...
16:17:53.822 DEBUG [WorkbenchTestable][AbstractWait] Waiting until active shell exists...
16:17:53.823 DEBUG [WorkbenchTestable][AbstractWait] Waiting until active shell exists finished successfully
16:17:53.823 DEBUG [WorkbenchTestable][RunIAfterTestExtensions] Run method runAfterTest() of class org.eclipse.reddeer.junit.extension.log.collector.AftersLogCollector
16:17:53.824 INFO [WorkbenchTestable][RequirementsRunner] Finished test: pubGetCommand__ExistingDartProject__CommandIsAvailableAndRunsPubGet no-configuration(org.eclipse.dartboard.test.pub.PubGetHandlerTest)
16:17:53.824 DEBUG [WorkbenchTestable][RunIAfterClassExtensions] Run after class extensions for test class org.eclipse.dartboard.test.pub.PubGetHandlerTest
16:17:53.824 DEBUG [WorkbenchTestable][RunIAfterClassExtensions] Run method runAfterTestClass() of class org.eclipse.reddeer.junit.extension.after.test.impl.CloseAllShellsExt
16:17:53.824 INFO [WorkbenchTestable][WorkbenchShellHandler] Closing all shells...
16:17:53.831 DEBUG [WorkbenchTestable][AbstractWait] Waiting until active shell exists...
16:17:53.831 DEBUG [WorkbenchTestable][AbstractWait] Waiting until active shell exists finished successfully
Tests run: 2, Failures: 0, Errors: 0, Skipped: 0, Time elapsed: 6.393 s - in org.eclipse.dartboard.test.pub.PubGetHandlerTest
pubGetCommand__ExistingNonDartProject__CommandIsNotAvailable no-configuration(org.eclipse.dartboard.test.pub.PubGetHandlerTest)  Time elapsed: 2.906 s
pubGetCommand__ExistingDartProject__CommandIsAvailableAndRunsPubGet no-configuration(org.eclipse.dartboard.test.pub.PubGetHandlerTest)  Time elapsed: 3.188 s
Running org.eclipse.dartboard.test.propertytester.IsDartProjectPropertyTesterTest
Tests run: 5, Failures: 0, Errors: 0, Skipped: 0, Time elapsed: 1.669 s - in org.eclipse.dartboard.test.propertytester.IsDartProjectPropertyTesterTest
test__NullResource__ReturnsFalse(org.eclipse.dartboard.test.propertytester.IsDartProjectPropertyTesterTest)  Time elapsed: 0 s
test__ExistingPubspec__ReturnsTrue(org.eclipse.dartboard.test.propertytester.IsDartProjectPropertyTesterTest)  Time elapsed: 1.473 s
test__NullResourceProject__ReturnsFalse(org.eclipse.dartboard.test.propertytester.IsDartProjectPropertyTesterTest)  Time elapsed: 0.19 s
test__ExistingDartFile__ReturnsTrue(org.eclipse.dartboard.test.propertytester.IsDartProjectPropertyTesterTest)  Time elapsed: 0.001 s
test__MemberListingFails__ReturnsFalse(org.eclipse.dartboard.test.propertytester.IsDartProjectPropertyTesterTest)  Time elapsed: 0.004 s

Results:

Errors: 
  LaunchShortcutTest.launchShortcut__DartProjectNoLaunchConfig__NewLaunchConfigIsCreated:34 ? RedDeer
  DartProjectTest.projectWizard__NewDartProject__CreatesNewProject:72 ? RedDeer ...

Tests run: 20, Failures: 0, Errors: 2, Skipped: 0

[INFO] ------------------------------------------------------------------------
[INFO] Reactor Summary:
[INFO] 
[INFO] org.eclipse.dartboard.main 0.1.0-SNAPSHOT .......... SUCCESS [  7.253 s]
[INFO] org.eclipse.dartboard 0.1.0-SNAPSHOT ............... SUCCESS [ 25.632 s]
[INFO] org.eclipse.dartboard.feature 0.1.0-SNAPSHOT ....... SUCCESS [  2.071 s]
[INFO] org.eclipse.dartboard.update 1.0.0-SNAPSHOT ........ SUCCESS [  7.746 s]
[INFO] org.eclipse.dartboard.test 1.0.0-SNAPSHOT .......... FAILURE [02:09 min]
[INFO] ------------------------------------------------------------------------
[INFO] BUILD FAILURE
[INFO] ------------------------------------------------------------------------
[INFO] Total time:  05:07 min
[INFO] Finished at: 2020-01-18T16:17:57Z
[INFO] ------------------------------------------------------------------------
[ERROR] Failed to execute goal org.eclipse.tycho:tycho-surefire-plugin:1.6.0-SNAPSHOT:test (default-test) on project org.eclipse.dartboard.test: There are test failures.
[ERROR] 
[ERROR] Please refer to /home/jenkins/agent/workspace/release/org.eclipse.dartboard.test/target/surefire-reports for the individual test results.
[ERROR] -> [Help 1]
[ERROR] 
[ERROR] To see the full stack trace of the errors, re-run Maven with the -e switch.
[ERROR] Re-run Maven using the -X switch to enable full debug logging.
[ERROR] 
[ERROR] For more information about the errors and possible solutions, please read the following articles:
[ERROR] [Help 1] http://cwiki.apache.org/confluence/display/MAVEN/MojoFailureException
[ERROR] 
[ERROR] After correcting the problems, you can resume the build with the command
[ERROR]   mvn <goals> -rf :org.eclipse.dartboard.test
[Pipeline] }
Terminating xvnc.
Killing processes
kill finished with exit code 2
[Pipeline] // wrap
Post stage
[Pipeline] junit
Recording test results
[Pipeline] }
[Pipeline] // stage
[Pipeline] stage
[Pipeline] { (Deploy to update site)
Stage "Deploy to update site" skipped due to earlier failure(s)
[Pipeline] }
[Pipeline] // stage
[Pipeline] stage
[Pipeline] { (Declarative: Post Actions)
[Pipeline] mail
[Pipeline] }
[Pipeline] // stage
[Pipeline] }
[Pipeline] // timeout
[Pipeline] }
[Pipeline] // withEnv
[Pipeline] }
[Pipeline] // container
[Pipeline] }
[Pipeline] // withEnv
[Pipeline] }
[Pipeline] // node
[Pipeline] }
[Pipeline] // podTemplate
[Pipeline] End of Pipeline
ERROR: script returned exit code 1
Finished: FAILURE