UnstableConsole Output

Skipping 1,085 KB.. Full Log
B | 52/152 kB | 16/21 kB | 12/35 kB 
Progress (4): 57 kB | 52/152 kB | 20/21 kB | 12/35 kB
Progress (4): 57 kB | 52/152 kB | 20/21 kB | 16/35 kB
Progress (4): 57 kB | 56/152 kB | 20/21 kB | 16/35 kB
Progress (4): 57 kB | 56/152 kB | 20/21 kB | 20/35 kB
Progress (4): 57 kB | 56/152 kB | 21 kB | 20/35 kB   
Progress (4): 57 kB | 56/152 kB | 21 kB | 24/35 kB
Progress (4): 57 kB | 60/152 kB | 21 kB | 24/35 kB
Progress (4): 57 kB | 60/152 kB | 21 kB | 28/35 kB
Progress (4): 57 kB | 64/152 kB | 21 kB | 28/35 kB
                                                  
Downloaded from eclipse.maven.central.mirror: https://repo.eclipse.org/content/repositories/maven_central/org/apache/maven/maven-artifact-manager/2.0.6/maven-artifact-manager-2.0.6.jar (57 kB at 1.3 MB/s)
Progress (3): 64/152 kB | 21 kB | 32/35 kB
                                          
Downloading from eclipse.maven.central.mirror: https://repo.eclipse.org/content/repositories/maven_central/org/apache/maven/reporting/maven-reporting-api/2.0.6/maven-reporting-api-2.0.6.jar
Progress (3): 68/152 kB | 21 kB | 32/35 kB
Progress (3): 68/152 kB | 21 kB | 35 kB   
Progress (3): 72/152 kB | 21 kB | 35 kB
Progress (3): 76/152 kB | 21 kB | 35 kB
Progress (3): 80/152 kB | 21 kB | 35 kB
Progress (3): 84/152 kB | 21 kB | 35 kB
Progress (3): 88/152 kB | 21 kB | 35 kB
Progress (3): 92/152 kB | 21 kB | 35 kB
Progress (3): 96/152 kB | 21 kB | 35 kB
Progress (3): 100/152 kB | 21 kB | 35 kB
Progress (3): 104/152 kB | 21 kB | 35 kB
Progress (3): 108/152 kB | 21 kB | 35 kB
Progress (3): 112/152 kB | 21 kB | 35 kB
Progress (3): 116/152 kB | 21 kB | 35 kB
Progress (3): 120/152 kB | 21 kB | 35 kB
Progress (3): 124/152 kB | 21 kB | 35 kB
Progress (3): 128/152 kB | 21 kB | 35 kB
Progress (3): 132/152 kB | 21 kB | 35 kB
Progress (3): 136/152 kB | 21 kB | 35 kB
Progress (3): 140/152 kB | 21 kB | 35 kB
Progress (3): 144/152 kB | 21 kB | 35 kB
                                        
Downloaded from eclipse.maven.central.mirror: https://repo.eclipse.org/content/repositories/maven_central/org/apache/maven/maven-plugin-parameter-documenter/2.0.6/maven-plugin-parameter-documenter-2.0.6.jar (21 kB at 432 kB/s)
Progress (2): 148/152 kB | 35 kB
                                
Downloading from eclipse.maven.central.mirror: https://repo.eclipse.org/content/repositories/maven_central/org/apache/maven/doxia/doxia-sink-api/1.0-alpha-7/doxia-sink-api-1.0-alpha-7.jar
Progress (2): 152 kB | 35 kB
                            
Downloaded from eclipse.maven.central.mirror: https://repo.eclipse.org/content/repositories/maven_central/org/apache/maven/maven-profile/2.0.6/maven-profile-2.0.6.jar (35 kB at 678 kB/s)
Downloading from eclipse.maven.central.mirror: https://repo.eclipse.org/content/repositories/maven_central/org/apache/maven/maven-repository-metadata/2.0.6/maven-repository-metadata-2.0.6.jar
Progress (2): 152 kB | 4.1/9.9 kB
Progress (2): 152 kB | 7.7/9.9 kB
Progress (2): 152 kB | 9.9 kB    
                             
Downloaded from eclipse.maven.central.mirror: https://repo.eclipse.org/content/repositories/maven_central/org/apache/maven/maven-core/2.0.6/maven-core-2.0.6.jar (152 kB at 2.6 MB/s)
Downloading from eclipse.maven.central.mirror: https://repo.eclipse.org/content/repositories/maven_central/org/apache/maven/maven-error-diagnostics/2.0.6/maven-error-diagnostics-2.0.6.jar
Downloaded from eclipse.maven.central.mirror: https://repo.eclipse.org/content/repositories/maven_central/org/apache/maven/reporting/maven-reporting-api/2.0.6/maven-reporting-api-2.0.6.jar (9.9 kB at 166 kB/s)
Downloading from eclipse.maven.central.mirror: https://repo.eclipse.org/content/repositories/maven_central/org/apache/maven/maven-plugin-descriptor/2.0.6/maven-plugin-descriptor-2.0.6.jar
Progress (1): 4.1/5.9 kB
Progress (1): 5.9 kB    
Progress (2): 5.9 kB | 4.1/24 kB
Progress (2): 5.9 kB | 7.7/24 kB
Progress (2): 5.9 kB | 12/24 kB 
Progress (2): 5.9 kB | 16/24 kB
Progress (2): 5.9 kB | 20/24 kB
Progress (2): 5.9 kB | 24/24 kB
Progress (2): 5.9 kB | 24 kB   
Progress (3): 5.9 kB | 24 kB | 4.1/37 kB
Progress (3): 5.9 kB | 24 kB | 7.7/37 kB
Progress (3): 5.9 kB | 24 kB | 12/37 kB 
Progress (3): 5.9 kB | 24 kB | 16/37 kB
Progress (3): 5.9 kB | 24 kB | 20/37 kB
Progress (3): 5.9 kB | 24 kB | 24/37 kB
Progress (3): 5.9 kB | 24 kB | 28/37 kB
Progress (3): 5.9 kB | 24 kB | 32/37 kB
                                       
Downloaded from eclipse.maven.central.mirror: https://repo.eclipse.org/content/repositories/maven_central/org/apache/maven/doxia/doxia-sink-api/1.0-alpha-7/doxia-sink-api-1.0-alpha-7.jar (5.9 kB at 77 kB/s)
Progress (3): 24 kB | 32/37 kB | 4.1/14 kB
Progress (3): 24 kB | 36/37 kB | 4.1/14 kB
Progress (3): 24 kB | 36/37 kB | 7.7/14 kB
                                          
Downloading from eclipse.maven.central.mirror: https://repo.eclipse.org/content/repositories/maven_central/classworlds/classworlds/1.1/classworlds-1.1.jar
Progress (3): 24 kB | 36/37 kB | 12/14 kB
                                         
Downloaded from eclipse.maven.central.mirror: https://repo.eclipse.org/content/repositories/maven_central/org/apache/maven/maven-repository-metadata/2.0.6/maven-repository-metadata-2.0.6.jar (24 kB at 310 kB/s)
Downloading from eclipse.maven.central.mirror: https://repo.eclipse.org/content/repositories/maven_central/org/apache/maven/maven-artifact/2.0.6/maven-artifact-2.0.6.jar
Progress (2): 37 kB | 12/14 kB
Progress (2): 37 kB | 14 kB   
                           
Downloaded from eclipse.maven.central.mirror: https://repo.eclipse.org/content/repositories/maven_central/org/apache/maven/maven-error-diagnostics/2.0.6/maven-error-diagnostics-2.0.6.jar (14 kB at 158 kB/s)
Downloaded from eclipse.maven.central.mirror: https://repo.eclipse.org/content/repositories/maven_central/org/apache/maven/maven-plugin-descriptor/2.0.6/maven-plugin-descriptor-2.0.6.jar (37 kB at 424 kB/s)
Downloading from eclipse.maven.central.mirror: https://repo.eclipse.org/content/repositories/maven_central/org/apache/maven/maven-settings/2.0.6/maven-settings-2.0.6.jar
Progress (1): 4.1/38 kB
                       
Downloading from eclipse.maven.central.mirror: https://repo.eclipse.org/content/repositories/maven_central/org/apache/maven/maven-model/2.0.6/maven-model-2.0.6.jar
Progress (1): 7.7/38 kB
Progress (1): 12/38 kB 
Progress (1): 16/38 kB
Progress (1): 20/38 kB
Progress (1): 24/38 kB
Progress (2): 24/38 kB | 4.1/87 kB
Progress (2): 24/38 kB | 7.7/87 kB
Progress (2): 24/38 kB | 12/87 kB 
Progress (2): 24/38 kB | 16/87 kB
Progress (2): 24/38 kB | 20/87 kB
Progress (2): 24/38 kB | 24/87 kB
Progress (2): 24/38 kB | 28/87 kB
Progress (2): 24/38 kB | 32/87 kB
Progress (2): 24/38 kB | 33/87 kB
Progress (2): 24/38 kB | 37/87 kB
Progress (2): 24/38 kB | 41/87 kB
Progress (2): 24/38 kB | 45/87 kB
Progress (2): 24/38 kB | 49/87 kB
Progress (2): 24/38 kB | 53/87 kB
Progress (2): 24/38 kB | 57/87 kB
Progress (2): 24/38 kB | 61/87 kB
Progress (2): 24/38 kB | 65/87 kB
Progress (2): 24/38 kB | 69/87 kB
Progress (2): 24/38 kB | 73/87 kB
Progress (3): 24/38 kB | 73/87 kB | 4.1/49 kB
Progress (3): 24/38 kB | 73/87 kB | 7.7/49 kB
Progress (3): 24/38 kB | 73/87 kB | 12/49 kB 
Progress (3): 24/38 kB | 73/87 kB | 16/49 kB
Progress (3): 24/38 kB | 73/87 kB | 20/49 kB
Progress (3): 24/38 kB | 73/87 kB | 24/49 kB
Progress (3): 24/38 kB | 73/87 kB | 28/49 kB
Progress (3): 24/38 kB | 73/87 kB | 32/49 kB
Progress (3): 24/38 kB | 73/87 kB | 36/49 kB
Progress (3): 24/38 kB | 73/87 kB | 40/49 kB
Progress (3): 24/38 kB | 73/87 kB | 44/49 kB
Progress (3): 24/38 kB | 73/87 kB | 48/49 kB
Progress (3): 24/38 kB | 73/87 kB | 49 kB   
Progress (4): 24/38 kB | 73/87 kB | 49 kB | 4.1/86 kB
Progress (4): 24/38 kB | 73/87 kB | 49 kB | 7.7/86 kB
Progress (4): 24/38 kB | 73/87 kB | 49 kB | 12/86 kB 
Progress (4): 24/38 kB | 73/87 kB | 49 kB | 16/86 kB
                                                    
Downloaded from eclipse.maven.central.mirror: https://repo.eclipse.org/content/repositories/maven_central/org/apache/maven/maven-settings/2.0.6/maven-settings-2.0.6.jar (49 kB at 459 kB/s)
Downloading from eclipse.maven.central.mirror: https://repo.eclipse.org/content/repositories/maven_central/org/apache/maven/maven-monitor/2.0.6/maven-monitor-2.0.6.jar
Progress (3): 24/38 kB | 73/87 kB | 20/86 kB
Progress (3): 24/38 kB | 73/87 kB | 24/86 kB
Progress (3): 24/38 kB | 73/87 kB | 28/86 kB
Progress (3): 24/38 kB | 73/87 kB | 32/86 kB
Progress (3): 24/38 kB | 73/87 kB | 33/86 kB
Progress (3): 24/38 kB | 73/87 kB | 37/86 kB
Progress (3): 24/38 kB | 73/87 kB | 41/86 kB
Progress (3): 24/38 kB | 73/87 kB | 45/86 kB
Progress (3): 24/38 kB | 73/87 kB | 49/86 kB
Progress (3): 24/38 kB | 73/87 kB | 53/86 kB
Progress (3): 24/38 kB | 73/87 kB | 57/86 kB
Progress (3): 24/38 kB | 73/87 kB | 61/86 kB
Progress (3): 24/38 kB | 73/87 kB | 65/86 kB
Progress (3): 24/38 kB | 73/87 kB | 69/86 kB
Progress (3): 24/38 kB | 73/87 kB | 73/86 kB
Progress (3): 24/38 kB | 73/87 kB | 77/86 kB
Progress (3): 24/38 kB | 73/87 kB | 81/86 kB
Progress (3): 24/38 kB | 73/87 kB | 85/86 kB
Progress (3): 24/38 kB | 73/87 kB | 86 kB   
Progress (4): 24/38 kB | 73/87 kB | 86 kB | 4.1/10 kB
Progress (4): 24/38 kB | 73/87 kB | 86 kB | 7.7/10 kB
Progress (4): 24/38 kB | 73/87 kB | 86 kB | 10 kB    
                                                 
Downloaded from eclipse.maven.central.mirror: https://repo.eclipse.org/content/repositories/maven_central/org/apache/maven/maven-model/2.0.6/maven-model-2.0.6.jar (86 kB at 738 kB/s)
Downloading from eclipse.maven.central.mirror: https://repo.eclipse.org/content/repositories/maven_central/org/codehaus/plexus/plexus-container-default/1.0-alpha-9-stable-1/plexus-container-default-1.0-alpha-9-stable-1.jar
Downloaded from eclipse.maven.central.mirror: https://repo.eclipse.org/content/repositories/maven_central/org/apache/maven/maven-monitor/2.0.6/maven-monitor-2.0.6.jar (10 kB at 76 kB/s)
Downloading from eclipse.maven.central.mirror: https://repo.eclipse.org/content/repositories/maven_central/org/codehaus/plexus/plexus-utils/2.0.5/plexus-utils-2.0.5.jar
Progress (3): 24/38 kB | 73/87 kB | 4.1/194 kB
Progress (3): 24/38 kB | 73/87 kB | 7.7/194 kB
Progress (3): 24/38 kB | 73/87 kB | 12/194 kB 
Progress (3): 24/38 kB | 73/87 kB | 16/194 kB
Progress (3): 24/38 kB | 73/87 kB | 20/194 kB
Progress (3): 24/38 kB | 73/87 kB | 24/194 kB
Progress (3): 24/38 kB | 73/87 kB | 28/194 kB
Progress (3): 24/38 kB | 73/87 kB | 32/194 kB
Progress (3): 24/38 kB | 73/87 kB | 33/194 kB
Progress (3): 24/38 kB | 73/87 kB | 37/194 kB
Progress (3): 24/38 kB | 73/87 kB | 41/194 kB
Progress (3): 24/38 kB | 73/87 kB | 45/194 kB
Progress (3): 24/38 kB | 73/87 kB | 49/194 kB
Progress (3): 24/38 kB | 73/87 kB | 53/194 kB
Progress (3): 24/38 kB | 73/87 kB | 57/194 kB
Progress (3): 24/38 kB | 73/87 kB | 61/194 kB
Progress (3): 24/38 kB | 73/87 kB | 65/194 kB
Progress (3): 24/38 kB | 73/87 kB | 69/194 kB
Progress (3): 24/38 kB | 73/87 kB | 73/194 kB
Progress (3): 24/38 kB | 73/87 kB | 77/194 kB
Progress (3): 24/38 kB | 73/87 kB | 81/194 kB
Progress (3): 24/38 kB | 73/87 kB | 85/194 kB
Progress (4): 24/38 kB | 73/87 kB | 85/194 kB | 4.1/223 kB
Progress (4): 24/38 kB | 73/87 kB | 89/194 kB | 4.1/223 kB
Progress (4): 24/38 kB | 73/87 kB | 89/194 kB | 7.7/223 kB
Progress (4): 24/38 kB | 73/87 kB | 93/194 kB | 7.7/223 kB
Progress (4): 24/38 kB | 73/87 kB | 93/194 kB | 12/223 kB 
Progress (4): 24/38 kB | 73/87 kB | 97/194 kB | 12/223 kB
Progress (4): 24/38 kB | 73/87 kB | 97/194 kB | 16/223 kB
Progress (4): 24/38 kB | 73/87 kB | 101/194 kB | 16/223 kB
Progress (4): 24/38 kB | 73/87 kB | 101/194 kB | 20/223 kB
Progress (4): 24/38 kB | 73/87 kB | 105/194 kB | 20/223 kB
Progress (4): 24/38 kB | 73/87 kB | 105/194 kB | 24/223 kB
Progress (4): 24/38 kB | 73/87 kB | 109/194 kB | 24/223 kB
Progress (4): 24/38 kB | 73/87 kB | 109/194 kB | 28/223 kB
Progress (4): 24/38 kB | 73/87 kB | 113/194 kB | 28/223 kB
Progress (4): 24/38 kB | 73/87 kB | 113/194 kB | 32/223 kB
Progress (4): 24/38 kB | 73/87 kB | 117/194 kB | 32/223 kB
Progress (4): 24/38 kB | 73/87 kB | 117/194 kB | 33/223 kB
Progress (4): 24/38 kB | 73/87 kB | 121/194 kB | 33/223 kB
Progress (4): 24/38 kB | 73/87 kB | 121/194 kB | 37/223 kB
Progress (4): 24/38 kB | 73/87 kB | 125/194 kB | 37/223 kB
Progress (4): 24/38 kB | 73/87 kB | 125/194 kB | 41/223 kB
Progress (4): 24/38 kB | 73/87 kB | 129/194 kB | 41/223 kB
Progress (4): 24/38 kB | 73/87 kB | 129/194 kB | 45/223 kB
Progress (4): 24/38 kB | 73/87 kB | 133/194 kB | 45/223 kB
Progress (4): 24/38 kB | 73/87 kB | 133/194 kB | 49/223 kB
Progress (4): 24/38 kB | 73/87 kB | 137/194 kB | 49/223 kB
Progress (4): 24/38 kB | 73/87 kB | 137/194 kB | 53/223 kB
Progress (4): 24/38 kB | 73/87 kB | 141/194 kB | 53/223 kB
Progress (4): 24/38 kB | 73/87 kB | 141/194 kB | 57/223 kB
Progress (4): 24/38 kB | 73/87 kB | 145/194 kB | 57/223 kB
Progress (4): 24/38 kB | 73/87 kB | 145/194 kB | 61/223 kB
Progress (4): 24/38 kB | 73/87 kB | 149/194 kB | 61/223 kB
Progress (4): 24/38 kB | 73/87 kB | 149/194 kB | 65/223 kB
Progress (4): 24/38 kB | 73/87 kB | 153/194 kB | 65/223 kB
Progress (4): 24/38 kB | 73/87 kB | 153/194 kB | 66/223 kB
Progress (4): 24/38 kB | 73/87 kB | 157/194 kB | 66/223 kB
Progress (4): 24/38 kB | 73/87 kB | 157/194 kB | 70/223 kB
Progress (4): 24/38 kB | 73/87 kB | 161/194 kB | 70/223 kB
Progress (4): 24/38 kB | 73/87 kB | 161/194 kB | 74/223 kB
Progress (4): 24/38 kB | 73/87 kB | 165/194 kB | 74/223 kB
Progress (4): 24/38 kB | 73/87 kB | 165/194 kB | 78/223 kB
Progress (4): 24/38 kB | 73/87 kB | 169/194 kB | 78/223 kB
Progress (4): 24/38 kB | 73/87 kB | 169/194 kB | 82/223 kB
Progress (4): 24/38 kB | 73/87 kB | 173/194 kB | 82/223 kB
Progress (4): 24/38 kB | 73/87 kB | 173/194 kB | 86/223 kB
Progress (4): 24/38 kB | 73/87 kB | 177/194 kB | 86/223 kB
Progress (4): 24/38 kB | 73/87 kB | 177/194 kB | 90/223 kB
Progress (4): 24/38 kB | 73/87 kB | 181/194 kB | 90/223 kB
Progress (4): 24/38 kB | 73/87 kB | 181/194 kB | 94/223 kB
Progress (4): 24/38 kB | 73/87 kB | 185/194 kB | 94/223 kB
Progress (4): 24/38 kB | 73/87 kB | 185/194 kB | 98/223 kB
Progress (4): 24/38 kB | 73/87 kB | 189/194 kB | 98/223 kB
Progress (4): 24/38 kB | 73/87 kB | 189/194 kB | 98/223 kB
Progress (4): 24/38 kB | 73/87 kB | 193/194 kB | 98/223 kB
Progress (4): 24/38 kB | 73/87 kB | 193/194 kB | 102/223 kB
Progress (4): 24/38 kB | 73/87 kB | 194 kB | 102/223 kB    
Progress (4): 24/38 kB | 73/87 kB | 194 kB | 106/223 kB
Progress (4): 24/38 kB | 73/87 kB | 194 kB | 110/223 kB
Progress (4): 24/38 kB | 73/87 kB | 194 kB | 114/223 kB
Progress (4): 24/38 kB | 73/87 kB | 194 kB | 118/223 kB
Progress (4): 24/38 kB | 73/87 kB | 194 kB | 122/223 kB
Progress (4): 24/38 kB | 73/87 kB | 194 kB | 126/223 kB
Progress (4): 24/38 kB | 73/87 kB | 194 kB | 130/223 kB
Progress (4): 24/38 kB | 73/87 kB | 194 kB | 134/223 kB
Progress (4): 24/38 kB | 73/87 kB | 194 kB | 138/223 kB
Progress (4): 24/38 kB | 73/87 kB | 194 kB | 142/223 kB
Progress (4): 24/38 kB | 73/87 kB | 194 kB | 146/223 kB
Progress (4): 24/38 kB | 73/87 kB | 194 kB | 150/223 kB
Progress (4): 24/38 kB | 73/87 kB | 194 kB | 154/223 kB
Progress (4): 24/38 kB | 73/87 kB | 194 kB | 158/223 kB
Progress (4): 24/38 kB | 73/87 kB | 194 kB | 162/223 kB
Progress (4): 24/38 kB | 73/87 kB | 194 kB | 166/223 kB
Progress (4): 24/38 kB | 73/87 kB | 194 kB | 170/223 kB
Progress (4): 24/38 kB | 73/87 kB | 194 kB | 174/223 kB
Progress (4): 24/38 kB | 73/87 kB | 194 kB | 178/223 kB
Progress (4): 24/38 kB | 73/87 kB | 194 kB | 182/223 kB
Progress (4): 24/38 kB | 73/87 kB | 194 kB | 186/223 kB
Progress (4): 24/38 kB | 73/87 kB | 194 kB | 190/223 kB
Progress (4): 24/38 kB | 73/87 kB | 194 kB | 194/223 kB
Progress (4): 24/38 kB | 73/87 kB | 194 kB | 198/223 kB
Progress (4): 24/38 kB | 73/87 kB | 194 kB | 202/223 kB
Progress (4): 24/38 kB | 73/87 kB | 194 kB | 206/223 kB
Progress (4): 24/38 kB | 73/87 kB | 194 kB | 210/223 kB
Progress (4): 24/38 kB | 73/87 kB | 194 kB | 214/223 kB
Progress (4): 24/38 kB | 73/87 kB | 194 kB | 218/223 kB
Progress (4): 24/38 kB | 73/87 kB | 194 kB | 222/223 kB
Progress (4): 24/38 kB | 73/87 kB | 194 kB | 223 kB    
                                                   
Downloaded from eclipse.maven.central.mirror: https://repo.eclipse.org/content/repositories/maven_central/org/codehaus/plexus/plexus-utils/2.0.5/plexus-utils-2.0.5.jar (223 kB at 1.3 MB/s)
Downloaded from eclipse.maven.central.mirror: https://repo.eclipse.org/content/repositories/maven_central/org/codehaus/plexus/plexus-container-default/1.0-alpha-9-stable-1/plexus-container-default-1.0-alpha-9-stable-1.jar (194 kB at 1.1 MB/s)
Downloading from eclipse.maven.central.mirror: https://repo.eclipse.org/content/repositories/maven_central/org/sonatype/plexus/plexus-build-api/0.0.4/plexus-build-api-0.0.4.jar
Downloading from eclipse.maven.central.mirror: https://repo.eclipse.org/content/repositories/maven_central/org/apache/maven/shared/maven-filtering/1.0-beta-4/maven-filtering-1.0-beta-4.jar
Progress (3): 24/38 kB | 73/87 kB | 4.1/35 kB
Progress (3): 24/38 kB | 73/87 kB | 7.7/35 kB
Progress (3): 24/38 kB | 73/87 kB | 12/35 kB 
Progress (3): 24/38 kB | 73/87 kB | 16/35 kB
Progress (3): 24/38 kB | 73/87 kB | 20/35 kB
Progress (3): 24/38 kB | 73/87 kB | 24/35 kB
Progress (3): 24/38 kB | 73/87 kB | 28/35 kB
Progress (3): 24/38 kB | 73/87 kB | 32/35 kB
Progress (3): 24/38 kB | 73/87 kB | 33/35 kB
Progress (3): 24/38 kB | 73/87 kB | 35 kB   
                                         
Downloaded from eclipse.maven.central.mirror: https://repo.eclipse.org/content/repositories/maven_central/org/apache/maven/shared/maven-filtering/1.0-beta-4/maven-filtering-1.0-beta-4.jar (35 kB at 175 kB/s)
Downloading from eclipse.maven.central.mirror: https://repo.eclipse.org/content/repositories/maven_central/org/codehaus/plexus/plexus-interpolation/1.13/plexus-interpolation-1.13.jar
Progress (3): 24/38 kB | 73/87 kB | 4.1/61 kB
Progress (3): 24/38 kB | 73/87 kB | 7.7/61 kB
Progress (3): 24/38 kB | 73/87 kB | 12/61 kB 
Progress (3): 24/38 kB | 73/87 kB | 16/61 kB
Progress (3): 24/38 kB | 73/87 kB | 20/61 kB
Progress (3): 24/38 kB | 73/87 kB | 24/61 kB
Progress (3): 24/38 kB | 73/87 kB | 28/61 kB
Progress (3): 24/38 kB | 73/87 kB | 32/61 kB
Progress (3): 24/38 kB | 73/87 kB | 36/61 kB
Progress (3): 24/38 kB | 73/87 kB | 40/61 kB
Progress (3): 24/38 kB | 73/87 kB | 44/61 kB
Progress (3): 24/38 kB | 73/87 kB | 48/61 kB
Progress (3): 24/38 kB | 73/87 kB | 52/61 kB
Progress (3): 24/38 kB | 73/87 kB | 56/61 kB
Progress (3): 24/38 kB | 73/87 kB | 60/61 kB
Progress (3): 24/38 kB | 73/87 kB | 61 kB   
                                         
Downloaded from eclipse.maven.central.mirror: https://repo.eclipse.org/content/repositories/maven_central/org/codehaus/plexus/plexus-interpolation/1.13/plexus-interpolation-1.13.jar (61 kB at 275 kB/s)
Progress (2): 24/38 kB | 77/87 kB
Progress (2): 24/38 kB | 81/87 kB
Progress (2): 24/38 kB | 85/87 kB
Progress (2): 24/38 kB | 87 kB   
                              
Downloaded from eclipse.maven.central.mirror: https://repo.eclipse.org/content/repositories/maven_central/org/apache/maven/maven-artifact/2.0.6/maven-artifact-2.0.6.jar (87 kB at 281 kB/s)
Progress (1): 28/38 kB
Progress (1): 32/38 kB
Progress (1): 36/38 kB
Progress (1): 38 kB   
                   
Downloaded from eclipse.maven.central.mirror: https://repo.eclipse.org/content/repositories/maven_central/classworlds/classworlds/1.1/classworlds-1.1.jar (38 kB at 110 kB/s)
Progress (1): 4.1/6.8 kB
Progress (1): 6.8 kB    
                    
Downloaded from eclipse.maven.central.mirror: https://repo.eclipse.org/content/repositories/maven_central/org/sonatype/plexus/plexus-build-api/0.0.4/plexus-build-api-0.0.4.jar (6.8 kB at 15 kB/s)
Progress (1): 4.1/116 kB
Progress (1): 7.7/116 kB
Progress (1): 12/116 kB 
Progress (1): 16/116 kB
Progress (1): 20/116 kB
Progress (1): 24/116 kB
Progress (1): 28/116 kB
Progress (1): 32/116 kB
Progress (1): 36/116 kB
Progress (1): 40/116 kB
Progress (1): 44/116 kB
Progress (1): 48/116 kB
Progress (1): 52/116 kB
Progress (1): 56/116 kB
Progress (1): 60/116 kB
Progress (1): 64/116 kB
Progress (1): 68/116 kB
Progress (1): 72/116 kB
Progress (1): 76/116 kB
Progress (1): 80/116 kB
Progress (1): 84/116 kB
Progress (1): 88/116 kB
Progress (1): 92/116 kB
Progress (1): 96/116 kB
Progress (1): 100/116 kB
Progress (1): 104/116 kB
Progress (1): 108/116 kB
Progress (1): 112/116 kB
Progress (1): 116/116 kB
Progress (1): 116 kB    
                    
Downloaded from eclipse.maven.central.mirror: https://repo.eclipse.org/content/repositories/maven_central/org/apache/maven/maven-project/2.0.6/maven-project-2.0.6.jar (116 kB at 112 kB/s)
[INFO] Using 'UTF-8' encoding to copy filtered resources.
[INFO] skip non existing resourceDirectory /jobs/genie.corrosion/corrosion/branches/master/workspace/org.eclipse.corrosion/src/main/resources
[INFO] 
[INFO] --- tycho-compiler-plugin:1.4.0:compile (default-compile) @ org.eclipse.corrosion ---
Downloading from cbi: https://repo.eclipse.org/content/groups/cbi/org/codehaus/plexus/plexus-compiler-manager/2.2/plexus-compiler-manager-2.2.pom
Downloading from jboss: https://repository.jboss.org/org/codehaus/plexus/plexus-compiler-manager/2.2/plexus-compiler-manager-2.2.pom
Downloading from eclipse.maven.central.mirror: https://repo.eclipse.org/content/repositories/maven_central/org/codehaus/plexus/plexus-compiler-manager/2.2/plexus-compiler-manager-2.2.pom
Progress (1): 690 B
                   
Downloaded from eclipse.maven.central.mirror: https://repo.eclipse.org/content/repositories/maven_central/org/codehaus/plexus/plexus-compiler-manager/2.2/plexus-compiler-manager-2.2.pom (690 B at 36 kB/s)
Downloading from cbi: https://repo.eclipse.org/content/groups/cbi/org/codehaus/plexus/plexus-compiler/2.2/plexus-compiler-2.2.pom
Downloading from jboss: https://repository.jboss.org/org/codehaus/plexus/plexus-compiler/2.2/plexus-compiler-2.2.pom
Downloading from eclipse.maven.central.mirror: https://repo.eclipse.org/content/repositories/maven_central/org/codehaus/plexus/plexus-compiler/2.2/plexus-compiler-2.2.pom
Progress (1): 3.6 kB
                    
Downloaded from eclipse.maven.central.mirror: https://repo.eclipse.org/content/repositories/maven_central/org/codehaus/plexus/plexus-compiler/2.2/plexus-compiler-2.2.pom (3.6 kB at 201 kB/s)
Downloading from cbi: https://repo.eclipse.org/content/groups/cbi/org/codehaus/plexus/plexus-components/1.3.1/plexus-components-1.3.1.pom
Downloading from jboss: https://repository.jboss.org/org/codehaus/plexus/plexus-components/1.3.1/plexus-components-1.3.1.pom
Downloading from eclipse.maven.central.mirror: https://repo.eclipse.org/content/repositories/maven_central/org/codehaus/plexus/plexus-components/1.3.1/plexus-components-1.3.1.pom
Progress (1): 3.1 kB
                    
Downloaded from eclipse.maven.central.mirror: https://repo.eclipse.org/content/repositories/maven_central/org/codehaus/plexus/plexus-components/1.3.1/plexus-components-1.3.1.pom (3.1 kB at 12 kB/s)
Downloading from cbi: https://repo.eclipse.org/content/groups/cbi/org/codehaus/plexus/plexus-compiler-api/2.2/plexus-compiler-api-2.2.pom
Downloading from jboss: https://repository.jboss.org/org/codehaus/plexus/plexus-compiler-api/2.2/plexus-compiler-api-2.2.pom
Downloading from eclipse.maven.central.mirror: https://repo.eclipse.org/content/repositories/maven_central/org/codehaus/plexus/plexus-compiler-api/2.2/plexus-compiler-api-2.2.pom
Progress (1): 865 B
                   
Downloaded from eclipse.maven.central.mirror: https://repo.eclipse.org/content/repositories/maven_central/org/codehaus/plexus/plexus-compiler-api/2.2/plexus-compiler-api-2.2.pom (865 B at 28 kB/s)
Downloading from cbi: https://repo.eclipse.org/content/groups/cbi/org/eclipse/tycho/tycho-compiler-jdt/1.4.0/tycho-compiler-jdt-1.4.0.pom
Downloading from jboss: https://repository.jboss.org/org/eclipse/tycho/tycho-compiler-jdt/1.4.0/tycho-compiler-jdt-1.4.0.pom
Downloading from eclipse.maven.central.mirror: https://repo.eclipse.org/content/repositories/maven_central/org/eclipse/tycho/tycho-compiler-jdt/1.4.0/tycho-compiler-jdt-1.4.0.pom
Progress (1): 2.4 kB
                    
Downloaded from eclipse.maven.central.mirror: https://repo.eclipse.org/content/repositories/maven_central/org/eclipse/tycho/tycho-compiler-jdt/1.4.0/tycho-compiler-jdt-1.4.0.pom (2.4 kB at 47 kB/s)
Downloading from cbi: https://repo.eclipse.org/content/groups/cbi/org/eclipse/tycho/tycho-lib-detector/1.4.0/tycho-lib-detector-1.4.0.pom
Downloading from jboss: https://repository.jboss.org/org/eclipse/tycho/tycho-lib-detector/1.4.0/tycho-lib-detector-1.4.0.pom
Downloading from eclipse.maven.central.mirror: https://repo.eclipse.org/content/repositories/maven_central/org/eclipse/tycho/tycho-lib-detector/1.4.0/tycho-lib-detector-1.4.0.pom
Progress (1): 1.6 kB
                    
Downloaded from eclipse.maven.central.mirror: https://repo.eclipse.org/content/repositories/maven_central/org/eclipse/tycho/tycho-lib-detector/1.4.0/tycho-lib-detector-1.4.0.pom (1.6 kB at 58 kB/s)
Downloading from cbi: https://repo.eclipse.org/content/groups/cbi/org/eclipse/jdt/ecj/3.17.0/ecj-3.17.0.pom
Downloading from jboss: https://repository.jboss.org/org/eclipse/jdt/ecj/3.17.0/ecj-3.17.0.pom
Downloading from eclipse.maven.central.mirror: https://repo.eclipse.org/content/repositories/maven_central/org/eclipse/jdt/ecj/3.17.0/ecj-3.17.0.pom
Progress (1): 1.7 kB
                    
Downloaded from eclipse.maven.central.mirror: https://repo.eclipse.org/content/repositories/maven_central/org/eclipse/jdt/ecj/3.17.0/ecj-3.17.0.pom (1.7 kB at 58 kB/s)
Downloading from cbi: https://repo.eclipse.org/content/groups/cbi/org/codehaus/plexus/plexus-compiler-manager/2.2/plexus-compiler-manager-2.2.jar
Downloading from cbi: https://repo.eclipse.org/content/groups/cbi/org/eclipse/tycho/tycho-lib-detector/1.4.0/tycho-lib-detector-1.4.0.jar
Downloading from cbi: https://repo.eclipse.org/content/groups/cbi/org/eclipse/tycho/tycho-compiler-jdt/1.4.0/tycho-compiler-jdt-1.4.0.jar
Downloading from cbi: https://repo.eclipse.org/content/groups/cbi/org/codehaus/plexus/plexus-compiler-api/2.2/plexus-compiler-api-2.2.jar
Downloading from cbi: https://repo.eclipse.org/content/groups/cbi/org/eclipse/jdt/ecj/3.17.0/ecj-3.17.0.jar
Downloading from jboss: https://repository.jboss.org/org/codehaus/plexus/plexus-compiler-manager/2.2/plexus-compiler-manager-2.2.jar
Downloading from jboss: https://repository.jboss.org/org/eclipse/jdt/ecj/3.17.0/ecj-3.17.0.jar
Downloading from jboss: https://repository.jboss.org/org/eclipse/tycho/tycho-lib-detector/1.4.0/tycho-lib-detector-1.4.0.jar
Downloading from jboss: https://repository.jboss.org/org/eclipse/tycho/tycho-compiler-jdt/1.4.0/tycho-compiler-jdt-1.4.0.jar
Downloading from jboss: https://repository.jboss.org/org/codehaus/plexus/plexus-compiler-api/2.2/plexus-compiler-api-2.2.jar
Downloading from eclipse.maven.central.mirror: https://repo.eclipse.org/content/repositories/maven_central/org/codehaus/plexus/plexus-compiler-manager/2.2/plexus-compiler-manager-2.2.jar
Downloading from eclipse.maven.central.mirror: https://repo.eclipse.org/content/repositories/maven_central/org/eclipse/jdt/ecj/3.17.0/ecj-3.17.0.jar
Downloading from eclipse.maven.central.mirror: https://repo.eclipse.org/content/repositories/maven_central/org/eclipse/tycho/tycho-lib-detector/1.4.0/tycho-lib-detector-1.4.0.jar
Downloading from eclipse.maven.central.mirror: https://repo.eclipse.org/content/repositories/maven_central/org/eclipse/tycho/tycho-compiler-jdt/1.4.0/tycho-compiler-jdt-1.4.0.jar
Downloading from eclipse.maven.central.mirror: https://repo.eclipse.org/content/repositories/maven_central/org/codehaus/plexus/plexus-compiler-api/2.2/plexus-compiler-api-2.2.jar
Progress (1): 4.1/4.6 kB
Progress (1): 4.6 kB    
Progress (2): 4.6 kB | 4.1/25 kB
Progress (2): 4.6 kB | 7.7/25 kB
Progress (2): 4.6 kB | 12/25 kB 
Progress (2): 4.6 kB | 16/25 kB
Progress (2): 4.6 kB | 20/25 kB
Progress (2): 4.6 kB | 24/25 kB
Progress (2): 4.6 kB | 25 kB   
Progress (3): 4.6 kB | 25 kB | 4.1/18 kB
Progress (3): 4.6 kB | 25 kB | 7.7/18 kB
Progress (3): 4.6 kB | 25 kB | 12/18 kB 
Progress (3): 4.6 kB | 25 kB | 16/18 kB
Progress (3): 4.6 kB | 25 kB | 18 kB   
                                    
Downloaded from eclipse.maven.central.mirror: https://repo.eclipse.org/content/repositories/maven_central/org/codehaus/plexus/plexus-compiler-manager/2.2/plexus-compiler-manager-2.2.jar (4.6 kB at 109 kB/s)
Progress (3): 25 kB | 18 kB | 3.5 kB
Progress (4): 25 kB | 18 kB | 3.5 kB | 0/2.8 MB
Progress (4): 25 kB | 18 kB | 3.5 kB | 0/2.8 MB
Progress (4): 25 kB | 18 kB | 3.5 kB | 0/2.8 MB
Progress (4): 25 kB | 18 kB | 3.5 kB | 0/2.8 MB
                                               
Downloaded from eclipse.maven.central.mirror: https://repo.eclipse.org/content/repositories/maven_central/org/eclipse/tycho/tycho-compiler-jdt/1.4.0/tycho-compiler-jdt-1.4.0.jar (18 kB at 394 kB/s)
Progress (3): 25 kB | 3.5 kB | 0/2.8 MB
                                       
Downloaded from eclipse.maven.central.mirror: https://repo.eclipse.org/content/repositories/maven_central/org/codehaus/plexus/plexus-compiler-api/2.2/plexus-compiler-api-2.2.jar (25 kB at 521 kB/s)
Progress (2): 3.5 kB | 0/2.8 MB
Progress (2): 3.5 kB | 0/2.8 MB
Progress (2): 3.5 kB | 0/2.8 MB
Progress (2): 3.5 kB | 0/2.8 MB
Progress (2): 3.5 kB | 0/2.8 MB
Progress (2): 3.5 kB | 0/2.8 MB
Progress (2): 3.5 kB | 0/2.8 MB
Progress (2): 3.5 kB | 0.1/2.8 MB
Progress (2): 3.5 kB | 0.1/2.8 MB
Progress (2): 3.5 kB | 0.1/2.8 MB
Progress (2): 3.5 kB | 0.1/2.8 MB
Progress (2): 3.5 kB | 0.1/2.8 MB
Progress (2): 3.5 kB | 0.1/2.8 MB
Progress (2): 3.5 kB | 0.1/2.8 MB
Progress (2): 3.5 kB | 0.1/2.8 MB
Progress (2): 3.5 kB | 0.1/2.8 MB
Progress (2): 3.5 kB | 0.1/2.8 MB
Progress (2): 3.5 kB | 0.1/2.8 MB
Progress (2): 3.5 kB | 0.1/2.8 MB
Progress (2): 3.5 kB | 0.1/2.8 MB
Progress (2): 3.5 kB | 0.1/2.8 MB
Progress (2): 3.5 kB | 0.1/2.8 MB
Progress (2): 3.5 kB | 0.1/2.8 MB
Progress (2): 3.5 kB | 0.1/2.8 MB
Progress (2): 3.5 kB | 0.1/2.8 MB
Progress (2): 3.5 kB | 0.1/2.8 MB
Progress (2): 3.5 kB | 0.1/2.8 MB
Progress (2): 3.5 kB | 0.1/2.8 MB
Progress (2): 3.5 kB | 0.1/2.8 MB
Progress (2): 3.5 kB | 0.1/2.8 MB
Progress (2): 3.5 kB | 0.1/2.8 MB
Progress (2): 3.5 kB | 0.1/2.8 MB
Progress (2): 3.5 kB | 0.1/2.8 MB
                                 
Downloaded from eclipse.maven.central.mirror: https://repo.eclipse.org/content/repositories/maven_central/org/eclipse/tycho/tycho-lib-detector/1.4.0/tycho-lib-detector-1.4.0.jar (3.5 kB at 66 kB/s)
Progress (1): 0.2/2.8 MB
Progress (1): 0.2/2.8 MB
Progress (1): 0.2/2.8 MB
Progress (1): 0.2/2.8 MB
Progress (1): 0.2/2.8 MB
Progress (1): 0.2/2.8 MB
Progress (1): 0.2/2.8 MB
Progress (1): 0.2/2.8 MB
Progress (1): 0.2/2.8 MB
Progress (1): 0.2/2.8 MB
Progress (1): 0.2/2.8 MB
Progress (1): 0.2/2.8 MB
Progress (1): 0.2/2.8 MB
Progress (1): 0.2/2.8 MB
Progress (1): 0.2/2.8 MB
Progress (1): 0.2/2.8 MB
Progress (1): 0.2/2.8 MB
Progress (1): 0.2/2.8 MB
Progress (1): 0.2/2.8 MB
Progress (1): 0.2/2.8 MB
Progress (1): 0.2/2.8 MB
Progress (1): 0.2/2.8 MB
Progress (1): 0.2/2.8 MB
Progress (1): 0.2/2.8 MB
Progress (1): 0.2/2.8 MB
Progress (1): 0.3/2.8 MB
Progress (1): 0.3/2.8 MB
Progress (1): 0.3/2.8 MB
Progress (1): 0.3/2.8 MB
Progress (1): 0.3/2.8 MB
Progress (1): 0.3/2.8 MB
Progress (1): 0.3/2.8 MB
Progress (1): 0.3/2.8 MB
Progress (1): 0.3/2.8 MB
Progress (1): 0.3/2.8 MB
Progress (1): 0.3/2.8 MB
Progress (1): 0.3/2.8 MB
Progress (1): 0.3/2.8 MB
Progress (1): 0.3/2.8 MB
Progress (1): 0.3/2.8 MB
Progress (1): 0.3/2.8 MB
Progress (1): 0.3/2.8 MB
Progress (1): 0.3/2.8 MB
Progress (1): 0.3/2.8 MB
Progress (1): 0.3/2.8 MB
Progress (1): 0.3/2.8 MB
Progress (1): 0.3/2.8 MB
Progress (1): 0.3/2.8 MB
Progress (1): 0.3/2.8 MB
Progress (1): 0.3/2.8 MB
Progress (1): 0.4/2.8 MB
Progress (1): 0.4/2.8 MB
Progress (1): 0.4/2.8 MB
Progress (1): 0.4/2.8 MB
Progress (1): 0.4/2.8 MB
Progress (1): 0.4/2.8 MB
Progress (1): 0.4/2.8 MB
Progress (1): 0.4/2.8 MB
Progress (1): 0.4/2.8 MB
Progress (1): 0.4/2.8 MB
Progress (1): 0.4/2.8 MB
Progress (1): 0.4/2.8 MB
Progress (1): 0.4/2.8 MB
Progress (1): 0.4/2.8 MB
Progress (1): 0.4/2.8 MB
Progress (1): 0.4/2.8 MB
Progress (1): 0.4/2.8 MB
Progress (1): 0.4/2.8 MB
Progress (1): 0.4/2.8 MB
Progress (1): 0.4/2.8 MB
Progress (1): 0.4/2.8 MB
Progress (1): 0.4/2.8 MB
Progress (1): 0.4/2.8 MB
Progress (1): 0.4/2.8 MB
Progress (1): 0.4/2.8 MB
Progress (1): 0.5/2.8 MB
Progress (1): 0.5/2.8 MB
Progress (1): 0.5/2.8 MB
Progress (1): 0.5/2.8 MB
Progress (1): 0.5/2.8 MB
Progress (1): 0.5/2.8 MB
Progress (1): 0.5/2.8 MB
Progress (1): 0.5/2.8 MB
Progress (1): 0.5/2.8 MB
Progress (1): 0.5/2.8 MB
Progress (1): 0.5/2.8 MB
Progress (1): 0.5/2.8 MB
Progress (1): 0.5/2.8 MB
Progress (1): 0.5/2.8 MB
Progress (1): 0.5/2.8 MB
Progress (1): 0.5/2.8 MB
Progress (1): 0.5/2.8 MB
Progress (1): 0.5/2.8 MB
Progress (1): 0.5/2.8 MB
Progress (1): 0.5/2.8 MB
Progress (1): 0.5/2.8 MB
Progress (1): 0.5/2.8 MB
Progress (1): 0.5/2.8 MB
Progress (1): 0.5/2.8 MB
Progress (1): 0.5/2.8 MB
Progress (1): 0.6/2.8 MB
Progress (1): 0.6/2.8 MB
Progress (1): 0.6/2.8 MB
Progress (1): 0.6/2.8 MB
Progress (1): 0.6/2.8 MB
Progress (1): 0.6/2.8 MB
Progress (1): 0.6/2.8 MB
Progress (1): 0.6/2.8 MB
Progress (1): 0.6/2.8 MB
Progress (1): 0.6/2.8 MB
Progress (1): 0.6/2.8 MB
Progress (1): 0.6/2.8 MB
Progress (1): 0.6/2.8 MB
Progress (1): 0.6/2.8 MB
Progress (1): 0.6/2.8 MB
Progress (1): 0.6/2.8 MB
Progress (1): 0.6/2.8 MB
Progress (1): 0.6/2.8 MB
Progress (1): 0.6/2.8 MB
Progress (1): 0.6/2.8 MB
Progress (1): 0.6/2.8 MB
Progress (1): 0.6/2.8 MB
Progress (1): 0.6/2.8 MB
Progress (1): 0.6/2.8 MB
Progress (1): 0.6/2.8 MB
Progress (1): 0.7/2.8 MB
Progress (1): 0.7/2.8 MB
Progress (1): 0.7/2.8 MB
Progress (1): 0.7/2.8 MB
Progress (1): 0.7/2.8 MB
Progress (1): 0.7/2.8 MB
Progress (1): 0.7/2.8 MB
Progress (1): 0.7/2.8 MB
Progress (1): 0.7/2.8 MB
Progress (1): 0.7/2.8 MB
Progress (1): 0.7/2.8 MB
Progress (1): 0.7/2.8 MB
Progress (1): 0.7/2.8 MB
Progress (1): 0.7/2.8 MB
Progress (1): 0.7/2.8 MB
Progress (1): 0.7/2.8 MB
Progress (1): 0.7/2.8 MB
Progress (1): 0.7/2.8 MB
Progress (1): 0.7/2.8 MB
Progress (1): 0.7/2.8 MB
Progress (1): 0.7/2.8 MB
Progress (1): 0.7/2.8 MB
Progress (1): 0.7/2.8 MB
Progress (1): 0.7/2.8 MB
Progress (1): 0.7/2.8 MB
Progress (1): 0.8/2.8 MB
Progress (1): 0.8/2.8 MB
Progress (1): 0.8/2.8 MB
Progress (1): 0.8/2.8 MB
Progress (1): 0.8/2.8 MB
Progress (1): 0.8/2.8 MB
Progress (1): 0.8/2.8 MB
Progress (1): 0.8/2.8 MB
Progress (1): 0.8/2.8 MB
Progress (1): 0.8/2.8 MB
Progress (1): 0.8/2.8 MB
Progress (1): 0.8/2.8 MB
Progress (1): 0.8/2.8 MB
Progress (1): 0.8/2.8 MB
Progress (1): 0.8/2.8 MB
Progress (1): 0.8/2.8 MB
Progress (1): 0.8/2.8 MB
Progress (1): 0.8/2.8 MB
Progress (1): 0.8/2.8 MB
Progress (1): 0.8/2.8 MB
Progress (1): 0.8/2.8 MB
Progress (1): 0.8/2.8 MB
Progress (1): 0.8/2.8 MB
Progress (1): 0.8/2.8 MB
Progress (1): 0.8/2.8 MB
Progress (1): 0.9/2.8 MB
Progress (1): 0.9/2.8 MB
Progress (1): 0.9/2.8 MB
Progress (1): 0.9/2.8 MB
Progress (1): 0.9/2.8 MB
Progress (1): 0.9/2.8 MB
Progress (1): 0.9/2.8 MB
Progress (1): 0.9/2.8 MB
Progress (1): 0.9/2.8 MB
Progress (1): 0.9/2.8 MB
Progress (1): 0.9/2.8 MB
Progress (1): 0.9/2.8 MB
Progress (1): 0.9/2.8 MB
Progress (1): 0.9/2.8 MB
Progress (1): 0.9/2.8 MB
Progress (1): 0.9/2.8 MB
Progress (1): 0.9/2.8 MB
Progress (1): 0.9/2.8 MB
Progress (1): 0.9/2.8 MB
Progress (1): 0.9/2.8 MB
Progress (1): 0.9/2.8 MB
Progress (1): 0.9/2.8 MB
Progress (1): 0.9/2.8 MB
Progress (1): 0.9/2.8 MB
Progress (1): 0.9/2.8 MB
Progress (1): 1.0/2.8 MB
Progress (1): 1.0/2.8 MB
Progress (1): 1.0/2.8 MB
Progress (1): 1.0/2.8 MB
Progress (1): 1.0/2.8 MB
Progress (1): 1.0/2.8 MB
Progress (1): 1.0/2.8 MB
Progress (1): 1.0/2.8 MB
Progress (1): 1.0/2.8 MB
Progress (1): 1.0/2.8 MB
Progress (1): 1.0/2.8 MB
Progress (1): 1.0/2.8 MB
Progress (1): 1.0/2.8 MB
Progress (1): 1.0/2.8 MB
Progress (1): 1.0/2.8 MB
Progress (1): 1.0/2.8 MB
Progress (1): 1.0/2.8 MB
Progress (1): 1.0/2.8 MB
Progress (1): 1.0/2.8 MB
Progress (1): 1.0/2.8 MB
Progress (1): 1.0/2.8 MB
Progress (1): 1.0/2.8 MB
Progress (1): 1.0/2.8 MB
Progress (1): 1.0/2.8 MB
Progress (1): 1.0/2.8 MB
Progress (1): 1.1/2.8 MB
Progress (1): 1.1/2.8 MB
Progress (1): 1.1/2.8 MB
Progress (1): 1.1/2.8 MB
Progress (1): 1.1/2.8 MB
Progress (1): 1.1/2.8 MB
Progress (1): 1.1/2.8 MB
Progress (1): 1.1/2.8 MB
Progress (1): 1.1/2.8 MB
Progress (1): 1.1/2.8 MB
Progress (1): 1.1/2.8 MB
Progress (1): 1.1/2.8 MB
Progress (1): 1.1/2.8 MB
Progress (1): 1.1/2.8 MB
Progress (1): 1.1/2.8 MB
Progress (1): 1.1/2.8 MB
Progress (1): 1.1/2.8 MB
Progress (1): 1.1/2.8 MB
Progress (1): 1.1/2.8 MB
Progress (1): 1.1/2.8 MB
Progress (1): 1.1/2.8 MB
Progress (1): 1.1/2.8 MB
Progress (1): 1.1/2.8 MB
Progress (1): 1.1/2.8 MB
Progress (1): 1.1/2.8 MB
Progress (1): 1.2/2.8 MB
Progress (1): 1.2/2.8 MB
Progress (1): 1.2/2.8 MB
Progress (1): 1.2/2.8 MB
Progress (1): 1.2/2.8 MB
Progress (1): 1.2/2.8 MB
Progress (1): 1.2/2.8 MB
Progress (1): 1.2/2.8 MB
Progress (1): 1.2/2.8 MB
Progress (1): 1.2/2.8 MB
Progress (1): 1.2/2.8 MB
Progress (1): 1.2/2.8 MB
Progress (1): 1.2/2.8 MB
Progress (1): 1.2/2.8 MB
Progress (1): 1.2/2.8 MB
Progress (1): 1.2/2.8 MB
Progress (1): 1.2/2.8 MB
Progress (1): 1.2/2.8 MB
Progress (1): 1.2/2.8 MB
Progress (1): 1.2/2.8 MB
Progress (1): 1.2/2.8 MB
Progress (1): 1.2/2.8 MB
Progress (1): 1.2/2.8 MB
Progress (1): 1.2/2.8 MB
Progress (1): 1.2/2.8 MB
Progress (1): 1.3/2.8 MB
Progress (1): 1.3/2.8 MB
Progress (1): 1.3/2.8 MB
Progress (1): 1.3/2.8 MB
Progress (1): 1.3/2.8 MB
Progress (1): 1.3/2.8 MB
Progress (1): 1.3/2.8 MB
Progress (1): 1.3/2.8 MB
Progress (1): 1.3/2.8 MB
Progress (1): 1.3/2.8 MB
Progress (1): 1.3/2.8 MB
Progress (1): 1.3/2.8 MB
Progress (1): 1.3/2.8 MB
Progress (1): 1.3/2.8 MB
Progress (1): 1.3/2.8 MB
Progress (1): 1.3/2.8 MB
Progress (1): 1.3/2.8 MB
Progress (1): 1.3/2.8 MB
Progress (1): 1.3/2.8 MB
Progress (1): 1.3/2.8 MB
Progress (1): 1.3/2.8 MB
Progress (1): 1.3/2.8 MB
Progress (1): 1.3/2.8 MB
Progress (1): 1.3/2.8 MB
Progress (1): 1.3/2.8 MB
Progress (1): 1.4/2.8 MB
Progress (1): 1.4/2.8 MB
Progress (1): 1.4/2.8 MB
Progress (1): 1.4/2.8 MB
Progress (1): 1.4/2.8 MB
Progress (1): 1.4/2.8 MB
Progress (1): 1.4/2.8 MB
Progress (1): 1.4/2.8 MB
Progress (1): 1.4/2.8 MB
Progress (1): 1.4/2.8 MB
Progress (1): 1.4/2.8 MB
Progress (1): 1.4/2.8 MB
Progress (1): 1.4/2.8 MB
Progress (1): 1.4/2.8 MB
Progress (1): 1.4/2.8 MB
Progress (1): 1.4/2.8 MB
Progress (1): 1.4/2.8 MB
Progress (1): 1.4/2.8 MB
Progress (1): 1.4/2.8 MB
Progress (1): 1.4/2.8 MB
Progress (1): 1.4/2.8 MB
Progress (1): 1.4/2.8 MB
Progress (1): 1.4/2.8 MB
Progress (1): 1.4/2.8 MB
Progress (1): 1.4/2.8 MB
Progress (1): 1.5/2.8 MB
Progress (1): 1.5/2.8 MB
Progress (1): 1.5/2.8 MB
Progress (1): 1.5/2.8 MB
Progress (1): 1.5/2.8 MB
Progress (1): 1.5/2.8 MB
Progress (1): 1.5/2.8 MB
Progress (1): 1.5/2.8 MB
Progress (1): 1.5/2.8 MB
Progress (1): 1.5/2.8 MB
Progress (1): 1.5/2.8 MB
Progress (1): 1.5/2.8 MB
Progress (1): 1.5/2.8 MB
Progress (1): 1.5/2.8 MB
Progress (1): 1.5/2.8 MB
Progress (1): 1.5/2.8 MB
Progress (1): 1.5/2.8 MB
Progress (1): 1.5/2.8 MB
Progress (1): 1.5/2.8 MB
Progress (1): 1.5/2.8 MB
Progress (1): 1.5/2.8 MB
Progress (1): 1.5/2.8 MB
Progress (1): 1.5/2.8 MB
Progress (1): 1.5/2.8 MB
Progress (1): 1.5/2.8 MB
Progress (1): 1.6/2.8 MB
Progress (1): 1.6/2.8 MB
Progress (1): 1.6/2.8 MB
Progress (1): 1.6/2.8 MB
Progress (1): 1.6/2.8 MB
Progress (1): 1.6/2.8 MB
Progress (1): 1.6/2.8 MB
Progress (1): 1.6/2.8 MB
Progress (1): 1.6/2.8 MB
Progress (1): 1.6/2.8 MB
Progress (1): 1.6/2.8 MB
Progress (1): 1.6/2.8 MB
Progress (1): 1.6/2.8 MB
Progress (1): 1.6/2.8 MB
Progress (1): 1.6/2.8 MB
Progress (1): 1.6/2.8 MB
Progress (1): 1.6/2.8 MB
Progress (1): 1.6/2.8 MB
Progress (1): 1.6/2.8 MB
Progress (1): 1.6/2.8 MB
Progress (1): 1.6/2.8 MB
Progress (1): 1.6/2.8 MB
Progress (1): 1.6/2.8 MB
Progress (1): 1.6/2.8 MB
Progress (1): 1.6/2.8 MB
Progress (1): 1.7/2.8 MB
Progress (1): 1.7/2.8 MB
Progress (1): 1.7/2.8 MB
Progress (1): 1.7/2.8 MB
Progress (1): 1.7/2.8 MB
Progress (1): 1.7/2.8 MB
Progress (1): 1.7/2.8 MB
Progress (1): 1.7/2.8 MB
Progress (1): 1.7/2.8 MB
Progress (1): 1.7/2.8 MB
Progress (1): 1.7/2.8 MB
Progress (1): 1.7/2.8 MB
Progress (1): 1.7/2.8 MB
Progress (1): 1.7/2.8 MB
Progress (1): 1.7/2.8 MB
Progress (1): 1.7/2.8 MB
Progress (1): 1.7/2.8 MB
Progress (1): 1.7/2.8 MB
Progress (1): 1.7/2.8 MB
Progress (1): 1.7/2.8 MB
Progress (1): 1.7/2.8 MB
Progress (1): 1.7/2.8 MB
Progress (1): 1.7/2.8 MB
Progress (1): 1.7/2.8 MB
Progress (1): 1.7/2.8 MB
Progress (1): 1.8/2.8 MB
Progress (1): 1.8/2.8 MB
Progress (1): 1.8/2.8 MB
Progress (1): 1.8/2.8 MB
Progress (1): 1.8/2.8 MB
Progress (1): 1.8/2.8 MB
Progress (1): 1.8/2.8 MB
Progress (1): 1.8/2.8 MB
Progress (1): 1.8/2.8 MB
Progress (1): 1.8/2.8 MB
Progress (1): 1.8/2.8 MB
Progress (1): 1.8/2.8 MB
Progress (1): 1.8/2.8 MB
Progress (1): 1.8/2.8 MB
Progress (1): 1.8/2.8 MB
Progress (1): 1.8/2.8 MB
Progress (1): 1.8/2.8 MB
Progress (1): 1.8/2.8 MB
Progress (1): 1.8/2.8 MB
Progress (1): 1.8/2.8 MB
Progress (1): 1.8/2.8 MB
Progress (1): 1.8/2.8 MB
Progress (1): 1.8/2.8 MB
Progress (1): 1.8/2.8 MB
Progress (1): 1.8/2.8 MB
Progress (1): 1.9/2.8 MB
Progress (1): 1.9/2.8 MB
Progress (1): 1.9/2.8 MB
Progress (1): 1.9/2.8 MB
Progress (1): 1.9/2.8 MB
Progress (1): 1.9/2.8 MB
Progress (1): 1.9/2.8 MB
Progress (1): 1.9/2.8 MB
Progress (1): 1.9/2.8 MB
Progress (1): 1.9/2.8 MB
Progress (1): 1.9/2.8 MB
Progress (1): 1.9/2.8 MB
Progress (1): 1.9/2.8 MB
Progress (1): 1.9/2.8 MB
Progress (1): 1.9/2.8 MB
Progress (1): 1.9/2.8 MB
Progress (1): 1.9/2.8 MB
Progress (1): 1.9/2.8 MB
Progress (1): 1.9/2.8 MB
Progress (1): 1.9/2.8 MB
Progress (1): 1.9/2.8 MB
Progress (1): 1.9/2.8 MB
Progress (1): 1.9/2.8 MB
Progress (1): 1.9/2.8 MB
Progress (1): 1.9/2.8 MB
Progress (1): 2.0/2.8 MB
Progress (1): 2.0/2.8 MB
Progress (1): 2.0/2.8 MB
Progress (1): 2.0/2.8 MB
Progress (1): 2.0/2.8 MB
Progress (1): 2.0/2.8 MB
Progress (1): 2.0/2.8 MB
Progress (1): 2.0/2.8 MB
Progress (1): 2.0/2.8 MB
Progress (1): 2.0/2.8 MB
Progress (1): 2.0/2.8 MB
Progress (1): 2.0/2.8 MB
Progress (1): 2.0/2.8 MB
Progress (1): 2.0/2.8 MB
Progress (1): 2.0/2.8 MB
Progress (1): 2.0/2.8 MB
Progress (1): 2.0/2.8 MB
Progress (1): 2.0/2.8 MB
Progress (1): 2.0/2.8 MB
Progress (1): 2.0/2.8 MB
Progress (1): 2.0/2.8 MB
Progress (1): 2.0/2.8 MB
Progress (1): 2.0/2.8 MB
Progress (1): 2.0/2.8 MB
Progress (1): 2.0/2.8 MB
Progress (1): 2.1/2.8 MB
Progress (1): 2.1/2.8 MB
Progress (1): 2.1/2.8 MB
Progress (1): 2.1/2.8 MB
Progress (1): 2.1/2.8 MB
Progress (1): 2.1/2.8 MB
Progress (1): 2.1/2.8 MB
Progress (1): 2.1/2.8 MB
Progress (1): 2.1/2.8 MB
Progress (1): 2.1/2.8 MB
Progress (1): 2.1/2.8 MB
Progress (1): 2.1/2.8 MB
Progress (1): 2.1/2.8 MB
Progress (1): 2.1/2.8 MB
Progress (1): 2.1/2.8 MB
Progress (1): 2.1/2.8 MB
Progress (1): 2.1/2.8 MB
Progress (1): 2.1/2.8 MB
Progress (1): 2.1/2.8 MB
Progress (1): 2.1/2.8 MB
Progress (1): 2.1/2.8 MB
Progress (1): 2.1/2.8 MB
Progress (1): 2.1/2.8 MB
Progress (1): 2.1/2.8 MB
Progress (1): 2.1/2.8 MB
Progress (1): 2.2/2.8 MB
Progress (1): 2.2/2.8 MB
Progress (1): 2.2/2.8 MB
Progress (1): 2.2/2.8 MB
Progress (1): 2.2/2.8 MB
Progress (1): 2.2/2.8 MB
Progress (1): 2.2/2.8 MB
Progress (1): 2.2/2.8 MB
Progress (1): 2.2/2.8 MB
Progress (1): 2.2/2.8 MB
Progress (1): 2.2/2.8 MB
Progress (1): 2.2/2.8 MB
Progress (1): 2.2/2.8 MB
Progress (1): 2.2/2.8 MB
Progress (1): 2.2/2.8 MB
Progress (1): 2.2/2.8 MB
Progress (1): 2.2/2.8 MB
Progress (1): 2.2/2.8 MB
Progress (1): 2.2/2.8 MB
Progress (1): 2.2/2.8 MB
Progress (1): 2.2/2.8 MB
Progress (1): 2.2/2.8 MB
Progress (1): 2.2/2.8 MB
Progress (1): 2.2/2.8 MB
Progress (1): 2.2/2.8 MB
Progress (1): 2.3/2.8 MB
Progress (1): 2.3/2.8 MB
Progress (1): 2.3/2.8 MB
Progress (1): 2.3/2.8 MB
Progress (1): 2.3/2.8 MB
Progress (1): 2.3/2.8 MB
Progress (1): 2.3/2.8 MB
Progress (1): 2.3/2.8 MB
Progress (1): 2.3/2.8 MB
Progress (1): 2.3/2.8 MB
Progress (1): 2.3/2.8 MB
Progress (1): 2.3/2.8 MB
Progress (1): 2.3/2.8 MB
Progress (1): 2.3/2.8 MB
Progress (1): 2.3/2.8 MB
Progress (1): 2.3/2.8 MB
Progress (1): 2.3/2.8 MB
Progress (1): 2.3/2.8 MB
Progress (1): 2.3/2.8 MB
Progress (1): 2.3/2.8 MB
Progress (1): 2.3/2.8 MB
Progress (1): 2.3/2.8 MB
Progress (1): 2.3/2.8 MB
Progress (1): 2.3/2.8 MB
Progress (1): 2.3/2.8 MB
Progress (1): 2.4/2.8 MB
Progress (1): 2.4/2.8 MB
Progress (1): 2.4/2.8 MB
Progress (1): 2.4/2.8 MB
Progress (1): 2.4/2.8 MB
Progress (1): 2.4/2.8 MB
Progress (1): 2.4/2.8 MB
Progress (1): 2.4/2.8 MB
Progress (1): 2.4/2.8 MB
Progress (1): 2.4/2.8 MB
Progress (1): 2.4/2.8 MB
Progress (1): 2.4/2.8 MB
Progress (1): 2.4/2.8 MB
Progress (1): 2.4/2.8 MB
Progress (1): 2.4/2.8 MB
Progress (1): 2.4/2.8 MB
Progress (1): 2.4/2.8 MB
Progress (1): 2.4/2.8 MB
Progress (1): 2.4/2.8 MB
Progress (1): 2.4/2.8 MB
Progress (1): 2.4/2.8 MB
Progress (1): 2.4/2.8 MB
Progress (1): 2.4/2.8 MB
Progress (1): 2.4/2.8 MB
Progress (1): 2.4/2.8 MB
Progress (1): 2.5/2.8 MB
Progress (1): 2.5/2.8 MB
Progress (1): 2.5/2.8 MB
Progress (1): 2.5/2.8 MB
Progress (1): 2.5/2.8 MB
Progress (1): 2.5/2.8 MB
Progress (1): 2.5/2.8 MB
Progress (1): 2.5/2.8 MB
Progress (1): 2.5/2.8 MB
Progress (1): 2.5/2.8 MB
Progress (1): 2.5/2.8 MB
Progress (1): 2.5/2.8 MB
Progress (1): 2.5/2.8 MB
Progress (1): 2.5/2.8 MB
Progress (1): 2.5/2.8 MB
Progress (1): 2.5/2.8 MB
Progress (1): 2.5/2.8 MB
Progress (1): 2.5/2.8 MB
Progress (1): 2.5/2.8 MB
Progress (1): 2.5/2.8 MB
Progress (1): 2.5/2.8 MB
Progress (1): 2.5/2.8 MB
Progress (1): 2.5/2.8 MB
Progress (1): 2.5/2.8 MB
Progress (1): 2.5/2.8 MB
Progress (1): 2.6/2.8 MB
Progress (1): 2.6/2.8 MB
Progress (1): 2.6/2.8 MB
Progress (1): 2.6/2.8 MB
Progress (1): 2.6/2.8 MB
Progress (1): 2.6/2.8 MB
Progress (1): 2.6/2.8 MB
Progress (1): 2.6/2.8 MB
Progress (1): 2.6/2.8 MB
Progress (1): 2.6/2.8 MB
Progress (1): 2.6/2.8 MB
Progress (1): 2.6/2.8 MB
Progress (1): 2.6/2.8 MB
Progress (1): 2.6/2.8 MB
Progress (1): 2.6/2.8 MB
Progress (1): 2.6/2.8 MB
Progress (1): 2.6/2.8 MB
Progress (1): 2.6/2.8 MB
Progress (1): 2.6/2.8 MB
Progress (1): 2.6/2.8 MB
Progress (1): 2.6/2.8 MB
Progress (1): 2.6/2.8 MB
Progress (1): 2.6/2.8 MB
Progress (1): 2.6/2.8 MB
Progress (1): 2.6/2.8 MB
Progress (1): 2.7/2.8 MB
Progress (1): 2.7/2.8 MB
Progress (1): 2.7/2.8 MB
Progress (1): 2.7/2.8 MB
Progress (1): 2.7/2.8 MB
Progress (1): 2.7/2.8 MB
Progress (1): 2.7/2.8 MB
Progress (1): 2.7/2.8 MB
Progress (1): 2.7/2.8 MB
Progress (1): 2.7/2.8 MB
Progress (1): 2.7/2.8 MB
Progress (1): 2.7/2.8 MB
Progress (1): 2.7/2.8 MB
Progress (1): 2.7/2.8 MB
Progress (1): 2.7/2.8 MB
Progress (1): 2.7/2.8 MB
Progress (1): 2.7/2.8 MB
Progress (1): 2.7/2.8 MB
Progress (1): 2.7/2.8 MB
Progress (1): 2.7/2.8 MB
Progress (1): 2.7/2.8 MB
Progress (1): 2.7/2.8 MB
Progress (1): 2.7/2.8 MB
Progress (1): 2.7/2.8 MB
Progress (1): 2.7/2.8 MB
Progress (1): 2.8/2.8 MB
Progress (1): 2.8/2.8 MB
Progress (1): 2.8/2.8 MB
Progress (1): 2.8/2.8 MB
Progress (1): 2.8/2.8 MB
Progress (1): 2.8/2.8 MB
Progress (1): 2.8/2.8 MB
Progress (1): 2.8/2.8 MB
Progress (1): 2.8/2.8 MB
Progress (1): 2.8/2.8 MB
Progress (1): 2.8/2.8 MB
Progress (1): 2.8/2.8 MB
Progress (1): 2.8/2.8 MB
Progress (1): 2.8/2.8 MB
Progress (1): 2.8/2.8 MB
Progress (1): 2.8/2.8 MB
Progress (1): 2.8/2.8 MB
Progress (1): 2.8/2.8 MB
Progress (1): 2.8/2.8 MB
Progress (1): 2.8/2.8 MB
Progress (1): 2.8/2.8 MB
Progress (1): 2.8 MB    
                    
Downloaded from eclipse.maven.central.mirror: https://repo.eclipse.org/content/repositories/maven_central/org/eclipse/jdt/ecj/3.17.0/ecj-3.17.0.jar (2.8 MB at 1.1 MB/s)
[INFO] Compiling 46 source files to /jobs/genie.corrosion/corrosion/branches/master/workspace/org.eclipse.corrosion/target/classes
[WARNING] /jobs/genie.corrosion/corrosion/branches/master/workspace/org.eclipse.corrosion/src/org/eclipse/corrosion/snippet/Snippet.java:[62] 
	return new LSCompletionProposal(info.getDocument(), offset, item, info.getLanguageClient());
	                                                                       ^^^^^^^^^^^^^^^^^^^
The method getLanguageClient() from the type LanguageServiceAccessor.LSPDocumentInfo is deprecated
1 problem (1 warning)
[INFO] 
[INFO] --- maven-resources-plugin:2.4.3:testResources (default-testResources) @ org.eclipse.corrosion ---
[INFO] Using 'UTF-8' encoding to copy filtered resources.
[INFO] skip non existing resourceDirectory /jobs/genie.corrosion/corrosion/branches/master/workspace/org.eclipse.corrosion/src/test/resources
[INFO] 
[INFO] --- tycho-source-plugin:1.4.0:plugin-source (plugin-source) @ org.eclipse.corrosion ---
[INFO] Building jar: /jobs/genie.corrosion/corrosion/branches/master/workspace/org.eclipse.corrosion/target/org.eclipse.corrosion-0.4.1-SNAPSHOT-sources.jar
[INFO] 
[INFO] --- target-platform-configuration:1.4.0:target-platform (default-target-platform) @ org.eclipse.corrosion ---
[INFO] 
[INFO] --- tycho-packaging-plugin:1.4.0:package-plugin (default-package-plugin) @ org.eclipse.corrosion ---
[INFO] Building jar: /jobs/genie.corrosion/corrosion/branches/master/workspace/org.eclipse.corrosion/target/org.eclipse.corrosion-0.4.1-SNAPSHOT.jar
[INFO] 
[INFO] --- tycho-p2-plugin:1.4.0:p2-metadata-default (default-p2-metadata-default) @ org.eclipse.corrosion ---
[INFO] 
[INFO] --- tycho-pack200a-plugin:1.4.0:normalize (pack200-normalize) @ org.eclipse.corrosion ---
[INFO] Pack200 normalizing jar /jobs/genie.corrosion/corrosion/branches/master/workspace/org.eclipse.corrosion/target/org.eclipse.corrosion-0.4.1-SNAPSHOT.jar
[INFO] 
[INFO] --- eclipse-jarsigner-plugin:1.1.5:sign (sign) @ org.eclipse.corrosion ---
[INFO] Signing jar: /jobs/genie.corrosion/corrosion/branches/master/workspace/org.eclipse.corrosion/target/org.eclipse.corrosion-0.4.1-SNAPSHOT.jar
[INFO] Signing jar: /jobs/genie.corrosion/corrosion/branches/master/workspace/org.eclipse.corrosion/target/org.eclipse.corrosion-0.4.1-SNAPSHOT-sources.jar
[INFO] 
[INFO] --- tycho-pack200b-plugin:1.4.0:pack (pack200-pack) @ org.eclipse.corrosion ---
[INFO] Pack200 packing jar /jobs/genie.corrosion/corrosion/branches/master/workspace/org.eclipse.corrosion/target/org.eclipse.corrosion-0.4.1-SNAPSHOT.jar
[INFO] 
[INFO] --- tycho-p2-plugin:1.4.0:p2-metadata (p2-metadata) @ org.eclipse.corrosion ---
[WARNING] MavenProject: org.eclipse.corrosion:org.eclipse.corrosion:0.4.1-SNAPSHOT @ /jobs/genie.corrosion/corrosion/branches/master/workspace/org.eclipse.corrosion/pom.xml: baseline and build artifacts have same version but different contents
   no-classifier: different
      META-INF/ECLIPSE_.RSA: different
      META-INF/ECLIPSE_.SF: different
   classifier-sources: different
      META-INF/ECLIPSE_.RSA: different
      META-INF/ECLIPSE_.SF: different

[INFO] MavenProject: org.eclipse.corrosion:org.eclipse.corrosion:0.4.1-SNAPSHOT @ /jobs/genie.corrosion/corrosion/branches/master/workspace/org.eclipse.corrosion/pom.xml
    The main artifact has been replaced with the baseline version.
    The following attached artifacts have been replaced with the baseline version: [pack200, sources]

[INFO] 
[INFO] --- tycho-p2-extras-plugin:1.4.0:compare-version-with-baselines (compare-version-with-baseline) @ org.eclipse.corrosion ---
[INFO] Fetching p2.index from http://download.eclipse.org/corrosion/releases/latest/
[INFO] Fetching p2.index from http://download.eclipse.org/corrosion/releases/latest/
[INFO] Adding repository http://download.eclipse.org/corrosion/releases/latest
[INFO] Fetching content.xml.xz from http://download.eclipse.org/corrosion/releases/latest/
[INFO] Fetching content.xml.xz from http://download.eclipse.org/corrosion/releases/latest/
[INFO] Fetching org.eclipse.corrosion_0.4.0.201903131727.jar.pack.gz from http://download.eclipse.org/corrosion/releases/latest/plugins/ (77.08kB)
[INFO] Fetching org.eclipse.corrosion_0.4.0.201903131727.jar.pack.gz from http://download.eclipse.org/corrosion/releases/latest/plugins/ (77.08kB)
[INFO] Fetching org.eclipse.corrosion.source_0.4.0.201903131727.jar from http://download.eclipse.org/corrosion/releases/latest/plugins/ (86.21kB)
[INFO] Fetching org.eclipse.corrosion.source_0.4.0.201903131727.jar from http://download.eclipse.org/corrosion/releases/latest/plugins/ (86.21kB)
[INFO] 
[INFO] ---------< org.eclipse.corrosion:org.eclipse.corrosion.tests >----------
[INFO] Building org.eclipse.corrosion.tests 0.4.0-SNAPSHOT                [4/6]
[INFO] ------------------------[ eclipse-test-plugin ]-------------------------
[INFO] 
[INFO] --- maven-clean-plugin:2.5:clean (default-clean) @ org.eclipse.corrosion.tests ---
[INFO] 
[INFO] --- tycho-packaging-plugin:1.4.0:build-qualifier (default-build-qualifier) @ org.eclipse.corrosion.tests ---
[INFO] The project's OSGi version is 0.4.0.201901241750
[INFO] 
[INFO] --- tycho-packaging-plugin:1.4.0:validate-id (default-validate-id) @ org.eclipse.corrosion.tests ---
[INFO] 
[INFO] --- tycho-packaging-plugin:1.4.0:validate-version (default-validate-version) @ org.eclipse.corrosion.tests ---
[INFO] 
[INFO] --- jacoco-maven-plugin:0.8.3:prepare-agent (default) @ org.eclipse.corrosion.tests ---
[INFO] tycho.testArgLine set to -javaagent:/home/hudson/genie.corrosion/.jenkins/jobs/corrosion/branches/master/workspace/.m2/org/jacoco/org.jacoco.agent/0.8.3/org.jacoco.agent-0.8.3-runtime.jar=destfile=/jobs/genie.corrosion/corrosion/branches/master/workspace/org.eclipse.corrosion.tests/target/jacoco.exec,append=true,includes=org.eclipse.corrosion*
[INFO] 
[INFO] --- maven-resources-plugin:2.4.3:resources (default-resources) @ org.eclipse.corrosion.tests ---
[INFO] Using 'UTF-8' encoding to copy filtered resources.
[INFO] skip non existing resourceDirectory /jobs/genie.corrosion/corrosion/branches/master/workspace/org.eclipse.corrosion.tests/src/main/resources
[INFO] 
[INFO] --- tycho-compiler-plugin:1.4.0:compile (default-compile) @ org.eclipse.corrosion.tests ---
[INFO] Compiling 11 source files to /jobs/genie.corrosion/corrosion/branches/master/workspace/org.eclipse.corrosion.tests/target/classes
[WARNING] /jobs/genie.corrosion/corrosion/branches/master/workspace/org.eclipse.corrosion.tests/src/org/eclipse/corrosion/tests/TestIDEIntegration.java:[23] 
	import org.eclipse.ui.internal.genericeditor.ExtensionBasedTextEditor;
	       ^^^^^^^^^^^^^^^^^^^^^^^^^^^^^^^^^^^^^^^^^^^^^^^^^^^^^^^^^^^^^^
Discouraged access: The type 'ExtensionBasedTextEditor' is not API (restriction on classpath entry '/home/hudson/genie.corrosion/.jenkins/jobs/corrosion/branches/master/workspace/.m2/p2/osgi/bundle/org.eclipse.ui.genericeditor/1.1.300.v20190228-1402/org.eclipse.ui.genericeditor-1.1.300.v20190228-1402.jar')
[WARNING] /jobs/genie.corrosion/corrosion/branches/master/workspace/org.eclipse.corrosion.tests/src/org/eclipse/corrosion/tests/TestIDEIntegration.java:[34] 
	Assert.assertTrue(editor instanceof ExtensionBasedTextEditor);
	                                    ^^^^^^^^^^^^^^^^^^^^^^^^
Discouraged access: The type 'ExtensionBasedTextEditor' is not API (restriction on classpath entry '/home/hudson/genie.corrosion/.jenkins/jobs/corrosion/branches/master/workspace/.m2/p2/osgi/bundle/org.eclipse.ui.genericeditor/1.1.300.v20190228-1402/org.eclipse.ui.genericeditor-1.1.300.v20190228-1402.jar')
[WARNING] /jobs/genie.corrosion/corrosion/branches/master/workspace/org.eclipse.corrosion.tests/src/org/eclipse/corrosion/tests/TestIDEIntegration.java:[42] 
	Assert.assertTrue(editor instanceof ExtensionBasedTextEditor);
	                                    ^^^^^^^^^^^^^^^^^^^^^^^^
Discouraged access: The type 'ExtensionBasedTextEditor' is not API (restriction on classpath entry '/home/hudson/genie.corrosion/.jenkins/jobs/corrosion/branches/master/workspace/.m2/p2/osgi/bundle/org.eclipse.ui.genericeditor/1.1.300.v20190228-1402/org.eclipse.ui.genericeditor-1.1.300.v20190228-1402.jar')
[WARNING] /jobs/genie.corrosion/corrosion/branches/master/workspace/org.eclipse.corrosion.tests/src/org/eclipse/corrosion/tests/TestLSPIntegration.java:[30] 
	import org.eclipse.lsp4e.LanguageServiceAccessor;
	       ^^^^^^^^^^^^^^^^^^^^^^^^^^^^^^^^^^^^^^^^^
Discouraged access: The type 'LanguageServiceAccessor' is not API (restriction on classpath entry '/home/hudson/genie.corrosion/.jenkins/jobs/corrosion/branches/master/workspace/.m2/p2/osgi/bundle/org.eclipse.lsp4e/0.9.0.201903130753/org.eclipse.lsp4e-0.9.0.201903130753.jar')
[WARNING] /jobs/genie.corrosion/corrosion/branches/master/workspace/org.eclipse.corrosion.tests/src/org/eclipse/corrosion/tests/TestLSPIntegration.java:[53] 
	CompletableFuture<LanguageServer> languageServer = LanguageServiceAccessor
	                                                   ^^^^^^^^^^^^^^^^^^^^^^^
Discouraged access: The type 'LanguageServiceAccessor' is not API (restriction on classpath entry '/home/hudson/genie.corrosion/.jenkins/jobs/corrosion/branches/master/workspace/.m2/p2/osgi/bundle/org.eclipse.lsp4e/0.9.0.201903130753/org.eclipse.lsp4e-0.9.0.201903130753.jar')
[WARNING] /jobs/genie.corrosion/corrosion/branches/master/workspace/org.eclipse.corrosion.tests/src/org/eclipse/corrosion/tests/TestLSPIntegration.java:[54] 
	.getInitializedLanguageServers(rustFile, capabilities -> capabilities.getHoverProvider() != null)
	 ^^^^^^^^^^^^^^^^^^^^^^^^^^^^^
Discouraged access: The method 'LanguageServiceAccessor.getInitializedLanguageServers(IFile, Predicate<ServerCapabilities>)' is not API (restriction on classpath entry '/home/hudson/genie.corrosion/.jenkins/jobs/corrosion/branches/master/workspace/.m2/p2/osgi/bundle/org.eclipse.lsp4e/0.9.0.201903130753/org.eclipse.lsp4e-0.9.0.201903130753.jar')
6 problems (6 warnings)
[INFO] 
[INFO] --- maven-resources-plugin:2.4.3:testResources (default-testResources) @ org.eclipse.corrosion.tests ---
[INFO] Using 'UTF-8' encoding to copy filtered resources.
[INFO] skip non existing resourceDirectory /jobs/genie.corrosion/corrosion/branches/master/workspace/org.eclipse.corrosion.tests/src/test/resources
[INFO] 
[INFO] --- tycho-source-plugin:1.4.0:plugin-source (plugin-source) @ org.eclipse.corrosion.tests ---
[INFO] Building jar: /jobs/genie.corrosion/corrosion/branches/master/workspace/org.eclipse.corrosion.tests/target/org.eclipse.corrosion.tests-0.4.0-SNAPSHOT-sources.jar
[INFO] 
[INFO] --- target-platform-configuration:1.4.0:target-platform (default-target-platform) @ org.eclipse.corrosion.tests ---
[INFO] 
[INFO] --- tycho-packaging-plugin:1.4.0:package-plugin (default-package-plugin) @ org.eclipse.corrosion.tests ---
[INFO] Building jar: /jobs/genie.corrosion/corrosion/branches/master/workspace/org.eclipse.corrosion.tests/target/org.eclipse.corrosion.tests-0.4.0-SNAPSHOT.jar
[INFO] 
[INFO] --- tycho-p2-plugin:1.4.0:p2-metadata-default (default-p2-metadata-default) @ org.eclipse.corrosion.tests ---
[INFO] 
[INFO] --- tycho-pack200a-plugin:1.4.0:normalize (pack200-normalize) @ org.eclipse.corrosion.tests ---
[INFO] Pack200 normalizing jar /jobs/genie.corrosion/corrosion/branches/master/workspace/org.eclipse.corrosion.tests/target/org.eclipse.corrosion.tests-0.4.0-SNAPSHOT.jar
[INFO] 
[INFO] --- eclipse-jarsigner-plugin:1.1.5:sign (sign) @ org.eclipse.corrosion.tests ---
[INFO] Signing jar: /jobs/genie.corrosion/corrosion/branches/master/workspace/org.eclipse.corrosion.tests/target/org.eclipse.corrosion.tests-0.4.0-SNAPSHOT.jar
[INFO] Signing jar: /jobs/genie.corrosion/corrosion/branches/master/workspace/org.eclipse.corrosion.tests/target/org.eclipse.corrosion.tests-0.4.0-SNAPSHOT-sources.jar
[INFO] 
[INFO] --- tycho-pack200b-plugin:1.4.0:pack (pack200-pack) @ org.eclipse.corrosion.tests ---
[INFO] Pack200 packing jar /jobs/genie.corrosion/corrosion/branches/master/workspace/org.eclipse.corrosion.tests/target/org.eclipse.corrosion.tests-0.4.0-SNAPSHOT.jar
[INFO] 
[INFO] --- tycho-p2-plugin:1.4.0:p2-metadata (p2-metadata) @ org.eclipse.corrosion.tests ---
[INFO] No baseline version MavenProject: org.eclipse.corrosion:org.eclipse.corrosion.tests:0.4.0-SNAPSHOT @ /jobs/genie.corrosion/corrosion/branches/master/workspace/org.eclipse.corrosion.tests/pom.xml
[INFO] 
[INFO] --- tycho-surefire-plugin:1.4.0:test (default-test) @ org.eclipse.corrosion.tests ---
[INFO] Expected eclipse log file: /jobs/genie.corrosion/corrosion/branches/master/workspace/org.eclipse.corrosion.tests/target/work/data/.metadata/.log
[INFO] Command line:
	[/opt/public/common/java/oracle/jdk1.8.0_192_x64/jre/bin/java, -Dosgi.noShutdown=false, -Dosgi.os=linux, -Dosgi.ws=gtk, -Dosgi.arch=x86_64, -javaagent:/home/hudson/genie.corrosion/.jenkins/jobs/corrosion/branches/master/workspace/.m2/org/jacoco/org.jacoco.agent/0.8.3/org.jacoco.agent-0.8.3-runtime.jar=destfile=/jobs/genie.corrosion/corrosion/branches/master/workspace/org.eclipse.corrosion.tests/target/jacoco.exec,append=true,includes=org.eclipse.corrosion*, -Dosgi.clean=true, -jar, /jobs/genie.corrosion/corrosion/branches/master/workspace/.m2/p2/osgi/bundle/org.eclipse.equinox.launcher/1.5.300.v20190213-1655/org.eclipse.equinox.launcher-1.5.300.v20190213-1655.jar, -data, /jobs/genie.corrosion/corrosion/branches/master/workspace/org.eclipse.corrosion.tests/target/work/data, -install, /jobs/genie.corrosion/corrosion/branches/master/workspace/org.eclipse.corrosion.tests/target/work, -configuration, /jobs/genie.corrosion/corrosion/branches/master/workspace/org.eclipse.corrosion.tests/target/work/configuration, -application, org.eclipse.tycho.surefire.osgibooter.uitest, -testproperties, /jobs/genie.corrosion/corrosion/branches/master/workspace/org.eclipse.corrosion.tests/target/surefire.properties]
Picked up JAVA_TOOL_OPTIONS: -Xmx2G -Djava.io.tmpdir=/tmp/genie.corrosion
Running org.eclipse.corrosion.tests.AllTests
Jun 12, 2019 11:04:31 AM org.eclipse.lsp4j.jsonrpc.RemoteEndpoint notify
WARNING: Failed to send notification message.
org.eclipse.lsp4j.jsonrpc.JsonRpcException: java.io.IOException: Stream Closed
	at org.eclipse.lsp4j.jsonrpc.json.StreamMessageConsumer.consume(StreamMessageConsumer.java:72)
	at org.eclipse.lsp4e.LanguageServerWrapper.lambda$1(LanguageServerWrapper.java:213)
	at org.eclipse.lsp4j.jsonrpc.RemoteEndpoint.notify(RemoteEndpoint.java:126)
	at org.eclipse.lsp4j.jsonrpc.services.EndpointProxy.invoke(EndpointProxy.java:88)
	at com.sun.proxy.$Proxy34.didClose(Unknown Source)
	at org.eclipse.lsp4e.DocumentContentSynchronizer.lambda$3(DocumentContentSynchronizer.java:153)
	at java.util.concurrent.CompletableFuture.uniAccept(CompletableFuture.java:656)
	at java.util.concurrent.CompletableFuture$UniAccept.tryFire(CompletableFuture.java:632)
	at java.util.concurrent.CompletableFuture$Completion.exec(CompletableFuture.java:443)
	at java.util.concurrent.ForkJoinTask.doExec(ForkJoinTask.java:289)
	at java.util.concurrent.ForkJoinPool$WorkQueue.runTask(ForkJoinPool.java:1056)
	at java.util.concurrent.ForkJoinPool.runWorker(ForkJoinPool.java:1692)
	at java.util.concurrent.ForkJoinWorkerThread.run(ForkJoinWorkerThread.java:157)
Caused by: java.io.IOException: Stream Closed
	at java.io.FileOutputStream.writeBytes(Native Method)
	at java.io.FileOutputStream.write(FileOutputStream.java:326)
	at java.io.BufferedOutputStream.flushBuffer(BufferedOutputStream.java:82)
	at java.io.BufferedOutputStream.flush(BufferedOutputStream.java:140)
	at org.eclipse.lsp4j.jsonrpc.json.StreamMessageConsumer.consume(StreamMessageConsumer.java:69)
	... 12 more

Tests run: 25, Failures: 0, Errors: 1, Skipped: 0, Time elapsed: 26.562 s <<< FAILURE! - in org.eclipse.corrosion.tests.AllTests
testManifestEditorAssociation(org.eclipse.corrosion.tests.TestIDEIntegration)  Time elapsed: 4.348 s
testRustEditorAssociation(org.eclipse.corrosion.tests.TestIDEIntegration)  Time elapsed: 0.382 s
testRustSyntaxHighlighting(org.eclipse.corrosion.tests.TestSyntaxHighlighting)  Time elapsed: 0.723 s
testManifestSyntaxHighlighting(org.eclipse.corrosion.tests.TestSyntaxHighlighting)  Time elapsed: 0.424 s
testLSFound(org.eclipse.corrosion.tests.TestLSPIntegration)  Time elapsed: 1.265 s
testLSWorks(org.eclipse.corrosion.tests.TestLSPIntegration)  Time elapsed: 1.031 s
testCreateNewProjectOutOfWorkspace(org.eclipse.corrosion.tests.TestNewCargoProjectWizard)  Time elapsed: 0.972 s
testNewProjectPage(org.eclipse.corrosion.tests.TestNewCargoProjectWizard)  Time elapsed: 0.09 s
testCreateNewProject(org.eclipse.corrosion.tests.TestNewCargoProjectWizard)  Time elapsed: 0.843 s
testBasicRun(org.eclipse.corrosion.tests.TestRunConfiguration)  Time elapsed: 1.881 s
testFailOnDeletedProject(org.eclipse.corrosion.tests.TestRunConfiguration)  Time elapsed: 0.256 s
testFailOnNonCargoProject(org.eclipse.corrosion.tests.TestRunConfiguration)  Time elapsed: 0.105 s
testFailOnFakeProjectName(org.eclipse.corrosion.tests.TestRunConfiguration)  Time elapsed: 0.095 s
testTranslateVariablesInBuildCommand(org.eclipse.corrosion.tests.TestRunConfiguration)  Time elapsed: 0.982 s
testDebugLaunch(org.eclipse.corrosion.tests.TestDebugConfiguration)  Time elapsed: 4.62 s
testExportPageWithChangingProject(org.eclipse.corrosion.tests.TestExportCargoProjectWizard)  Time elapsed: 0.251 s
testExportProject(org.eclipse.corrosion.tests.TestExportCargoProjectWizard)  Time elapsed: 1.267 s
testExportPageWithNonCargoProject(org.eclipse.corrosion.tests.TestExportCargoProjectWizard)  Time elapsed: 0.293 s
testExportPageWithSelection(org.eclipse.corrosion.tests.TestExportCargoProjectWizard)  Time elapsed: 0.245 s
testBuildingMessages(org.eclipse.corrosion.tests.TestLSPExtensions)  Time elapsed: 0.05 s
testIndexingMessages(org.eclipse.corrosion.tests.TestLSPExtensions)  Time elapsed: 5.004 s  <<< ERROR!
java.lang.NullPointerException
	at org.eclipse.corrosion.tests.TestLSPExtensions.testIndexingMessages(TestLSPExtensions.java:64)

testCompletionsLimited(org.eclipse.corrosion.tests.TestSnippetContentAssistProcessor)  Time elapsed: 0.33 s
testSingleLineComment(org.eclipse.corrosion.tests.TestSnippetContentAssistProcessor)  Time elapsed: 0.343 s
testMultiLineComment(org.eclipse.corrosion.tests.TestSnippetContentAssistProcessor)  Time elapsed: 0.336 s
testCompletionsPresent(org.eclipse.corrosion.tests.TestSnippetContentAssistProcessor)  Time elapsed: 0.3 s

Results:

Errors: 
  TestLSPExtensions.testIndexingMessages:64 NullPointer

Tests run: 25, Failures: 0, Errors: 1, Skipped: 0

[ERROR] There are test failures.

Please refer to /jobs/genie.corrosion/corrosion/branches/master/workspace/org.eclipse.corrosion.tests/target/surefire-reports for the individual test results.
[INFO] 
[INFO] --- tycho-p2-extras-plugin:1.4.0:compare-version-with-baselines (compare-version-with-baseline) @ org.eclipse.corrosion.tests ---
[INFO] 
[INFO] --------< org.eclipse.corrosion:org.eclipse.corrosion.feature >---------
[INFO] Building org.eclipse.corrosion.feature 0.4.1-SNAPSHOT              [5/6]
[INFO] --------------------------[ eclipse-feature ]---------------------------
[INFO] 
[INFO] --- maven-clean-plugin:2.5:clean (default-clean) @ org.eclipse.corrosion.feature ---
[INFO] 
[INFO] --- tycho-packaging-plugin:1.4.0:build-qualifier-aggregator (default-build-qualifier-aggregator) @ org.eclipse.corrosion.feature ---
[INFO] The project's OSGi version is 0.4.1.201903251734
[INFO] 
[INFO] --- tycho-packaging-plugin:1.4.0:validate-id (default-validate-id) @ org.eclipse.corrosion.feature ---
[INFO] 
[INFO] --- tycho-packaging-plugin:1.4.0:validate-version (default-validate-version) @ org.eclipse.corrosion.feature ---
[INFO] 
[INFO] --- jacoco-maven-plugin:0.8.3:prepare-agent (default) @ org.eclipse.corrosion.feature ---
[INFO] argLine set to -javaagent:/home/hudson/genie.corrosion/.jenkins/jobs/corrosion/branches/master/workspace/.m2/org/jacoco/org.jacoco.agent/0.8.3/org.jacoco.agent-0.8.3-runtime.jar=destfile=/jobs/genie.corrosion/corrosion/branches/master/workspace/org.eclipse.corrosion.feature/target/jacoco.exec,append=true,includes=org.eclipse.corrosion*
[INFO] 
[INFO] --- tycho-source-plugin:1.4.0:plugin-source (plugin-source) @ org.eclipse.corrosion.feature ---
[INFO] 
[INFO] --- target-platform-configuration:1.4.0:target-platform (default-target-platform) @ org.eclipse.corrosion.feature ---
[INFO] 
[INFO] --- tycho-packaging-plugin:1.4.0:package-feature (default-package-feature) @ org.eclipse.corrosion.feature ---
[INFO] Building jar: /jobs/genie.corrosion/corrosion/branches/master/workspace/org.eclipse.corrosion.feature/target/org.eclipse.corrosion.feature-0.4.1-SNAPSHOT.jar
[INFO] 
[INFO] --- tycho-p2-plugin:1.4.0:p2-metadata-default (default-p2-metadata-default) @ org.eclipse.corrosion.feature ---
[INFO] 
[INFO] --- tycho-p2-plugin:1.4.0:feature-p2-metadata (default-feature-p2-metadata) @ org.eclipse.corrosion.feature ---
[INFO] 
[INFO] --- tycho-pack200a-plugin:1.4.0:normalize (pack200-normalize) @ org.eclipse.corrosion.feature ---
[INFO] 
[INFO] --- eclipse-jarsigner-plugin:1.1.5:sign (sign) @ org.eclipse.corrosion.feature ---
[INFO] Signing jar: /jobs/genie.corrosion/corrosion/branches/master/workspace/org.eclipse.corrosion.feature/target/org.eclipse.corrosion.feature-0.4.1-SNAPSHOT.jar
[INFO] 
[INFO] --- tycho-pack200b-plugin:1.4.0:pack (pack200-pack) @ org.eclipse.corrosion.feature ---
[INFO] 
[INFO] --- tycho-p2-plugin:1.4.0:p2-metadata (p2-metadata) @ org.eclipse.corrosion.feature ---
[WARNING] MavenProject: org.eclipse.corrosion:org.eclipse.corrosion.feature:0.4.1-SNAPSHOT @ /jobs/genie.corrosion/corrosion/branches/master/workspace/org.eclipse.corrosion.feature/pom.xml: baseline and build artifacts have same version but different contents
   no-classifier: different
      META-INF/ECLIPSE_.RSA: different

[INFO] MavenProject: org.eclipse.corrosion:org.eclipse.corrosion.feature:0.4.1-SNAPSHOT @ /jobs/genie.corrosion/corrosion/branches/master/workspace/org.eclipse.corrosion.feature/pom.xml
    The main artifact has been replaced with the baseline version.

[INFO] 
[INFO] --- tycho-p2-extras-plugin:1.4.0:compare-version-with-baselines (compare-version-with-baseline) @ org.eclipse.corrosion.feature ---
[INFO] Fetching org.eclipse.corrosion.feature_0.4.0.201903131727.jar from http://download.eclipse.org/corrosion/releases/latest/features/ (18.68kB)
[INFO] Fetching org.eclipse.corrosion.feature_0.4.0.201903131727.jar from http://download.eclipse.org/corrosion/releases/latest/features/ (18.68kB)
[INFO] 
[INFO] ------------------< org.eclipse.corrosion:repository >------------------
[INFO] Building repository 0.4.1-SNAPSHOT                                 [6/6]
[INFO] -------------------------[ eclipse-repository ]-------------------------
[INFO] 
[INFO] --- maven-clean-plugin:2.5:clean (default-clean) @ repository ---
[INFO] 
[INFO] --- tycho-packaging-plugin:1.4.0:build-qualifier-aggregator (default-build-qualifier-aggregator) @ repository ---
[INFO] The project's OSGi version is 0.4.1.201903251734
[INFO] 
[INFO] --- maven-clean-plugin:2.5:clean (default-clean-1) @ repository ---
[INFO] 
[INFO] --- jacoco-maven-plugin:0.8.3:prepare-agent (default) @ repository ---
[INFO] argLine set to -javaagent:/home/hudson/genie.corrosion/.jenkins/jobs/corrosion/branches/master/workspace/.m2/org/jacoco/org.jacoco.agent/0.8.3/org.jacoco.agent-0.8.3-runtime.jar=destfile=/jobs/genie.corrosion/corrosion/branches/master/workspace/repository/target/jacoco.exec,append=true,includes=org.eclipse.corrosion*
[INFO] 
[INFO] --- maven-resources-plugin:2.4.3:resources (default-resources) @ repository ---
[INFO] Using 'UTF-8' encoding to copy filtered resources.
[INFO] skip non existing resourceDirectory /jobs/genie.corrosion/corrosion/branches/master/workspace/repository/src/main/resources
[INFO] 
[INFO] --- tycho-source-plugin:1.4.0:plugin-source (plugin-source) @ repository ---
[INFO] 
[INFO] --- target-platform-configuration:1.4.0:target-platform (default-target-platform) @ repository ---
[INFO] 
[INFO] --- tycho-p2-publisher-plugin:1.4.0:publish-osgi-ee (default-publish-osgi-ee) @ repository ---
[INFO] Published profile IUs: [a.jre.javase 10.0.0, config.a.jre.javase 10.0.0]
[INFO] Published profile IUs: [a.jre.javase 11.0.0, config.a.jre.javase 11.0.0]
[INFO] 
[INFO] --- tycho-p2-publisher-plugin:1.4.0:publish-products (default-publish-products) @ repository ---
[INFO] 
[INFO] --- tycho-p2-publisher-plugin:1.4.0:publish-categories (default-publish-categories) @ repository ---
[INFO] 
[INFO] --- tycho-p2-publisher-plugin:1.4.0:attach-artifacts (default-attach-artifacts) @ repository ---
[INFO] 
[INFO] --- tycho-p2-repository-plugin:1.4.0:assemble-repository (default-assemble-repository) @ repository ---
[INFO] 
[INFO] --- tycho-p2-repository-plugin:1.4.0:archive-repository (default-archive-repository) @ repository ---
[INFO] Building zip: /jobs/genie.corrosion/corrosion/branches/master/workspace/repository/target/repository-0.4.1-SNAPSHOT.zip
[INFO] 
[INFO] --- tycho-pack200a-plugin:1.4.0:normalize (pack200-normalize) @ repository ---
[INFO] 
[INFO] --- eclipse-jarsigner-plugin:1.1.5:sign (sign) @ repository ---
[INFO] 
[INFO] --- tycho-pack200b-plugin:1.4.0:pack (pack200-pack) @ repository ---
[INFO] 
[INFO] --- tycho-p2-plugin:1.4.0:p2-metadata (p2-metadata) @ repository ---
[INFO] 
[INFO] --- tycho-p2-extras-plugin:1.4.0:compare-version-with-baselines (compare-version-with-baseline) @ repository ---
[INFO] ------------------------------------------------------------------------
[INFO] Reactor Summary:
[INFO] 
[INFO] parent 0.4.1-SNAPSHOT .............................. SUCCESS [01:33 min]
[INFO] target-platform 0.4.1-SNAPSHOT ..................... SUCCESS [ 16.076 s]
[INFO] org.eclipse.corrosion 0.4.1-SNAPSHOT ............... SUCCESS [ 58.442 s]
[INFO] org.eclipse.corrosion.tests 0.4.0-SNAPSHOT ......... SUCCESS [ 39.344 s]
[INFO] org.eclipse.corrosion.feature 0.4.1-SNAPSHOT ....... SUCCESS [  1.807 s]
[INFO] repository 0.4.1-SNAPSHOT .......................... SUCCESS [  2.180 s]
[INFO] ------------------------------------------------------------------------
[INFO] BUILD SUCCESS
[INFO] ------------------------------------------------------------------------
[INFO] Total time:  06:53 min
[INFO] Finished at: 2019-06-12T11:04:58-04:00
[INFO] ------------------------------------------------------------------------
[Pipeline] }
Terminating xvnc.
[Pipeline] // wrap
Post stage
[Pipeline] junit
Recording test results
[Pipeline] archiveArtifacts
Archiving artifacts
[Pipeline] }
[Pipeline] // withEnv
[Pipeline] }
[Pipeline] // stage
[Pipeline] stage
[Pipeline] { (SonarQube analysis)
[Pipeline] tool
[Pipeline] envVarsForTool
[Pipeline] tool
[Pipeline] envVarsForTool
[Pipeline] withEnv
[Pipeline] {
[Pipeline] withSonarQubeEnv
Injecting SonarQube environment variables using the configuration: Eclipse Sonar
[Pipeline] {
[Pipeline] sh
+ mvn -Dmaven.repo.local=/home/hudson/genie.corrosion/.jenkins/jobs/corrosion/branches/master/workspace/.m2 org.sonarsource.scanner.maven:sonar-maven-plugin:3.3.0.603:sonar -Dsonar.host.url=https://sonar.eclipse.org '-Dsonar.jdbc.url=jdbc:mysql://dbmaster:3306/sonar?autoReconnect=true&useUnicode=true&characterEncoding=utf8' -Dsonar.jdbc.username=sonar_rw '-Dsonar.jdbc.password=******'
Picked up JAVA_TOOL_OPTIONS: -Xmx2G -Djava.io.tmpdir=/tmp/genie.corrosion
[INFO] Scanning for projects...
[WARNING] No explicit target runtime environment configuration. Build is platform dependent.
[WARNING] No explicit target runtime environment configuration. Build is platform dependent.
[WARNING] No explicit target runtime environment configuration. Build is platform dependent.
[WARNING] No explicit target runtime environment configuration. Build is platform dependent.
[INFO] Computing target platform for MavenProject: org.eclipse.corrosion:org.eclipse.corrosion:0.4.1-SNAPSHOT @ /jobs/genie.corrosion/corrosion/branches/master/workspace/org.eclipse.corrosion/pom.xml
[INFO] Fetching p2.index from http://download.eclipse.org/eclipse/updates/4.11/
[INFO] Fetching p2.index from http://download.eclipse.org/eclipse/updates/4.11/
[INFO] Adding repository http://download.eclipse.org/eclipse/updates/4.11
[INFO] Fetching p2.index from http://download.eclipse.org/eclipse/updates/4.11/R-4.11-201903070500/
[INFO] Fetching p2.index from http://download.eclipse.org/eclipse/updates/4.11/R-4.11-201903070500/
[INFO] Fetching p2.index from http://download.eclipse.org/releases/2019-03/
[INFO] Fetching p2.index from http://download.eclipse.org/releases/2019-03/
[INFO] Adding repository http://download.eclipse.org/releases/2019-03
[INFO] Fetching p2.index from https://download.eclipse.org/technology/epp/packages/2019-03/
[INFO] Fetching p2.index from https://download.eclipse.org/technology/epp/packages/2019-03/
[INFO] Fetching p2.index from http://download.eclipse.org/releases/2019-03/201903201000/
[INFO] Fetching p2.index from http://download.eclipse.org/releases/2019-03/201903201000/
[INFO] Fetching p2.index from http://download.eclipse.org/cbi/updates/license/
[INFO] Fetching p2.index from http://download.eclipse.org/cbi/updates/license/
[INFO] Adding repository http://download.eclipse.org/cbi/updates/license
[INFO] Fetching p2.index from http://download.eclipse.org/cbi/updates/license/2.0.0.v20180130-0820/
[INFO] Fetching p2.index from http://download.eclipse.org/cbi/updates/license/2.0.0.v20180130-0820/
[INFO] Fetching p2.index from http://download.eclipse.org/cbi/updates/license/2.0.1.v20180423-1114/
[INFO] Fetching p2.index from http://download.eclipse.org/cbi/updates/license/2.0.1.v20180423-1114/
[INFO] Resolving dependencies of MavenProject: org.eclipse.corrosion:org.eclipse.corrosion:0.4.1-SNAPSHOT @ /jobs/genie.corrosion/corrosion/branches/master/workspace/org.eclipse.corrosion/pom.xml
[INFO] Resolving class path of MavenProject: org.eclipse.corrosion:org.eclipse.corrosion:0.4.1-SNAPSHOT @ /jobs/genie.corrosion/corrosion/branches/master/workspace/org.eclipse.corrosion/pom.xml
[INFO] Computing target platform for MavenProject: org.eclipse.corrosion:org.eclipse.corrosion.tests:0.4.0-SNAPSHOT @ /jobs/genie.corrosion/corrosion/branches/master/workspace/org.eclipse.corrosion.tests/pom.xml
[INFO] Resolving dependencies of MavenProject: org.eclipse.corrosion:org.eclipse.corrosion.tests:0.4.0-SNAPSHOT @ /jobs/genie.corrosion/corrosion/branches/master/workspace/org.eclipse.corrosion.tests/pom.xml
[INFO] Resolving class path of MavenProject: org.eclipse.corrosion:org.eclipse.corrosion.tests:0.4.0-SNAPSHOT @ /jobs/genie.corrosion/corrosion/branches/master/workspace/org.eclipse.corrosion.tests/pom.xml
[INFO] Computing target platform for MavenProject: org.eclipse.corrosion:org.eclipse.corrosion.feature:0.4.1-SNAPSHOT @ /jobs/genie.corrosion/corrosion/branches/master/workspace/org.eclipse.corrosion.feature/pom.xml
[INFO] Resolving dependencies of MavenProject: org.eclipse.corrosion:org.eclipse.corrosion.feature:0.4.1-SNAPSHOT @ /jobs/genie.corrosion/corrosion/branches/master/workspace/org.eclipse.corrosion.feature/pom.xml
[INFO] Resolving class path of MavenProject: org.eclipse.corrosion:org.eclipse.corrosion.feature:0.4.1-SNAPSHOT @ /jobs/genie.corrosion/corrosion/branches/master/workspace/org.eclipse.corrosion.feature/pom.xml
[INFO] Computing target platform for MavenProject: org.eclipse.corrosion:repository:0.4.1-SNAPSHOT @ /jobs/genie.corrosion/corrosion/branches/master/workspace/repository/pom.xml
[INFO] Resolving dependencies of MavenProject: org.eclipse.corrosion:repository:0.4.1-SNAPSHOT @ /jobs/genie.corrosion/corrosion/branches/master/workspace/repository/pom.xml
[INFO] Resolving class path of MavenProject: org.eclipse.corrosion:repository:0.4.1-SNAPSHOT @ /jobs/genie.corrosion/corrosion/branches/master/workspace/repository/pom.xml
[WARNING] The project org.eclipse.corrosion:parent:pom:0.4.1-SNAPSHOT uses prerequisites which is only intended for maven-plugin projects but not for non maven-plugin projects. For such purposes you should use the maven-enforcer-plugin. See https://maven.apache.org/enforcer/enforcer-rules/requireMavenVersion.html
[INFO] ------------------------------------------------------------------------
[INFO] Reactor Build Order:
[INFO] 
[INFO] parent                                                             [pom]
[INFO] target-platform                              [eclipse-target-definition]
[INFO] org.eclipse.corrosion                                   [eclipse-plugin]
[INFO] org.eclipse.corrosion.tests                        [eclipse-test-plugin]
[INFO] org.eclipse.corrosion.feature                          [eclipse-feature]
[INFO] repository                                          [eclipse-repository]
Downloading from cbi: https://repo.eclipse.org/content/groups/cbi/org/sonarsource/scanner/maven/sonar-maven-plugin/3.3.0.603/sonar-maven-plugin-3.3.0.603.pom
Downloading from jboss: https://repository.jboss.org/org/sonarsource/scanner/maven/sonar-maven-plugin/3.3.0.603/sonar-maven-plugin-3.3.0.603.pom
Downloading from eclipse.maven.central.mirror: https://repo.eclipse.org/content/repositories/maven_central/org/sonarsource/scanner/maven/sonar-maven-plugin/3.3.0.603/sonar-maven-plugin-3.3.0.603.pom
Progress (1): 4.1/9.1 kB
Progress (1): 7.7/9.1 kB
Progress (1): 9.1 kB    
                    
Downloaded from eclipse.maven.central.mirror: https://repo.eclipse.org/content/repositories/maven_central/org/sonarsource/scanner/maven/sonar-maven-plugin/3.3.0.603/sonar-maven-plugin-3.3.0.603.pom (9.1 kB at 32 kB/s)
Downloading from cbi: https://repo.eclipse.org/content/groups/cbi/org/sonarsource/parent/parent/40/parent-40.pom
Downloading from jboss: https://repository.jboss.org/org/sonarsource/parent/parent/40/parent-40.pom
Downloading from eclipse.maven.central.mirror: https://repo.eclipse.org/content/repositories/maven_central/org/sonarsource/parent/parent/40/parent-40.pom
Progress (1): 4.1/31 kB
Progress (1): 7.7/31 kB
Progress (1): 12/31 kB 
Progress (1): 16/31 kB
Progress (1): 20/31 kB
Progress (1): 24/31 kB
Progress (1): 28/31 kB
Progress (1): 31 kB   
                   
Downloaded from eclipse.maven.central.mirror: https://repo.eclipse.org/content/repositories/maven_central/org/sonarsource/parent/parent/40/parent-40.pom (31 kB at 451 kB/s)
Downloading from cbi: https://repo.eclipse.org/content/groups/cbi/org/sonarsource/scanner/maven/sonar-maven-plugin/3.3.0.603/sonar-maven-plugin-3.3.0.603.jar
Downloading from jboss: https://repository.jboss.org/org/sonarsource/scanner/maven/sonar-maven-plugin/3.3.0.603/sonar-maven-plugin-3.3.0.603.jar
Downloading from eclipse.maven.central.mirror: https://repo.eclipse.org/content/repositories/maven_central/org/sonarsource/scanner/maven/sonar-maven-plugin/3.3.0.603/sonar-maven-plugin-3.3.0.603.jar
Progress (1): 4.1/55 kB
Progress (1): 7.7/55 kB
Progress (1): 12/55 kB 
Progress (1): 16/55 kB
Progress (1): 20/55 kB
Progress (1): 24/55 kB
Progress (1): 28/55 kB
Progress (1): 32/55 kB
Progress (1): 36/55 kB
Progress (1): 40/55 kB
Progress (1): 44/55 kB
Progress (1): 48/55 kB
Progress (1): 52/55 kB
Progress (1): 55 kB   
                   
Downloaded from eclipse.maven.central.mirror: https://repo.eclipse.org/content/repositories/maven_central/org/sonarsource/scanner/maven/sonar-maven-plugin/3.3.0.603/sonar-maven-plugin-3.3.0.603.jar (55 kB at 1.1 MB/s)
[INFO] 
[INFO] --------------------< org.eclipse.corrosion:parent >--------------------
[INFO] Building parent 0.4.1-SNAPSHOT                                     [1/6]
[INFO] --------------------------------[ pom ]---------------------------------
[WARNING] The following dependencies could not be resolved at this point of the build but seem to be part of the reactor:
[WARNING] o org.eclipse.corrosion:org.eclipse.corrosion:jar:0.4.1-SNAPSHOT (provided)
[WARNING] Try running the build up to the lifecycle phase "package"
[WARNING] The following dependencies could not be resolved at this point of the build but seem to be part of the reactor:
[WARNING] o org.eclipse.corrosion:org.eclipse.corrosion:jar:0.4.1-SNAPSHOT (provided)
[WARNING] Try running the build up to the lifecycle phase "package"
[WARNING] The following dependencies could not be resolved at this point of the build but seem to be part of the reactor:
[WARNING] o org.eclipse.corrosion:org.eclipse.corrosion:jar:0.4.1-SNAPSHOT (provided)
[WARNING] o org.eclipse.corrosion:org.eclipse.corrosion.feature:jar:0.4.1-SNAPSHOT (provided)
[WARNING] Try running the build up to the lifecycle phase "package"
[INFO] 
[INFO] --- sonar-maven-plugin:3.3.0.603:sonar (default-cli) @ parent ---
Downloading from cbi: https://repo.eclipse.org/content/groups/cbi/org/apache/maven/shared/maven-dependency-tree/2.2/maven-dependency-tree-2.2.pom
Downloading from jboss: https://repository.jboss.org/org/apache/maven/shared/maven-dependency-tree/2.2/maven-dependency-tree-2.2.pom
Downloading from eclipse.maven.central.mirror: https://repo.eclipse.org/content/repositories/maven_central/org/apache/maven/shared/maven-dependency-tree/2.2/maven-dependency-tree-2.2.pom
Progress (1): 4.1/7.3 kB
Progress (1): 7.3 kB    
                    
Downloaded from eclipse.maven.central.mirror: https://repo.eclipse.org/content/repositories/maven_central/org/apache/maven/shared/maven-dependency-tree/2.2/maven-dependency-tree-2.2.pom (7.3 kB at 30 kB/s)
Downloading from cbi: https://repo.eclipse.org/content/groups/cbi/org/apache/maven/shared/maven-shared-components/20/maven-shared-components-20.pom
Downloading from jboss: https://repository.jboss.org/org/apache/maven/shared/maven-shared-components/20/maven-shared-components-20.pom
Downloading from eclipse.maven.central.mirror: https://repo.eclipse.org/content/repositories/maven_central/org/apache/maven/shared/maven-shared-components/20/maven-shared-components-20.pom
Progress (1): 4.1/5.1 kB
Progress (1): 5.1 kB    
                    
Downloaded from eclipse.maven.central.mirror: https://repo.eclipse.org/content/repositories/maven_central/org/apache/maven/shared/maven-shared-components/20/maven-shared-components-20.pom (5.1 kB at 119 kB/s)
Downloading from cbi: https://repo.eclipse.org/content/groups/cbi/org/apache/maven/maven-parent/24/maven-parent-24.pom
Downloading from jboss: https://repository.jboss.org/org/apache/maven/maven-parent/24/maven-parent-24.pom
Downloading from eclipse.maven.central.mirror: https://repo.eclipse.org/content/repositories/maven_central/org/apache/maven/maven-parent/24/maven-parent-24.pom
Progress (1): 4.1/37 kB
Progress (1): 7.7/37 kB
Progress (1): 12/37 kB 
Progress (1): 16/37 kB
Progress (1): 20/37 kB
Progress (1): 24/37 kB
Progress (1): 28/37 kB
Progress (1): 32/37 kB
Progress (1): 36/37 kB
Progress (1): 37 kB   
                   
Downloaded from eclipse.maven.central.mirror: https://repo.eclipse.org/content/repositories/maven_central/org/apache/maven/maven-parent/24/maven-parent-24.pom (37 kB at 142 kB/s)
Downloading from cbi: https://repo.eclipse.org/content/groups/cbi/org/apache/apache/14/apache-14.pom
Downloading from jboss: https://repository.jboss.org/org/apache/apache/14/apache-14.pom
Downloading from eclipse.maven.central.mirror: https://repo.eclipse.org/content/repositories/maven_central/org/apache/apache/14/apache-14.pom
Progress (1): 4.1/15 kB
Progress (1): 7.7/15 kB
Progress (1): 12/15 kB 
Progress (1): 15 kB   
                   
Downloaded from eclipse.maven.central.mirror: https://repo.eclipse.org/content/repositories/maven_central/org/apache/apache/14/apache-14.pom (15 kB at 432 kB/s)
Downloading from cbi: https://repo.eclipse.org/content/groups/cbi/org/sonarsource/scanner/api/sonar-scanner-api/2.9.0.887/sonar-scanner-api-2.9.0.887.pom
Downloading from jboss: https://repository.jboss.org/org/sonarsource/scanner/api/sonar-scanner-api/2.9.0.887/sonar-scanner-api-2.9.0.887.pom
Downloading from eclipse.maven.central.mirror: https://repo.eclipse.org/content/repositories/maven_central/org/sonarsource/scanner/api/sonar-scanner-api/2.9.0.887/sonar-scanner-api-2.9.0.887.pom
Progress (1): 4.1/5.1 kB
Progress (1): 5.1 kB    
                    
Downloaded from eclipse.maven.central.mirror: https://repo.eclipse.org/content/repositories/maven_central/org/sonarsource/scanner/api/sonar-scanner-api/2.9.0.887/sonar-scanner-api-2.9.0.887.pom (5.1 kB at 19 kB/s)
Downloading from cbi: https://repo.eclipse.org/content/groups/cbi/org/sonarsource/scanner/api/sonar-scanner-api-parent/2.9.0.887/sonar-scanner-api-parent-2.9.0.887.pom
Downloading from jboss: https://repository.jboss.org/org/sonarsource/scanner/api/sonar-scanner-api-parent/2.9.0.887/sonar-scanner-api-parent-2.9.0.887.pom
Downloading from eclipse.maven.central.mirror: https://repo.eclipse.org/content/repositories/maven_central/org/sonarsource/scanner/api/sonar-scanner-api-parent/2.9.0.887/sonar-scanner-api-parent-2.9.0.887.pom
Progress (1): 4.1/4.7 kB
Progress (1): 4.7 kB    
                    
Downloaded from eclipse.maven.central.mirror: https://repo.eclipse.org/content/repositories/maven_central/org/sonarsource/scanner/api/sonar-scanner-api-parent/2.9.0.887/sonar-scanner-api-parent-2.9.0.887.pom (4.7 kB at 16 kB/s)
Downloading from cbi: https://repo.eclipse.org/content/groups/cbi/commons-lang/commons-lang/2.6/commons-lang-2.6.pom
Downloading from jboss: https://repository.jboss.org/commons-lang/commons-lang/2.6/commons-lang-2.6.pom
Downloading from eclipse.maven.central.mirror: https://repo.eclipse.org/content/repositories/maven_central/commons-lang/commons-lang/2.6/commons-lang-2.6.pom
Progress (1): 4.1/17 kB
Progress (1): 7.7/17 kB
Progress (1): 12/17 kB 
Progress (1): 16/17 kB
Progress (1): 17 kB   
                   
Downloaded from eclipse.maven.central.mirror: https://repo.eclipse.org/content/repositories/maven_central/commons-lang/commons-lang/2.6/commons-lang-2.6.pom (17 kB at 68 kB/s)
Downloading from cbi: https://repo.eclipse.org/content/groups/cbi/org/apache/commons/commons-parent/17/commons-parent-17.pom
Downloading from jboss: https://repository.jboss.org/org/apache/commons/commons-parent/17/commons-parent-17.pom
Downloading from eclipse.maven.central.mirror: https://repo.eclipse.org/content/repositories/maven_central/org/apache/commons/commons-parent/17/commons-parent-17.pom
Progress (1): 4.1/31 kB
Progress (1): 7.7/31 kB
Progress (1): 12/31 kB 
Progress (1): 16/31 kB
Progress (1): 20/31 kB
Progress (1): 24/31 kB
Progress (1): 28/31 kB
Progress (1): 31 kB   
                   
Downloaded from eclipse.maven.central.mirror: https://repo.eclipse.org/content/repositories/maven_central/org/apache/commons/commons-parent/17/commons-parent-17.pom (31 kB at 650 kB/s)
Downloading from cbi: https://repo.eclipse.org/content/groups/cbi/com/google/code/findbugs/jsr305/2.0.3/jsr305-2.0.3.pom
Downloading from jboss: https://repository.jboss.org/com/google/code/findbugs/jsr305/2.0.3/jsr305-2.0.3.pom
Downloading from eclipse.maven.central.mirror: https://repo.eclipse.org/content/repositories/maven_central/com/google/code/findbugs/jsr305/2.0.3/jsr305-2.0.3.pom
Progress (1): 1.4 kB
                    
Downloaded from eclipse.maven.central.mirror: https://repo.eclipse.org/content/repositories/maven_central/com/google/code/findbugs/jsr305/2.0.3/jsr305-2.0.3.pom (1.4 kB at 29 kB/s)
Downloading from cbi: https://repo.eclipse.org/content/groups/cbi/org/apache/maven/shared/maven-dependency-tree/2.2/maven-dependency-tree-2.2.jar
Downloading from cbi: https://repo.eclipse.org/content/groups/cbi/com/google/code/findbugs/jsr305/2.0.3/jsr305-2.0.3.jar
Downloading from cbi: https://repo.eclipse.org/content/groups/cbi/commons-lang/commons-lang/2.6/commons-lang-2.6.jar
Downloading from cbi: https://repo.eclipse.org/content/groups/cbi/org/sonarsource/scanner/api/sonar-scanner-api/2.9.0.887/sonar-scanner-api-2.9.0.887.jar
Downloading from jboss: https://repository.jboss.org/org/apache/maven/shared/maven-dependency-tree/2.2/maven-dependency-tree-2.2.jar
Downloading from jboss: https://repository.jboss.org/com/google/code/findbugs/jsr305/2.0.3/jsr305-2.0.3.jar
Downloading from jboss: https://repository.jboss.org/commons-lang/commons-lang/2.6/commons-lang-2.6.jar
Downloading from jboss: https://repository.jboss.org/org/sonarsource/scanner/api/sonar-scanner-api/2.9.0.887/sonar-scanner-api-2.9.0.887.jar
Downloading from eclipse.maven.central.mirror: https://repo.eclipse.org/content/repositories/maven_central/org/apache/maven/shared/maven-dependency-tree/2.2/maven-dependency-tree-2.2.jar
Downloading from eclipse.maven.central.mirror: https://repo.eclipse.org/content/repositories/maven_central/com/google/code/findbugs/jsr305/2.0.3/jsr305-2.0.3.jar
Downloading from eclipse.maven.central.mirror: https://repo.eclipse.org/content/repositories/maven_central/commons-lang/commons-lang/2.6/commons-lang-2.6.jar
Downloading from eclipse.maven.central.mirror: https://repo.eclipse.org/content/repositories/maven_central/org/sonarsource/scanner/api/sonar-scanner-api/2.9.0.887/sonar-scanner-api-2.9.0.887.jar
Progress (1): 4.1/64 kB
Progress (1): 7.7/64 kB
Progress (1): 12/64 kB 
Progress (1): 16/64 kB
Progress (1): 20/64 kB
Progress (1): 24/64 kB
Progress (1): 28/64 kB
Progress (1): 32/64 kB
Progress (2): 32/64 kB | 4.1/284 kB
Progress (2): 36/64 kB | 4.1/284 kB
Progress (2): 36/64 kB | 7.7/284 kB
Progress (2): 40/64 kB | 7.7/284 kB
Progress (2): 40/64 kB | 12/284 kB 
Progress (2): 44/64 kB | 12/284 kB
Progress (2): 44/64 kB | 16/284 kB
Progress (2): 48/64 kB | 16/284 kB
Progress (2): 48/64 kB | 20/284 kB
Progress (2): 52/64 kB | 20/284 kB
Progress (2): 52/64 kB | 24/284 kB
Progress (2): 56/64 kB | 24/284 kB
Progress (2): 56/64 kB | 28/284 kB
Progress (2): 60/64 kB | 28/284 kB
Progress (2): 60/64 kB | 32/284 kB
Progress (2): 64 kB | 32/284 kB   
Progress (2): 64 kB | 36/284 kB
Progress (2): 64 kB | 40/284 kB
Progress (2): 64 kB | 44/284 kB
Progress (2): 64 kB | 48/284 kB
Progress (2): 64 kB | 52/284 kB
Progress (2): 64 kB | 56/284 kB
Progress (2): 64 kB | 60/284 kB
Progress (2): 64 kB | 64/284 kB
Progress (2): 64 kB | 68/284 kB
Progress (2): 64 kB | 72/284 kB
Progress (3): 64 kB | 72/284 kB | 4.1/33 kB
Progress (3): 64 kB | 76/284 kB | 4.1/33 kB
Progress (3): 64 kB | 76/284 kB | 7.7/33 kB
Progress (3): 64 kB | 80/284 kB | 7.7/33 kB
Progress (3): 64 kB | 84/284 kB | 7.7/33 kB
Progress (3): 64 kB | 88/284 kB | 7.7/33 kB
Progress (3): 64 kB | 92/284 kB | 7.7/33 kB
Progress (3): 64 kB | 92/284 kB | 12/33 kB 
Progress (3): 64 kB | 96/284 kB | 12/33 kB
Progress (3): 64 kB | 96/284 kB | 16/33 kB
Progress (3): 64 kB | 100/284 kB | 16/33 kB
Progress (3): 64 kB | 100/284 kB | 20/33 kB
Progress (3): 64 kB | 104/284 kB | 20/33 kB
Progress (3): 64 kB | 104/284 kB | 24/33 kB
Progress (3): 64 kB | 108/284 kB | 24/33 kB
Progress (3): 64 kB | 108/284 kB | 28/33 kB
Progress (3): 64 kB | 112/284 kB | 28/33 kB
Progress (3): 64 kB | 112/284 kB | 32/33 kB
Progress (3): 64 kB | 116/284 kB | 32/33 kB
Progress (3): 64 kB | 116/284 kB | 33 kB   
Progress (3): 64 kB | 120/284 kB | 33 kB
Progress (3): 64 kB | 124/284 kB | 33 kB
Progress (3): 64 kB | 128/284 kB | 33 kB
Progress (3): 64 kB | 132/284 kB | 33 kB
Progress (3): 64 kB | 136/284 kB | 33 kB
Progress (3): 64 kB | 140/284 kB | 33 kB
Progress (3): 64 kB | 144/284 kB | 33 kB
Progress (3): 64 kB | 148/284 kB | 33 kB
Progress (3): 64 kB | 152/284 kB | 33 kB
Progress (3): 64 kB | 156/284 kB | 33 kB
Progress (3): 64 kB | 160/284 kB | 33 kB
Progress (3): 64 kB | 164/284 kB | 33 kB
Progress (3): 64 kB | 168/284 kB | 33 kB
Progress (3): 64 kB | 172/284 kB | 33 kB
Progress (3): 64 kB | 176/284 kB | 33 kB
                                        
Downloaded from eclipse.maven.central.mirror: https://repo.eclipse.org/content/repositories/maven_central/org/apache/maven/shared/maven-dependency-tree/2.2/maven-dependency-tree-2.2.jar (64 kB at 1.1 MB/s)
Progress (2): 180/284 kB | 33 kB
Progress (2): 184/284 kB | 33 kB
Progress (2): 188/284 kB | 33 kB
Progress (2): 192/284 kB | 33 kB
Progress (2): 196/284 kB | 33 kB
Progress (2): 200/284 kB | 33 kB
Progress (2): 204/284 kB | 33 kB
Progress (2): 208/284 kB | 33 kB
Progress (2): 212/284 kB | 33 kB
                                
Downloaded from eclipse.maven.central.mirror: https://repo.eclipse.org/content/repositories/maven_central/com/google/code/findbugs/jsr305/2.0.3/jsr305-2.0.3.jar (33 kB at 533 kB/s)
Progress (2): 212/284 kB | 4.1/532 kB
Progress (2): 216/284 kB | 4.1/532 kB
Progress (2): 216/284 kB | 7.7/532 kB
Progress (2): 220/284 kB | 7.7/532 kB
Progress (2): 220/284 kB | 12/532 kB 
Progress (2): 224/284 kB | 12/532 kB
Progress (2): 224/284 kB | 16/532 kB
Progress (2): 228/284 kB | 16/532 kB
Progress (2): 228/284 kB | 20/532 kB
Progress (2): 232/284 kB | 20/532 kB
Progress (2): 232/284 kB | 24/532 kB
Progress (2): 236/284 kB | 24/532 kB
Progress (2): 236/284 kB | 28/532 kB
Progress (2): 240/284 kB | 28/532 kB
Progress (2): 240/284 kB | 32/532 kB
Progress (2): 244/284 kB | 32/532 kB
Progress (2): 244/284 kB | 36/532 kB
Progress (2): 248/284 kB | 36/532 kB
Progress (2): 248/284 kB | 40/532 kB
Progress (2): 252/284 kB | 40/532 kB
Progress (2): 252/284 kB | 44/532 kB
Progress (2): 256/284 kB | 44/532 kB
Progress (2): 256/284 kB | 48/532 kB
Progress (2): 260/284 kB | 48/532 kB
Progress (2): 260/284 kB | 52/532 kB
Progress (2): 264/284 kB | 52/532 kB
Progress (2): 264/284 kB | 56/532 kB
Progress (2): 268/284 kB | 56/532 kB
Progress (2): 268/284 kB | 60/532 kB
Progress (2): 272/284 kB | 60/532 kB
Progress (2): 272/284 kB | 64/532 kB
Progress (2): 276/284 kB | 64/532 kB
Progress (2): 276/284 kB | 68/532 kB
Progress (2): 280/284 kB | 68/532 kB
Progress (2): 280/284 kB | 72/532 kB
Progress (2): 284/284 kB | 72/532 kB
Progress (2): 284/284 kB | 76/532 kB
Progress (2): 284 kB | 76/532 kB    
Progress (2): 284 kB | 80/532 kB
Progress (2): 284 kB | 84/532 kB
Progress (2): 284 kB | 88/532 kB
Progress (2): 284 kB | 92/532 kB
Progress (2): 284 kB | 96/532 kB
Progress (2): 284 kB | 100/532 kB
Progress (2): 284 kB | 104/532 kB
Progress (2): 284 kB | 108/532 kB
Progress (2): 284 kB | 112/532 kB
Progress (2): 284 kB | 116/532 kB
Progress (2): 284 kB | 120/532 kB
Progress (2): 284 kB | 124/532 kB
Progress (2): 284 kB | 128/532 kB
Progress (2): 284 kB | 132/532 kB
Progress (2): 284 kB | 136/532 kB
Progress (2): 284 kB | 140/532 kB
Progress (2): 284 kB | 144/532 kB
Progress (2): 284 kB | 148/532 kB
Progress (2): 284 kB | 152/532 kB
Progress (2): 284 kB | 156/532 kB
Progress (2): 284 kB | 160/532 kB
Progress (2): 284 kB | 164/532 kB
Progress (2): 284 kB | 168/532 kB
                                 
Downloaded from eclipse.maven.central.mirror: https://repo.eclipse.org/content/repositories/maven_central/commons-lang/commons-lang/2.6/commons-lang-2.6.jar (284 kB at 3.6 MB/s)
Progress (1): 172/532 kB
Progress (1): 176/532 kB
Progress (1): 180/532 kB
Progress (1): 184/532 kB
Progress (1): 188/532 kB
Progress (1): 192/532 kB
Progress (1): 196/532 kB
Progress (1): 200/532 kB
Progress (1): 204/532 kB
Progress (1): 208/532 kB
Progress (1): 212/532 kB
Progress (1): 216/532 kB
Progress (1): 220/532 kB
Progress (1): 224/532 kB
Progress (1): 228/532 kB
Progress (1): 232/532 kB
Progress (1): 236/532 kB
Progress (1): 240/532 kB
Progress (1): 244/532 kB
Progress (1): 248/532 kB
Progress (1): 252/532 kB
Progress (1): 256/532 kB
Progress (1): 260/532 kB
Progress (1): 264/532 kB
Progress (1): 268/532 kB
Progress (1): 272/532 kB
Progress (1): 276/532 kB
Progress (1): 280/532 kB
Progress (1): 284/532 kB
Progress (1): 288/532 kB
Progress (1): 292/532 kB
Progress (1): 296/532 kB
Progress (1): 300/532 kB
Progress (1): 304/532 kB
Progress (1): 308/532 kB
Progress (1): 312/532 kB
Progress (1): 316/532 kB
Progress (1): 320/532 kB
Progress (1): 324/532 kB
Progress (1): 328/532 kB
Progress (1): 332/532 kB
Progress (1): 336/532 kB
Progress (1): 340/532 kB
Progress (1): 344/532 kB
Progress (1): 348/532 kB
Progress (1): 352/532 kB
Progress (1): 356/532 kB
Progress (1): 360/532 kB
Progress (1): 364/532 kB
Progress (1): 368/532 kB
Progress (1): 372/532 kB
Progress (1): 376/532 kB
Progress (1): 380/532 kB
Progress (1): 384/532 kB
Progress (1): 388/532 kB
Progress (1): 392/532 kB
Progress (1): 396/532 kB
Progress (1): 400/532 kB
Progress (1): 404/532 kB
Progress (1): 408/532 kB
Progress (1): 412/532 kB
Progress (1): 416/532 kB
Progress (1): 420/532 kB
Progress (1): 424/532 kB
Progress (1): 428/532 kB
Progress (1): 432/532 kB
Progress (1): 436/532 kB
Progress (1): 440/532 kB
Progress (1): 444/532 kB
Progress (1): 448/532 kB
Progress (1): 452/532 kB
Progress (1): 456/532 kB
Progress (1): 460/532 kB
Progress (1): 464/532 kB
Progress (1): 468/532 kB
Progress (1): 472/532 kB
Progress (1): 476/532 kB
Progress (1): 480/532 kB
Progress (1): 484/532 kB
Progress (1): 488/532 kB
Progress (1): 492/532 kB
Progress (1): 496/532 kB
Progress (1): 500/532 kB
Progress (1): 504/532 kB
Progress (1): 508/532 kB
Progress (1): 512/532 kB
Progress (1): 516/532 kB
Progress (1): 520/532 kB
Progress (1): 524/532 kB
Progress (1): 528/532 kB
Progress (1): 532/532 kB
Progress (1): 532 kB    
                    
Downloaded from eclipse.maven.central.mirror: https://repo.eclipse.org/content/repositories/maven_central/org/sonarsource/scanner/api/sonar-scanner-api/2.9.0.887/sonar-scanner-api-2.9.0.887.jar (532 kB at 1.7 MB/s)
Downloading from jboss: https://repository.jboss.org/org/apache/maven/plugins/maven-compiler-plugin/maven-metadata.xml
Downloading from cbi: https://repo.eclipse.org/content/groups/cbi/org/apache/maven/plugins/maven-compiler-plugin/maven-metadata.xml
Downloading from eclipse.maven.central.mirror: https://repo.eclipse.org/content/repositories/maven_central/org/apache/maven/plugins/maven-compiler-plugin/maven-metadata.xml
Progress (1): 889 B
Progress (2): 889 B | 1.0 kB
                            
Downloaded from eclipse.maven.central.mirror: https://repo.eclipse.org/content/repositories/maven_central/org/apache/maven/plugins/maven-compiler-plugin/maven-metadata.xml (1.0 kB at 4.2 kB/s)
Downloaded from jboss: https://repository.jboss.org/org/apache/maven/plugins/maven-compiler-plugin/maven-metadata.xml (889 B at 2.8 kB/s)
Downloading from cbi: https://repo.eclipse.org/content/groups/cbi/org/apache/maven/plugins/maven-compiler-plugin/3.8.1/maven-compiler-plugin-3.8.1.pom
Downloading from jboss: https://repository.jboss.org/org/apache/maven/plugins/maven-compiler-plugin/3.8.1/maven-compiler-plugin-3.8.1.pom
Downloading from eclipse.maven.central.mirror: https://repo.eclipse.org/content/repositories/maven_central/org/apache/maven/plugins/maven-compiler-plugin/3.8.1/maven-compiler-plugin-3.8.1.pom
Progress (1): 4.1/12 kB
Progress (1): 7.7/12 kB
Progress (1): 12/12 kB 
Progress (1): 12 kB   
                   
Downloaded from eclipse.maven.central.mirror: https://repo.eclipse.org/content/repositories/maven_central/org/apache/maven/plugins/maven-compiler-plugin/3.8.1/maven-compiler-plugin-3.8.1.pom (12 kB at 624 kB/s)
Downloading from cbi: https://repo.eclipse.org/content/groups/cbi/org/apache/maven/plugins/maven-plugins/33/maven-plugins-33.pom
Downloading from jboss: https://repository.jboss.org/org/apache/maven/plugins/maven-plugins/33/maven-plugins-33.pom
Downloading from eclipse.maven.central.mirror: https://repo.eclipse.org/content/repositories/maven_central/org/apache/maven/plugins/maven-plugins/33/maven-plugins-33.pom
Progress (1): 4.1/11 kB
Progress (1): 7.7/11 kB
Progress (1): 11 kB    
                   
Downloaded from eclipse.maven.central.mirror: https://repo.eclipse.org/content/repositories/maven_central/org/apache/maven/plugins/maven-plugins/33/maven-plugins-33.pom (11 kB at 237 kB/s)
Downloading from cbi: https://repo.eclipse.org/content/groups/cbi/org/apache/maven/maven-parent/33/maven-parent-33.pom
Downloading from jboss: https://repository.jboss.org/org/apache/maven/maven-parent/33/maven-parent-33.pom
Downloading from eclipse.maven.central.mirror: https://repo.eclipse.org/content/repositories/maven_central/org/apache/maven/maven-parent/33/maven-parent-33.pom
Progress (1): 4.1/44 kB
Progress (1): 7.7/44 kB
Progress (1): 12/44 kB 
Progress (1): 16/44 kB
Progress (1): 20/44 kB
Progress (1): 24/44 kB
Progress (1): 28/44 kB
Progress (1): 32/44 kB
Progress (1): 36/44 kB
Progress (1): 40/44 kB
Progress (1): 44/44 kB
Progress (1): 44 kB   
                   
Downloaded from eclipse.maven.central.mirror: https://repo.eclipse.org/content/repositories/maven_central/org/apache/maven/maven-parent/33/maven-parent-33.pom (44 kB at 1.1 MB/s)
Downloading from cbi: https://repo.eclipse.org/content/groups/cbi/org/apache/apache/21/apache-21.pom
Downloading from jboss: https://repository.jboss.org/org/apache/apache/21/apache-21.pom
Downloading from eclipse.maven.central.mirror: https://repo.eclipse.org/content/repositories/maven_central/org/apache/apache/21/apache-21.pom
Progress (1): 4.1/17 kB
Progress (1): 7.7/17 kB
Progress (1): 12/17 kB 
Progress (1): 16/17 kB
Progress (1): 17 kB   
                   
Downloaded from eclipse.maven.central.mirror: https://repo.eclipse.org/content/repositories/maven_central/org/apache/apache/21/apache-21.pom (17 kB at 323 kB/s)
Downloading from cbi: https://repo.eclipse.org/content/groups/cbi/org/apache/maven/plugins/maven-compiler-plugin/3.8.1/maven-compiler-plugin-3.8.1.jar
Downloading from jboss: https://repository.jboss.org/org/apache/maven/plugins/maven-compiler-plugin/3.8.1/maven-compiler-plugin-3.8.1.jar
Downloading from eclipse.maven.central.mirror: https://repo.eclipse.org/content/repositories/maven_central/org/apache/maven/plugins/maven-compiler-plugin/3.8.1/maven-compiler-plugin-3.8.1.jar
Progress (1): 4.1/62 kB
Progress (1): 7.7/62 kB
Progress (1): 12/62 kB 
Progress (1): 16/62 kB
Progress (1): 20/62 kB
Progress (1): 24/62 kB
Progress (1): 28/62 kB
Progress (1): 32/62 kB
Progress (1): 36/62 kB
Progress (1): 40/62 kB
Progress (1): 44/62 kB
Progress (1): 48/62 kB
Progress (1): 52/62 kB
Progress (1): 56/62 kB
Progress (1): 60/62 kB
Progress (1): 62 kB   
                   
Downloaded from eclipse.maven.central.mirror: https://repo.eclipse.org/content/repositories/maven_central/org/apache/maven/plugins/maven-compiler-plugin/3.8.1/maven-compiler-plugin-3.8.1.jar (62 kB at 50 kB/s)
[INFO] User cache: /opt/public/hipp/homes/genie.corrosion/.sonar/cache
[INFO] SonarQube version: 4.5.7
[INFO] Default locale: "en_US", source code encoding: "UTF-8"
11:05:36.972 INFO  - Load global referentials...
11:05:37.361 INFO  - Load global referentials done: 391 ms
11:05:37.404 INFO  - User cache: /opt/public/hipp/homes/genie.corrosion/.sonar/cache
11:05:37.513 INFO  - Install plugins
11:05:38.192 INFO  - Install JDBC driver
11:05:38.205 INFO  - Create JDBC datasource for jdbc:mysql://dbmaster:3306/sonar?autoReconnect=true&useUnicode=true&characterEncoding=utf8
11:05:39.736 INFO  - Initializing Hibernate
11:05:43.628 INFO  - Load project referentials...
11:05:44.097 INFO  - Load project referentials done: 469 ms
11:05:44.097 INFO  - Load project settings
11:05:44.700 INFO  - Loading technical debt model...
11:05:44.724 INFO  - Loading technical debt model done: 24 ms
11:05:44.727 INFO  - Apply project exclusions
11:05:45.075 INFO  - -------------  Scan target-platform
11:05:45.078 INFO  - Load module settings
11:05:46.192 INFO  - Loading rules...
11:05:46.399 INFO  - Loading rules done: 207 ms
11:05:46.428 INFO  - Configure Maven plugins
11:05:46.573 INFO  - Compare to previous analysis (2019-05-01)
11:05:46.585 INFO  - Compare over 30 days (2019-05-13, analysis of 2019-05-01 11:04:20.0)
11:05:46.597 INFO  - Compare to previous version (2019-03-13)
11:05:46.599 INFO  - No quality gate is configured.
11:05:46.629 INFO  - Base dir: /jobs/genie.corrosion/corrosion/branches/master/workspace/target-platform
11:05:46.629 INFO  - Working dir: /jobs/genie.corrosion/corrosion/branches/master/workspace/target-platform/target/sonar
11:05:46.630 INFO  - Source paths: pom.xml
11:05:46.630 INFO  - Source encoding: UTF-8, default locale: en_US
11:05:46.630 INFO  - Index files
11:05:46.640 INFO  - Excluded sources: 
11:05:46.640 INFO  -   **/util/*Switch.java
11:05:46.669 INFO  - 0 files indexed
11:05:46.674 INFO  - JaCoCoSensor: JaCoCo report not found : /jobs/genie.corrosion/corrosion/branches/master/workspace/target-platform/target/jacoco.exec
11:05:46.674 INFO  - JaCoCoItSensor: JaCoCo IT report not found: /jobs/genie.corrosion/corrosion/branches/master/workspace/target-platform/target/jacoco-it.exec
11:05:46.704 INFO  - Sensor QProfileSensor...
11:05:46.721 INFO  - Sensor QProfileSensor done: 17 ms
11:05:46.721 INFO  - Sensor InitialOpenIssuesSensor...
11:05:46.728 INFO  - Sensor InitialOpenIssuesSensor done: 7 ms
11:05:46.728 INFO  - Sensor ProjectLinksSensor...
11:05:46.735 INFO  - Sensor ProjectLinksSensor done: 7 ms
11:05:46.737 INFO  - Sensor VersionEventsSensor...
11:05:46.754 INFO  - Sensor VersionEventsSensor done: 17 ms
11:05:46.754 INFO  - Sensor FileHashSensor...
11:05:46.755 INFO  - Sensor FileHashSensor done: 1 ms
11:05:46.755 INFO  - Sensor CPD Sensor (wrapped)...
11:05:46.755 INFO  - Sensor CPD Sensor (wrapped) done: 0 ms
11:05:46.929 INFO  - Execute decorators...
11:05:47.053 INFO  - -------------  Scan org.eclipse.corrosion
11:05:47.054 INFO  - Load module settings
11:05:47.092 INFO  - Configure Maven plugins
11:05:47.094 INFO  - Compare to previous analysis (2019-05-01)
11:05:47.095 INFO  - Compare over 30 days (2019-05-13, analysis of 2019-05-01 11:04:20.0)
11:05:47.096 INFO  - Compare to previous version (2019-03-13)
11:05:47.097 INFO  - No quality gate is configured.
11:05:47.113 INFO  - Base dir: /jobs/genie.corrosion/corrosion/branches/master/workspace/org.eclipse.corrosion
11:05:47.113 INFO  - Working dir: /jobs/genie.corrosion/corrosion/branches/master/workspace/org.eclipse.corrosion/target/sonar
11:05:47.113 INFO  - Source paths: pom.xml, src
11:05:47.113 INFO  - Binary dirs: target/classes
11:05:47.113 INFO  - Source encoding: UTF-8, default locale: en_US
11:05:47.113 INFO  - Index files
11:05:47.113 INFO  - Excluded sources: 
11:05:47.114 INFO  -   **/util/*Switch.java
11:05:47.184 INFO  - 46 files indexed
11:05:47.464 INFO  - Quality profile for java: Sonar way with Findbugs
11:05:47.478 INFO  - JaCoCoSensor: JaCoCo report not found : /jobs/genie.corrosion/corrosion/branches/master/workspace/org.eclipse.corrosion/target/jacoco.exec
11:05:47.478 INFO  - JaCoCoItSensor: JaCoCo IT report not found: /jobs/genie.corrosion/corrosion/branches/master/workspace/org.eclipse.corrosion/target/jacoco-it.exec
11:05:47.485 INFO  - Sensor JavaSquidSensor...
11:05:47.779 INFO  - Configured Java source version (sonar.java.source): 6
11:05:47.799 INFO  - JavaClasspath initialization...
11:05:47.831 INFO  - JavaClasspath initialization done: 32 ms
11:05:47.831 INFO  - JavaTestClasspath initialization...
11:05:47.874 INFO  - JavaTestClasspath initialization done: 43 ms
11:05:48.719 INFO  - Java Main Files AST scan...
11:05:48.721 INFO  - 46 source files to be analyzed
11:05:49.025 ERROR - Class not found: org.osgi.annotation.versioning.ConsumerType
11:05:49.026 ERROR - Class not found: org.osgi.annotation.versioning.ProviderType
11:05:49.274 ERROR - Class not found: org.osgi.annotation.versioning.ConsumerType
11:05:49.274 ERROR - Class not found: org.osgi.annotation.versioning.ProviderType
11:05:49.484 ERROR - Class not found: org.osgi.annotation.versioning.ConsumerType
11:05:49.484 ERROR - Class not found: org.osgi.annotation.versioning.ProviderType
11:05:49.750 ERROR - Class not found: org.osgi.annotation.versioning.ConsumerType
11:05:49.751 ERROR - Class not found: org.osgi.annotation.versioning.ProviderType
11:05:50.136 ERROR - Class not found: org.osgi.annotation.versioning.ConsumerType
11:05:50.136 ERROR - Class not found: org.osgi.annotation.versioning.ProviderType
11:05:50.462 ERROR - Class not found: org.osgi.annotation.versioning.ConsumerType
11:05:50.463 ERROR - Class not found: org.osgi.annotation.versioning.ProviderType
11:05:50.674 ERROR - Class not found: org.osgi.annotation.versioning.ConsumerType
11:05:50.674 ERROR - Class not found: org.osgi.annotation.versioning.ProviderType
11:05:50.844 ERROR - Class not found: org.osgi.annotation.versioning.ProviderType
11:05:50.847 ERROR - Class not found: org.osgi.annotation.versioning.ConsumerType
11:05:51.106 ERROR - Class not found: org.osgi.annotation.versioning.ProviderType
11:05:51.110 ERROR - Class not found: org.osgi.annotation.versioning.ConsumerType
11:05:51.348 ERROR - Class not found: org.osgi.annotation.versioning.ConsumerType
11:05:51.349 ERROR - Class not found: org.osgi.annotation.versioning.ProviderType
11:05:51.855 ERROR - Class not found: org.osgi.annotation.versioning.ConsumerType
11:05:51.856 ERROR - Class not found: org.osgi.annotation.versioning.ProviderType
11:05:52.106 ERROR - Class not found: org.osgi.annotation.versioning.ConsumerType
11:05:52.106 ERROR - Class not found: org.osgi.annotation.versioning.ProviderType
11:05:52.256 ERROR - Class not found: org.osgi.annotation.versioning.ConsumerType
11:05:52.256 ERROR - Class not found: org.osgi.annotation.versioning.ProviderType
11:05:52.455 ERROR - Class not found: org.osgi.annotation.versioning.ProviderType
11:05:52.457 ERROR - Class not found: org.osgi.annotation.versioning.ConsumerType
11:05:52.701 ERROR - Class not found: org.osgi.annotation.versioning.ConsumerType
11:05:52.701 ERROR - Class not found: org.osgi.annotation.versioning.ProviderType
11:05:52.810 ERROR - Class not found: org.osgi.annotation.versioning.ConsumerType
11:05:52.810 ERROR - Class not found: org.osgi.annotation.versioning.ProviderType
11:05:52.975 WARN  - [JOURNAL_FLUSHER] WARNING Journal flush operation took 3,862ms last 8 cycles average is 482ms
11:05:53.060 ERROR - Class not found: org.osgi.annotation.versioning.ConsumerType
11:05:53.060 ERROR - Class not found: org.osgi.annotation.versioning.ProviderType
11:05:53.186 ERROR - Class not found: org.osgi.annotation.versioning.ConsumerType
11:05:53.187 ERROR - Class not found: org.osgi.annotation.versioning.ProviderType
11:05:53.327 ERROR - Class not found: org.osgi.annotation.versioning.ConsumerType
11:05:53.327 ERROR - Class not found: org.osgi.annotation.versioning.ProviderType
11:05:53.544 ERROR - Class not found: org.osgi.annotation.versioning.ProviderType
11:05:53.547 ERROR - Class not found: org.osgi.annotation.versioning.ConsumerType
11:05:54.026 ERROR - Class not found: org.osgi.annotation.versioning.ProviderType
11:05:54.028 ERROR - Class not found: org.osgi.annotation.versioning.ConsumerType
11:05:54.135 ERROR - Class not found: org.osgi.annotation.versioning.ConsumerType
11:05:54.135 ERROR - Class not found: org.osgi.annotation.versioning.ProviderType
11:05:54.254 ERROR - Class not found: org.osgi.annotation.versioning.ConsumerType
11:05:54.254 ERROR - Class not found: org.osgi.annotation.versioning.ProviderType
11:05:54.529 ERROR - Class not found: org.osgi.annotation.versioning.ProviderType
11:05:54.532 ERROR - Class not found: org.osgi.annotation.versioning.ConsumerType
11:05:54.681 ERROR - Class not found: org.osgi.annotation.versioning.ConsumerType
11:05:54.681 ERROR - Class not found: org.osgi.annotation.versioning.ProviderType
11:05:54.748 INFO  - Java Main Files AST scan done: 6029 ms
11:05:54.749 INFO  - 46/46 source files have been analyzed
11:05:54.751 INFO  - Java bytecode scan...
11:05:55.159 INFO  - Java bytecode scan done: 408 ms
11:05:55.159 INFO  - Java Test Files AST scan...
11:05:55.159 INFO  - 0 source files to be analyzed
11:05:55.159 INFO  - Java Test Files AST scan done: 0 ms
11:05:55.160 INFO  - 0/0 source files have been analyzed
11:05:55.162 INFO  - Package design analysis...
11:05:55.242 INFO  - Package design analysis done: 80 ms
11:05:55.249 INFO  - Sensor JavaSquidSensor done: 7764 ms
11:05:55.250 INFO  - Sensor QProfileSensor...
11:05:55.251 INFO  - Sensor QProfileSensor done: 1 ms
11:05:55.252 INFO  - Sensor InitialOpenIssuesSensor...
11:05:55.295 INFO  - Sensor InitialOpenIssuesSensor done: 43 ms
11:05:55.295 INFO  - Sensor ProjectLinksSensor...
11:05:55.299 INFO  - Sensor ProjectLinksSensor done: 4 ms
11:05:55.300 INFO  - Sensor VersionEventsSensor...
11:05:55.306 INFO  - Sensor VersionEventsSensor done: 6 ms
11:05:55.306 INFO  - Sensor FileHashSensor...
11:05:55.311 INFO  - Sensor FileHashSensor done: 5 ms
11:05:55.311 INFO  - Sensor org.sonar.plugins.findbugs.FindbugsSensor@4d561fe9...
11:05:55.313 INFO  - Execute Findbugs 3.0.1...
11:05:56.674 INFO  - Findbugs output report: /jobs/genie.corrosion/corrosion/branches/master/workspace/org.eclipse.corrosion/target/sonar/findbugs-result.xml
11:06:05.341 INFO  - Execute Findbugs 3.0.1 done: 10028 ms
11:06:05.348 INFO  - Sensor org.sonar.plugins.findbugs.FindbugsSensor@4d561fe9 done: 10037 ms
11:06:05.348 INFO  - Sensor SurefireSensor...
11:06:05.349 INFO  - parsing /jobs/genie.corrosion/corrosion/branches/master/workspace/org.eclipse.corrosion/target/surefire-reports
11:06:05.350 ERROR - Reports path not found or is not a directory: /jobs/genie.corrosion/corrosion/branches/master/workspace/org.eclipse.corrosion/target/surefire-reports
11:06:05.350 INFO  - Sensor SurefireSensor done: 2 ms
11:06:05.350 INFO  - Sensor PmdSensor...
11:06:05.351 INFO  - Execute PMD 5.4.2...
11:06:05.483 INFO  - Java version: 1.6
11:06:05.515 INFO  - PMD configuration: /jobs/genie.corrosion/corrosion/branches/master/workspace/org.eclipse.corrosion/target/sonar/pmd.xml
11:06:08.067 INFO  - Execute PMD 5.4.2 done: 2716 ms
11:06:08.072 INFO  - Sensor PmdSensor done: 2722 ms
11:06:08.072 INFO  - Sensor CheckstyleSensor...
11:06:08.074 INFO  - Execute Checkstyle ${checkstyle.version}...
11:06:08.088 INFO  - Checkstyle configuration: /jobs/genie.corrosion/corrosion/branches/master/workspace/org.eclipse.corrosion/target/sonar/checkstyle.xml
11:06:10.133 INFO  - Execute Checkstyle ${checkstyle.version} done: 2059 ms
11:06:10.133 INFO  - Sensor CheckstyleSensor done: 2061 ms
11:06:10.133 INFO  - Sensor CPD Sensor (wrapped)...
11:06:10.134 INFO  - JavaCpdEngine is used for java
11:06:10.136 INFO  - Cross-project analysis disabled
11:06:10.312 INFO  - Sensor CPD Sensor (wrapped) done: 179 ms
11:06:10.435 INFO  - Execute decorators...
11:06:11.277 INFO  - -------------  Scan org.eclipse.corrosion.tests
11:06:11.279 INFO  - Load module settings
11:06:11.379 INFO  - Configure Maven plugins
11:06:11.381 INFO  - Compare to previous analysis (2019-05-01)
11:06:11.382 INFO  - Compare over 30 days (2019-05-13, analysis of 2019-05-01 11:04:20.0)
11:06:11.384 INFO  - Compare to previous version (2019-03-13)
11:06:11.385 INFO  - No quality gate is configured.
11:06:11.402 INFO  - Base dir: /jobs/genie.corrosion/corrosion/branches/master/workspace/org.eclipse.corrosion.tests
11:06:11.402 INFO  - Working dir: /jobs/genie.corrosion/corrosion/branches/master/workspace/org.eclipse.corrosion.tests/target/sonar
11:06:11.403 INFO  - Source paths: pom.xml, src
11:06:11.403 INFO  - Binary dirs: target/classes
11:06:11.403 INFO  - Source encoding: UTF-8, default locale: en_US
11:06:11.403 INFO  - Index files
11:06:11.403 INFO  - Excluded sources: 
11:06:11.403 INFO  -   **/util/*Switch.java
11:06:11.422 INFO  - 11 files indexed
11:06:11.475 INFO  - Quality profile for java: Sonar way with Findbugs
11:06:11.478 INFO  - JaCoCoItSensor: JaCoCo IT report not found: /jobs/genie.corrosion/corrosion/branches/master/workspace/org.eclipse.corrosion.tests/target/jacoco-it.exec
11:06:11.480 INFO  - Sensor JavaSquidSensor...
11:06:11.482 INFO  - Configured Java source version (sonar.java.source): 6
11:06:11.482 INFO  - JavaClasspath initialization...
11:06:11.512 INFO  - JavaClasspath initialization done: 30 ms
11:06:11.512 INFO  - JavaTestClasspath initialization...
11:06:11.549 INFO  - JavaTestClasspath initialization done: 37 ms
11:06:11.557 INFO  - Java Main Files AST scan...
11:06:11.557 INFO  - 11 source files to be analyzed
11:06:11.723 ERROR - Class not found: org.osgi.annotation.versioning.ProviderType
11:06:11.725 ERROR - Class not found: org.osgi.annotation.versioning.ConsumerType
11:06:12.073 ERROR - Class not found: org.osgi.annotation.versioning.ConsumerType
11:06:12.074 ERROR - Class not found: org.osgi.annotation.versioning.ProviderType
11:06:12.962 ERROR - Class not found: org.osgi.annotation.versioning.ProviderType
11:06:12.965 ERROR - Class not found: org.osgi.annotation.versioning.ConsumerType
11:06:13.135 ERROR - Class not found: org.osgi.annotation.versioning.ConsumerType
11:06:13.136 ERROR - Class not found: org.osgi.annotation.versioning.ProviderType
11:06:13.469 INFO  - Java Main Files AST scan done: 1913 ms
11:06:13.469 INFO  - 11/11 source files have been analyzed
11:06:13.470 INFO  - Java bytecode scan...
11:06:13.541 WARN  - Class 'org/eclipse/corrosion/CorrosionPlugin' is not accessible through the ClassLoader.
11:06:13.541 WARN  - Class 'org/eclipse/corrosion/CorrosionPlugin' is not accessible through the ClassLoader.
11:06:13.542 WARN  - Class 'org/eclipse/corrosion/CorrosionPlugin' is not accessible through the ClassLoader.
11:06:13.542 WARN  - Class 'org/eclipse/corrosion/CorrosionPlugin' is not accessible through the ClassLoader.
11:06:13.550 WARN  - Class 'org/eclipse/corrosion/debug/RustDebugDelegate' is not accessible through the ClassLoader.
11:06:13.556 WARN  - Class 'org/eclipse/corrosion/debug/RustDebugDelegate' is not accessible through the ClassLoader.
11:06:13.598 WARN  - Class 'org/eclipse/corrosion/wizards/export/CargoExportWizard' is not accessible through the ClassLoader.
11:06:13.598 WARN  - Class 'org/eclipse/corrosion/wizards/export/CargoExportWizard' is not accessible through the ClassLoader.
11:06:13.598 WARN  - Class 'org/eclipse/corrosion/wizards/export/CargoExportWizard' is not accessible through the ClassLoader.
11:06:13.602 WARN  - Class 'org/eclipse/corrosion/wizards/export/CargoExportWizard' is not accessible through the ClassLoader.
11:06:13.605 WARN  - Class 'org/eclipse/corrosion/wizards/export/CargoExportWizard' is not accessible through the ClassLoader.
11:06:13.605 WARN  - Class 'org/eclipse/corrosion/wizards/export/CargoExportWizard' is not accessible through the ClassLoader.
11:06:13.605 WARN  - Class 'org/eclipse/corrosion/wizards/export/CargoExportWizardPage' is not accessible through the ClassLoader.
11:06:13.605 WARN  - Class 'org/eclipse/corrosion/wizards/export/CargoExportWizard' is not accessible through the ClassLoader.
11:06:13.606 WARN  - Class 'org/eclipse/corrosion/wizards/export/CargoExportWizard' is not accessible through the ClassLoader.
11:06:13.606 WARN  - Class 'org/eclipse/corrosion/wizards/export/CargoExportWizard' is not accessible through the ClassLoader.
11:06:13.619 WARN  - Class 'org/eclipse/corrosion/edit/RLSClientImplementation' is not accessible through the ClassLoader.
11:06:13.622 WARN  - Class 'org/eclipse/corrosion/extensions/ProgressParams' is not accessible through the ClassLoader.
11:06:13.622 WARN  - Class 'org/eclipse/corrosion/edit/RLSClientImplementation' is not accessible through the ClassLoader.
11:06:13.622 WARN  - Class 'org/eclipse/corrosion/extensions/ProgressParams' is not accessible through the ClassLoader.
11:06:13.622 WARN  - Class 'org/eclipse/corrosion/edit/RLSClientImplementation' is not accessible through the ClassLoader.
11:06:13.623 WARN  - Class 'org/eclipse/corrosion/extensions/ProgressParams' is not accessible through the ClassLoader.
11:06:13.623 WARN  - Class 'org/eclipse/corrosion/edit/RLSClientImplementation' is not accessible through the ClassLoader.
11:06:13.623 WARN  - Class 'org/eclipse/corrosion/extensions/ProgressParams' is not accessible through the ClassLoader.
11:06:13.623 WARN  - Class 'org/eclipse/corrosion/edit/RLSClientImplementation' is not accessible through the ClassLoader.
11:06:13.623 WARN  - Class 'org/eclipse/corrosion/edit/RLSClientImplementation' is not accessible through the ClassLoader.
11:06:13.623 WARN  - Class 'org/eclipse/corrosion/extensions/ProgressParams' is not accessible through the ClassLoader.
11:06:13.624 WARN  - Class 'org/eclipse/corrosion/edit/RLSClientImplementation' is not accessible through the ClassLoader.
11:06:13.624 WARN  - Class 'org/eclipse/corrosion/extensions/ProgressParams' is not accessible through the ClassLoader.
11:06:13.624 WARN  - Class 'org/eclipse/corrosion/edit/RLSClientImplementation' is not accessible through the ClassLoader.
11:06:13.638 WARN  - Class 'org/eclipse/corrosion/wizards/newproject/NewCargoProjectWizard' is not accessible through the ClassLoader.
11:06:13.638 WARN  - Class 'org/eclipse/corrosion/wizards/newproject/NewCargoProjectWizard' is not accessible through the ClassLoader.
11:06:13.638 WARN  - Class 'org/eclipse/corrosion/wizards/newproject/NewCargoProjectWizard' is not accessible through the ClassLoader.
11:06:13.639 WARN  - Class 'org/eclipse/corrosion/wizards/newproject/NewCargoProjectWizardPage' is not accessible through the ClassLoader.
11:06:13.639 WARN  - Class 'org/eclipse/corrosion/wizards/newproject/NewCargoProjectWizardPage' is not accessible through the ClassLoader.
11:06:13.639 WARN  - Class 'org/eclipse/corrosion/wizards/newproject/NewCargoProjectWizardPage' is not accessible through the ClassLoader.
11:06:13.640 WARN  - Class 'org/eclipse/corrosion/wizards/newproject/NewCargoProjectWizard' is not accessible through the ClassLoader.
11:06:13.640 WARN  - Class 'org/eclipse/corrosion/wizards/newproject/NewCargoProjectWizard' is not accessible through the ClassLoader.
11:06:13.640 WARN  - Class 'org/eclipse/corrosion/wizards/newproject/NewCargoProjectWizard' is not accessible through the ClassLoader.
11:06:13.641 WARN  - Class 'org/eclipse/corrosion/wizards/newproject/NewCargoProjectWizard' is not accessible through the ClassLoader.
11:06:13.641 WARN  - Class 'org/eclipse/corrosion/wizards/newproject/NewCargoProjectWizard' is not accessible through the ClassLoader.
11:06:13.641 WARN  - Class 'org/eclipse/corrosion/wizards/newproject/NewCargoProjectWizard' is not accessible through the ClassLoader.
11:06:13.641 WARN  - Class 'org/eclipse/corrosion/wizards/newproject/NewCargoProjectWizard' is not accessible through the ClassLoader.
11:06:13.643 WARN  - Class 'org/eclipse/corrosion/wizards/newproject/NewCargoProjectWizard' is not accessible through the ClassLoader.
11:06:13.643 WARN  - Class 'org/eclipse/corrosion/wizards/newproject/NewCargoProjectWizard' is not accessible through the ClassLoader.
11:06:13.644 WARN  - Class 'org/eclipse/corrosion/run/CargoRunDelegate' is not accessible through the ClassLoader.
11:06:13.644 WARN  - Class 'org/eclipse/corrosion/run/CargoRunDelegate' is not accessible through the ClassLoader.
11:06:13.651 WARN  - Class 'org/eclipse/corrosion/snippet/SnippetContentAssistProcessor' is not accessible through the ClassLoader.
11:06:13.651 WARN  - Class 'org/eclipse/corrosion/snippet/SnippetContentAssistProcessor' is not accessible through the ClassLoader.
11:06:13.686 INFO  - Java bytecode scan done: 216 ms
11:06:13.687 INFO  - Java Test Files AST scan...
11:06:13.687 INFO  - 0 source files to be analyzed
11:06:13.687 INFO  - Java Test Files AST scan done: 0 ms
11:06:13.687 INFO  - Package design analysis...
11:06:13.687 INFO  - 0/0 source files have been analyzed
11:06:13.767 INFO  - Package design analysis done: 80 ms
11:06:13.768 INFO  - Sensor JavaSquidSensor done: 2288 ms
11:06:13.769 INFO  - Sensor QProfileSensor...
11:06:13.770 INFO  - Sensor QProfileSensor done: 1 ms
11:06:13.770 INFO  - Sensor InitialOpenIssuesSensor...
11:06:13.775 INFO  - Sensor InitialOpenIssuesSensor done: 5 ms
11:06:13.775 INFO  - Sensor ProjectLinksSensor...
11:06:13.780 INFO  - Sensor ProjectLinksSensor done: 5 ms
11:06:13.781 INFO  - Sensor VersionEventsSensor...
11:06:13.787 INFO  - Sensor VersionEventsSensor done: 6 ms
11:06:13.788 INFO  - Sensor FileHashSensor...
11:06:13.789 INFO  - Sensor FileHashSensor done: 2 ms
11:06:13.789 INFO  - Sensor org.sonar.plugins.findbugs.FindbugsSensor@4cfd7d8a...
11:06:13.789 INFO  - Execute Findbugs 3.0.1...
11:06:13.827 INFO  - Findbugs output report: /jobs/genie.corrosion/corrosion/branches/master/workspace/org.eclipse.corrosion.tests/target/sonar/findbugs-result.xml
The following classes needed for analysis were missing:
  org.eclipse.corrosion.edit.RLSClientImplementation
  org.eclipse.corrosion.extensions.ProgressParams
  org.eclipse.corrosion.CorrosionPlugin
  org.eclipse.corrosion.debug.RustDebugDelegate
  org.eclipse.corrosion.snippet.SnippetContentAssistProcessor
  org.eclipse.corrosion.wizards.export.CargoExportWizard
  org.eclipse.corrosion.wizards.export.CargoExportWizardPage
  org.eclipse.corrosion.wizards.newproject.NewCargoProjectWizard
  org.eclipse.corrosion.wizards.newproject.NewCargoProjectWizardPage
  org.eclipse.corrosion.run.CargoRunDelegate
11:06:16.163 INFO  - Execute Findbugs 3.0.1 done: 2374 ms
11:06:16.164 INFO  - Sensor org.sonar.plugins.findbugs.FindbugsSensor@4cfd7d8a done: 2375 ms
11:06:16.164 INFO  - Sensor SurefireSensor...
11:06:16.164 INFO  - parsing /jobs/genie.corrosion/corrosion/branches/master/workspace/org.eclipse.corrosion.tests/target/surefire-reports
11:06:16.729 INFO  - Sensor SurefireSensor done: 565 ms
11:06:16.729 INFO  - Sensor JaCoCoOverallSensor...
11:06:16.738 INFO  - Analysing /jobs/genie.corrosion/corrosion/branches/master/workspace/org.eclipse.corrosion.tests/target/jacoco.exec
11:06:16.748 INFO  - Analysing /jobs/genie.corrosion/corrosion/branches/master/workspace/org.eclipse.corrosion.tests/target/sonar/jacoco-overall.exec
11:06:16.813 INFO  - No information about coverage per test.
11:06:16.813 INFO  - Sensor JaCoCoOverallSensor done: 84 ms
11:06:16.813 INFO  - Sensor PmdSensor...
11:06:16.814 INFO  - Execute PMD 5.4.2...
11:06:16.817 INFO  - Java version: 1.6
11:06:16.822 INFO  - PMD configuration: /jobs/genie.corrosion/corrosion/branches/master/workspace/org.eclipse.corrosion.tests/target/sonar/pmd.xml
11:06:17.457 INFO  - Execute PMD 5.4.2 done: 644 ms
11:06:17.457 INFO  - Sensor PmdSensor done: 644 ms
11:06:17.458 INFO  - Sensor CheckstyleSensor...
11:06:17.458 INFO  - Execute Checkstyle ${checkstyle.version}...
11:06:17.459 INFO  - Checkstyle configuration: /jobs/genie.corrosion/corrosion/branches/master/workspace/org.eclipse.corrosion.tests/target/sonar/checkstyle.xml
11:06:17.742 INFO  - Execute Checkstyle ${checkstyle.version} done: 284 ms
11:06:17.742 INFO  - Sensor CheckstyleSensor done: 284 ms
11:06:17.742 INFO  - Sensor JaCoCoSensor...
11:06:17.743 INFO  - Analysing /jobs/genie.corrosion/corrosion/branches/master/workspace/org.eclipse.corrosion.tests/target/jacoco.exec
11:06:17.759 INFO  - No information about coverage per test.
11:06:17.759 INFO  - Sensor JaCoCoSensor done: 17 ms
11:06:17.759 INFO  - Sensor CPD Sensor (wrapped)...
11:06:17.759 INFO  - JavaCpdEngine is used for java
11:06:17.759 INFO  - Cross-project analysis disabled
11:06:17.776 INFO  - Sensor CPD Sensor (wrapped) done: 17 ms
11:06:17.894 INFO  - Execute decorators...
11:06:17.977 INFO  - -------------  Scan org.eclipse.corrosion.feature
11:06:17.978 INFO  - Load module settings
11:06:18.007 INFO  - Configure Maven plugins
11:06:18.009 INFO  - Compare to previous analysis (2019-05-01)
11:06:18.010 INFO  - Compare over 30 days (2019-05-13, analysis of 2019-05-01 11:04:20.0)
11:06:18.011 INFO  - Compare to previous version (2019-03-13)
11:06:18.012 INFO  - No quality gate is configured.
11:06:18.025 INFO  - Base dir: /jobs/genie.corrosion/corrosion/branches/master/workspace/org.eclipse.corrosion.feature
11:06:18.025 INFO  - Working dir: /jobs/genie.corrosion/corrosion/branches/master/workspace/org.eclipse.corrosion.feature/target/sonar
11:06:18.026 INFO  - Source paths: pom.xml
11:06:18.026 INFO  - Source encoding: UTF-8, default locale: en_US
11:06:18.026 INFO  - Index files
11:06:18.026 INFO  - Excluded sources: 
11:06:18.026 INFO  -   **/util/*Switch.java
11:06:18.030 INFO  - 0 files indexed
11:06:18.032 INFO  - JaCoCoSensor: JaCoCo report not found : /jobs/genie.corrosion/corrosion/branches/master/workspace/org.eclipse.corrosion.feature/target/jacoco.exec
11:06:18.032 INFO  - JaCoCoItSensor: JaCoCo IT report not found: /jobs/genie.corrosion/corrosion/branches/master/workspace/org.eclipse.corrosion.feature/target/jacoco-it.exec
11:06:18.034 INFO  - Sensor QProfileSensor...
11:06:18.035 INFO  - Sensor QProfileSensor done: 1 ms
11:06:18.035 INFO  - Sensor InitialOpenIssuesSensor...
11:06:18.038 INFO  - Sensor InitialOpenIssuesSensor done: 3 ms
11:06:18.038 INFO  - Sensor ProjectLinksSensor...
11:06:18.042 INFO  - Sensor ProjectLinksSensor done: 4 ms
11:06:18.043 INFO  - Sensor VersionEventsSensor...
11:06:18.049 INFO  - Sensor VersionEventsSensor done: 6 ms
11:06:18.049 INFO  - Sensor FileHashSensor...
11:06:18.049 INFO  - Sensor FileHashSensor done: 0 ms
11:06:18.049 INFO  - Sensor CPD Sensor (wrapped)...
11:06:18.049 INFO  - Sensor CPD Sensor (wrapped) done: 0 ms
11:06:18.126 INFO  - Execute decorators...
11:06:18.142 INFO  - -------------  Scan repository
11:06:18.143 INFO  - Load module settings
11:06:18.170 INFO  - Configure Maven plugins
11:06:18.171 INFO  - Compare to previous analysis (2019-05-01)
11:06:18.172 INFO  - Compare over 30 days (2019-05-13, analysis of 2019-05-01 11:04:20.0)
11:06:18.173 INFO  - Compare to previous version (2019-03-13)
11:06:18.174 INFO  - No quality gate is configured.
11:06:18.187 INFO  - Base dir: /jobs/genie.corrosion/corrosion/branches/master/workspace/repository
11:06:18.187 INFO  - Working dir: /jobs/genie.corrosion/corrosion/branches/master/workspace/repository/target/sonar
11:06:18.187 INFO  - Source paths: pom.xml
11:06:18.187 INFO  - Source encoding: UTF-8, default locale: en_US
11:06:18.187 INFO  - Index files
11:06:18.187 INFO  - Excluded sources: 
11:06:18.187 INFO  -   **/util/*Switch.java
11:06:18.191 INFO  - 0 files indexed
11:06:18.192 INFO  - JaCoCoSensor: JaCoCo report not found : /jobs/genie.corrosion/corrosion/branches/master/workspace/repository/target/jacoco.exec
11:06:18.192 INFO  - JaCoCoItSensor: JaCoCo IT report not found: /jobs/genie.corrosion/corrosion/branches/master/workspace/repository/target/jacoco-it.exec
11:06:18.194 INFO  - Sensor QProfileSensor...
11:06:18.194 INFO  - Sensor QProfileSensor done: 0 ms
11:06:18.194 INFO  - Sensor InitialOpenIssuesSensor...
11:06:18.198 INFO  - Sensor InitialOpenIssuesSensor done: 4 ms
11:06:18.198 INFO  - Sensor ProjectLinksSensor...
11:06:18.201 INFO  - Sensor ProjectLinksSensor done: 3 ms
11:06:18.202 INFO  - Sensor VersionEventsSensor...
11:06:18.206 INFO  - Sensor VersionEventsSensor done: 4 ms
11:06:18.206 INFO  - Sensor FileHashSensor...
11:06:18.206 INFO  - Sensor FileHashSensor done: 0 ms
11:06:18.206 INFO  - Sensor CPD Sensor (wrapped)...
11:06:18.206 INFO  - Sensor CPD Sensor (wrapped) done: 0 ms
11:06:18.295 INFO  - Execute decorators...
11:06:18.310 INFO  - -------------  Scan parent
11:06:18.311 INFO  - Load module settings
11:06:18.335 INFO  - Configure Maven plugins
11:06:18.336 INFO  - Compare to previous analysis (2019-05-01)
11:06:18.337 INFO  - Compare over 30 days (2019-05-13, analysis of 2019-05-01 11:04:20.0)
11:06:18.338 INFO  - Compare to previous version (2019-03-13)
11:06:18.339 INFO  - No quality gate is configured.
11:06:18.348 INFO  - Base dir: /jobs/genie.corrosion/corrosion/branches/master/workspace
11:06:18.349 INFO  - Working dir: /jobs/genie.corrosion/corrosion/branches/master/workspace/target/sonar
11:06:18.349 INFO  - Source encoding: UTF-8, default locale: en_US
11:06:18.349 INFO  - JaCoCoSensor: JaCoCo report not found : /jobs/genie.corrosion/corrosion/branches/master/workspace/target/jacoco.exec
11:06:18.349 INFO  - JaCoCoItSensor: JaCoCo IT report not found: /jobs/genie.corrosion/corrosion/branches/master/workspace/target/jacoco-it.exec
11:06:18.351 INFO  - Sensor InitialOpenIssuesSensor...
11:06:18.354 INFO  - Sensor InitialOpenIssuesSensor done: 3 ms
11:06:18.354 INFO  - Sensor ProjectLinksSensor...
11:06:18.357 INFO  - Sensor ProjectLinksSensor done: 3 ms
11:06:18.358 INFO  - Sensor VersionEventsSensor...
11:06:18.363 INFO  - Sensor VersionEventsSensor done: 5 ms
11:06:18.363 INFO  - Sensor FileHashSensor...
11:06:18.363 INFO  - Sensor FileHashSensor done: 0 ms
11:06:18.363 INFO  - Sensor CPD Sensor (wrapped)...
11:06:18.363 INFO  - Sensor CPD Sensor (wrapped) done: 0 ms
11:06:18.434 INFO  - Execute decorators...
11:06:18.470 INFO  - Store results in database
11:06:19.589 INFO  - ANALYSIS SUCCESSFUL, you can browse https://sonar.eclipse.org/dashboard/index/org.eclipse.corrosion:parent
11:06:20.822 INFO  - Executing post-job class org.sonar.plugins.core.issue.notification.SendIssueNotificationsPostJob
11:06:20.824 INFO  - Executing post-job class org.sonar.plugins.core.batch.IndexProjectPostJob
11:06:20.860 INFO  - Executing post-job class org.sonar.plugins.dbcleaner.ProjectPurgePostJob
11:06:20.870 INFO  - -> Keep one snapshot per day between 2019-05-15 and 2019-06-11
11:06:20.871 INFO  - -> Keep one snapshot per week between 2018-06-13 and 2019-05-15
11:06:20.872 INFO  - <- Delete snapshot: 2019-04-10T07:16:07-0400 [38321395]
11:06:20.896 INFO  - -> Keep one snapshot per month between 2014-06-18 and 2018-06-13
11:06:20.896 INFO  - -> Delete data prior to: 2014-06-18
11:06:20.903 INFO  - -> Clean parent [id=199366]
11:06:20.905 INFO  - <- Clean snapshot 38830023
11:06:21.005 INFO  - -> Clean target-platform [id=199367]
11:06:21.008 INFO  - -> Clean org.eclipse.corrosion [id=199368]
11:06:21.009 INFO  - -> Clean org.eclipse.corrosion.tests [id=199369]
11:06:21.011 INFO  - -> Clean org.eclipse.corrosion.feature [id=199370]
11:06:21.013 INFO  - -> Clean repository [id=199371]
[INFO] ------------------------------------------------------------------------
[INFO] Reactor Summary:
[INFO] 
[INFO] parent 0.4.1-SNAPSHOT .............................. SUCCESS [ 53.909 s]
[INFO] target-platform 0.4.1-SNAPSHOT ..................... SKIPPED
[INFO] org.eclipse.corrosion 0.4.1-SNAPSHOT ............... SKIPPED
[INFO] org.eclipse.corrosion.tests 0.4.0-SNAPSHOT ......... SKIPPED
[INFO] org.eclipse.corrosion.feature 0.4.1-SNAPSHOT ....... SKIPPED
[INFO] repository 0.4.1-SNAPSHOT .......................... SKIPPED
[INFO] ------------------------------------------------------------------------
[INFO] BUILD SUCCESS
[INFO] ------------------------------------------------------------------------
[INFO] Total time:  01:06 min
[INFO] Finished at: 2019-06-12T11:06:21-04:00
[INFO] ------------------------------------------------------------------------
[Pipeline] }
[Pipeline] // withSonarQubeEnv
[Pipeline] }
[Pipeline] // withEnv
[Pipeline] }
[Pipeline] // stage
[Pipeline] stage
[Pipeline] { (Deploy)
[Pipeline] tool
[Pipeline] envVarsForTool
[Pipeline] tool
[Pipeline] envVarsForTool
[Pipeline] withEnv
[Pipeline] {
[Pipeline] sh
+ rm -rf /home/data/httpd/download.eclipse.org/corrosion/snapshots
[Pipeline] sh
+ mkdir -p /home/data/httpd/download.eclipse.org/corrosion/snapshots
[Pipeline] sh
+ cp -r repository/target/repository/artifacts.jar repository/target/repository/artifacts.xml.xz repository/target/repository/content.jar repository/target/repository/content.xml.xz repository/target/repository/features repository/target/repository/p2.index repository/target/repository/plugins /home/data/httpd/download.eclipse.org/corrosion/snapshots
[Pipeline] sh
+ cp repository/target/repository-0.4.1-SNAPSHOT.zip /home/data/httpd/download.eclipse.org/corrosion/snapshots/repository.zip
[Pipeline] }
[Pipeline] // withEnv
[Pipeline] }
[Pipeline] // stage
[Pipeline] }
[Pipeline] // withEnv
[Pipeline] }
[Pipeline] // withEnv
[Pipeline] }
[Pipeline] // withEnv
[Pipeline] }
[Pipeline] // node
[Pipeline] End of Pipeline

GitHub has been notified of this commit’s build result

Finished: UNSTABLE