Console Output

Started by timer
Checkout:workspace / /home/hudson/genie.collections/.hudson/jobs/coverage-nightly/workspace - hudson.remoting.LocalChannel@75ec1682
Using strategy: Default
Git Exe: git
Last Built Revision: Revision 8a378efd53a7e8c7025bbbee1a20a3fef424f73e (origin/master)
Checkout:workspace / /home/hudson/genie.collections/.hudson/jobs/coverage-nightly/workspace - hudson.remoting.LocalChannel@75ec1682
Fetching changes from the remote Git repository
Fetching upstream changes from https://github.com/eclipse/eclipse-collections.git
Commencing build of Revision 8a378efd53a7e8c7025bbbee1a20a3fef424f73e (origin/master)
Checking out Revision 8a378efd53a7e8c7025bbbee1a20a3fef424f73e (origin/master)
[INFO] Using Maven 3 installation: apache-maven-latest
[INFO] Checking Maven 3 installation environment
[workspace] $ /shared/common/apache-maven-latest/bin/mvn --help
[INFO] Checking Maven 3 installation version
[INFO] Detected Maven 3 installation version: 3.3.9
[workspace] $ /shared/common/apache-maven-latest/bin/mvn clean generate-sources clover:setup install clover:aggregate clover:clover -V -B -e -Dmaven.ext.class.path=/home/hudson/genie.collections/.hudson/maven/slavebundle/resources:/home/hudson/genie.collections/.hudson/maven/slavebundle/lib/maven3-eventspy-3.1.jar:/home/hudson/genie.collections/.hudson/war/webapp/WEB-INF/lib/hudson-remoting-3.0.3.jar -Dhudson.eventspy.port=51055 -Dmaven.repo.local=/home/hudson/genie.collections/.hudson/jobs/coverage-nightly/workspace/.maven/repo -f pom.xml
[DEBUG] Waiting for connection on port: 51055
Apache Maven 3.3.9 (bb52d8502b132ec0a5a3f4c09453c07478323dc5; 2015-11-10T11:41:47-05:00)
Maven home: /shared/common/apache-maven-latest
Java version: 1.8.0_51, vendor: Oracle Corporation
Java home: /opt/public/common/jdk1.8.0_51.x64/jre
Default locale: en_US, platform encoding: UTF-8
OS name: "linux", version: "3.0.101-0.47.71-default", arch: "amd64", family: "unix"
SLF4J: Class path contains multiple SLF4J bindings.
SLF4J: Found binding in [jar:file:/home/hudson/genie.collections/.hudson/maven/slavebundle/lib/maven3-eventspy-runtime.jar!/org/slf4j/impl/StaticLoggerBinder.class]
SLF4J: Found binding in [jar:file:/shared/common/apache-maven-latest/lib/slf4j-simple-1.7.5.jar!/org/slf4j/impl/StaticLoggerBinder.class]
SLF4J: See http://www.slf4j.org/codes.html#multiple_bindings for an explanation.
[DEBUG] Connected to remote
[INFO] Error stacktraces are turned on.
[WARN] o.h.m.e.EventSpyProcessor - Unhandled event: org.apache.maven.toolchain.building.DefaultToolchainsBuildingRequest@23cd4ff2 (org.apache.maven.toolchain.building.DefaultToolchainsBuildingRequest)
[WARN] o.h.m.e.EventSpyProcessor - Unhandled event: org.apache.maven.toolchain.building.DefaultToolchainsBuildingRequest@23cd4ff2 (org.apache.maven.toolchain.building.DefaultToolchainsBuildingRequest)
[INFO] Scanning for projects...
[INFO] ------------------------------------------------------------------------
[INFO] Reactor Build Order:
[INFO] 
[INFO] Eclipse Collections Parent Project
[INFO] Eclipse Collections Code Generator
[INFO] Eclipse Collections Code Generator Ant Task
[INFO] Eclipse Collections Code Generator Maven Plugin
[INFO] Eclipse Collections API
[INFO] Eclipse Collections Main Library
[INFO] Eclipse Collections Test Utilities
[INFO] Eclipse Collections Fork Join Utilities
[INFO] Eclipse Collections Unit Test Suite
[INFO] Eclipse Collections Scala Unit Test Suite
[INFO] Eclipse Collections Serialization Test Suite
[INFO] Eclipse Collections JMH Scala Test Suite
[INFO] Eclipse Collections JMH Test Suite
[INFO] Eclipse Collections Test Trait JUnit Runner
[INFO] Eclipse Collections Java 8 Unit Test Suite
[WARNING] The POM for org.apache.maven.plugins:maven-release-plugin:jar:3.0-r1585899 is missing, no dependency information available
[WARNING] Failed to retrieve plugin descriptor for org.apache.maven.plugins:maven-release-plugin:3.0-r1585899: Plugin org.apache.maven.plugins:maven-release-plugin:3.0-r1585899 or one of its dependencies could not be resolved: Failure to find org.apache.maven.plugins:maven-release-plugin:jar:3.0-r1585899 in https://repo.maven.apache.org/maven2 was cached in the local repository, resolution will not be reattempted until the update interval of central has elapsed or updates are forced
[INFO] ------------------------------------------------------------------------
[INFO] Reactor Summary:
[INFO] 
[INFO] Eclipse Collections Parent Project ................. SKIPPED
[INFO] Eclipse Collections Code Generator ................. SKIPPED
[INFO] Eclipse Collections Code Generator Ant Task ........ SKIPPED
[INFO] Eclipse Collections Code Generator Maven Plugin .... SKIPPED
[INFO] Eclipse Collections API ............................ SKIPPED
[INFO] Eclipse Collections Main Library ................... SKIPPED
[INFO] Eclipse Collections Test Utilities ................. SKIPPED
[INFO] Eclipse Collections Fork Join Utilities ............ SKIPPED
[INFO] Eclipse Collections Unit Test Suite ................ SKIPPED
[INFO] Eclipse Collections Scala Unit Test Suite .......... SKIPPED
[INFO] Eclipse Collections Serialization Test Suite ....... SKIPPED
[INFO] Eclipse Collections JMH Scala Test Suite ........... SKIPPED
[INFO] Eclipse Collections JMH Test Suite ................. SKIPPED
[INFO] Eclipse Collections Test Trait JUnit Runner ........ SKIPPED
[INFO] Eclipse Collections Java 8 Unit Test Suite ......... SKIPPED
[INFO] ------------------------------------------------------------------------
[INFO] BUILD FAILURE
[INFO] ------------------------------------------------------------------------
[INFO] Total time: 1.880 s
[INFO] Finished at: 2016-06-05T21:00:42-04:00
[INFO] Final Memory: 26M/1458M
[INFO] ------------------------------------------------------------------------
[INFO] o.h.m.e.h.MavenExecutionResultHandler - Build failed with exception(s)
[INFO] o.h.m.e.h.MavenExecutionResultHandler - [1] org.apache.maven.plugin.MojoNotFoundException: Could not find goal 'setup' in plugin org.apache.maven.plugins:maven-clover-plugin:2.4 among available goals aggregate, check, instrumentInternal, instrument, log, clover, save-history
[DEBUG] Closing connection to remote
[ERROR] Could not find goal 'setup' in plugin org.apache.maven.plugins:maven-clover-plugin:2.4 among available goals aggregate, check, instrumentInternal, instrument, log, clover, save-history -> [Help 1]
org.apache.maven.plugin.MojoNotFoundException: Could not find goal 'setup' in plugin org.apache.maven.plugins:maven-clover-plugin:2.4 among available goals aggregate, check, instrumentInternal, instrument, log, clover, save-history
	at org.apache.maven.plugin.internal.DefaultMavenPluginManager.getMojoDescriptor(DefaultMavenPluginManager.java:290)
	at org.apache.maven.plugin.DefaultBuildPluginManager.getMojoDescriptor(DefaultBuildPluginManager.java:241)
	at org.apache.maven.lifecycle.internal.MojoDescriptorCreator.getMojoDescriptor(MojoDescriptorCreator.java:238)
	at org.apache.maven.lifecycle.internal.DefaultLifecycleTaskSegmentCalculator.calculateTaskSegments(DefaultLifecycleTaskSegmentCalculator.java:103)
	at org.apache.maven.lifecycle.internal.DefaultLifecycleTaskSegmentCalculator.calculateTaskSegments(DefaultLifecycleTaskSegmentCalculator.java:83)
	at org.apache.maven.lifecycle.internal.LifecycleStarter.execute(LifecycleStarter.java:89)
	at org.apache.maven.DefaultMaven.doExecute(DefaultMaven.java:307)
	at org.apache.maven.DefaultMaven.doExecute(DefaultMaven.java:193)
	at org.apache.maven.DefaultMaven.execute(DefaultMaven.java:106)
	at org.apache.maven.cli.MavenCli.execute(MavenCli.java:863)
	at org.apache.maven.cli.MavenCli.doMain(MavenCli.java:288)
	at org.apache.maven.cli.MavenCli.main(MavenCli.java:199)
	at sun.reflect.NativeMethodAccessorImpl.invoke0(Native Method)
	at sun.reflect.NativeMethodAccessorImpl.invoke(NativeMethodAccessorImpl.java:62)
	at sun.reflect.DelegatingMethodAccessorImpl.invoke(DelegatingMethodAccessorImpl.java:43)
	at java.lang.reflect.Method.invoke(Method.java:497)
	at org.codehaus.plexus.classworlds.launcher.Launcher.launchEnhanced(Launcher.java:289)
	at org.codehaus.plexus.classworlds.launcher.Launcher.launch(Launcher.java:229)
	at org.codehaus.plexus.classworlds.launcher.Launcher.mainWithExitCode(Launcher.java:415)
	at org.codehaus.plexus.classworlds.launcher.Launcher.main(Launcher.java:356)
[ERROR] 
[ERROR] Re-run Maven using the -X switch to enable full debug logging.
[ERROR] 
[ERROR] For more information about the errors and possible solutions, please read the following articles:
[ERROR] [Help 1] http://cwiki.apache.org/confluence/display/MAVEN/MojoNotFoundException
[DEBUG] Waiting for process to finish
[DEBUG] Result: 1
Archiving artifacts
Finished: FAILURE