FailedConsole Output

Started by an SCM change
Running as SYSTEM
Agent default-agent-blwjk is provisioned from template Kubernetes Pod Template
---
apiVersion: "v1"
kind: "Pod"
metadata:
  annotations: {}
  labels:
    jenkins: "slave"
  name: "default-agent-blwjk"
spec:
  containers:
  - env:
    - name: "JENKINS_SECRET"
      value: "8823ad9a8a7458c83ff9c7946c6132934c94afbee7a901944342b3f801482157"
    - name: "JENKINS_TUNNEL"
      value: "jenkins-discovery.cbi.svc.cluster.local:50000"
    - name: "JENKINS_AGENT_NAME"
      value: "default-agent-blwjk"
    - name: "JENKINS_NAME"
      value: "default-agent-blwjk"
    - name: "JENKINS_URL"
      value: "http://jenkins-ui.cbi.svc.cluster.local/cbi/"
    - name: "HOME"
      value: "/home/jenkins"
    image: "eclipsecbijenkins/jenkins-agent:3.29@sha256:7ed40e42a47fc792227d6259ce09d9f8e04a85df538d40c5903effa7346dca2f"
    imagePullPolicy: "IfNotPresent"
    name: "jnlp"
    resources:
      limits:
        memory: "4096Mi"
        cpu: "2000m"
      requests:
        memory: "4096Mi"
        cpu: "1000m"
    securityContext:
      privileged: false
    tty: true
    volumeMounts:
    - mountPath: "/home/jenkins/.m2/toolchains.xml"
      name: "toolchains-xml"
      readOnly: true
      subPath: "toolchains.xml"
    - mountPath: "/opt/tools"
      name: "volume-0"
      readOnly: false
    - mountPath: "/home/jenkins/.m2/repository"
      name: "volume-2"
      readOnly: false
    - mountPath: "/home/jenkins"
      name: "workspace-volume"
      readOnly: false
    - mountPath: "/home/jenkins/.m2/settings-security.xml"
      name: "settings-security-xml"
      readOnly: true
      subPath: "settings-security.xml"
    - mountPath: "/home/jenkins/.m2/settings.xml"
      name: "settings-xml"
      readOnly: true
      subPath: "settings.xml"
    - mountPath: "/home/jenkins/.ssh"
      name: "volume-1"
      readOnly: false
    workingDir: "/home/jenkins"
  nodeSelector: {}
  restartPolicy: "Never"
  volumes:
  - name: "settings-security-xml"
    secret:
      items:
      - key: "settings-security.xml"
        path: "settings-security.xml"
      secretName: "m2-secret-dir"
  - name: "volume-0"
    persistentVolumeClaim:
      claimName: "tools-claim-jiro-cbi"
      readOnly: true
  - configMap:
      items:
      - key: "toolchains.xml"
        path: "toolchains.xml"
      name: "m2-dir"
    name: "toolchains-xml"
  - emptyDir:
      medium: ""
    name: "volume-2"
  - configMap:
      name: "known-hosts"
    name: "volume-1"
  - name: "settings-xml"
    secret:
      items:
      - key: "settings.xml"
        path: "settings.xml"
      secretName: "m2-secret-dir"
  - emptyDir:
      medium: ""
    name: "workspace-volume"

Building remotely on default-agent-blwjk in workspace /home/jenkins/workspace/signing-packaging-common-master
No credentials specified
Cloning the remote Git repository
Cloning repository git://git.eclipse.org/gitroot/cbi/org.eclipse.cbi.git
 > /usr/bin/git init /home/jenkins/workspace/signing-packaging-common-master/org.eclipse.cbi # timeout=10
Fetching upstream changes from git://git.eclipse.org/gitroot/cbi/org.eclipse.cbi.git
 > /usr/bin/git --version # timeout=10
 > /usr/bin/git fetch --tags --force --progress git://git.eclipse.org/gitroot/cbi/org.eclipse.cbi.git +refs/heads/*:refs/remotes/origin/* # timeout=10
 > /usr/bin/git config remote.origin.url git://git.eclipse.org/gitroot/cbi/org.eclipse.cbi.git # timeout=10
 > /usr/bin/git config --add remote.origin.fetch +refs/heads/*:refs/remotes/origin/* # timeout=10
 > /usr/bin/git config remote.origin.url git://git.eclipse.org/gitroot/cbi/org.eclipse.cbi.git # timeout=10
Fetching upstream changes from git://git.eclipse.org/gitroot/cbi/org.eclipse.cbi.git
 > /usr/bin/git fetch --tags --force --progress git://git.eclipse.org/gitroot/cbi/org.eclipse.cbi.git +refs/heads/*:refs/remotes/origin/* # timeout=10
 > /usr/bin/git rev-parse origin/master^{commit} # timeout=10
Checking out Revision 54f901944c63924e15fe0da90deba92c013a5e49 (origin/master)
 > /usr/bin/git config core.sparsecheckout # timeout=10
 > /usr/bin/git checkout -f 54f901944c63924e15fe0da90deba92c013a5e49 # timeout=10
Commit message: "Use mvnw and a custom docker image for building"
 > /usr/bin/git rev-list --no-walk 58680a1cf379e206d70c10eebfb2ad516c1ff950 # timeout=10
[signing-packaging-common-master] $ /opt/tools/apache-maven/latest/bin/mvn -f org.eclipse.cbi/common/pom.xml -Dmaven.repo.local=/home/jenkins/workspace/signing-packaging-common-master/.repository clean install
Picked up JAVA_TOOL_OPTIONS: -XX:+IgnoreUnrecognizedVMOptions -XX:+UseContainerSupport -XX:+UnlockExperimentalVMOptions -XX:+UseCGroupMemoryLimitForHeap
Picked up _JAVA_OPTIONS: -XX:MaxRAMPercentage=64.0
[INFO] Scanning for projects...
[INFO] 
[INFO] ---------------------< org.eclipse.cbi:cbi-common >---------------------
[INFO] Building cbi-common 1.2.3-SNAPSHOT
[INFO] --------------------------------[ jar ]---------------------------------
Downloading from repo.eclipse.org: https://repo.eclipse.org/content/repositories/cbi/org/apache/maven/plugins/maven-enforcer-plugin/3.0.0-M2/maven-enforcer-plugin-3.0.0-M2.pom
Downloading from eclipse.maven.central.mirror: https://repo.eclipse.org/content/repositories/maven_central/org/apache/maven/plugins/maven-enforcer-plugin/3.0.0-M2/maven-enforcer-plugin-3.0.0-M2.pom
Progress (1): 4.1/6.8 kB
Progress (1): 6.8 kB    
                    
Downloaded from eclipse.maven.central.mirror: https://repo.eclipse.org/content/repositories/maven_central/org/apache/maven/plugins/maven-enforcer-plugin/3.0.0-M2/maven-enforcer-plugin-3.0.0-M2.pom (6.8 kB at 77 kB/s)
Downloading from repo.eclipse.org: https://repo.eclipse.org/content/repositories/cbi/org/apache/maven/enforcer/enforcer/3.0.0-M2/enforcer-3.0.0-M2.pom
Downloading from eclipse.maven.central.mirror: https://repo.eclipse.org/content/repositories/maven_central/org/apache/maven/enforcer/enforcer/3.0.0-M2/enforcer-3.0.0-M2.pom
Progress (1): 4.1/7.9 kB
Progress (1): 7.7/7.9 kB
Progress (1): 7.9 kB    
                    
Downloaded from eclipse.maven.central.mirror: https://repo.eclipse.org/content/repositories/maven_central/org/apache/maven/enforcer/enforcer/3.0.0-M2/enforcer-3.0.0-M2.pom (7.9 kB at 219 kB/s)
Downloading from repo.eclipse.org: https://repo.eclipse.org/content/repositories/cbi/org/apache/maven/maven-parent/31/maven-parent-31.pom
Downloading from eclipse.maven.central.mirror: https://repo.eclipse.org/content/repositories/maven_central/org/apache/maven/maven-parent/31/maven-parent-31.pom
Progress (1): 4.1/43 kB
Progress (1): 7.7/43 kB
Progress (1): 12/43 kB 
Progress (1): 16/43 kB
Progress (1): 20/43 kB
Progress (1): 24/43 kB
Progress (1): 28/43 kB
Progress (1): 32/43 kB
Progress (1): 36/43 kB
Progress (1): 40/43 kB
Progress (1): 43 kB   
                   
Downloaded from eclipse.maven.central.mirror: https://repo.eclipse.org/content/repositories/maven_central/org/apache/maven/maven-parent/31/maven-parent-31.pom (43 kB at 1.2 MB/s)
Downloading from repo.eclipse.org: https://repo.eclipse.org/content/repositories/cbi/org/apache/apache/19/apache-19.pom
Downloading from eclipse.maven.central.mirror: https://repo.eclipse.org/content/repositories/maven_central/org/apache/apache/19/apache-19.pom
Progress (1): 4.1/15 kB
Progress (1): 7.7/15 kB
Progress (1): 12/15 kB 
Progress (1): 15 kB   
                   
Downloaded from eclipse.maven.central.mirror: https://repo.eclipse.org/content/repositories/maven_central/org/apache/apache/19/apache-19.pom (15 kB at 430 kB/s)
Downloading from repo.eclipse.org: https://repo.eclipse.org/content/repositories/cbi/org/apache/maven/plugins/maven-enforcer-plugin/3.0.0-M2/maven-enforcer-plugin-3.0.0-M2.jar
Downloading from eclipse.maven.central.mirror: https://repo.eclipse.org/content/repositories/maven_central/org/apache/maven/plugins/maven-enforcer-plugin/3.0.0-M2/maven-enforcer-plugin-3.0.0-M2.jar
Progress (1): 4.1/26 kB
Progress (1): 7.7/26 kB
Progress (1): 12/26 kB 
Progress (1): 16/26 kB
Progress (1): 20/26 kB
Progress (1): 24/26 kB
Progress (1): 26 kB   
                   
Downloaded from eclipse.maven.central.mirror: https://repo.eclipse.org/content/repositories/maven_central/org/apache/maven/plugins/maven-enforcer-plugin/3.0.0-M2/maven-enforcer-plugin-3.0.0-M2.jar (26 kB at 622 kB/s)
Downloading from repo.eclipse.org: https://repo.eclipse.org/content/repositories/cbi/com/github/spotbugs/spotbugs-maven-plugin/3.1.12.1/spotbugs-maven-plugin-3.1.12.1.pom
Downloading from eclipse.maven.central.mirror: https://repo.eclipse.org/content/repositories/maven_central/com/github/spotbugs/spotbugs-maven-plugin/3.1.12.1/spotbugs-maven-plugin-3.1.12.1.pom
Progress (1): 4.1/28 kB
Progress (1): 7.7/28 kB
Progress (1): 12/28 kB 
Progress (1): 16/28 kB
Progress (1): 20/28 kB
Progress (1): 24/28 kB
Progress (1): 28/28 kB
Progress (1): 28 kB   
                   
Downloaded from eclipse.maven.central.mirror: https://repo.eclipse.org/content/repositories/maven_central/com/github/spotbugs/spotbugs-maven-plugin/3.1.12.1/spotbugs-maven-plugin-3.1.12.1.pom (28 kB at 681 kB/s)
Downloading from repo.eclipse.org: https://repo.eclipse.org/content/repositories/cbi/com/github/hazendaz/base-parent/22/base-parent-22.pom
Downloading from eclipse.maven.central.mirror: https://repo.eclipse.org/content/repositories/maven_central/com/github/hazendaz/base-parent/22/base-parent-22.pom
Progress (1): 4.1/79 kB
Progress (1): 7.7/79 kB
Progress (1): 12/79 kB 
Progress (1): 16/79 kB
Progress (1): 20/79 kB
Progress (1): 24/79 kB
Progress (1): 28/79 kB
Progress (1): 32/79 kB
Progress (1): 36/79 kB
Progress (1): 40/79 kB
Progress (1): 44/79 kB
Progress (1): 48/79 kB
Progress (1): 52/79 kB
Progress (1): 56/79 kB
Progress (1): 60/79 kB
Progress (1): 64/79 kB
Progress (1): 68/79 kB
Progress (1): 72/79 kB
Progress (1): 76/79 kB
Progress (1): 79 kB   
                   
Downloaded from eclipse.maven.central.mirror: https://repo.eclipse.org/content/repositories/maven_central/com/github/hazendaz/base-parent/22/base-parent-22.pom (79 kB at 1.8 MB/s)
Downloading from repo.eclipse.org: https://repo.eclipse.org/content/repositories/cbi/com/github/spotbugs/spotbugs-maven-plugin/3.1.12.1/spotbugs-maven-plugin-3.1.12.1.jar
Downloading from eclipse.maven.central.mirror: https://repo.eclipse.org/content/repositories/maven_central/com/github/spotbugs/spotbugs-maven-plugin/3.1.12.1/spotbugs-maven-plugin-3.1.12.1.jar
Progress (1): 4.1/168 kB
Progress (1): 7.7/168 kB
Progress (1): 12/168 kB 
Progress (1): 16/168 kB
Progress (1): 20/168 kB
Progress (1): 24/168 kB
Progress (1): 28/168 kB
Progress (1): 32/168 kB
Progress (1): 36/168 kB
Progress (1): 40/168 kB
Progress (1): 44/168 kB
Progress (1): 48/168 kB
Progress (1): 52/168 kB
Progress (1): 56/168 kB
Progress (1): 60/168 kB
Progress (1): 64/168 kB
Progress (1): 68/168 kB
Progress (1): 72/168 kB
Progress (1): 76/168 kB
Progress (1): 80/168 kB
Progress (1): 84/168 kB
Progress (1): 88/168 kB
Progress (1): 92/168 kB
Progress (1): 96/168 kB
Progress (1): 100/168 kB
Progress (1): 104/168 kB
Progress (1): 108/168 kB
Progress (1): 112/168 kB
Progress (1): 116/168 kB
Progress (1): 120/168 kB
Progress (1): 124/168 kB
Progress (1): 128/168 kB
Progress (1): 131/168 kB
Progress (1): 135/168 kB
Progress (1): 139/168 kB
Progress (1): 143/168 kB
Progress (1): 147/168 kB
Progress (1): 151/168 kB
Progress (1): 155/168 kB
Progress (1): 159/168 kB
Progress (1): 163/168 kB
Progress (1): 167/168 kB
Progress (1): 168 kB    
                    
Downloaded from eclipse.maven.central.mirror: https://repo.eclipse.org/content/repositories/maven_central/com/github/spotbugs/spotbugs-maven-plugin/3.1.12.1/spotbugs-maven-plugin-3.1.12.1.jar (168 kB at 3.3 MB/s)
Downloading from repo.eclipse.org: https://repo.eclipse.org/content/repositories/cbi/org/apache/maven/plugins/maven-jar-plugin/3.1.2/maven-jar-plugin-3.1.2.pom
Downloading from eclipse.maven.central.mirror: https://repo.eclipse.org/content/repositories/maven_central/org/apache/maven/plugins/maven-jar-plugin/3.1.2/maven-jar-plugin-3.1.2.pom
Progress (1): 4.1/7.3 kB
Progress (1): 7.3 kB    
                    
Downloaded from eclipse.maven.central.mirror: https://repo.eclipse.org/content/repositories/maven_central/org/apache/maven/plugins/maven-jar-plugin/3.1.2/maven-jar-plugin-3.1.2.pom (7.3 kB at 236 kB/s)
Downloading from repo.eclipse.org: https://repo.eclipse.org/content/repositories/cbi/org/apache/maven/plugins/maven-plugins/33/maven-plugins-33.pom
Downloading from eclipse.maven.central.mirror: https://repo.eclipse.org/content/repositories/maven_central/org/apache/maven/plugins/maven-plugins/33/maven-plugins-33.pom
Progress (1): 4.1/11 kB
Progress (1): 7.7/11 kB
Progress (1): 11 kB    
                   
Downloaded from eclipse.maven.central.mirror: https://repo.eclipse.org/content/repositories/maven_central/org/apache/maven/plugins/maven-plugins/33/maven-plugins-33.pom (11 kB at 345 kB/s)
Downloading from repo.eclipse.org: https://repo.eclipse.org/content/repositories/cbi/org/apache/maven/maven-parent/33/maven-parent-33.pom
Downloading from eclipse.maven.central.mirror: https://repo.eclipse.org/content/repositories/maven_central/org/apache/maven/maven-parent/33/maven-parent-33.pom
Progress (1): 4.1/44 kB
Progress (1): 7.7/44 kB
Progress (1): 12/44 kB 
Progress (1): 16/44 kB
Progress (1): 20/44 kB
Progress (1): 24/44 kB
Progress (1): 28/44 kB
Progress (1): 32/44 kB
Progress (1): 36/44 kB
Progress (1): 40/44 kB
Progress (1): 44/44 kB
Progress (1): 44 kB   
                   
Downloaded from eclipse.maven.central.mirror: https://repo.eclipse.org/content/repositories/maven_central/org/apache/maven/maven-parent/33/maven-parent-33.pom (44 kB at 1.1 MB/s)
Downloading from repo.eclipse.org: https://repo.eclipse.org/content/repositories/cbi/org/apache/apache/21/apache-21.pom
Downloading from eclipse.maven.central.mirror: https://repo.eclipse.org/content/repositories/maven_central/org/apache/apache/21/apache-21.pom
Progress (1): 4.1/17 kB
Progress (1): 7.7/17 kB
Progress (1): 12/17 kB 
Progress (1): 16/17 kB
Progress (1): 17 kB   
                   
Downloaded from eclipse.maven.central.mirror: https://repo.eclipse.org/content/repositories/maven_central/org/apache/apache/21/apache-21.pom (17 kB at 356 kB/s)
Downloading from repo.eclipse.org: https://repo.eclipse.org/content/repositories/cbi/org/apache/maven/plugins/maven-jar-plugin/3.1.2/maven-jar-plugin-3.1.2.jar
Downloading from eclipse.maven.central.mirror: https://repo.eclipse.org/content/repositories/maven_central/org/apache/maven/plugins/maven-jar-plugin/3.1.2/maven-jar-plugin-3.1.2.jar
Progress (1): 4.1/28 kB
Progress (1): 7.7/28 kB
Progress (1): 12/28 kB 
Progress (1): 16/28 kB
Progress (1): 20/28 kB
Progress (1): 24/28 kB
Progress (1): 28/28 kB
Progress (1): 28 kB   
                   
Downloaded from eclipse.maven.central.mirror: https://repo.eclipse.org/content/repositories/maven_central/org/apache/maven/plugins/maven-jar-plugin/3.1.2/maven-jar-plugin-3.1.2.jar (28 kB at 755 kB/s)
Downloading from repo.eclipse.org: https://repo.eclipse.org/content/repositories/cbi/org/apache/maven/plugins/maven-clean-plugin/3.1.0/maven-clean-plugin-3.1.0.pom
Downloading from eclipse.maven.central.mirror: https://repo.eclipse.org/content/repositories/maven_central/org/apache/maven/plugins/maven-clean-plugin/3.1.0/maven-clean-plugin-3.1.0.pom
Progress (1): 4.1/5.2 kB
Progress (1): 5.2 kB    
                    
Downloaded from eclipse.maven.central.mirror: https://repo.eclipse.org/content/repositories/maven_central/org/apache/maven/plugins/maven-clean-plugin/3.1.0/maven-clean-plugin-3.1.0.pom (5.2 kB at 172 kB/s)
Downloading from repo.eclipse.org: https://repo.eclipse.org/content/repositories/cbi/org/apache/maven/plugins/maven-plugins/31/maven-plugins-31.pom
Downloading from eclipse.maven.central.mirror: https://repo.eclipse.org/content/repositories/maven_central/org/apache/maven/plugins/maven-plugins/31/maven-plugins-31.pom
Progress (1): 4.1/10 kB
Progress (1): 7.7/10 kB
Progress (1): 10 kB    
                   
Downloaded from eclipse.maven.central.mirror: https://repo.eclipse.org/content/repositories/maven_central/org/apache/maven/plugins/maven-plugins/31/maven-plugins-31.pom (10 kB at 347 kB/s)
Downloading from repo.eclipse.org: https://repo.eclipse.org/content/repositories/cbi/org/apache/maven/plugins/maven-clean-plugin/3.1.0/maven-clean-plugin-3.1.0.jar
Downloading from eclipse.maven.central.mirror: https://repo.eclipse.org/content/repositories/maven_central/org/apache/maven/plugins/maven-clean-plugin/3.1.0/maven-clean-plugin-3.1.0.jar
Progress (1): 4.1/30 kB
Progress (1): 7.7/30 kB
Progress (1): 12/30 kB 
Progress (1): 16/30 kB
Progress (1): 20/30 kB
Progress (1): 24/30 kB
Progress (1): 28/30 kB
Progress (1): 30 kB   
                   
Downloaded from eclipse.maven.central.mirror: https://repo.eclipse.org/content/repositories/maven_central/org/apache/maven/plugins/maven-clean-plugin/3.1.0/maven-clean-plugin-3.1.0.jar (30 kB at 847 kB/s)
Downloading from repo.eclipse.org: https://repo.eclipse.org/content/repositories/cbi/org/apache/maven/plugins/maven-checkstyle-plugin/3.1.0/maven-checkstyle-plugin-3.1.0.pom
Downloading from eclipse.maven.central.mirror: https://repo.eclipse.org/content/repositories/maven_central/org/apache/maven/plugins/maven-checkstyle-plugin/3.1.0/maven-checkstyle-plugin-3.1.0.pom
Progress (1): 4.1/14 kB
Progress (1): 7.7/14 kB
Progress (1): 12/14 kB 
Progress (1): 14 kB   
                   
Downloaded from eclipse.maven.central.mirror: https://repo.eclipse.org/content/repositories/maven_central/org/apache/maven/plugins/maven-checkstyle-plugin/3.1.0/maven-checkstyle-plugin-3.1.0.pom (14 kB at 196 kB/s)
Downloading from repo.eclipse.org: https://repo.eclipse.org/content/repositories/cbi/org/apache/maven/plugins/maven-checkstyle-plugin/3.1.0/maven-checkstyle-plugin-3.1.0.jar
Downloading from eclipse.maven.central.mirror: https://repo.eclipse.org/content/repositories/maven_central/org/apache/maven/plugins/maven-checkstyle-plugin/3.1.0/maven-checkstyle-plugin-3.1.0.jar
Progress (1): 4.1/110 kB
Progress (1): 7.7/110 kB
Progress (1): 12/110 kB 
Progress (1): 16/110 kB
Progress (1): 20/110 kB
Progress (1): 24/110 kB
Progress (1): 28/110 kB
Progress (1): 32/110 kB
Progress (1): 36/110 kB
Progress (1): 40/110 kB
Progress (1): 44/110 kB
Progress (1): 48/110 kB
Progress (1): 52/110 kB
Progress (1): 56/110 kB
Progress (1): 60/110 kB
Progress (1): 64/110 kB
Progress (1): 68/110 kB
Progress (1): 72/110 kB
Progress (1): 76/110 kB
Progress (1): 80/110 kB
Progress (1): 84/110 kB
Progress (1): 88/110 kB
Progress (1): 92/110 kB
Progress (1): 96/110 kB
Progress (1): 100/110 kB
Progress (1): 104/110 kB
Progress (1): 108/110 kB
Progress (1): 110 kB    
                    
Downloaded from eclipse.maven.central.mirror: https://repo.eclipse.org/content/repositories/maven_central/org/apache/maven/plugins/maven-checkstyle-plugin/3.1.0/maven-checkstyle-plugin-3.1.0.jar (110 kB at 2.0 MB/s)
Downloading from repo.eclipse.org: https://repo.eclipse.org/content/repositories/cbi/org/apache/maven/plugins/maven-resources-plugin/3.1.0/maven-resources-plugin-3.1.0.pom
Downloading from eclipse.maven.central.mirror: https://repo.eclipse.org/content/repositories/maven_central/org/apache/maven/plugins/maven-resources-plugin/3.1.0/maven-resources-plugin-3.1.0.pom
Progress (1): 4.1/7.2 kB
Progress (1): 7.2 kB    
                    
Downloaded from eclipse.maven.central.mirror: https://repo.eclipse.org/content/repositories/maven_central/org/apache/maven/plugins/maven-resources-plugin/3.1.0/maven-resources-plugin-3.1.0.pom (7.2 kB at 287 kB/s)
Downloading from repo.eclipse.org: https://repo.eclipse.org/content/repositories/cbi/org/apache/maven/plugins/maven-resources-plugin/3.1.0/maven-resources-plugin-3.1.0.jar
Downloading from eclipse.maven.central.mirror: https://repo.eclipse.org/content/repositories/maven_central/org/apache/maven/plugins/maven-resources-plugin/3.1.0/maven-resources-plugin-3.1.0.jar
Progress (1): 4.1/32 kB
Progress (1): 7.7/32 kB
Progress (1): 12/32 kB 
Progress (1): 16/32 kB
Progress (1): 20/32 kB
Progress (1): 24/32 kB
Progress (1): 28/32 kB
Progress (1): 32 kB   
                   
Downloaded from eclipse.maven.central.mirror: https://repo.eclipse.org/content/repositories/maven_central/org/apache/maven/plugins/maven-resources-plugin/3.1.0/maven-resources-plugin-3.1.0.jar (32 kB at 134 kB/s)
Downloading from repo.eclipse.org: https://repo.eclipse.org/content/repositories/cbi/org/apache/maven/plugins/maven-compiler-plugin/3.8.1/maven-compiler-plugin-3.8.1.pom
Downloading from eclipse.maven.central.mirror: https://repo.eclipse.org/content/repositories/maven_central/org/apache/maven/plugins/maven-compiler-plugin/3.8.1/maven-compiler-plugin-3.8.1.pom
Progress (1): 4.1/12 kB
Progress (1): 7.7/12 kB
Progress (1): 12/12 kB 
Progress (1): 12 kB   
                   
Downloaded from eclipse.maven.central.mirror: https://repo.eclipse.org/content/repositories/maven_central/org/apache/maven/plugins/maven-compiler-plugin/3.8.1/maven-compiler-plugin-3.8.1.pom (12 kB at 260 kB/s)
Downloading from repo.eclipse.org: https://repo.eclipse.org/content/repositories/cbi/org/apache/maven/plugins/maven-compiler-plugin/3.8.1/maven-compiler-plugin-3.8.1.jar
Downloading from eclipse.maven.central.mirror: https://repo.eclipse.org/content/repositories/maven_central/org/apache/maven/plugins/maven-compiler-plugin/3.8.1/maven-compiler-plugin-3.8.1.jar
Progress (1): 4.1/62 kB
Progress (1): 7.7/62 kB
Progress (1): 12/62 kB 
Progress (1): 16/62 kB
Progress (1): 20/62 kB
Progress (1): 24/62 kB
Progress (1): 28/62 kB
Progress (1): 32/62 kB
Progress (1): 36/62 kB
Progress (1): 40/62 kB
Progress (1): 44/62 kB
Progress (1): 48/62 kB
Progress (1): 52/62 kB
Progress (1): 56/62 kB
Progress (1): 60/62 kB
Progress (1): 62 kB   
                   
Downloaded from eclipse.maven.central.mirror: https://repo.eclipse.org/content/repositories/maven_central/org/apache/maven/plugins/maven-compiler-plugin/3.8.1/maven-compiler-plugin-3.8.1.jar (62 kB at 1.3 MB/s)
Downloading from repo.eclipse.org: https://repo.eclipse.org/content/repositories/cbi/org/apache/maven/plugins/maven-surefire-plugin/2.22.2/maven-surefire-plugin-2.22.2.pom
Downloading from eclipse.maven.central.mirror: https://repo.eclipse.org/content/repositories/maven_central/org/apache/maven/plugins/maven-surefire-plugin/2.22.2/maven-surefire-plugin-2.22.2.pom
Progress (1): 4.1/5.0 kB
Progress (1): 5.0 kB    
                    
Downloaded from eclipse.maven.central.mirror: https://repo.eclipse.org/content/repositories/maven_central/org/apache/maven/plugins/maven-surefire-plugin/2.22.2/maven-surefire-plugin-2.22.2.pom (5.0 kB at 128 kB/s)
Downloading from repo.eclipse.org: https://repo.eclipse.org/content/repositories/cbi/org/apache/maven/surefire/surefire/2.22.2/surefire-2.22.2.pom
Downloading from eclipse.maven.central.mirror: https://repo.eclipse.org/content/repositories/maven_central/org/apache/maven/surefire/surefire/2.22.2/surefire-2.22.2.pom
Progress (1): 4.1/26 kB
Progress (1): 7.7/26 kB
Progress (1): 12/26 kB 
Progress (1): 16/26 kB
Progress (1): 20/26 kB
Progress (1): 24/26 kB
Progress (1): 26 kB   
                   
Downloaded from eclipse.maven.central.mirror: https://repo.eclipse.org/content/repositories/maven_central/org/apache/maven/surefire/surefire/2.22.2/surefire-2.22.2.pom (26 kB at 860 kB/s)
Downloading from repo.eclipse.org: https://repo.eclipse.org/content/repositories/cbi/org/apache/maven/plugins/maven-surefire-plugin/2.22.2/maven-surefire-plugin-2.22.2.jar
Downloading from eclipse.maven.central.mirror: https://repo.eclipse.org/content/repositories/maven_central/org/apache/maven/plugins/maven-surefire-plugin/2.22.2/maven-surefire-plugin-2.22.2.jar
Progress (1): 4.1/41 kB
Progress (1): 7.7/41 kB
Progress (1): 12/41 kB 
Progress (1): 16/41 kB
Progress (1): 20/41 kB
Progress (1): 24/41 kB
Progress (1): 28/41 kB
Progress (1): 32/41 kB
Progress (1): 36/41 kB
Progress (1): 40/41 kB
Progress (1): 41 kB   
                   
Downloaded from eclipse.maven.central.mirror: https://repo.eclipse.org/content/repositories/maven_central/org/apache/maven/plugins/maven-surefire-plugin/2.22.2/maven-surefire-plugin-2.22.2.jar (41 kB at 1.1 MB/s)
Downloading from repo.eclipse.org: https://repo.eclipse.org/content/repositories/cbi/org/apache/maven/plugins/maven-install-plugin/2.5.2/maven-install-plugin-2.5.2.pom
Downloading from eclipse.maven.central.mirror: https://repo.eclipse.org/content/repositories/maven_central/org/apache/maven/plugins/maven-install-plugin/2.5.2/maven-install-plugin-2.5.2.pom
Progress (1): 4.1/6.4 kB
Progress (1): 6.4 kB    
                    
Downloaded from eclipse.maven.central.mirror: https://repo.eclipse.org/content/repositories/maven_central/org/apache/maven/plugins/maven-install-plugin/2.5.2/maven-install-plugin-2.5.2.pom (6.4 kB at 194 kB/s)
Downloading from repo.eclipse.org: https://repo.eclipse.org/content/repositories/cbi/org/apache/maven/plugins/maven-plugins/25/maven-plugins-25.pom
Downloading from eclipse.maven.central.mirror: https://repo.eclipse.org/content/repositories/maven_central/org/apache/maven/plugins/maven-plugins/25/maven-plugins-25.pom
Progress (1): 4.1/9.6 kB
Progress (1): 7.7/9.6 kB
Progress (1): 9.6 kB    
                    
Downloaded from eclipse.maven.central.mirror: https://repo.eclipse.org/content/repositories/maven_central/org/apache/maven/plugins/maven-plugins/25/maven-plugins-25.pom (9.6 kB at 341 kB/s)
Downloading from repo.eclipse.org: https://repo.eclipse.org/content/repositories/cbi/org/apache/maven/maven-parent/24/maven-parent-24.pom
Downloading from eclipse.maven.central.mirror: https://repo.eclipse.org/content/repositories/maven_central/org/apache/maven/maven-parent/24/maven-parent-24.pom
Progress (1): 4.1/37 kB
Progress (1): 7.7/37 kB
Progress (1): 12/37 kB 
Progress (1): 16/37 kB
Progress (1): 20/37 kB
Progress (1): 24/37 kB
Progress (1): 28/37 kB
Progress (1): 32/37 kB
Progress (1): 36/37 kB
Progress (1): 37 kB   
                   
Downloaded from eclipse.maven.central.mirror: https://repo.eclipse.org/content/repositories/maven_central/org/apache/maven/maven-parent/24/maven-parent-24.pom (37 kB at 946 kB/s)
Downloading from repo.eclipse.org: https://repo.eclipse.org/content/repositories/cbi/org/apache/apache/14/apache-14.pom
Downloading from eclipse.maven.central.mirror: https://repo.eclipse.org/content/repositories/maven_central/org/apache/apache/14/apache-14.pom
Progress (1): 4.1/15 kB
Progress (1): 7.7/15 kB
Progress (1): 12/15 kB 
Progress (1): 15 kB   
                   
Downloaded from eclipse.maven.central.mirror: https://repo.eclipse.org/content/repositories/maven_central/org/apache/apache/14/apache-14.pom (15 kB at 506 kB/s)
Downloading from repo.eclipse.org: https://repo.eclipse.org/content/repositories/cbi/org/apache/maven/plugins/maven-install-plugin/2.5.2/maven-install-plugin-2.5.2.jar
Downloading from eclipse.maven.central.mirror: https://repo.eclipse.org/content/repositories/maven_central/org/apache/maven/plugins/maven-install-plugin/2.5.2/maven-install-plugin-2.5.2.jar
Progress (1): 4.1/33 kB
Progress (1): 7.7/33 kB
Progress (1): 12/33 kB 
Progress (1): 16/33 kB
Progress (1): 20/33 kB
Progress (1): 24/33 kB
Progress (1): 28/33 kB
Progress (1): 32/33 kB
Progress (1): 33 kB   
                   
Downloaded from eclipse.maven.central.mirror: https://repo.eclipse.org/content/repositories/maven_central/org/apache/maven/plugins/maven-install-plugin/2.5.2/maven-install-plugin-2.5.2.jar (33 kB at 625 kB/s)
Downloading from repo.eclipse.org: https://repo.eclipse.org/content/repositories/cbi/org/apache/commons/commons-compress/1.18/commons-compress-1.18.pom
Downloading from eclipse.maven.central.mirror: https://repo.eclipse.org/content/repositories/maven_central/org/apache/commons/commons-compress/1.18/commons-compress-1.18.pom
Progress (1): 4.1/18 kB
Progress (1): 7.7/18 kB
Progress (1): 12/18 kB 
Progress (1): 16/18 kB
Progress (1): 18 kB   
                   
Downloaded from eclipse.maven.central.mirror: https://repo.eclipse.org/content/repositories/maven_central/org/apache/commons/commons-compress/1.18/commons-compress-1.18.pom (18 kB at 608 kB/s)
Downloading from repo.eclipse.org: https://repo.eclipse.org/content/repositories/cbi/org/apache/commons/commons-parent/47/commons-parent-47.pom
Downloading from eclipse.maven.central.mirror: https://repo.eclipse.org/content/repositories/maven_central/org/apache/commons/commons-parent/47/commons-parent-47.pom
Progress (1): 4.1/78 kB
Progress (1): 7.7/78 kB
Progress (1): 12/78 kB 
Progress (1): 16/78 kB
Progress (1): 20/78 kB
Progress (1): 24/78 kB
Progress (1): 28/78 kB
Progress (1): 32/78 kB
Progress (1): 36/78 kB
Progress (1): 40/78 kB
Progress (1): 44/78 kB
Progress (1): 48/78 kB
Progress (1): 52/78 kB
Progress (1): 56/78 kB
Progress (1): 60/78 kB
Progress (1): 64/78 kB
Progress (1): 68/78 kB
Progress (1): 72/78 kB
Progress (1): 76/78 kB
Progress (1): 78 kB   
                   
Downloaded from eclipse.maven.central.mirror: https://repo.eclipse.org/content/repositories/maven_central/org/apache/commons/commons-parent/47/commons-parent-47.pom (78 kB at 2.1 MB/s)
Downloading from repo.eclipse.org: https://repo.eclipse.org/content/repositories/cbi/com/google/guava/guava/28.0-jre/guava-28.0-jre.pom
Downloading from eclipse.maven.central.mirror: https://repo.eclipse.org/content/repositories/maven_central/com/google/guava/guava/28.0-jre/guava-28.0-jre.pom
Progress (1): 4.1/8.7 kB
Progress (1): 7.7/8.7 kB
Progress (1): 8.7 kB    
                    
Downloaded from eclipse.maven.central.mirror: https://repo.eclipse.org/content/repositories/maven_central/com/google/guava/guava/28.0-jre/guava-28.0-jre.pom (8.7 kB at 33 kB/s)
Downloading from repo.eclipse.org: https://repo.eclipse.org/content/repositories/cbi/com/google/guava/guava-parent/28.0-jre/guava-parent-28.0-jre.pom
Downloading from eclipse.maven.central.mirror: https://repo.eclipse.org/content/repositories/maven_central/com/google/guava/guava-parent/28.0-jre/guava-parent-28.0-jre.pom
Progress (1): 4.1/13 kB
Progress (1): 7.7/13 kB
Progress (1): 12/13 kB 
Progress (1): 13 kB   
                   
Downloaded from eclipse.maven.central.mirror: https://repo.eclipse.org/content/repositories/maven_central/com/google/guava/guava-parent/28.0-jre/guava-parent-28.0-jre.pom (13 kB at 103 kB/s)
Downloading from repo.eclipse.org: https://repo.eclipse.org/content/repositories/cbi/com/google/guava/failureaccess/1.0.1/failureaccess-1.0.1.pom
Downloading from eclipse.maven.central.mirror: https://repo.eclipse.org/content/repositories/maven_central/com/google/guava/failureaccess/1.0.1/failureaccess-1.0.1.pom
Progress (1): 2.4 kB
                    
Downloaded from eclipse.maven.central.mirror: https://repo.eclipse.org/content/repositories/maven_central/com/google/guava/failureaccess/1.0.1/failureaccess-1.0.1.pom (2.4 kB at 60 kB/s)
Downloading from repo.eclipse.org: https://repo.eclipse.org/content/repositories/cbi/com/google/guava/guava-parent/26.0-android/guava-parent-26.0-android.pom
Downloading from eclipse.maven.central.mirror: https://repo.eclipse.org/content/repositories/maven_central/com/google/guava/guava-parent/26.0-android/guava-parent-26.0-android.pom
Progress (1): 4.1/10 kB
Progress (1): 7.7/10 kB
Progress (1): 10 kB    
                   
Downloaded from eclipse.maven.central.mirror: https://repo.eclipse.org/content/repositories/maven_central/com/google/guava/guava-parent/26.0-android/guava-parent-26.0-android.pom (10 kB at 254 kB/s)
Downloading from repo.eclipse.org: https://repo.eclipse.org/content/repositories/cbi/org/sonatype/oss/oss-parent/9/oss-parent-9.pom
Downloading from eclipse.maven.central.mirror: https://repo.eclipse.org/content/repositories/maven_central/org/sonatype/oss/oss-parent/9/oss-parent-9.pom
Progress (1): 4.1/6.6 kB
Progress (1): 6.6 kB    
                    
Downloaded from eclipse.maven.central.mirror: https://repo.eclipse.org/content/repositories/maven_central/org/sonatype/oss/oss-parent/9/oss-parent-9.pom (6.6 kB at 212 kB/s)
Downloading from repo.eclipse.org: https://repo.eclipse.org/content/repositories/cbi/com/google/guava/listenablefuture/9999.0-empty-to-avoid-conflict-with-guava/listenablefuture-9999.0-empty-to-avoid-conflict-with-guava.pom
Downloading from eclipse.maven.central.mirror: https://repo.eclipse.org/content/repositories/maven_central/com/google/guava/listenablefuture/9999.0-empty-to-avoid-conflict-with-guava/listenablefuture-9999.0-empty-to-avoid-conflict-with-guava.pom
Progress (1): 2.3 kB
                    
Downloaded from eclipse.maven.central.mirror: https://repo.eclipse.org/content/repositories/maven_central/com/google/guava/listenablefuture/9999.0-empty-to-avoid-conflict-with-guava/listenablefuture-9999.0-empty-to-avoid-conflict-with-guava.pom (2.3 kB at 51 kB/s)
Downloading from repo.eclipse.org: https://repo.eclipse.org/content/repositories/cbi/com/google/code/findbugs/jsr305/3.0.2/jsr305-3.0.2.pom
Downloading from eclipse.maven.central.mirror: https://repo.eclipse.org/content/repositories/maven_central/com/google/code/findbugs/jsr305/3.0.2/jsr305-3.0.2.pom
Progress (1): 4.1/4.3 kB
Progress (1): 4.3 kB    
                    
Downloaded from eclipse.maven.central.mirror: https://repo.eclipse.org/content/repositories/maven_central/com/google/code/findbugs/jsr305/3.0.2/jsr305-3.0.2.pom (4.3 kB at 107 kB/s)
Downloading from repo.eclipse.org: https://repo.eclipse.org/content/repositories/cbi/org/sonatype/oss/oss-parent/7/oss-parent-7.pom
Downloading from eclipse.maven.central.mirror: https://repo.eclipse.org/content/repositories/maven_central/org/sonatype/oss/oss-parent/7/oss-parent-7.pom
Progress (1): 4.1/4.8 kB
Progress (1): 4.8 kB    
                    
Downloaded from eclipse.maven.central.mirror: https://repo.eclipse.org/content/repositories/maven_central/org/sonatype/oss/oss-parent/7/oss-parent-7.pom (4.8 kB at 146 kB/s)
Downloading from repo.eclipse.org: https://repo.eclipse.org/content/repositories/cbi/org/checkerframework/checker-qual/2.8.1/checker-qual-2.8.1.pom
Downloading from eclipse.maven.central.mirror: https://repo.eclipse.org/content/repositories/maven_central/org/checkerframework/checker-qual/2.8.1/checker-qual-2.8.1.pom
Progress (1): 2.4 kB
                    
Downloaded from eclipse.maven.central.mirror: https://repo.eclipse.org/content/repositories/maven_central/org/checkerframework/checker-qual/2.8.1/checker-qual-2.8.1.pom (2.4 kB at 28 kB/s)
Downloading from repo.eclipse.org: https://repo.eclipse.org/content/repositories/cbi/com/google/errorprone/error_prone_annotations/2.3.2/error_prone_annotations-2.3.2.pom
Downloading from eclipse.maven.central.mirror: https://repo.eclipse.org/content/repositories/maven_central/com/google/errorprone/error_prone_annotations/2.3.2/error_prone_annotations-2.3.2.pom
Progress (1): 1.8 kB
                    
Downloaded from eclipse.maven.central.mirror: https://repo.eclipse.org/content/repositories/maven_central/com/google/errorprone/error_prone_annotations/2.3.2/error_prone_annotations-2.3.2.pom (1.8 kB at 19 kB/s)
Downloading from repo.eclipse.org: https://repo.eclipse.org/content/repositories/cbi/com/google/errorprone/error_prone_parent/2.3.2/error_prone_parent-2.3.2.pom
Downloading from eclipse.maven.central.mirror: https://repo.eclipse.org/content/repositories/maven_central/com/google/errorprone/error_prone_parent/2.3.2/error_prone_parent-2.3.2.pom
Progress (1): 4.1/5.2 kB
Progress (1): 5.2 kB    
                    
Downloaded from eclipse.maven.central.mirror: https://repo.eclipse.org/content/repositories/maven_central/com/google/errorprone/error_prone_parent/2.3.2/error_prone_parent-2.3.2.pom (5.2 kB at 39 kB/s)
Downloading from repo.eclipse.org: https://repo.eclipse.org/content/repositories/cbi/com/google/j2objc/j2objc-annotations/1.3/j2objc-annotations-1.3.pom
Downloading from eclipse.maven.central.mirror: https://repo.eclipse.org/content/repositories/maven_central/com/google/j2objc/j2objc-annotations/1.3/j2objc-annotations-1.3.pom
Progress (1): 2.8 kB
                    
Downloaded from eclipse.maven.central.mirror: https://repo.eclipse.org/content/repositories/maven_central/com/google/j2objc/j2objc-annotations/1.3/j2objc-annotations-1.3.pom (2.8 kB at 35 kB/s)
Downloading from repo.eclipse.org: https://repo.eclipse.org/content/repositories/cbi/org/codehaus/mojo/animal-sniffer-annotations/1.17/animal-sniffer-annotations-1.17.pom
Downloading from eclipse.maven.central.mirror: https://repo.eclipse.org/content/repositories/maven_central/org/codehaus/mojo/animal-sniffer-annotations/1.17/animal-sniffer-annotations-1.17.pom
Progress (1): 2.6 kB
                    
Downloaded from eclipse.maven.central.mirror: https://repo.eclipse.org/content/repositories/maven_central/org/codehaus/mojo/animal-sniffer-annotations/1.17/animal-sniffer-annotations-1.17.pom (2.6 kB at 37 kB/s)
Downloading from repo.eclipse.org: https://repo.eclipse.org/content/repositories/cbi/org/codehaus/mojo/animal-sniffer-parent/1.17/animal-sniffer-parent-1.17.pom
Downloading from eclipse.maven.central.mirror: https://repo.eclipse.org/content/repositories/maven_central/org/codehaus/mojo/animal-sniffer-parent/1.17/animal-sniffer-parent-1.17.pom
Progress (1): 4.1/8.6 kB
Progress (1): 7.7/8.6 kB
Progress (1): 8.6 kB    
                    
Downloaded from eclipse.maven.central.mirror: https://repo.eclipse.org/content/repositories/maven_central/org/codehaus/mojo/animal-sniffer-parent/1.17/animal-sniffer-parent-1.17.pom (8.6 kB at 196 kB/s)
Downloading from repo.eclipse.org: https://repo.eclipse.org/content/repositories/cbi/org/codehaus/mojo/mojo-parent/40/mojo-parent-40.pom
Downloading from eclipse.maven.central.mirror: https://repo.eclipse.org/content/repositories/maven_central/org/codehaus/mojo/mojo-parent/40/mojo-parent-40.pom
Progress (1): 4.1/34 kB
Progress (1): 7.7/34 kB
Progress (1): 12/34 kB 
Progress (1): 16/34 kB
Progress (1): 20/34 kB
Progress (1): 24/34 kB
Progress (1): 28/34 kB
Progress (1): 32/34 kB
Progress (1): 34 kB   
                   
Downloaded from eclipse.maven.central.mirror: https://repo.eclipse.org/content/repositories/maven_central/org/codehaus/mojo/mojo-parent/40/mojo-parent-40.pom (34 kB at 1.1 MB/s)
Downloading from repo.eclipse.org: https://repo.eclipse.org/content/repositories/cbi/com/google/auto/value/auto-value/1.6.5/auto-value-1.6.5.pom
Downloading from eclipse.maven.central.mirror: https://repo.eclipse.org/content/repositories/maven_central/com/google/auto/value/auto-value/1.6.5/auto-value-1.6.5.pom
Progress (1): 4.1/6.1 kB
Progress (1): 6.1 kB    
                    
Downloaded from eclipse.maven.central.mirror: https://repo.eclipse.org/content/repositories/maven_central/com/google/auto/value/auto-value/1.6.5/auto-value-1.6.5.pom (6.1 kB at 16 kB/s)
Downloading from repo.eclipse.org: https://repo.eclipse.org/content/repositories/cbi/com/google/auto/value/auto-value-parent/1.6.5/auto-value-parent-1.6.5.pom
Downloading from eclipse.maven.central.mirror: https://repo.eclipse.org/content/repositories/maven_central/com/google/auto/value/auto-value-parent/1.6.5/auto-value-parent-1.6.5.pom
Progress (1): 1.7 kB
                    
Downloaded from eclipse.maven.central.mirror: https://repo.eclipse.org/content/repositories/maven_central/com/google/auto/value/auto-value-parent/1.6.5/auto-value-parent-1.6.5.pom (1.7 kB at 8.9 kB/s)
Downloading from repo.eclipse.org: https://repo.eclipse.org/content/repositories/cbi/com/google/auto/auto-parent/7/auto-parent-7.pom
Downloading from eclipse.maven.central.mirror: https://repo.eclipse.org/content/repositories/maven_central/com/google/auto/auto-parent/7/auto-parent-7.pom
Progress (1): 4.1/6.5 kB
Progress (1): 6.5 kB    
                    
Downloaded from eclipse.maven.central.mirror: https://repo.eclipse.org/content/repositories/maven_central/com/google/auto/auto-parent/7/auto-parent-7.pom (6.5 kB at 47 kB/s)
Downloading from repo.eclipse.org: https://repo.eclipse.org/content/repositories/cbi/com/google/auto/value/auto-value-annotations/1.6.5/auto-value-annotations-1.6.5.pom
Downloading from eclipse.maven.central.mirror: https://repo.eclipse.org/content/repositories/maven_central/com/google/auto/value/auto-value-annotations/1.6.5/auto-value-annotations-1.6.5.pom
Progress (1): 2.6 kB
                    
Downloaded from eclipse.maven.central.mirror: https://repo.eclipse.org/content/repositories/maven_central/com/google/auto/value/auto-value-annotations/1.6.5/auto-value-annotations-1.6.5.pom (2.6 kB at 12 kB/s)
Downloading from repo.eclipse.org: https://repo.eclipse.org/content/repositories/cbi/org/eclipse/cbi/checkstyle/1.0.2/checkstyle-1.0.2.pom
Downloading from eclipse.maven.central.mirror: https://repo.eclipse.org/content/repositories/maven_central/org/eclipse/cbi/checkstyle/1.0.2/checkstyle-1.0.2.pom
[WARNING] The POM for org.eclipse.cbi:checkstyle:jar:1.0.2 is missing, no dependency information available
Downloading from repo.eclipse.org: https://repo.eclipse.org/content/repositories/cbi/junit/junit/4.12/junit-4.12.pom
Downloading from eclipse.maven.central.mirror: https://repo.eclipse.org/content/repositories/maven_central/junit/junit/4.12/junit-4.12.pom
Progress (1): 4.1/24 kB
Progress (1): 7.7/24 kB
Progress (1): 12/24 kB 
Progress (1): 16/24 kB
Progress (1): 20/24 kB
Progress (1): 24/24 kB
Progress (1): 24 kB   
                   
Downloaded from eclipse.maven.central.mirror: https://repo.eclipse.org/content/repositories/maven_central/junit/junit/4.12/junit-4.12.pom (24 kB at 696 kB/s)
Downloading from repo.eclipse.org: https://repo.eclipse.org/content/repositories/cbi/org/hamcrest/hamcrest-core/1.3/hamcrest-core-1.3.pom
Downloading from eclipse.maven.central.mirror: https://repo.eclipse.org/content/repositories/maven_central/org/hamcrest/hamcrest-core/1.3/hamcrest-core-1.3.pom
Progress (1): 766 B
                   
Downloaded from eclipse.maven.central.mirror: https://repo.eclipse.org/content/repositories/maven_central/org/hamcrest/hamcrest-core/1.3/hamcrest-core-1.3.pom (766 B at 23 kB/s)
Downloading from repo.eclipse.org: https://repo.eclipse.org/content/repositories/cbi/org/hamcrest/hamcrest-parent/1.3/hamcrest-parent-1.3.pom
Downloading from eclipse.maven.central.mirror: https://repo.eclipse.org/content/repositories/maven_central/org/hamcrest/hamcrest-parent/1.3/hamcrest-parent-1.3.pom
Progress (1): 2.0 kB
                    
Downloaded from eclipse.maven.central.mirror: https://repo.eclipse.org/content/repositories/maven_central/org/hamcrest/hamcrest-parent/1.3/hamcrest-parent-1.3.pom (2.0 kB at 62 kB/s)
Downloading from repo.eclipse.org: https://repo.eclipse.org/content/repositories/cbi/com/google/jimfs/jimfs/1.1/jimfs-1.1.pom
Downloading from eclipse.maven.central.mirror: https://repo.eclipse.org/content/repositories/maven_central/com/google/jimfs/jimfs/1.1/jimfs-1.1.pom
Progress (1): 4.1/4.1 kB
Progress (1): 4.1 kB    
                    
Downloaded from eclipse.maven.central.mirror: https://repo.eclipse.org/content/repositories/maven_central/com/google/jimfs/jimfs/1.1/jimfs-1.1.pom (4.1 kB at 19 kB/s)
Downloading from repo.eclipse.org: https://repo.eclipse.org/content/repositories/cbi/com/google/jimfs/jimfs-parent/1.1/jimfs-parent-1.1.pom
Downloading from eclipse.maven.central.mirror: https://repo.eclipse.org/content/repositories/maven_central/com/google/jimfs/jimfs-parent/1.1/jimfs-parent-1.1.pom
Progress (1): 4.1/7.3 kB
Progress (1): 7.3 kB    
                    
Downloaded from eclipse.maven.central.mirror: https://repo.eclipse.org/content/repositories/maven_central/com/google/jimfs/jimfs-parent/1.1/jimfs-parent-1.1.pom (7.3 kB at 54 kB/s)
Downloading from repo.eclipse.org: https://repo.eclipse.org/content/repositories/cbi/org/apache/commons/commons-compress/1.18/commons-compress-1.18.jar
Downloading from repo.eclipse.org: https://repo.eclipse.org/content/repositories/cbi/com/google/guava/guava/28.0-jre/guava-28.0-jre.jar
Downloading from repo.eclipse.org: https://repo.eclipse.org/content/repositories/cbi/com/google/guava/listenablefuture/9999.0-empty-to-avoid-conflict-with-guava/listenablefuture-9999.0-empty-to-avoid-conflict-with-guava.jar
Downloading from repo.eclipse.org: https://repo.eclipse.org/content/repositories/cbi/com/google/guava/failureaccess/1.0.1/failureaccess-1.0.1.jar
Downloading from repo.eclipse.org: https://repo.eclipse.org/content/repositories/cbi/com/google/code/findbugs/jsr305/3.0.2/jsr305-3.0.2.jar
Downloading from repo.eclipse.org: https://repo.eclipse.org/content/repositories/cbi/org/checkerframework/checker-qual/2.8.1/checker-qual-2.8.1.jar
Downloading from repo.eclipse.org: https://repo.eclipse.org/content/repositories/cbi/com/google/errorprone/error_prone_annotations/2.3.2/error_prone_annotations-2.3.2.jar
Downloading from repo.eclipse.org: https://repo.eclipse.org/content/repositories/cbi/com/google/j2objc/j2objc-annotations/1.3/j2objc-annotations-1.3.jar
Downloading from repo.eclipse.org: https://repo.eclipse.org/content/repositories/cbi/org/codehaus/mojo/animal-sniffer-annotations/1.17/animal-sniffer-annotations-1.17.jar
Downloading from repo.eclipse.org: https://repo.eclipse.org/content/repositories/cbi/com/google/auto/value/auto-value/1.6.5/auto-value-1.6.5.jar
Downloading from repo.eclipse.org: https://repo.eclipse.org/content/repositories/cbi/com/google/auto/value/auto-value-annotations/1.6.5/auto-value-annotations-1.6.5.jar
Downloading from repo.eclipse.org: https://repo.eclipse.org/content/repositories/cbi/org/eclipse/cbi/checkstyle/1.0.2/checkstyle-1.0.2.jar
Downloading from repo.eclipse.org: https://repo.eclipse.org/content/repositories/cbi/junit/junit/4.12/junit-4.12.jar
Downloading from repo.eclipse.org: https://repo.eclipse.org/content/repositories/cbi/org/hamcrest/hamcrest-core/1.3/hamcrest-core-1.3.jar
Downloading from repo.eclipse.org: https://repo.eclipse.org/content/repositories/cbi/com/google/jimfs/jimfs/1.1/jimfs-1.1.jar
Downloading from eclipse.maven.central.mirror: https://repo.eclipse.org/content/repositories/maven_central/org/apache/commons/commons-compress/1.18/commons-compress-1.18.jar
Downloading from eclipse.maven.central.mirror: https://repo.eclipse.org/content/repositories/maven_central/com/google/guava/failureaccess/1.0.1/failureaccess-1.0.1.jar
Downloading from eclipse.maven.central.mirror: https://repo.eclipse.org/content/repositories/maven_central/com/google/guava/guava/28.0-jre/guava-28.0-jre.jar
Downloading from eclipse.maven.central.mirror: https://repo.eclipse.org/content/repositories/maven_central/com/google/code/findbugs/jsr305/3.0.2/jsr305-3.0.2.jar
Downloading from eclipse.maven.central.mirror: https://repo.eclipse.org/content/repositories/maven_central/com/google/guava/listenablefuture/9999.0-empty-to-avoid-conflict-with-guava/listenablefuture-9999.0-empty-to-avoid-conflict-with-guava.jar
Progress (1): 4.1/592 kB
Progress (1): 7.7/592 kB
Progress (1): 12/592 kB 
Progress (1): 16/592 kB
Progress (1): 20/592 kB
Progress (1): 24/592 kB
Progress (1): 28/592 kB
Progress (1): 32/592 kB
Progress (2): 32/592 kB | 4.1/20 kB
Progress (2): 36/592 kB | 4.1/20 kB
Progress (2): 36/592 kB | 7.7/20 kB
Progress (2): 40/592 kB | 7.7/20 kB
Progress (2): 44/592 kB | 7.7/20 kB
Progress (2): 48/592 kB | 7.7/20 kB
Progress (2): 52/592 kB | 7.7/20 kB
Progress (2): 52/592 kB | 12/20 kB 
Progress (2): 56/592 kB | 12/20 kB
Progress (2): 60/592 kB | 12/20 kB
Progress (2): 64/592 kB | 12/20 kB
Progress (2): 64/592 kB | 16/20 kB
Progress (2): 68/592 kB | 16/20 kB
Progress (2): 68/592 kB | 20/20 kB
Progress (2): 72/592 kB | 20/20 kB
Progress (2): 72/592 kB | 20 kB   
Progress (2): 76/592 kB | 20 kB
Progress (2): 80/592 kB | 20 kB
Progress (2): 84/592 kB | 20 kB
Progress (2): 88/592 kB | 20 kB
Progress (2): 92/592 kB | 20 kB
Progress (2): 96/592 kB | 20 kB
Progress (2): 100/592 kB | 20 kB
Progress (2): 104/592 kB | 20 kB
Progress (2): 108/592 kB | 20 kB
Progress (2): 112/592 kB | 20 kB
Progress (2): 116/592 kB | 20 kB
Progress (2): 120/592 kB | 20 kB
Progress (2): 124/592 kB | 20 kB
Progress (2): 128/592 kB | 20 kB
Progress (2): 132/592 kB | 20 kB
Progress (2): 136/592 kB | 20 kB
Progress (2): 140/592 kB | 20 kB
Progress (2): 144/592 kB | 20 kB
Progress (2): 148/592 kB | 20 kB
Progress (2): 152/592 kB | 20 kB
Progress (2): 156/592 kB | 20 kB
Progress (2): 160/592 kB | 20 kB
Progress (2): 164/592 kB | 20 kB
Progress (2): 168/592 kB | 20 kB
Progress (2): 172/592 kB | 20 kB
Progress (2): 176/592 kB | 20 kB
Progress (2): 180/592 kB | 20 kB
Progress (2): 184/592 kB | 20 kB
Progress (2): 188/592 kB | 20 kB
Progress (2): 192/592 kB | 20 kB
Progress (2): 196/592 kB | 20 kB
Progress (2): 200/592 kB | 20 kB
Progress (2): 204/592 kB | 20 kB
Progress (2): 208/592 kB | 20 kB
Progress (2): 212/592 kB | 20 kB
Progress (2): 216/592 kB | 20 kB
Progress (2): 220/592 kB | 20 kB
Progress (2): 224/592 kB | 20 kB
Progress (2): 228/592 kB | 20 kB
                                
Downloaded from eclipse.maven.central.mirror: https://repo.eclipse.org/content/repositories/maven_central/com/google/code/findbugs/jsr305/3.0.2/jsr305-3.0.2.jar (20 kB at 453 kB/s)
Progress (1): 232/592 kB
                        
Downloading from eclipse.maven.central.mirror: https://repo.eclipse.org/content/repositories/maven_central/org/checkerframework/checker-qual/2.8.1/checker-qual-2.8.1.jar
Progress (1): 236/592 kB
Progress (1): 240/592 kB
Progress (1): 244/592 kB
Progress (1): 248/592 kB
Progress (1): 252/592 kB
Progress (1): 256/592 kB
Progress (1): 260/592 kB
Progress (1): 264/592 kB
Progress (1): 268/592 kB
Progress (1): 272/592 kB
Progress (1): 276/592 kB
Progress (1): 280/592 kB
Progress (2): 280/592 kB | 4.1/4.6 kB
Progress (2): 280/592 kB | 4.6 kB    
Progress (3): 280/592 kB | 4.6 kB | 2.2 kB
Progress (3): 284/592 kB | 4.6 kB | 2.2 kB
Progress (3): 288/592 kB | 4.6 kB | 2.2 kB
Progress (3): 292/592 kB | 4.6 kB | 2.2 kB
Progress (3): 296/592 kB | 4.6 kB | 2.2 kB
Progress (3): 300/592 kB | 4.6 kB | 2.2 kB
Progress (3): 304/592 kB | 4.6 kB | 2.2 kB
Progress (3): 308/592 kB | 4.6 kB | 2.2 kB
Progress (3): 312/592 kB | 4.6 kB | 2.2 kB
Progress (3): 316/592 kB | 4.6 kB | 2.2 kB
Progress (3): 320/592 kB | 4.6 kB | 2.2 kB
Progress (3): 324/592 kB | 4.6 kB | 2.2 kB
Progress (3): 328/592 kB | 4.6 kB | 2.2 kB
Progress (3): 332/592 kB | 4.6 kB | 2.2 kB
Progress (3): 336/592 kB | 4.6 kB | 2.2 kB
                                          
Downloaded from eclipse.maven.central.mirror: https://repo.eclipse.org/content/repositories/maven_central/com/google/guava/failureaccess/1.0.1/failureaccess-1.0.1.jar (4.6 kB at 82 kB/s)
Downloaded from eclipse.maven.central.mirror: https://repo.eclipse.org/content/repositories/maven_central/com/google/guava/listenablefuture/9999.0-empty-to-avoid-conflict-with-guava/listenablefuture-9999.0-empty-to-avoid-conflict-with-guava.jar (2.2 kB at 40 kB/s)
Downloading from eclipse.maven.central.mirror: https://repo.eclipse.org/content/repositories/maven_central/com/google/errorprone/error_prone_annotations/2.3.2/error_prone_annotations-2.3.2.jar
Progress (1): 340/592 kB
                        
Downloading from eclipse.maven.central.mirror: https://repo.eclipse.org/content/repositories/maven_central/com/google/j2objc/j2objc-annotations/1.3/j2objc-annotations-1.3.jar
Progress (1): 344/592 kB
Progress (1): 348/592 kB
Progress (1): 352/592 kB
Progress (1): 356/592 kB
Progress (1): 360/592 kB
Progress (1): 364/592 kB
Progress (1): 368/592 kB
Progress (1): 372/592 kB
Progress (1): 376/592 kB
Progress (1): 380/592 kB
Progress (1): 384/592 kB
Progress (1): 388/592 kB
Progress (1): 392/592 kB
Progress (1): 396/592 kB
Progress (1): 400/592 kB
Progress (1): 404/592 kB
Progress (1): 408/592 kB
Progress (1): 412/592 kB
Progress (1): 416/592 kB
Progress (1): 420/592 kB
Progress (1): 424/592 kB
Progress (1): 428/592 kB
Progress (1): 432/592 kB
Progress (1): 436/592 kB
Progress (1): 440/592 kB
Progress (1): 444/592 kB
Progress (1): 448/592 kB
Progress (1): 452/592 kB
Progress (1): 456/592 kB
Progress (1): 460/592 kB
Progress (1): 464/592 kB
Progress (1): 468/592 kB
Progress (1): 472/592 kB
Progress (1): 476/592 kB
Progress (1): 480/592 kB
Progress (1): 484/592 kB
Progress (1): 488/592 kB
Progress (1): 492/592 kB
Progress (1): 496/592 kB
Progress (1): 500/592 kB
Progress (1): 504/592 kB
Progress (1): 508/592 kB
Progress (1): 512/592 kB
Progress (1): 516/592 kB
Progress (1): 520/592 kB
Progress (1): 524/592 kB
Progress (1): 528/592 kB
Progress (1): 532/592 kB
Progress (1): 536/592 kB
Progress (1): 540/592 kB
Progress (1): 544/592 kB
Progress (1): 548/592 kB
Progress (1): 552/592 kB
Progress (1): 556/592 kB
Progress (1): 560/592 kB
Progress (1): 564/592 kB
Progress (1): 568/592 kB
Progress (1): 572/592 kB
Progress (1): 576/592 kB
Progress (1): 580/592 kB
Progress (1): 584/592 kB
Progress (1): 588/592 kB
Progress (1): 592/592 kB
Progress (1): 592 kB    
                    
Downloaded from eclipse.maven.central.mirror: https://repo.eclipse.org/content/repositories/maven_central/org/apache/commons/commons-compress/1.18/commons-compress-1.18.jar (592 kB at 5.7 MB/s)
Downloading from eclipse.maven.central.mirror: https://repo.eclipse.org/content/repositories/maven_central/org/codehaus/mojo/animal-sniffer-annotations/1.17/animal-sniffer-annotations-1.17.jar
Progress (1): 0/2.7 MB
Progress (1): 0/2.7 MB
Progress (1): 0/2.7 MB
Progress (1): 0/2.7 MB
Progress (1): 0/2.7 MB
Progress (1): 0/2.7 MB
Progress (1): 0/2.7 MB
Progress (1): 0/2.7 MB
Progress (1): 0/2.7 MB
Progress (1): 0/2.7 MB
Progress (1): 0/2.7 MB
Progress (1): 0/2.7 MB
Progress (1): 0.1/2.7 MB
Progress (1): 0.1/2.7 MB
Progress (1): 0.1/2.7 MB
Progress (1): 0.1/2.7 MB
Progress (1): 0.1/2.7 MB
Progress (1): 0.1/2.7 MB
Progress (1): 0.1/2.7 MB
Progress (1): 0.1/2.7 MB
Progress (1): 0.1/2.7 MB
Progress (1): 0.1/2.7 MB
Progress (1): 0.1/2.7 MB
Progress (1): 0.1/2.7 MB
Progress (1): 0.1/2.7 MB
Progress (2): 0.1/2.7 MB | 3.4 kB
                                 
Downloaded from eclipse.maven.central.mirror: https://repo.eclipse.org/content/repositories/maven_central/org/codehaus/mojo/animal-sniffer-annotations/1.17/animal-sniffer-annotations-1.17.jar (3.4 kB at 23 kB/s)
Downloading from eclipse.maven.central.mirror: https://repo.eclipse.org/content/repositories/maven_central/com/google/auto/value/auto-value/1.6.5/auto-value-1.6.5.jar
Progress (2): 0.1/2.7 MB | 4.1/13 kB
Progress (2): 0.1/2.7 MB | 7.7/13 kB
Progress (2): 0.1/2.7 MB | 12/13 kB 
Progress (2): 0.1/2.7 MB | 13 kB   
                                
Downloaded from eclipse.maven.central.mirror: https://repo.eclipse.org/content/repositories/maven_central/com/google/errorprone/error_prone_annotations/2.3.2/error_prone_annotations-2.3.2.jar (13 kB at 80 kB/s)
Downloading from eclipse.maven.central.mirror: https://repo.eclipse.org/content/repositories/maven_central/com/google/auto/value/auto-value-annotations/1.6.5/auto-value-annotations-1.6.5.jar
Progress (1): 0.1/2.7 MB
Progress (1): 0.1/2.7 MB
Progress (1): 0.1/2.7 MB
Progress (1): 0.1/2.7 MB
Progress (1): 0.1/2.7 MB
Progress (1): 0.1/2.7 MB
Progress (1): 0.1/2.7 MB
Progress (1): 0.1/2.7 MB
Progress (1): 0.1/2.7 MB
Progress (1): 0.1/2.7 MB
Progress (1): 0.1/2.7 MB
Progress (1): 0.1/2.7 MB
Progress (1): 0.1/2.7 MB
Progress (1): 0.2/2.7 MB
Progress (1): 0.2/2.7 MB
Progress (1): 0.2/2.7 MB
Progress (1): 0.2/2.7 MB
Progress (1): 0.2/2.7 MB
Progress (1): 0.2/2.7 MB
Progress (1): 0.2/2.7 MB
Progress (1): 0.2/2.7 MB
Progress (1): 0.2/2.7 MB
Progress (1): 0.2/2.7 MB
Progress (1): 0.2/2.7 MB
Progress (1): 0.2/2.7 MB
Progress (1): 0.2/2.7 MB
Progress (1): 0.2/2.7 MB
Progress (1): 0.2/2.7 MB
Progress (1): 0.2/2.7 MB
Progress (1): 0.2/2.7 MB
Progress (1): 0.2/2.7 MB
Progress (1): 0.2/2.7 MB
Progress (1): 0.2/2.7 MB
Progress (1): 0.2/2.7 MB
Progress (1): 0.2/2.7 MB
Progress (1): 0.2/2.7 MB
Progress (1): 0.2/2.7 MB
Progress (1): 0.2/2.7 MB
Progress (1): 0.2/2.7 MB
Progress (1): 0.2/2.7 MB
Progress (1): 0.2/2.7 MB
Progress (1): 0.3/2.7 MB
Progress (1): 0.3/2.7 MB
Progress (1): 0.3/2.7 MB
Progress (1): 0.3/2.7 MB
Progress (1): 0.3/2.7 MB
Progress (1): 0.3/2.7 MB
Progress (1): 0.3/2.7 MB
Progress (1): 0.3/2.7 MB
Progress (1): 0.3/2.7 MB
Progress (1): 0.3/2.7 MB
Progress (1): 0.3/2.7 MB
Progress (1): 0.3/2.7 MB
Progress (1): 0.3/2.7 MB
Progress (1): 0.3/2.7 MB
Progress (1): 0.3/2.7 MB
Progress (1): 0.3/2.7 MB
Progress (1): 0.3/2.7 MB
Progress (1): 0.3/2.7 MB
Progress (1): 0.3/2.7 MB
Progress (1): 0.3/2.7 MB
Progress (1): 0.3/2.7 MB
Progress (1): 0.3/2.7 MB
Progress (1): 0.3/2.7 MB
Progress (1): 0.3/2.7 MB
Progress (1): 0.3/2.7 MB
Progress (1): 0.3/2.7 MB
Progress (1): 0.3/2.7 MB
Progress (1): 0.4/2.7 MB
Progress (1): 0.4/2.7 MB
Progress (1): 0.4/2.7 MB
Progress (1): 0.4/2.7 MB
Progress (1): 0.4/2.7 MB
Progress (1): 0.4/2.7 MB
Progress (1): 0.4/2.7 MB
Progress (1): 0.4/2.7 MB
Progress (1): 0.4/2.7 MB
Progress (1): 0.4/2.7 MB
Progress (1): 0.4/2.7 MB
Progress (1): 0.4/2.7 MB
Progress (1): 0.4/2.7 MB
Progress (1): 0.4/2.7 MB
Progress (1): 0.4/2.7 MB
Progress (1): 0.4/2.7 MB
Progress (1): 0.4/2.7 MB
Progress (1): 0.4/2.7 MB
Progress (1): 0.4/2.7 MB
Progress (1): 0.4/2.7 MB
Progress (1): 0.4/2.7 MB
Progress (1): 0.4/2.7 MB
Progress (1): 0.4/2.7 MB
Progress (1): 0.4/2.7 MB
Progress (1): 0.4/2.7 MB
Progress (1): 0.4/2.7 MB
Progress (1): 0.4/2.7 MB
Progress (1): 0.4/2.7 MB
Progress (1): 0.5/2.7 MB
Progress (1): 0.5/2.7 MB
Progress (1): 0.5/2.7 MB
Progress (1): 0.5/2.7 MB
Progress (1): 0.5/2.7 MB
Progress (1): 0.5/2.7 MB
Progress (1): 0.5/2.7 MB
Progress (1): 0.5/2.7 MB
Progress (1): 0.5/2.7 MB
Progress (1): 0.5/2.7 MB
Progress (1): 0.5/2.7 MB
Progress (1): 0.5/2.7 MB
Progress (1): 0.5/2.7 MB
Progress (1): 0.5/2.7 MB
Progress (1): 0.5/2.7 MB
Progress (1): 0.5/2.7 MB
Progress (1): 0.5/2.7 MB
Progress (1): 0.5/2.7 MB
Progress (1): 0.5/2.7 MB
Progress (1): 0.5/2.7 MB
Progress (1): 0.5/2.7 MB
Progress (1): 0.5/2.7 MB
Progress (1): 0.5/2.7 MB
Progress (1): 0.5/2.7 MB
Progress (1): 0.5/2.7 MB
Progress (1): 0.5/2.7 MB
Progress (1): 0.5/2.7 MB
Progress (1): 0.6/2.7 MB
Progress (1): 0.6/2.7 MB
Progress (1): 0.6/2.7 MB
Progress (1): 0.6/2.7 MB
Progress (1): 0.6/2.7 MB
Progress (1): 0.6/2.7 MB
Progress (1): 0.6/2.7 MB
Progress (1): 0.6/2.7 MB
Progress (1): 0.6/2.7 MB
Progress (1): 0.6/2.7 MB
Progress (1): 0.6/2.7 MB
Progress (1): 0.6/2.7 MB
Progress (1): 0.6/2.7 MB
Progress (1): 0.6/2.7 MB
Progress (1): 0.6/2.7 MB
Progress (1): 0.6/2.7 MB
Progress (1): 0.6/2.7 MB
Progress (1): 0.6/2.7 MB
Progress (1): 0.6/2.7 MB
Progress (1): 0.6/2.7 MB
Progress (1): 0.6/2.7 MB
Progress (1): 0.6/2.7 MB
Progress (1): 0.6/2.7 MB
Progress (1): 0.6/2.7 MB
Progress (1): 0.6/2.7 MB
Progress (1): 0.6/2.7 MB
Progress (1): 0.7/2.7 MB
Progress (1): 0.7/2.7 MB
Progress (1): 0.7/2.7 MB
Progress (1): 0.7/2.7 MB
Progress (1): 0.7/2.7 MB
Progress (1): 0.7/2.7 MB
Progress (1): 0.7/2.7 MB
Progress (1): 0.7/2.7 MB
Progress (1): 0.7/2.7 MB
Progress (1): 0.7/2.7 MB
Progress (1): 0.7/2.7 MB
Progress (1): 0.7/2.7 MB
Progress (1): 0.7/2.7 MB
Progress (1): 0.7/2.7 MB
Progress (1): 0.7/2.7 MB
Progress (1): 0.7/2.7 MB
Progress (1): 0.7/2.7 MB
Progress (1): 0.7/2.7 MB
Progress (1): 0.7/2.7 MB
Progress (1): 0.7/2.7 MB
Progress (1): 0.7/2.7 MB
Progress (1): 0.7/2.7 MB
Progress (1): 0.7/2.7 MB
Progress (1): 0.7/2.7 MB
Progress (1): 0.7/2.7 MB
Progress (1): 0.8/2.7 MB
Progress (1): 0.8/2.7 MB
Progress (1): 0.8/2.7 MB
Progress (1): 0.8/2.7 MB
Progress (1): 0.8/2.7 MB
Progress (1): 0.8/2.7 MB
Progress (1): 0.8/2.7 MB
Progress (1): 0.8/2.7 MB
Progress (1): 0.8/2.7 MB
Progress (1): 0.8/2.7 MB
Progress (1): 0.8/2.7 MB
Progress (1): 0.8/2.7 MB
Progress (1): 0.8/2.7 MB
Progress (1): 0.8/2.7 MB
Progress (1): 0.8/2.7 MB
Progress (1): 0.8/2.7 MB
Progress (1): 0.8/2.7 MB
Progress (1): 0.8/2.7 MB
Progress (1): 0.8/2.7 MB
Progress (1): 0.8/2.7 MB
Progress (1): 0.8/2.7 MB
Progress (1): 0.8/2.7 MB
Progress (1): 0.8/2.7 MB
Progress (1): 0.8/2.7 MB
Progress (1): 0.8/2.7 MB
Progress (1): 0.9/2.7 MB
Progress (1): 0.9/2.7 MB
Progress (1): 0.9/2.7 MB
Progress (1): 0.9/2.7 MB
Progress (1): 0.9/2.7 MB
Progress (1): 0.9/2.7 MB
Progress (1): 0.9/2.7 MB
Progress (1): 0.9/2.7 MB
Progress (1): 0.9/2.7 MB
Progress (1): 0.9/2.7 MB
Progress (1): 0.9/2.7 MB
Progress (1): 0.9/2.7 MB
Progress (1): 0.9/2.7 MB
Progress (1): 0.9/2.7 MB
Progress (1): 0.9/2.7 MB
Progress (1): 0.9/2.7 MB
Progress (1): 0.9/2.7 MB
Progress (1): 0.9/2.7 MB
Progress (1): 0.9/2.7 MB
Progress (1): 0.9/2.7 MB
Progress (1): 0.9/2.7 MB
Progress (1): 0.9/2.7 MB
Progress (1): 0.9/2.7 MB
Progress (1): 0.9/2.7 MB
Progress (1): 0.9/2.7 MB
Progress (1): 0.9/2.7 MB
Progress (1): 0.9/2.7 MB
Progress (1): 1.0/2.7 MB
Progress (1): 1.0/2.7 MB
Progress (1): 1.0/2.7 MB
Progress (1): 1.0/2.7 MB
Progress (1): 1.0/2.7 MB
Progress (1): 1.0/2.7 MB
Progress (1): 1.0/2.7 MB
Progress (1): 1.0/2.7 MB
Progress (1): 1.0/2.7 MB
Progress (1): 1.0/2.7 MB
Progress (1): 1.0/2.7 MB
Progress (1): 1.0/2.7 MB
Progress (1): 1.0/2.7 MB
Progress (1): 1.0/2.7 MB
Progress (1): 1.0/2.7 MB
Progress (1): 1.0/2.7 MB
Progress (1): 1.0/2.7 MB
Progress (1): 1.0/2.7 MB
Progress (1): 1.0/2.7 MB
Progress (1): 1.0/2.7 MB
Progress (1): 1.0/2.7 MB
Progress (1): 1.0/2.7 MB
Progress (1): 1.0/2.7 MB
Progress (1): 1.0/2.7 MB
Progress (1): 1.0/2.7 MB
Progress (1): 1.1/2.7 MB
Progress (1): 1.1/2.7 MB
Progress (1): 1.1/2.7 MB
Progress (1): 1.1/2.7 MB
Progress (1): 1.1/2.7 MB
Progress (1): 1.1/2.7 MB
Progress (1): 1.1/2.7 MB
Progress (1): 1.1/2.7 MB
Progress (1): 1.1/2.7 MB
Progress (1): 1.1/2.7 MB
Progress (1): 1.1/2.7 MB
Progress (1): 1.1/2.7 MB
Progress (1): 1.1/2.7 MB
Progress (1): 1.1/2.7 MB
Progress (1): 1.1/2.7 MB
Progress (1): 1.1/2.7 MB
Progress (1): 1.1/2.7 MB
Progress (1): 1.1/2.7 MB
Progress (1): 1.1/2.7 MB
Progress (1): 1.1/2.7 MB
Progress (1): 1.1/2.7 MB
Progress (1): 1.1/2.7 MB
Progress (1): 1.1/2.7 MB
Progress (1): 1.1/2.7 MB
Progress (1): 1.1/2.7 MB
Progress (1): 1.2/2.7 MB
Progress (1): 1.2/2.7 MB
Progress (1): 1.2/2.7 MB
Progress (1): 1.2/2.7 MB
Progress (1): 1.2/2.7 MB
Progress (1): 1.2/2.7 MB
Progress (1): 1.2/2.7 MB
Progress (1): 1.2/2.7 MB
Progress (1): 1.2/2.7 MB
Progress (1): 1.2/2.7 MB
Progress (1): 1.2/2.7 MB
Progress (1): 1.2/2.7 MB
Progress (1): 1.2/2.7 MB
Progress (1): 1.2/2.7 MB
Progress (1): 1.2/2.7 MB
Progress (1): 1.2/2.7 MB
Progress (1): 1.2/2.7 MB
Progress (1): 1.2/2.7 MB
Progress (1): 1.2/2.7 MB
Progress (1): 1.2/2.7 MB
Progress (1): 1.2/2.7 MB
Progress (1): 1.2/2.7 MB
Progress (1): 1.2/2.7 MB
Progress (1): 1.2/2.7 MB
Progress (1): 1.2/2.7 MB
Progress (1): 1.3/2.7 MB
Progress (1): 1.3/2.7 MB
Progress (1): 1.3/2.7 MB
Progress (1): 1.3/2.7 MB
Progress (1): 1.3/2.7 MB
Progress (1): 1.3/2.7 MB
Progress (1): 1.3/2.7 MB
Progress (1): 1.3/2.7 MB
Progress (1): 1.3/2.7 MB
Progress (1): 1.3/2.7 MB
Progress (1): 1.3/2.7 MB
Progress (1): 1.3/2.7 MB
Progress (1): 1.3/2.7 MB
Progress (1): 1.3/2.7 MB
Progress (1): 1.3/2.7 MB
Progress (1): 1.3/2.7 MB
Progress (1): 1.3/2.7 MB
Progress (1): 1.3/2.7 MB
Progress (1): 1.3/2.7 MB
Progress (1): 1.3/2.7 MB
Progress (1): 1.3/2.7 MB
Progress (1): 1.3/2.7 MB
Progress (1): 1.3/2.7 MB
Progress (1): 1.3/2.7 MB
Progress (1): 1.3/2.7 MB
Progress (1): 1.4/2.7 MB
Progress (1): 1.4/2.7 MB
Progress (1): 1.4/2.7 MB
Progress (1): 1.4/2.7 MB
Progress (1): 1.4/2.7 MB
Progress (1): 1.4/2.7 MB
Progress (1): 1.4/2.7 MB
Progress (1): 1.4/2.7 MB
Progress (1): 1.4/2.7 MB
Progress (1): 1.4/2.7 MB
Progress (1): 1.4/2.7 MB
Progress (1): 1.4/2.7 MB
Progress (1): 1.4/2.7 MB
Progress (1): 1.4/2.7 MB
Progress (1): 1.4/2.7 MB
Progress (1): 1.4/2.7 MB
Progress (1): 1.4/2.7 MB
Progress (1): 1.4/2.7 MB
Progress (1): 1.4/2.7 MB
Progress (1): 1.4/2.7 MB
Progress (1): 1.4/2.7 MB
Progress (1): 1.4/2.7 MB
Progress (1): 1.4/2.7 MB
Progress (1): 1.4/2.7 MB
Progress (1): 1.4/2.7 MB
Progress (1): 1.5/2.7 MB
Progress (1): 1.5/2.7 MB
Progress (1): 1.5/2.7 MB
Progress (1): 1.5/2.7 MB
Progress (1): 1.5/2.7 MB
Progress (1): 1.5/2.7 MB
Progress (1): 1.5/2.7 MB
Progress (1): 1.5/2.7 MB
Progress (1): 1.5/2.7 MB
Progress (1): 1.5/2.7 MB
Progress (1): 1.5/2.7 MB
Progress (1): 1.5/2.7 MB
Progress (1): 1.5/2.7 MB
Progress (1): 1.5/2.7 MB
Progress (1): 1.5/2.7 MB
Progress (1): 1.5/2.7 MB
Progress (1): 1.5/2.7 MB
Progress (1): 1.5/2.7 MB
Progress (1): 1.5/2.7 MB
Progress (1): 1.5/2.7 MB
Progress (1): 1.5/2.7 MB
Progress (1): 1.5/2.7 MB
Progress (1): 1.5/2.7 MB
Progress (1): 1.5/2.7 MB
Progress (1): 1.5/2.7 MB
Progress (1): 1.6/2.7 MB
Progress (1): 1.6/2.7 MB
Progress (1): 1.6/2.7 MB
Progress (1): 1.6/2.7 MB
Progress (1): 1.6/2.7 MB
Progress (1): 1.6/2.7 MB
Progress (1): 1.6/2.7 MB
Progress (1): 1.6/2.7 MB
Progress (1): 1.6/2.7 MB
Progress (1): 1.6/2.7 MB
Progress (1): 1.6/2.7 MB
Progress (1): 1.6/2.7 MB
Progress (1): 1.6/2.7 MB
Progress (1): 1.6/2.7 MB
Progress (1): 1.6/2.7 MB
Progress (1): 1.6/2.7 MB
Progress (1): 1.6/2.7 MB
Progress (1): 1.6/2.7 MB
Progress (1): 1.6/2.7 MB
Progress (1): 1.6/2.7 MB
Progress (1): 1.6/2.7 MB
Progress (1): 1.6/2.7 MB
Progress (1): 1.6/2.7 MB
Progress (1): 1.6/2.7 MB
Progress (1): 1.6/2.7 MB
Progress (1): 1.7/2.7 MB
Progress (1): 1.7/2.7 MB
Progress (1): 1.7/2.7 MB
Progress (1): 1.7/2.7 MB
Progress (1): 1.7/2.7 MB
Progress (1): 1.7/2.7 MB
Progress (1): 1.7/2.7 MB
Progress (1): 1.7/2.7 MB
Progress (1): 1.7/2.7 MB
Progress (1): 1.7/2.7 MB
Progress (1): 1.7/2.7 MB
Progress (1): 1.7/2.7 MB
Progress (1): 1.7/2.7 MB
Progress (1): 1.7/2.7 MB
Progress (1): 1.7/2.7 MB
Progress (1): 1.7/2.7 MB
Progress (1): 1.7/2.7 MB
Progress (1): 1.7/2.7 MB
Progress (1): 1.7/2.7 MB
Progress (1): 1.7/2.7 MB
Progress (1): 1.7/2.7 MB
Progress (1): 1.7/2.7 MB
Progress (1): 1.7/2.7 MB
Progress (1): 1.7/2.7 MB
Progress (1): 1.7/2.7 MB
Progress (1): 1.8/2.7 MB
Progress (1): 1.8/2.7 MB
Progress (1): 1.8/2.7 MB
Progress (1): 1.8/2.7 MB
Progress (1): 1.8/2.7 MB
Progress (1): 1.8/2.7 MB
Progress (1): 1.8/2.7 MB
Progress (1): 1.8/2.7 MB
Progress (1): 1.8/2.7 MB
Progress (1): 1.8/2.7 MB
Progress (1): 1.8/2.7 MB
Progress (1): 1.8/2.7 MB
Progress (1): 1.8/2.7 MB
Progress (1): 1.8/2.7 MB
Progress (1): 1.8/2.7 MB
Progress (1): 1.8/2.7 MB
Progress (1): 1.8/2.7 MB
Progress (1): 1.8/2.7 MB
Progress (1): 1.8/2.7 MB
Progress (1): 1.8/2.7 MB
Progress (1): 1.8/2.7 MB
Progress (1): 1.8/2.7 MB
Progress (1): 1.8/2.7 MB
Progress (1): 1.8/2.7 MB
Progress (1): 1.8/2.7 MB
Progress (1): 1.9/2.7 MB
Progress (1): 1.9/2.7 MB
Progress (1): 1.9/2.7 MB
Progress (1): 1.9/2.7 MB
Progress (1): 1.9/2.7 MB
Progress (1): 1.9/2.7 MB
Progress (1): 1.9/2.7 MB
Progress (1): 1.9/2.7 MB
Progress (1): 1.9/2.7 MB
Progress (1): 1.9/2.7 MB
Progress (1): 1.9/2.7 MB
Progress (1): 1.9/2.7 MB
Progress (1): 1.9/2.7 MB
Progress (1): 1.9/2.7 MB
Progress (1): 1.9/2.7 MB
Progress (1): 1.9/2.7 MB
Progress (1): 1.9/2.7 MB
Progress (1): 1.9/2.7 MB
Progress (1): 1.9/2.7 MB
Progress (1): 1.9/2.7 MB
Progress (1): 1.9/2.7 MB
Progress (1): 1.9/2.7 MB
Progress (1): 1.9/2.7 MB
Progress (1): 1.9/2.7 MB
Progress (1): 1.9/2.7 MB
Progress (1): 2.0/2.7 MB
Progress (1): 2.0/2.7 MB
Progress (1): 2.0/2.7 MB
Progress (1): 2.0/2.7 MB
Progress (1): 2.0/2.7 MB
Progress (1): 2.0/2.7 MB
Progress (1): 2.0/2.7 MB
Progress (1): 2.0/2.7 MB
Progress (1): 2.0/2.7 MB
Progress (1): 2.0/2.7 MB
Progress (1): 2.0/2.7 MB
Progress (1): 2.0/2.7 MB
Progress (1): 2.0/2.7 MB
Progress (1): 2.0/2.7 MB
Progress (1): 2.0/2.7 MB
Progress (1): 2.0/2.7 MB
Progress (1): 2.0/2.7 MB
Progress (1): 2.0/2.7 MB
Progress (1): 2.0/2.7 MB
Progress (1): 2.0/2.7 MB
Progress (1): 2.0/2.7 MB
Progress (1): 2.0/2.7 MB
Progress (1): 2.0/2.7 MB
Progress (1): 2.0/2.7 MB
Progress (1): 2.0/2.7 MB
Progress (1): 2.1/2.7 MB
Progress (1): 2.1/2.7 MB
Progress (1): 2.1/2.7 MB
Progress (1): 2.1/2.7 MB
Progress (1): 2.1/2.7 MB
Progress (1): 2.1/2.7 MB
Progress (1): 2.1/2.7 MB
Progress (1): 2.1/2.7 MB
Progress (1): 2.1/2.7 MB
Progress (1): 2.1/2.7 MB
Progress (1): 2.1/2.7 MB
Progress (1): 2.1/2.7 MB
Progress (1): 2.1/2.7 MB
Progress (1): 2.1/2.7 MB
Progress (1): 2.1/2.7 MB
Progress (1): 2.1/2.7 MB
Progress (1): 2.1/2.7 MB
Progress (1): 2.1/2.7 MB
Progress (1): 2.1/2.7 MB
Progress (1): 2.1/2.7 MB
Progress (1): 2.1/2.7 MB
Progress (1): 2.1/2.7 MB
Progress (1): 2.1/2.7 MB
Progress (1): 2.1/2.7 MB
Progress (1): 2.1/2.7 MB
Progress (1): 2.2/2.7 MB
Progress (1): 2.2/2.7 MB
Progress (1): 2.2/2.7 MB
Progress (1): 2.2/2.7 MB
Progress (1): 2.2/2.7 MB
Progress (1): 2.2/2.7 MB
Progress (1): 2.2/2.7 MB
Progress (1): 2.2/2.7 MB
Progress (1): 2.2/2.7 MB
Progress (1): 2.2/2.7 MB
Progress (1): 2.2/2.7 MB
Progress (1): 2.2/2.7 MB
Progress (1): 2.2/2.7 MB
Progress (1): 2.2/2.7 MB
Progress (1): 2.2/2.7 MB
Progress (1): 2.2/2.7 MB
Progress (1): 2.2/2.7 MB
Progress (1): 2.2/2.7 MB
Progress (1): 2.2/2.7 MB
Progress (1): 2.2/2.7 MB
Progress (1): 2.2/2.7 MB
Progress (1): 2.2/2.7 MB
Progress (1): 2.2/2.7 MB
Progress (1): 2.2/2.7 MB
Progress (1): 2.2/2.7 MB
Progress (1): 2.3/2.7 MB
Progress (2): 2.3/2.7 MB | 4.1/8.8 kB
Progress (3): 2.3/2.7 MB | 4.1/8.8 kB | 4.1/201 kB
Progress (3): 2.3/2.7 MB | 7.7/8.8 kB | 4.1/201 kB
Progress (3): 2.3/2.7 MB | 7.7/8.8 kB | 4.1/201 kB
Progress (3): 2.3/2.7 MB | 8.8 kB | 4.1/201 kB    
Progress (3): 2.3/2.7 MB | 8.8 kB | 7.7/201 kB
Progress (3): 2.3/2.7 MB | 8.8 kB | 7.7/201 kB
Progress (3): 2.3/2.7 MB | 8.8 kB | 12/201 kB 
Progress (3): 2.3/2.7 MB | 8.8 kB | 12/201 kB
Progress (3): 2.3/2.7 MB | 8.8 kB | 16/201 kB
Progress (3): 2.3/2.7 MB | 8.8 kB | 16/201 kB
Progress (3): 2.3/2.7 MB | 8.8 kB | 20/201 kB
Progress (3): 2.3/2.7 MB | 8.8 kB | 20/201 kB
Progress (3): 2.3/2.7 MB | 8.8 kB | 24/201 kB
Progress (3): 2.3/2.7 MB | 8.8 kB | 24/201 kB
Progress (3): 2.3/2.7 MB | 8.8 kB | 28/201 kB
Progress (3): 2.3/2.7 MB | 8.8 kB | 28/201 kB
Progress (3): 2.3/2.7 MB | 8.8 kB | 32/201 kB
Progress (3): 2.3/2.7 MB | 8.8 kB | 32/201 kB
Progress (3): 2.3/2.7 MB | 8.8 kB | 36/201 kB
Progress (3): 2.3/2.7 MB | 8.8 kB | 36/201 kB
Progress (3): 2.3/2.7 MB | 8.8 kB | 40/201 kB
Progress (3): 2.3/2.7 MB | 8.8 kB | 40/201 kB
Progress (3): 2.3/2.7 MB | 8.8 kB | 44/201 kB
Progress (3): 2.3/2.7 MB | 8.8 kB | 44/201 kB
Progress (3): 2.3/2.7 MB | 8.8 kB | 48/201 kB
Progress (3): 2.3/2.7 MB | 8.8 kB | 48/201 kB
Progress (3): 2.3/2.7 MB | 8.8 kB | 52/201 kB
Progress (3): 2.3/2.7 MB | 8.8 kB | 56/201 kB
Progress (3): 2.3/2.7 MB | 8.8 kB | 56/201 kB
Progress (3): 2.3/2.7 MB | 8.8 kB | 60/201 kB
Progress (3): 2.3/2.7 MB | 8.8 kB | 60/201 kB
Progress (3): 2.3/2.7 MB | 8.8 kB | 64/201 kB
Progress (3): 2.3/2.7 MB | 8.8 kB | 64/201 kB
Progress (3): 2.3/2.7 MB | 8.8 kB | 66/201 kB
Progress (3): 2.3/2.7 MB | 8.8 kB | 66/201 kB
Progress (3): 2.3/2.7 MB | 8.8 kB | 70/201 kB
Progress (3): 2.3/2.7 MB | 8.8 kB | 70/201 kB
Progress (3): 2.3/2.7 MB | 8.8 kB | 74/201 kB
Progress (3): 2.3/2.7 MB | 8.8 kB | 74/201 kB
Progress (3): 2.3/2.7 MB | 8.8 kB | 78/201 kB
Progress (3): 2.3/2.7 MB | 8.8 kB | 82/201 kB
Progress (3): 2.3/2.7 MB | 8.8 kB | 82/201 kB
Progress (3): 2.3/2.7 MB | 8.8 kB | 86/201 kB
Progress (3): 2.3/2.7 MB | 8.8 kB | 86/201 kB
Progress (3): 2.3/2.7 MB | 8.8 kB | 90/201 kB
Progress (3): 2.3/2.7 MB | 8.8 kB | 90/201 kB
Progress (3): 2.3/2.7 MB | 8.8 kB | 94/201 kB
Progress (3): 2.3/2.7 MB | 8.8 kB | 94/201 kB
Progress (3): 2.3/2.7 MB | 8.8 kB | 98/201 kB
Progress (3): 2.3/2.7 MB | 8.8 kB | 98/201 kB
Progress (3): 2.3/2.7 MB | 8.8 kB | 98/201 kB
Progress (3): 2.3/2.7 MB | 8.8 kB | 98/201 kB
Progress (3): 2.3/2.7 MB | 8.8 kB | 102/201 kB
Progress (3): 2.4/2.7 MB | 8.8 kB | 102/201 kB
Progress (3): 2.4/2.7 MB | 8.8 kB | 106/201 kB
Progress (3): 2.4/2.7 MB | 8.8 kB | 106/201 kB
Progress (3): 2.4/2.7 MB | 8.8 kB | 110/201 kB
Progress (3): 2.4/2.7 MB | 8.8 kB | 110/201 kB
Progress (3): 2.4/2.7 MB | 8.8 kB | 114/201 kB
Progress (3): 2.4/2.7 MB | 8.8 kB | 114/201 kB
Progress (3): 2.4/2.7 MB | 8.8 kB | 118/201 kB
Progress (3): 2.4/2.7 MB | 8.8 kB | 118/201 kB
Progress (3): 2.4/2.7 MB | 8.8 kB | 122/201 kB
Progress (3): 2.4/2.7 MB | 8.8 kB | 122/201 kB
Progress (3): 2.4/2.7 MB | 8.8 kB | 126/201 kB
Progress (3): 2.4/2.7 MB | 8.8 kB | 130/201 kB
Progress (3): 2.4/2.7 MB | 8.8 kB | 130/201 kB
Progress (3): 2.4/2.7 MB | 8.8 kB | 131/201 kB
Progress (3): 2.4/2.7 MB | 8.8 kB | 131/201 kB
Progress (3): 2.4/2.7 MB | 8.8 kB | 135/201 kB
Progress (3): 2.4/2.7 MB | 8.8 kB | 135/201 kB
Progress (3): 2.4/2.7 MB | 8.8 kB | 139/201 kB
Progress (3): 2.4/2.7 MB | 8.8 kB | 139/201 kB
Progress (3): 2.4/2.7 MB | 8.8 kB | 143/201 kB
Progress (3): 2.4/2.7 MB | 8.8 kB | 143/201 kB
Progress (3): 2.4/2.7 MB | 8.8 kB | 147/201 kB
Progress (3): 2.4/2.7 MB | 8.8 kB | 147/201 kB
Progress (3): 2.4/2.7 MB | 8.8 kB | 151/201 kB
Progress (3): 2.4/2.7 MB | 8.8 kB | 151/201 kB
Progress (3): 2.4/2.7 MB | 8.8 kB | 155/201 kB
Progress (3): 2.4/2.7 MB | 8.8 kB | 155/201 kB
Progress (3): 2.4/2.7 MB | 8.8 kB | 159/201 kB
Progress (3): 2.4/2.7 MB | 8.8 kB | 159/201 kB
Progress (3): 2.4/2.7 MB | 8.8 kB | 163/201 kB
Progress (3): 2.4/2.7 MB | 8.8 kB | 163/201 kB
Progress (3): 2.4/2.7 MB | 8.8 kB | 167/201 kB
Progress (3): 2.4/2.7 MB | 8.8 kB | 167/201 kB
Progress (3): 2.4/2.7 MB | 8.8 kB | 171/201 kB
Progress (3): 2.4/2.7 MB | 8.8 kB | 171/201 kB
Progress (3): 2.4/2.7 MB | 8.8 kB | 175/201 kB
Progress (3): 2.4/2.7 MB | 8.8 kB | 175/201 kB
Progress (3): 2.4/2.7 MB | 8.8 kB | 179/201 kB
Progress (3): 2.4/2.7 MB | 8.8 kB | 179/201 kB
Progress (3): 2.4/2.7 MB | 8.8 kB | 183/201 kB
Progress (3): 2.4/2.7 MB | 8.8 kB | 183/201 kB
Progress (3): 2.4/2.7 MB | 8.8 kB | 187/201 kB
Progress (3): 2.4/2.7 MB | 8.8 kB | 187/201 kB
Progress (3): 2.4/2.7 MB | 8.8 kB | 191/201 kB
Progress (3): 2.4/2.7 MB | 8.8 kB | 191/201 kB
Progress (3): 2.4/2.7 MB | 8.8 kB | 195/201 kB
Progress (3): 2.4/2.7 MB | 8.8 kB | 195/201 kB
Progress (3): 2.4/2.7 MB | 8.8 kB | 199/201 kB
Progress (3): 2.4/2.7 MB | 8.8 kB | 199/201 kB
Progress (3): 2.4/2.7 MB | 8.8 kB | 201 kB    
Progress (3): 2.5/2.7 MB | 8.8 kB | 201 kB
Progress (3): 2.5/2.7 MB | 8.8 kB | 201 kB
Progress (3): 2.5/2.7 MB | 8.8 kB | 201 kB
Progress (3): 2.5/2.7 MB | 8.8 kB | 201 kB
Progress (3): 2.5/2.7 MB | 8.8 kB | 201 kB
Progress (3): 2.5/2.7 MB | 8.8 kB | 201 kB
Progress (3): 2.5/2.7 MB | 8.8 kB | 201 kB
Progress (3): 2.5/2.7 MB | 8.8 kB | 201 kB
Progress (3): 2.5/2.7 MB | 8.8 kB | 201 kB
Progress (3): 2.5/2.7 MB | 8.8 kB | 201 kB
Progress (3): 2.5/2.7 MB | 8.8 kB | 201 kB
Progress (3): 2.5/2.7 MB | 8.8 kB | 201 kB
Progress (3): 2.5/2.7 MB | 8.8 kB | 201 kB
Progress (3): 2.5/2.7 MB | 8.8 kB | 201 kB
Progress (3): 2.5/2.7 MB | 8.8 kB | 201 kB
Progress (3): 2.5/2.7 MB | 8.8 kB | 201 kB
Progress (3): 2.5/2.7 MB | 8.8 kB | 201 kB
Progress (3): 2.5/2.7 MB | 8.8 kB | 201 kB
Progress (3): 2.5/2.7 MB | 8.8 kB | 201 kB
Progress (3): 2.5/2.7 MB | 8.8 kB | 201 kB
Progress (3): 2.5/2.7 MB | 8.8 kB | 201 kB
Progress (3): 2.5/2.7 MB | 8.8 kB | 201 kB
Progress (3): 2.5/2.7 MB | 8.8 kB | 201 kB
Progress (3): 2.5/2.7 MB | 8.8 kB | 201 kB
Progress (3): 2.5/2.7 MB | 8.8 kB | 201 kB
Progress (3): 2.6/2.7 MB | 8.8 kB | 201 kB
Progress (3): 2.6/2.7 MB | 8.8 kB | 201 kB
Progress (3): 2.6/2.7 MB | 8.8 kB | 201 kB
Progress (3): 2.6/2.7 MB | 8.8 kB | 201 kB
Progress (3): 2.6/2.7 MB | 8.8 kB | 201 kB
Progress (3): 2.6/2.7 MB | 8.8 kB | 201 kB
Progress (3): 2.6/2.7 MB | 8.8 kB | 201 kB
Progress (3): 2.6/2.7 MB | 8.8 kB | 201 kB
Progress (3): 2.6/2.7 MB | 8.8 kB | 201 kB
Progress (3): 2.6/2.7 MB | 8.8 kB | 201 kB
Progress (3): 2.6/2.7 MB | 8.8 kB | 201 kB
Progress (3): 2.6/2.7 MB | 8.8 kB | 201 kB
Progress (3): 2.6/2.7 MB | 8.8 kB | 201 kB
Progress (3): 2.6/2.7 MB | 8.8 kB | 201 kB
Progress (3): 2.6/2.7 MB | 8.8 kB | 201 kB
Progress (3): 2.6/2.7 MB | 8.8 kB | 201 kB
Progress (3): 2.6/2.7 MB | 8.8 kB | 201 kB
Progress (3): 2.6/2.7 MB | 8.8 kB | 201 kB
Progress (3): 2.6/2.7 MB | 8.8 kB | 201 kB
Progress (3): 2.6/2.7 MB | 8.8 kB | 201 kB
Progress (3): 2.6/2.7 MB | 8.8 kB | 201 kB
Progress (3): 2.6/2.7 MB | 8.8 kB | 201 kB
Progress (3): 2.6/2.7 MB | 8.8 kB | 201 kB
Progress (3): 2.6/2.7 MB | 8.8 kB | 201 kB
Progress (3): 2.6/2.7 MB | 8.8 kB | 201 kB
Progress (3): 2.7/2.7 MB | 8.8 kB | 201 kB
Progress (3): 2.7/2.7 MB | 8.8 kB | 201 kB
Progress (3): 2.7/2.7 MB | 8.8 kB | 201 kB
Progress (3): 2.7/2.7 MB | 8.8 kB | 201 kB
Progress (3): 2.7/2.7 MB | 8.8 kB | 201 kB
                                          
Downloaded from eclipse.maven.central.mirror: https://repo.eclipse.org/content/repositories/maven_central/org/checkerframework/checker-qual/2.8.1/checker-qual-2.8.1.jar (201 kB at 669 kB/s)
Progress (2): 2.7/2.7 MB | 8.8 kB
                                 
Downloading from eclipse.maven.central.mirror: https://repo.eclipse.org/content/repositories/maven_central/org/eclipse/cbi/checkstyle/1.0.2/checkstyle-1.0.2.jar
Progress (2): 2.7/2.7 MB | 8.8 kB
Progress (2): 2.7/2.7 MB | 8.8 kB
Progress (2): 2.7/2.7 MB | 8.8 kB
Progress (2): 2.7/2.7 MB | 8.8 kB
Progress (2): 2.7/2.7 MB | 8.8 kB
Progress (2): 2.7/2.7 MB | 8.8 kB
Progress (2): 2.7/2.7 MB | 8.8 kB
Progress (2): 2.7/2.7 MB | 8.8 kB
Progress (2): 2.7/2.7 MB | 8.8 kB
Progress (2): 2.7/2.7 MB | 8.8 kB
Progress (2): 2.7/2.7 MB | 8.8 kB
Progress (2): 2.7/2.7 MB | 8.8 kB
Progress (2): 2.7/2.7 MB | 8.8 kB
Progress (2): 2.7/2.7 MB | 8.8 kB
Progress (2): 2.7/2.7 MB | 8.8 kB
Progress (2): 2.7/2.7 MB | 8.8 kB
Progress (2): 2.7/2.7 MB | 8.8 kB
Progress (2): 2.7/2.7 MB | 8.8 kB
Progress (2): 2.7 MB | 8.8 kB    
                             
Downloaded from eclipse.maven.central.mirror: https://repo.eclipse.org/content/repositories/maven_central/com/google/j2objc/j2objc-annotations/1.3/j2objc-annotations-1.3.jar (8.8 kB at 29 kB/s)
Downloading from eclipse.maven.central.mirror: https://repo.eclipse.org/content/repositories/maven_central/junit/junit/4.12/junit-4.12.jar
Progress (2): 2.7 MB | 4.1/5.9 kB
Progress (2): 2.7 MB | 5.9 kB    
                             
Downloaded from eclipse.maven.central.mirror: https://repo.eclipse.org/content/repositories/maven_central/com/google/guava/guava/28.0-jre/guava-28.0-jre.jar (2.7 MB at 8.8 MB/s)
Downloading from eclipse.maven.central.mirror: https://repo.eclipse.org/content/repositories/maven_central/org/hamcrest/hamcrest-core/1.3/hamcrest-core-1.3.jar
Progress (2): 5.9 kB | 4.1/315 kB
Progress (2): 5.9 kB | 7.7/315 kB
Progress (2): 5.9 kB | 12/315 kB 
Progress (2): 5.9 kB | 16/315 kB
Progress (2): 5.9 kB | 20/315 kB
Progress (2): 5.9 kB | 24/315 kB
Progress (2): 5.9 kB | 28/315 kB
Progress (2): 5.9 kB | 32/315 kB
Progress (2): 5.9 kB | 33/315 kB
Progress (2): 5.9 kB | 37/315 kB
Progress (2): 5.9 kB | 41/315 kB
Progress (2): 5.9 kB | 45/315 kB
Progress (2): 5.9 kB | 49/315 kB
Progress (2): 5.9 kB | 53/315 kB
Progress (2): 5.9 kB | 57/315 kB
Progress (2): 5.9 kB | 61/315 kB
Progress (2): 5.9 kB | 65/315 kB
Progress (2): 5.9 kB | 66/315 kB
Progress (2): 5.9 kB | 70/315 kB
Progress (2): 5.9 kB | 74/315 kB
Progress (2): 5.9 kB | 78/315 kB
Progress (2): 5.9 kB | 82/315 kB
Progress (2): 5.9 kB | 86/315 kB
Progress (2): 5.9 kB | 90/315 kB
Progress (2): 5.9 kB | 94/315 kB
Progress (2): 5.9 kB | 98/315 kB
Progress (2): 5.9 kB | 98/315 kB
Progress (2): 5.9 kB | 102/315 kB
Progress (2): 5.9 kB | 106/315 kB
Progress (2): 5.9 kB | 110/315 kB
Progress (2): 5.9 kB | 114/315 kB
Progress (2): 5.9 kB | 118/315 kB
Progress (2): 5.9 kB | 122/315 kB
Progress (2): 5.9 kB | 126/315 kB
Progress (2): 5.9 kB | 130/315 kB
Progress (2): 5.9 kB | 131/315 kB
Progress (2): 5.9 kB | 135/315 kB
Progress (2): 5.9 kB | 139/315 kB
Progress (2): 5.9 kB | 143/315 kB
Progress (2): 5.9 kB | 147/315 kB
Progress (2): 5.9 kB | 151/315 kB
Progress (2): 5.9 kB | 155/315 kB
Progress (2): 5.9 kB | 159/315 kB
Progress (2): 5.9 kB | 163/315 kB
Progress (2): 5.9 kB | 164/315 kB
Progress (2): 5.9 kB | 168/315 kB
Progress (2): 5.9 kB | 172/315 kB
Progress (3): 5.9 kB | 172/315 kB | 4.1/45 kB
Progress (3): 5.9 kB | 176/315 kB | 4.1/45 kB
Progress (3): 5.9 kB | 176/315 kB | 7.7/45 kB
Progress (3): 5.9 kB | 180/315 kB | 7.7/45 kB
Progress (3): 5.9 kB | 180/315 kB | 12/45 kB 
Progress (3): 5.9 kB | 180/315 kB | 16/45 kB
Progress (3): 5.9 kB | 184/315 kB | 16/45 kB
Progress (3): 5.9 kB | 184/315 kB | 20/45 kB
Progress (3): 5.9 kB | 188/315 kB | 20/45 kB
Progress (3): 5.9 kB | 188/315 kB | 24/45 kB
Progress (3): 5.9 kB | 192/315 kB | 24/45 kB
Progress (3): 5.9 kB | 192/315 kB | 28/45 kB
Progress (3): 5.9 kB | 196/315 kB | 28/45 kB
Progress (3): 5.9 kB | 196/315 kB | 32/45 kB
Progress (3): 5.9 kB | 197/315 kB | 32/45 kB
Progress (3): 5.9 kB | 197/315 kB | 36/45 kB
Progress (3): 5.9 kB | 197/315 kB | 40/45 kB
Progress (3): 5.9 kB | 201/315 kB | 40/45 kB
Progress (3): 5.9 kB | 201/315 kB | 44/45 kB
Progress (3): 5.9 kB | 205/315 kB | 44/45 kB
Progress (3): 5.9 kB | 205/315 kB | 45 kB   
Progress (3): 5.9 kB | 209/315 kB | 45 kB
Progress (3): 5.9 kB | 213/315 kB | 45 kB
Progress (3): 5.9 kB | 217/315 kB | 45 kB
Progress (3): 5.9 kB | 221/315 kB | 45 kB
Progress (3): 5.9 kB | 225/315 kB | 45 kB
Progress (3): 5.9 kB | 229/315 kB | 45 kB
Progress (3): 5.9 kB | 229/315 kB | 45 kB
Progress (3): 5.9 kB | 233/315 kB | 45 kB
Progress (3): 5.9 kB | 237/315 kB | 45 kB
Progress (3): 5.9 kB | 241/315 kB | 45 kB
Progress (3): 5.9 kB | 245/315 kB | 45 kB
Progress (3): 5.9 kB | 249/315 kB | 45 kB
Progress (3): 5.9 kB | 253/315 kB | 45 kB
Progress (3): 5.9 kB | 257/315 kB | 45 kB
Progress (3): 5.9 kB | 261/315 kB | 45 kB
Progress (3): 5.9 kB | 262/315 kB | 45 kB
Progress (3): 5.9 kB | 266/315 kB | 45 kB
Progress (3): 5.9 kB | 270/315 kB | 45 kB
Progress (3): 5.9 kB | 274/315 kB | 45 kB
Progress (3): 5.9 kB | 278/315 kB | 45 kB
Progress (3): 5.9 kB | 282/315 kB | 45 kB
Progress (3): 5.9 kB | 286/315 kB | 45 kB
Progress (3): 5.9 kB | 290/315 kB | 45 kB
Progress (3): 5.9 kB | 294/315 kB | 45 kB
Progress (3): 5.9 kB | 298/315 kB | 45 kB
Progress (3): 5.9 kB | 302/315 kB | 45 kB
Progress (3): 5.9 kB | 306/315 kB | 45 kB
Progress (3): 5.9 kB | 310/315 kB | 45 kB
Progress (3): 5.9 kB | 314/315 kB | 45 kB
Progress (3): 5.9 kB | 315 kB | 45 kB    
                                     
Downloaded from eclipse.maven.central.mirror: https://repo.eclipse.org/content/repositories/maven_central/junit/junit/4.12/junit-4.12.jar (315 kB at 902 kB/s)
Downloaded from eclipse.maven.central.mirror: https://repo.eclipse.org/content/repositories/maven_central/org/hamcrest/hamcrest-core/1.3/hamcrest-core-1.3.jar (45 kB at 129 kB/s)
Downloading from eclipse.maven.central.mirror: https://repo.eclipse.org/content/repositories/maven_central/com/google/jimfs/jimfs/1.1/jimfs-1.1.jar
Downloaded from eclipse.maven.central.mirror: https://repo.eclipse.org/content/repositories/maven_central/com/google/auto/value/auto-value-annotations/1.6.5/auto-value-annotations-1.6.5.jar (5.9 kB at 13 kB/s)
Progress (1): 4.1/207 kB
Progress (1): 7.7/207 kB
Progress (1): 12/207 kB 
Progress (1): 16/207 kB
Progress (1): 20/207 kB
Progress (1): 24/207 kB
Progress (1): 28/207 kB
Progress (1): 32/207 kB
Progress (1): 33/207 kB
Progress (1): 37/207 kB
Progress (1): 41/207 kB
Progress (1): 45/207 kB
Progress (1): 49/207 kB
Progress (1): 53/207 kB
Progress (1): 57/207 kB
Progress (1): 61/207 kB
Progress (1): 65/207 kB
Progress (1): 66/207 kB
Progress (1): 70/207 kB
Progress (1): 74/207 kB
Progress (1): 78/207 kB
Progress (1): 82/207 kB
Progress (1): 86/207 kB
Progress (1): 90/207 kB
Progress (1): 94/207 kB
Progress (1): 98/207 kB
Progress (1): 98/207 kB
Progress (1): 102/207 kB
Progress (1): 106/207 kB
Progress (1): 110/207 kB
Progress (1): 114/207 kB
Progress (1): 118/207 kB
Progress (1): 122/207 kB
Progress (1): 126/207 kB
Progress (1): 130/207 kB
Progress (1): 131/207 kB
Progress (1): 135/207 kB
Progress (1): 139/207 kB
Progress (1): 143/207 kB
Progress (1): 147/207 kB
Progress (1): 151/207 kB
Progress (1): 155/207 kB
Progress (1): 159/207 kB
Progress (1): 163/207 kB
Progress (1): 164/207 kB
Progress (1): 168/207 kB
Progress (1): 172/207 kB
Progress (1): 176/207 kB
Progress (1): 180/207 kB
Progress (1): 184/207 kB
Progress (1): 188/207 kB
Progress (1): 192/207 kB
Progress (1): 196/207 kB
Progress (1): 200/207 kB
Progress (1): 204/207 kB
Progress (1): 207 kB    
Progress (2): 207 kB | 0/1.6 MB
Progress (2): 207 kB | 0/1.6 MB
Progress (2): 207 kB | 0/1.6 MB
Progress (2): 207 kB | 0/1.6 MB
Progress (2): 207 kB | 0/1.6 MB
Progress (2): 207 kB | 0/1.6 MB
Progress (2): 207 kB | 0/1.6 MB
Progress (2): 207 kB | 0/1.6 MB
Progress (2): 207 kB | 0/1.6 MB
Progress (2): 207 kB | 0/1.6 MB
Progress (2): 207 kB | 0/1.6 MB
Progress (2): 207 kB | 0/1.6 MB
Progress (2): 207 kB | 0/1.6 MB
Progress (2): 207 kB | 0.1/1.6 MB
Progress (2): 207 kB | 0.1/1.6 MB
Progress (2): 207 kB | 0.1/1.6 MB
Progress (2): 207 kB | 0.1/1.6 MB
Progress (2): 207 kB | 0.1/1.6 MB
Progress (2): 207 kB | 0.1/1.6 MB
Progress (2): 207 kB | 0.1/1.6 MB
Progress (2): 207 kB | 0.1/1.6 MB
Progress (2): 207 kB | 0.1/1.6 MB
Progress (2): 207 kB | 0.1/1.6 MB
Progress (2): 207 kB | 0.1/1.6 MB
Progress (2): 207 kB | 0.1/1.6 MB
Progress (2): 207 kB | 0.1/1.6 MB
Progress (2): 207 kB | 0.1/1.6 MB
Progress (2): 207 kB | 0.1/1.6 MB
Progress (2): 207 kB | 0.1/1.6 MB
Progress (2): 207 kB | 0.1/1.6 MB
Progress (2): 207 kB | 0.1/1.6 MB
Progress (2): 207 kB | 0.1/1.6 MB
Progress (2): 207 kB | 0.1/1.6 MB
Progress (2): 207 kB | 0.1/1.6 MB
Progress (2): 207 kB | 0.1/1.6 MB
Progress (2): 207 kB | 0.1/1.6 MB
Progress (2): 207 kB | 0.1/1.6 MB
Progress (2): 207 kB | 0.1/1.6 MB
Progress (2): 207 kB | 0.1/1.6 MB
Progress (2): 207 kB | 0.1/1.6 MB
Progress (2): 207 kB | 0.2/1.6 MB
Progress (2): 207 kB | 0.2/1.6 MB
Progress (2): 207 kB | 0.2/1.6 MB
Progress (2): 207 kB | 0.2/1.6 MB
Progress (2): 207 kB | 0.2/1.6 MB
Progress (2): 207 kB | 0.2/1.6 MB
Progress (2): 207 kB | 0.2/1.6 MB
Progress (2): 207 kB | 0.2/1.6 MB
Progress (2): 207 kB | 0.2/1.6 MB
Progress (2): 207 kB | 0.2/1.6 MB
Progress (2): 207 kB | 0.2/1.6 MB
Progress (2): 207 kB | 0.2/1.6 MB
Progress (2): 207 kB | 0.2/1.6 MB
Progress (2): 207 kB | 0.2/1.6 MB
Progress (2): 207 kB | 0.2/1.6 MB
Progress (2): 207 kB | 0.2/1.6 MB
Progress (2): 207 kB | 0.2/1.6 MB
Progress (2): 207 kB | 0.2/1.6 MB
Progress (2): 207 kB | 0.2/1.6 MB
Progress (2): 207 kB | 0.2/1.6 MB
Progress (2): 207 kB | 0.2/1.6 MB
Progress (2): 207 kB | 0.2/1.6 MB
Progress (2): 207 kB | 0.2/1.6 MB
Progress (2): 207 kB | 0.2/1.6 MB
Progress (2): 207 kB | 0.2/1.6 MB
Progress (2): 207 kB | 0.2/1.6 MB
Progress (2): 207 kB | 0.2/1.6 MB
Progress (2): 207 kB | 0.2/1.6 MB
Progress (2): 207 kB | 0.3/1.6 MB
Progress (2): 207 kB | 0.3/1.6 MB
Progress (2): 207 kB | 0.3/1.6 MB
Progress (2): 207 kB | 0.3/1.6 MB
Progress (2): 207 kB | 0.3/1.6 MB
Progress (2): 207 kB | 0.3/1.6 MB
Progress (2): 207 kB | 0.3/1.6 MB
Progress (2): 207 kB | 0.3/1.6 MB
Progress (2): 207 kB | 0.3/1.6 MB
Progress (2): 207 kB | 0.3/1.6 MB
Progress (2): 207 kB | 0.3/1.6 MB
Progress (2): 207 kB | 0.3/1.6 MB
Progress (2): 207 kB | 0.3/1.6 MB
Progress (2): 207 kB | 0.3/1.6 MB
Progress (2): 207 kB | 0.3/1.6 MB
Progress (2): 207 kB | 0.3/1.6 MB
Progress (2): 207 kB | 0.3/1.6 MB
Progress (2): 207 kB | 0.3/1.6 MB
Progress (2): 207 kB | 0.3/1.6 MB
Progress (2): 207 kB | 0.3/1.6 MB
Progress (2): 207 kB | 0.3/1.6 MB
Progress (2): 207 kB | 0.3/1.6 MB
Progress (2): 207 kB | 0.3/1.6 MB
Progress (2): 207 kB | 0.3/1.6 MB
Progress (2): 207 kB | 0.3/1.6 MB
Progress (2): 207 kB | 0.3/1.6 MB
Progress (2): 207 kB | 0.3/1.6 MB
Progress (2): 207 kB | 0.4/1.6 MB
Progress (2): 207 kB | 0.4/1.6 MB
Progress (2): 207 kB | 0.4/1.6 MB
Progress (2): 207 kB | 0.4/1.6 MB
Progress (2): 207 kB | 0.4/1.6 MB
Progress (2): 207 kB | 0.4/1.6 MB
Progress (2): 207 kB | 0.4/1.6 MB
Progress (2): 207 kB | 0.4/1.6 MB
Progress (2): 207 kB | 0.4/1.6 MB
Progress (2): 207 kB | 0.4/1.6 MB
Progress (2): 207 kB | 0.4/1.6 MB
Progress (2): 207 kB | 0.4/1.6 MB
Progress (2): 207 kB | 0.4/1.6 MB
Progress (2): 207 kB | 0.4/1.6 MB
Progress (2): 207 kB | 0.4/1.6 MB
Progress (2): 207 kB | 0.4/1.6 MB
Progress (2): 207 kB | 0.4/1.6 MB
Progress (2): 207 kB | 0.4/1.6 MB
Progress (2): 207 kB | 0.4/1.6 MB
Progress (2): 207 kB | 0.4/1.6 MB
Progress (2): 207 kB | 0.4/1.6 MB
Progress (2): 207 kB | 0.4/1.6 MB
Progress (2): 207 kB | 0.4/1.6 MB
Progress (2): 207 kB | 0.4/1.6 MB
Progress (2): 207 kB | 0.4/1.6 MB
Progress (2): 207 kB | 0.4/1.6 MB
Progress (2): 207 kB | 0.4/1.6 MB
Progress (2): 207 kB | 0.4/1.6 MB
Progress (2): 207 kB | 0.5/1.6 MB
Progress (2): 207 kB | 0.5/1.6 MB
Progress (2): 207 kB | 0.5/1.6 MB
Progress (2): 207 kB | 0.5/1.6 MB
Progress (2): 207 kB | 0.5/1.6 MB
Progress (2): 207 kB | 0.5/1.6 MB
Progress (2): 207 kB | 0.5/1.6 MB
Progress (2): 207 kB | 0.5/1.6 MB
Progress (2): 207 kB | 0.5/1.6 MB
Progress (2): 207 kB | 0.5/1.6 MB
Progress (2): 207 kB | 0.5/1.6 MB
Progress (2): 207 kB | 0.5/1.6 MB
Progress (2): 207 kB | 0.5/1.6 MB
Progress (2): 207 kB | 0.5/1.6 MB
Progress (2): 207 kB | 0.5/1.6 MB
Progress (2): 207 kB | 0.5/1.6 MB
Progress (2): 207 kB | 0.5/1.6 MB
Progress (2): 207 kB | 0.5/1.6 MB
Progress (2): 207 kB | 0.5/1.6 MB
Progress (2): 207 kB | 0.5/1.6 MB
Progress (2): 207 kB | 0.5/1.6 MB
Progress (2): 207 kB | 0.5/1.6 MB
Progress (2): 207 kB | 0.5/1.6 MB
Progress (2): 207 kB | 0.5/1.6 MB
Progress (2): 207 kB | 0.5/1.6 MB
Progress (2): 207 kB | 0.5/1.6 MB
Progress (2): 207 kB | 0.5/1.6 MB
Progress (2): 207 kB | 0.6/1.6 MB
Progress (2): 207 kB | 0.6/1.6 MB
Progress (2): 207 kB | 0.6/1.6 MB
Progress (2): 207 kB | 0.6/1.6 MB
Progress (2): 207 kB | 0.6/1.6 MB
Progress (2): 207 kB | 0.6/1.6 MB
Progress (2): 207 kB | 0.6/1.6 MB
Progress (2): 207 kB | 0.6/1.6 MB
Progress (2): 207 kB | 0.6/1.6 MB
Progress (2): 207 kB | 0.6/1.6 MB
Progress (2): 207 kB | 0.6/1.6 MB
Progress (2): 207 kB | 0.6/1.6 MB
Progress (2): 207 kB | 0.6/1.6 MB
Progress (2): 207 kB | 0.6/1.6 MB
Progress (2): 207 kB | 0.6/1.6 MB
Progress (2): 207 kB | 0.6/1.6 MB
Progress (2): 207 kB | 0.6/1.6 MB
Progress (2): 207 kB | 0.6/1.6 MB
Progress (2): 207 kB | 0.6/1.6 MB
Progress (2): 207 kB | 0.6/1.6 MB
Progress (2): 207 kB | 0.6/1.6 MB
Progress (2): 207 kB | 0.6/1.6 MB
Progress (2): 207 kB | 0.6/1.6 MB
Progress (2): 207 kB | 0.6/1.6 MB
Progress (2): 207 kB | 0.6/1.6 MB
Progress (2): 207 kB | 0.6/1.6 MB
Progress (2): 207 kB | 0.6/1.6 MB
Progress (2): 207 kB | 0.7/1.6 MB
Progress (2): 207 kB | 0.7/1.6 MB
Progress (2): 207 kB | 0.7/1.6 MB
Progress (2): 207 kB | 0.7/1.6 MB
Progress (2): 207 kB | 0.7/1.6 MB
Progress (2): 207 kB | 0.7/1.6 MB
Progress (2): 207 kB | 0.7/1.6 MB
Progress (2): 207 kB | 0.7/1.6 MB
Progress (2): 207 kB | 0.7/1.6 MB
Progress (2): 207 kB | 0.7/1.6 MB
Progress (2): 207 kB | 0.7/1.6 MB
Progress (2): 207 kB | 0.7/1.6 MB
Progress (2): 207 kB | 0.7/1.6 MB
Progress (2): 207 kB | 0.7/1.6 MB
Progress (2): 207 kB | 0.7/1.6 MB
Progress (2): 207 kB | 0.7/1.6 MB
Progress (2): 207 kB | 0.7/1.6 MB
Progress (2): 207 kB | 0.7/1.6 MB
Progress (2): 207 kB | 0.7/1.6 MB
Progress (2): 207 kB | 0.7/1.6 MB
Progress (2): 207 kB | 0.7/1.6 MB
Progress (2): 207 kB | 0.7/1.6 MB
Progress (2): 207 kB | 0.7/1.6 MB
Progress (2): 207 kB | 0.7/1.6 MB
Progress (2): 207 kB | 0.7/1.6 MB
Progress (2): 207 kB | 0.7/1.6 MB
Progress (2): 207 kB | 0.7/1.6 MB
Progress (2): 207 kB | 0.7/1.6 MB
Progress (2): 207 kB | 0.8/1.6 MB
Progress (2): 207 kB | 0.8/1.6 MB
Progress (2): 207 kB | 0.8/1.6 MB
Progress (2): 207 kB | 0.8/1.6 MB
Progress (2): 207 kB | 0.8/1.6 MB
Progress (2): 207 kB | 0.8/1.6 MB
Progress (2): 207 kB | 0.8/1.6 MB
Progress (2): 207 kB | 0.8/1.6 MB
Progress (2): 207 kB | 0.8/1.6 MB
Progress (2): 207 kB | 0.8/1.6 MB
Progress (2): 207 kB | 0.8/1.6 MB
Progress (2): 207 kB | 0.8/1.6 MB
Progress (2): 207 kB | 0.8/1.6 MB
Progress (2): 207 kB | 0.8/1.6 MB
Progress (2): 207 kB | 0.8/1.6 MB
Progress (2): 207 kB | 0.8/1.6 MB
Progress (2): 207 kB | 0.8/1.6 MB
Progress (2): 207 kB | 0.8/1.6 MB
Progress (2): 207 kB | 0.8/1.6 MB
Progress (2): 207 kB | 0.8/1.6 MB
Progress (2): 207 kB | 0.8/1.6 MB
Progress (2): 207 kB | 0.8/1.6 MB
Progress (2): 207 kB | 0.8/1.6 MB
Progress (2): 207 kB | 0.8/1.6 MB
Progress (2): 207 kB | 0.8/1.6 MB
Progress (2): 207 kB | 0.8/1.6 MB
Progress (2): 207 kB | 0.8/1.6 MB
Progress (2): 207 kB | 0.9/1.6 MB
Progress (2): 207 kB | 0.9/1.6 MB
Progress (2): 207 kB | 0.9/1.6 MB
Progress (2): 207 kB | 0.9/1.6 MB
Progress (2): 207 kB | 0.9/1.6 MB
Progress (2): 207 kB | 0.9/1.6 MB
Progress (2): 207 kB | 0.9/1.6 MB
Progress (2): 207 kB | 0.9/1.6 MB
Progress (2): 207 kB | 0.9/1.6 MB
Progress (2): 207 kB | 0.9/1.6 MB
Progress (2): 207 kB | 0.9/1.6 MB
Progress (2): 207 kB | 0.9/1.6 MB
Progress (2): 207 kB | 0.9/1.6 MB
Progress (2): 207 kB | 0.9/1.6 MB
Progress (2): 207 kB | 0.9/1.6 MB
Progress (2): 207 kB | 0.9/1.6 MB
Progress (2): 207 kB | 0.9/1.6 MB
Progress (2): 207 kB | 0.9/1.6 MB
Progress (2): 207 kB | 0.9/1.6 MB
Progress (2): 207 kB | 0.9/1.6 MB
Progress (2): 207 kB | 0.9/1.6 MB
Progress (2): 207 kB | 0.9/1.6 MB
Progress (2): 207 kB | 0.9/1.6 MB
Progress (2): 207 kB | 0.9/1.6 MB
Progress (2): 207 kB | 0.9/1.6 MB
Progress (2): 207 kB | 0.9/1.6 MB
Progress (2): 207 kB | 1.0/1.6 MB
Progress (2): 207 kB | 1.0/1.6 MB
Progress (2): 207 kB | 1.0/1.6 MB
Progress (2): 207 kB | 1.0/1.6 MB
Progress (2): 207 kB | 1.0/1.6 MB
Progress (2): 207 kB | 1.0/1.6 MB
Progress (2): 207 kB | 1.0/1.6 MB
Progress (2): 207 kB | 1.0/1.6 MB
Progress (2): 207 kB | 1.0/1.6 MB
Progress (2): 207 kB | 1.0/1.6 MB
Progress (2): 207 kB | 1.0/1.6 MB
Progress (2): 207 kB | 1.0/1.6 MB
Progress (2): 207 kB | 1.0/1.6 MB
Progress (2): 207 kB | 1.0/1.6 MB
Progress (2): 207 kB | 1.0/1.6 MB
Progress (2): 207 kB | 1.0/1.6 MB
Progress (2): 207 kB | 1.0/1.6 MB
Progress (2): 207 kB | 1.0/1.6 MB
Progress (2): 207 kB | 1.0/1.6 MB
Progress (2): 207 kB | 1.0/1.6 MB
Progress (2): 207 kB | 1.0/1.6 MB
Progress (2): 207 kB | 1.0/1.6 MB
Progress (2): 207 kB | 1.0/1.6 MB
Progress (2): 207 kB | 1.0/1.6 MB
Progress (2): 207 kB | 1.0/1.6 MB
Progress (2): 207 kB | 1.1/1.6 MB
Progress (2): 207 kB | 1.1/1.6 MB
Progress (2): 207 kB | 1.1/1.6 MB
Progress (2): 207 kB | 1.1/1.6 MB
Progress (2): 207 kB | 1.1/1.6 MB
Progress (2): 207 kB | 1.1/1.6 MB
Progress (2): 207 kB | 1.1/1.6 MB
Progress (2): 207 kB | 1.1/1.6 MB
Progress (2): 207 kB | 1.1/1.6 MB
Progress (2): 207 kB | 1.1/1.6 MB
Progress (2): 207 kB | 1.1/1.6 MB
Progress (2): 207 kB | 1.1/1.6 MB
Progress (2): 207 kB | 1.1/1.6 MB
Progress (2): 207 kB | 1.1/1.6 MB
Progress (2): 207 kB | 1.1/1.6 MB
Progress (2): 207 kB | 1.1/1.6 MB
Progress (2): 207 kB | 1.1/1.6 MB
Progress (2): 207 kB | 1.1/1.6 MB
Progress (2): 207 kB | 1.1/1.6 MB
Progress (2): 207 kB | 1.1/1.6 MB
Progress (2): 207 kB | 1.1/1.6 MB
Progress (2): 207 kB | 1.1/1.6 MB
Progress (2): 207 kB | 1.1/1.6 MB
Progress (2): 207 kB | 1.1/1.6 MB
Progress (2): 207 kB | 1.1/1.6 MB
Progress (2): 207 kB | 1.2/1.6 MB
Progress (2): 207 kB | 1.2/1.6 MB
Progress (2): 207 kB | 1.2/1.6 MB
Progress (2): 207 kB | 1.2/1.6 MB
Progress (2): 207 kB | 1.2/1.6 MB
Progress (2): 207 kB | 1.2/1.6 MB
Progress (2): 207 kB | 1.2/1.6 MB
Progress (2): 207 kB | 1.2/1.6 MB
Progress (2): 207 kB | 1.2/1.6 MB
Progress (2): 207 kB | 1.2/1.6 MB
Progress (2): 207 kB | 1.2/1.6 MB
Progress (2): 207 kB | 1.2/1.6 MB
Progress (2): 207 kB | 1.2/1.6 MB
Progress (2): 207 kB | 1.2/1.6 MB
Progress (2): 207 kB | 1.2/1.6 MB
Progress (2): 207 kB | 1.2/1.6 MB
Progress (2): 207 kB | 1.2/1.6 MB
Progress (2): 207 kB | 1.2/1.6 MB
Progress (2): 207 kB | 1.2/1.6 MB
Progress (2): 207 kB | 1.2/1.6 MB
Progress (2): 207 kB | 1.2/1.6 MB
Progress (2): 207 kB | 1.2/1.6 MB
Progress (2): 207 kB | 1.2/1.6 MB
Progress (2): 207 kB | 1.2/1.6 MB
Progress (2): 207 kB | 1.2/1.6 MB
Progress (2): 207 kB | 1.3/1.6 MB
Progress (2): 207 kB | 1.3/1.6 MB
Progress (2): 207 kB | 1.3/1.6 MB
Progress (2): 207 kB | 1.3/1.6 MB
Progress (2): 207 kB | 1.3/1.6 MB
Progress (2): 207 kB | 1.3/1.6 MB
Progress (2): 207 kB | 1.3/1.6 MB
Progress (2): 207 kB | 1.3/1.6 MB
Progress (2): 207 kB | 1.3/1.6 MB
Progress (2): 207 kB | 1.3/1.6 MB
Progress (2): 207 kB | 1.3/1.6 MB
Progress (2): 207 kB | 1.3/1.6 MB
Progress (2): 207 kB | 1.3/1.6 MB
Progress (2): 207 kB | 1.3/1.6 MB
Progress (2): 207 kB | 1.3/1.6 MB
Progress (2): 207 kB | 1.3/1.6 MB
Progress (2): 207 kB | 1.3/1.6 MB
Progress (2): 207 kB | 1.3/1.6 MB
Progress (2): 207 kB | 1.3/1.6 MB
Progress (2): 207 kB | 1.3/1.6 MB
Progress (2): 207 kB | 1.3/1.6 MB
Progress (2): 207 kB | 1.3/1.6 MB
Progress (2): 207 kB | 1.3/1.6 MB
Progress (2): 207 kB | 1.3/1.6 MB
Progress (2): 207 kB | 1.3/1.6 MB
Progress (2): 207 kB | 1.4/1.6 MB
Progress (2): 207 kB | 1.4/1.6 MB
Progress (2): 207 kB | 1.4/1.6 MB
Progress (2): 207 kB | 1.4/1.6 MB
Progress (2): 207 kB | 1.4/1.6 MB
Progress (2): 207 kB | 1.4/1.6 MB
Progress (2): 207 kB | 1.4/1.6 MB
Progress (2): 207 kB | 1.4/1.6 MB
Progress (2): 207 kB | 1.4/1.6 MB
Progress (2): 207 kB | 1.4/1.6 MB
Progress (2): 207 kB | 1.4/1.6 MB
Progress (2): 207 kB | 1.4/1.6 MB
Progress (2): 207 kB | 1.4/1.6 MB
Progress (2): 207 kB | 1.4/1.6 MB
Progress (2): 207 kB | 1.4/1.6 MB
Progress (2): 207 kB | 1.4/1.6 MB
Progress (2): 207 kB | 1.4/1.6 MB
Progress (2): 207 kB | 1.4/1.6 MB
Progress (2): 207 kB | 1.4/1.6 MB
Progress (2): 207 kB | 1.4/1.6 MB
Progress (2): 207 kB | 1.4/1.6 MB
Progress (2): 207 kB | 1.4/1.6 MB
Progress (2): 207 kB | 1.4/1.6 MB
Progress (2): 207 kB | 1.4/1.6 MB
Progress (2): 207 kB | 1.4/1.6 MB
Progress (2): 207 kB | 1.5/1.6 MB
Progress (2): 207 kB | 1.5/1.6 MB
Progress (2): 207 kB | 1.5/1.6 MB
Progress (2): 207 kB | 1.5/1.6 MB
Progress (2): 207 kB | 1.5/1.6 MB
Progress (2): 207 kB | 1.5/1.6 MB
Progress (2): 207 kB | 1.5/1.6 MB
Progress (2): 207 kB | 1.5/1.6 MB
Progress (2): 207 kB | 1.5/1.6 MB
Progress (2): 207 kB | 1.5/1.6 MB
Progress (2): 207 kB | 1.5/1.6 MB
Progress (2): 207 kB | 1.5/1.6 MB
Progress (2): 207 kB | 1.5/1.6 MB
Progress (2): 207 kB | 1.5/1.6 MB
Progress (2): 207 kB | 1.5/1.6 MB
Progress (2): 207 kB | 1.5/1.6 MB
Progress (2): 207 kB | 1.5/1.6 MB
Progress (2): 207 kB | 1.5/1.6 MB
Progress (2): 207 kB | 1.5/1.6 MB
Progress (2): 207 kB | 1.5/1.6 MB
Progress (2): 207 kB | 1.5/1.6 MB
Progress (2): 207 kB | 1.5/1.6 MB
Progress (2): 207 kB | 1.5/1.6 MB
Progress (2): 207 kB | 1.5/1.6 MB
Progress (2): 207 kB | 1.5/1.6 MB
Progress (2): 207 kB | 1.6/1.6 MB
Progress (2): 207 kB | 1.6/1.6 MB
Progress (2): 207 kB | 1.6/1.6 MB
Progress (2): 207 kB | 1.6/1.6 MB
Progress (2): 207 kB | 1.6/1.6 MB
Progress (2): 207 kB | 1.6/1.6 MB
Progress (2): 207 kB | 1.6/1.6 MB
Progress (2): 207 kB | 1.6/1.6 MB
Progress (2): 207 kB | 1.6/1.6 MB
Progress (2): 207 kB | 1.6/1.6 MB
Progress (2): 207 kB | 1.6/1.6 MB
Progress (2): 207 kB | 1.6/1.6 MB
Progress (2): 207 kB | 1.6/1.6 MB
Progress (2): 207 kB | 1.6/1.6 MB
Progress (2): 207 kB | 1.6/1.6 MB
Progress (2): 207 kB | 1.6/1.6 MB
Progress (2): 207 kB | 1.6/1.6 MB
Progress (2): 207 kB | 1.6/1.6 MB
Progress (2): 207 kB | 1.6/1.6 MB
Progress (2): 207 kB | 1.6/1.6 MB
Progress (2): 207 kB | 1.6/1.6 MB
Progress (2): 207 kB | 1.6/1.6 MB
Progress (2): 207 kB | 1.6/1.6 MB
Progress (2): 207 kB | 1.6 MB    
                             
Downloaded from eclipse.maven.central.mirror: https://repo.eclipse.org/content/repositories/maven_central/com/google/jimfs/jimfs/1.1/jimfs-1.1.jar (207 kB at 331 kB/s)
Downloaded from eclipse.maven.central.mirror: https://repo.eclipse.org/content/repositories/maven_central/com/google/auto/value/auto-value/1.6.5/auto-value-1.6.5.jar (1.6 MB at 2.5 MB/s)
[INFO] ------------------------------------------------------------------------
[INFO] BUILD FAILURE
[INFO] ------------------------------------------------------------------------
[INFO] Total time:  6.300 s
[INFO] Finished at: 2019-07-31T15:06:44Z
[INFO] ------------------------------------------------------------------------
[ERROR] Failed to execute goal on project cbi-common: Could not resolve dependencies for project org.eclipse.cbi:cbi-common:jar:1.2.3-SNAPSHOT: Could not find artifact org.eclipse.cbi:checkstyle:jar:1.0.2 in repo.eclipse.org (https://repo.eclipse.org/content/repositories/cbi) -> [Help 1]
[ERROR] 
[ERROR] To see the full stack trace of the errors, re-run Maven with the -e switch.
[ERROR] Re-run Maven using the -X switch to enable full debug logging.
[ERROR] 
[ERROR] For more information about the errors and possible solutions, please read the following articles:
[ERROR] [Help 1] http://cwiki.apache.org/confluence/display/MAVEN/DependencyResolutionException
Build step 'Invoke top-level Maven targets' marked build as failure
[FINDBUGS] Skipping publisher since build result is FAILURE
Recording test results
ERROR: Step ‘Publish JUnit test result report’ failed: No test report files were found. Configuration error?
Archiving artifacts
Started calculate disk usage of build
Finished Calculation of disk usage of build in 0 seconds
Started calculate disk usage of workspace
Finished Calculation of disk usage of workspace in 0 seconds
Finished: FAILURE