FailedConsole Output

Retriggered by user akurtako@redhat.com for Gerrit: https://git.eclipse.org/r/135545
Building on master in workspace /home/hudson/genie.cbi/.jenkins/jobs/signing-packaging-common-gerrit/workspace
 > /usr/local/bin/git rev-parse --is-inside-work-tree # timeout=10
Fetching changes from the remote Git repository
 > /usr/local/bin/git config remote.origin.url /gitroot/cbi/org.eclipse.cbi.git # timeout=10
Fetching upstream changes from /gitroot/cbi/org.eclipse.cbi.git
 > /usr/local/bin/git --version # timeout=10
 > /usr/local/bin/git fetch --tags --progress /gitroot/cbi/org.eclipse.cbi.git refs/changes/45/135545/2
 > /usr/local/bin/git rev-parse 7b2c682337a3f7401dbe09cfd2818797c6aca17a^{commit} # timeout=10
Checking out Revision 7b2c682337a3f7401dbe09cfd2818797c6aca17a (refs/changes/45/135545/2)
 > /usr/local/bin/git config core.sparsecheckout # timeout=10
 > /usr/local/bin/git checkout -f 7b2c682337a3f7401dbe09cfd2818797c6aca17a
Commit message: "Update to Guava 27.0.1"
 > /usr/local/bin/git rev-parse FETCH_HEAD^{commit} # timeout=10
 > /usr/local/bin/git rev-list --no-walk d2458078df770966db7e766d4267d5b6c97862f0 # timeout=10
[workspace] $ /shared/common/apache-maven-latest/bin/mvn -f org.eclipse.cbi/common/pom.xml -Dmaven.repo.local=/home/hudson/genie.cbi/.jenkins/jobs/signing-packaging-common-gerrit/workspace/.repository clean install
Picked up JAVA_TOOL_OPTIONS: -Xmx2G -Djava.io.tmpdir=/tmp/genie.cbi
[INFO] Scanning for projects...
[INFO] 
[INFO] ---------------------< org.eclipse.cbi:cbi-common >---------------------
[INFO] Building cbi-common 1.2.3-SNAPSHOT
[INFO] --------------------------------[ jar ]---------------------------------
[INFO] 
[INFO] --- maven-clean-plugin:3.1.0:clean (default-clean) @ cbi-common ---
[INFO] Deleting /jobs/genie.cbi/signing-packaging-common-gerrit/workspace/org.eclipse.cbi/common/target
[INFO] 
[INFO] --- maven-enforcer-plugin:3.0.0-M2:enforce (enforce-maven) @ cbi-common ---
[INFO] 
[INFO] --- maven-checkstyle-plugin:3.0.0:check (default) @ cbi-common ---
[INFO] Starting audit...
Audit done.
[INFO] 
[INFO] --- maven-resources-plugin:3.1.0:resources (default-resources) @ cbi-common ---
[INFO] Using 'UTF-8' encoding to copy filtered resources.
[INFO] Copying 4 resources
[INFO] 
[INFO] --- maven-compiler-plugin:3.8.0:compile (default-compile) @ cbi-common ---
[INFO] Compiling 10 source files to /jobs/genie.cbi/signing-packaging-common-gerrit/workspace/org.eclipse.cbi/common/target/classes
[INFO] 
[INFO] --- maven-resources-plugin:3.1.0:testResources (default-testResources) @ cbi-common ---
[INFO] Using 'UTF-8' encoding to copy filtered resources.
[INFO] Copying 3 resources
[INFO] 
[INFO] --- maven-compiler-plugin:3.8.0:testCompile (default-testCompile) @ cbi-common ---
[INFO] Compiling 4 source files to /jobs/genie.cbi/signing-packaging-common-gerrit/workspace/org.eclipse.cbi/common/target/test-classes
[INFO] 
[INFO] --- maven-surefire-plugin:2.22.0:test (default-test) @ cbi-common ---
[INFO] 
[INFO] -------------------------------------------------------
[INFO]  T E S T S
[INFO] -------------------------------------------------------
[INFO] Running org.eclipse.cbi.common.util.ZipsTest
[INFO] Tests run: 17, Failures: 0, Errors: 0, Skipped: 0, Time elapsed: 0.603 s - in org.eclipse.cbi.common.util.ZipsTest
[INFO] Running org.eclipse.cbi.common.util.MorePosixFilePermissionsTest
[INFO] Tests run: 8, Failures: 0, Errors: 0, Skipped: 0, Time elapsed: 0.001 s - in org.eclipse.cbi.common.util.MorePosixFilePermissionsTest
[INFO] Running org.eclipse.cbi.common.util.PathsTest
[INFO] Tests run: 10, Failures: 0, Errors: 0, Skipped: 0, Time elapsed: 0.005 s - in org.eclipse.cbi.common.util.PathsTest
[INFO] 
[INFO] Results:
[INFO] 
[INFO] Tests run: 35, Failures: 0, Errors: 0, Skipped: 0
[INFO] 
[INFO] 
[INFO] --- maven-jar-plugin:3.1.1:jar (default-jar) @ cbi-common ---
[INFO] Building jar: /jobs/genie.cbi/signing-packaging-common-gerrit/workspace/org.eclipse.cbi/common/target/cbi-common-1.2.3-SNAPSHOT.jar
[INFO] 
[INFO] --- maven-jar-plugin:3.1.1:test-jar (default) @ cbi-common ---
[INFO] Building jar: /jobs/genie.cbi/signing-packaging-common-gerrit/workspace/org.eclipse.cbi/common/target/cbi-common-1.2.3-SNAPSHOT-tests.jar
[INFO] 
[INFO] >>> spotbugs-maven-plugin:3.1.10:check (default) > :spotbugs @ cbi-common >>>
[INFO] 
[INFO] --- spotbugs-maven-plugin:3.1.10:spotbugs (spotbugs) @ cbi-common ---
[INFO] Fork Value is true
     [java] Picked up JAVA_TOOL_OPTIONS: -Xmx2G -Djava.io.tmpdir=/tmp/genie.cbi
     [java] Warnings generated: 2
[INFO] Done SpotBugs Analysis....
[INFO] 
[INFO] <<< spotbugs-maven-plugin:3.1.10:check (default) < :spotbugs @ cbi-common <<<
[INFO] 
[INFO] 
[INFO] --- spotbugs-maven-plugin:3.1.10:check (default) @ cbi-common ---
[INFO] BugInstance size is 2
[INFO] Error size is 0
[INFO] Total bugs: 2
[ERROR] d must be non-null but is marked as nullable [org.eclipse.cbi.common.security.MessageDigestAlgorithm$1] At MessageDigestAlgorithm.java:[line 75] NP_PARAMETER_MUST_BE_NONNULL_BUT_MARKED_AS_NULLABLE
[ERROR] d must be non-null but is marked as nullable [org.eclipse.cbi.common.security.SignatureAlgorithm$1] At SignatureAlgorithm.java:[line 79] NP_PARAMETER_MUST_BE_NONNULL_BUT_MARKED_AS_NULLABLE
[INFO] 


To see bug detail using the Spotbugs GUI, use the following command "mvn spotbugs:gui"



[INFO] ------------------------------------------------------------------------
[INFO] BUILD FAILURE
[INFO] ------------------------------------------------------------------------
[INFO] Total time: 27.361 s
[INFO] Finished at: 2019-01-22T10:37:44-05:00
[INFO] ------------------------------------------------------------------------
[ERROR] Failed to execute goal com.github.spotbugs:spotbugs-maven-plugin:3.1.10:check (default) on project cbi-common: failed with 2 bugs and 0 errors  -> [Help 1]
[ERROR] 
[ERROR] To see the full stack trace of the errors, re-run Maven with the -e switch.
[ERROR] Re-run Maven using the -X switch to enable full debug logging.
[ERROR] 
[ERROR] For more information about the errors and possible solutions, please read the following articles:
[ERROR] [Help 1] http://cwiki.apache.org/confluence/display/MAVEN/MojoExecutionException
Build step 'Invoke top-level Maven targets' marked build as failure
[FINDBUGS] Skipping publisher since build result is FAILURE
Archiving artifacts
Recording test results
Started calculate disk usage of build
Finished Calculation of disk usage of build in 0 seconds
Started calculate disk usage of workspace
Finished Calculation of disk usage of workspace in 0 seconds
Finished: FAILURE