FailedConsole Output

Triggered by Gerrit: https://git.eclipse.org/r/135545
Building on master in workspace /home/hudson/genie.cbi/.jenkins/jobs/signing-packaging-common-gerrit/workspace
 > /usr/local/bin/git rev-parse --is-inside-work-tree # timeout=10
Fetching changes from the remote Git repository
 > /usr/local/bin/git config remote.origin.url /gitroot/cbi/org.eclipse.cbi.git # timeout=10
Fetching upstream changes from /gitroot/cbi/org.eclipse.cbi.git
 > /usr/local/bin/git --version # timeout=10
 > /usr/local/bin/git fetch --tags --progress /gitroot/cbi/org.eclipse.cbi.git refs/changes/45/135545/2
 > /usr/local/bin/git rev-parse 7b2c682337a3f7401dbe09cfd2818797c6aca17a^{commit} # timeout=10
Checking out Revision 7b2c682337a3f7401dbe09cfd2818797c6aca17a (refs/changes/45/135545/2)
 > /usr/local/bin/git config core.sparsecheckout # timeout=10
 > /usr/local/bin/git checkout -f 7b2c682337a3f7401dbe09cfd2818797c6aca17a
Commit message: "Update to Guava 27.0.1"
 > /usr/local/bin/git rev-parse FETCH_HEAD^{commit} # timeout=10
 > /usr/local/bin/git rev-list --no-walk d2458078df770966db7e766d4267d5b6c97862f0 # timeout=10
[workspace] $ /shared/common/apache-maven-latest/bin/mvn -f org.eclipse.cbi/common/pom.xml -Dmaven.repo.local=/home/hudson/genie.cbi/.jenkins/jobs/signing-packaging-common-gerrit/workspace/.repository clean install
Picked up JAVA_TOOL_OPTIONS: -Xmx2G -Djava.io.tmpdir=/tmp/genie.cbi
[INFO] Scanning for projects...
[INFO] 
[INFO] ---------------------< org.eclipse.cbi:cbi-common >---------------------
[INFO] Building cbi-common 1.2.3-SNAPSHOT
[INFO] --------------------------------[ jar ]---------------------------------
Downloading from repo.eclipse.org: https://repo.eclipse.org/content/repositories/cbi/com/google/guava/guava/27.0.1-jre/guava-27.0.1-jre.pom
Downloading from eclipse.maven.central.mirror: https://repo.eclipse.org/content/repositories/maven_central/com/google/guava/guava/27.0.1-jre/guava-27.0.1-jre.pom
Progress (1): 4.1/8.3 kB
Progress (1): 7.7/8.3 kB
Progress (1): 8.3 kB    
                    
Downloaded from eclipse.maven.central.mirror: https://repo.eclipse.org/content/repositories/maven_central/com/google/guava/guava/27.0.1-jre/guava-27.0.1-jre.pom (8.3 kB at 78 kB/s)
Downloading from repo.eclipse.org: https://repo.eclipse.org/content/repositories/cbi/com/google/guava/guava-parent/27.0.1-jre/guava-parent-27.0.1-jre.pom
Downloading from eclipse.maven.central.mirror: https://repo.eclipse.org/content/repositories/maven_central/com/google/guava/guava-parent/27.0.1-jre/guava-parent-27.0.1-jre.pom
Progress (1): 4.1/10 kB
Progress (1): 7.7/10 kB
Progress (1): 10 kB    
                   
Downloaded from eclipse.maven.central.mirror: https://repo.eclipse.org/content/repositories/maven_central/com/google/guava/guava-parent/27.0.1-jre/guava-parent-27.0.1-jre.pom (10 kB at 99 kB/s)
Downloading from repo.eclipse.org: https://repo.eclipse.org/content/repositories/cbi/com/google/guava/failureaccess/1.0.1/failureaccess-1.0.1.pom
Downloading from eclipse.maven.central.mirror: https://repo.eclipse.org/content/repositories/maven_central/com/google/guava/failureaccess/1.0.1/failureaccess-1.0.1.pom
Progress (1): 2.4 kB
                    
Downloaded from eclipse.maven.central.mirror: https://repo.eclipse.org/content/repositories/maven_central/com/google/guava/failureaccess/1.0.1/failureaccess-1.0.1.pom (2.4 kB at 35 kB/s)
Downloading from repo.eclipse.org: https://repo.eclipse.org/content/repositories/cbi/com/google/guava/guava-parent/26.0-android/guava-parent-26.0-android.pom
Downloading from eclipse.maven.central.mirror: https://repo.eclipse.org/content/repositories/maven_central/com/google/guava/guava-parent/26.0-android/guava-parent-26.0-android.pom
Progress (1): 4.1/10 kB
Progress (1): 7.7/10 kB
Progress (1): 10 kB    
                   
Downloaded from eclipse.maven.central.mirror: https://repo.eclipse.org/content/repositories/maven_central/com/google/guava/guava-parent/26.0-android/guava-parent-26.0-android.pom (10 kB at 32 kB/s)
Downloading from repo.eclipse.org: https://repo.eclipse.org/content/repositories/cbi/com/google/guava/listenablefuture/9999.0-empty-to-avoid-conflict-with-guava/listenablefuture-9999.0-empty-to-avoid-conflict-with-guava.pom
Downloading from eclipse.maven.central.mirror: https://repo.eclipse.org/content/repositories/maven_central/com/google/guava/listenablefuture/9999.0-empty-to-avoid-conflict-with-guava/listenablefuture-9999.0-empty-to-avoid-conflict-with-guava.pom
Progress (1): 2.3 kB
                    
Downloaded from eclipse.maven.central.mirror: https://repo.eclipse.org/content/repositories/maven_central/com/google/guava/listenablefuture/9999.0-empty-to-avoid-conflict-with-guava/listenablefuture-9999.0-empty-to-avoid-conflict-with-guava.pom (2.3 kB at 28 kB/s)
Downloading from repo.eclipse.org: https://repo.eclipse.org/content/repositories/cbi/org/checkerframework/checker-qual/2.5.2/checker-qual-2.5.2.pom
Downloading from eclipse.maven.central.mirror: https://repo.eclipse.org/content/repositories/maven_central/org/checkerframework/checker-qual/2.5.2/checker-qual-2.5.2.pom
Progress (1): 2.5 kB
                    
Downloaded from eclipse.maven.central.mirror: https://repo.eclipse.org/content/repositories/maven_central/org/checkerframework/checker-qual/2.5.2/checker-qual-2.5.2.pom (2.5 kB at 28 kB/s)
Downloading from repo.eclipse.org: https://repo.eclipse.org/content/repositories/cbi/com/google/errorprone/error_prone_annotations/2.2.0/error_prone_annotations-2.2.0.pom
Downloading from eclipse.maven.central.mirror: https://repo.eclipse.org/content/repositories/maven_central/com/google/errorprone/error_prone_annotations/2.2.0/error_prone_annotations-2.2.0.pom
Progress (1): 1.8 kB
                    
Downloaded from eclipse.maven.central.mirror: https://repo.eclipse.org/content/repositories/maven_central/com/google/errorprone/error_prone_annotations/2.2.0/error_prone_annotations-2.2.0.pom (1.8 kB at 6.0 kB/s)
Downloading from repo.eclipse.org: https://repo.eclipse.org/content/repositories/cbi/com/google/errorprone/error_prone_parent/2.2.0/error_prone_parent-2.2.0.pom
Downloading from eclipse.maven.central.mirror: https://repo.eclipse.org/content/repositories/maven_central/com/google/errorprone/error_prone_parent/2.2.0/error_prone_parent-2.2.0.pom
Progress (1): 4.1/5.1 kB
Progress (1): 5.1 kB    
                    
Downloaded from eclipse.maven.central.mirror: https://repo.eclipse.org/content/repositories/maven_central/com/google/errorprone/error_prone_parent/2.2.0/error_prone_parent-2.2.0.pom (5.1 kB at 72 kB/s)
Downloading from repo.eclipse.org: https://repo.eclipse.org/content/repositories/cbi/com/google/j2objc/j2objc-annotations/1.1/j2objc-annotations-1.1.pom
Downloading from eclipse.maven.central.mirror: https://repo.eclipse.org/content/repositories/maven_central/com/google/j2objc/j2objc-annotations/1.1/j2objc-annotations-1.1.pom
Progress (1): 2.8 kB
                    
Downloaded from eclipse.maven.central.mirror: https://repo.eclipse.org/content/repositories/maven_central/com/google/j2objc/j2objc-annotations/1.1/j2objc-annotations-1.1.pom (2.8 kB at 55 kB/s)
Downloading from repo.eclipse.org: https://repo.eclipse.org/content/repositories/cbi/org/codehaus/mojo/animal-sniffer-annotations/1.17/animal-sniffer-annotations-1.17.pom
Downloading from eclipse.maven.central.mirror: https://repo.eclipse.org/content/repositories/maven_central/org/codehaus/mojo/animal-sniffer-annotations/1.17/animal-sniffer-annotations-1.17.pom
Progress (1): 2.6 kB
                    
Downloaded from eclipse.maven.central.mirror: https://repo.eclipse.org/content/repositories/maven_central/org/codehaus/mojo/animal-sniffer-annotations/1.17/animal-sniffer-annotations-1.17.pom (2.6 kB at 33 kB/s)
Downloading from repo.eclipse.org: https://repo.eclipse.org/content/repositories/cbi/org/codehaus/mojo/animal-sniffer-parent/1.17/animal-sniffer-parent-1.17.pom
Downloading from eclipse.maven.central.mirror: https://repo.eclipse.org/content/repositories/maven_central/org/codehaus/mojo/animal-sniffer-parent/1.17/animal-sniffer-parent-1.17.pom
Progress (1): 4.1/8.6 kB
Progress (1): 7.7/8.6 kB
Progress (1): 8.6 kB    
                    
Downloaded from eclipse.maven.central.mirror: https://repo.eclipse.org/content/repositories/maven_central/org/codehaus/mojo/animal-sniffer-parent/1.17/animal-sniffer-parent-1.17.pom (8.6 kB at 128 kB/s)
Downloading from repo.eclipse.org: https://repo.eclipse.org/content/repositories/cbi/com/google/guava/guava/27.0.1-jre/guava-27.0.1-jre.jar
Downloading from repo.eclipse.org: https://repo.eclipse.org/content/repositories/cbi/com/google/guava/listenablefuture/9999.0-empty-to-avoid-conflict-with-guava/listenablefuture-9999.0-empty-to-avoid-conflict-with-guava.jar
Downloading from repo.eclipse.org: https://repo.eclipse.org/content/repositories/cbi/com/google/guava/failureaccess/1.0.1/failureaccess-1.0.1.jar
Downloading from repo.eclipse.org: https://repo.eclipse.org/content/repositories/cbi/com/google/errorprone/error_prone_annotations/2.2.0/error_prone_annotations-2.2.0.jar
Downloading from repo.eclipse.org: https://repo.eclipse.org/content/repositories/cbi/org/checkerframework/checker-qual/2.5.2/checker-qual-2.5.2.jar
Downloading from repo.eclipse.org: https://repo.eclipse.org/content/repositories/cbi/com/google/j2objc/j2objc-annotations/1.1/j2objc-annotations-1.1.jar
Downloading from repo.eclipse.org: https://repo.eclipse.org/content/repositories/cbi/org/codehaus/mojo/animal-sniffer-annotations/1.17/animal-sniffer-annotations-1.17.jar
Downloading from eclipse.maven.central.mirror: https://repo.eclipse.org/content/repositories/maven_central/com/google/guava/guava/27.0.1-jre/guava-27.0.1-jre.jar
Downloading from eclipse.maven.central.mirror: https://repo.eclipse.org/content/repositories/maven_central/com/google/guava/failureaccess/1.0.1/failureaccess-1.0.1.jar
Downloading from eclipse.maven.central.mirror: https://repo.eclipse.org/content/repositories/maven_central/org/checkerframework/checker-qual/2.5.2/checker-qual-2.5.2.jar
Downloading from eclipse.maven.central.mirror: https://repo.eclipse.org/content/repositories/maven_central/com/google/guava/listenablefuture/9999.0-empty-to-avoid-conflict-with-guava/listenablefuture-9999.0-empty-to-avoid-conflict-with-guava.jar
Downloading from eclipse.maven.central.mirror: https://repo.eclipse.org/content/repositories/maven_central/com/google/errorprone/error_prone_annotations/2.2.0/error_prone_annotations-2.2.0.jar
Progress (1): 4.1/193 kB
Progress (1): 7.7/193 kB
Progress (1): 12/193 kB 
Progress (1): 16/193 kB
Progress (1): 20/193 kB
Progress (1): 24/193 kB
Progress (1): 28/193 kB
Progress (1): 32/193 kB
Progress (1): 36/193 kB
Progress (1): 40/193 kB
Progress (1): 44/193 kB
Progress (1): 48/193 kB
Progress (1): 52/193 kB
Progress (1): 56/193 kB
Progress (1): 60/193 kB
Progress (1): 64/193 kB
Progress (1): 66/193 kB
Progress (1): 70/193 kB
Progress (1): 74/193 kB
Progress (1): 78/193 kB
Progress (1): 82/193 kB
Progress (1): 86/193 kB
Progress (1): 90/193 kB
Progress (1): 94/193 kB
Progress (1): 98/193 kB
Progress (1): 98/193 kB
Progress (1): 102/193 kB
Progress (1): 106/193 kB
Progress (1): 110/193 kB
Progress (1): 114/193 kB
Progress (1): 118/193 kB
Progress (1): 122/193 kB
Progress (1): 126/193 kB
Progress (1): 130/193 kB
Progress (1): 131/193 kB
Progress (1): 135/193 kB
Progress (1): 139/193 kB
Progress (1): 143/193 kB
Progress (1): 147/193 kB
Progress (1): 151/193 kB
Progress (1): 155/193 kB
Progress (1): 159/193 kB
Progress (1): 163/193 kB
Progress (1): 167/193 kB
Progress (1): 171/193 kB
Progress (1): 175/193 kB
Progress (1): 179/193 kB
Progress (1): 183/193 kB
Progress (1): 187/193 kB
Progress (1): 191/193 kB
Progress (1): 193 kB    
                    
Downloaded from eclipse.maven.central.mirror: https://repo.eclipse.org/content/repositories/maven_central/org/checkerframework/checker-qual/2.5.2/checker-qual-2.5.2.jar (193 kB at 1.8 MB/s)
Downloading from eclipse.maven.central.mirror: https://repo.eclipse.org/content/repositories/maven_central/com/google/j2objc/j2objc-annotations/1.1/j2objc-annotations-1.1.jar
Progress (1): 4.1/8.8 kB
Progress (1): 7.7/8.8 kB
Progress (1): 8.8 kB    
                    
Downloaded from eclipse.maven.central.mirror: https://repo.eclipse.org/content/repositories/maven_central/com/google/j2objc/j2objc-annotations/1.1/j2objc-annotations-1.1.jar (8.8 kB at 54 kB/s)
Downloading from eclipse.maven.central.mirror: https://repo.eclipse.org/content/repositories/maven_central/org/codehaus/mojo/animal-sniffer-annotations/1.17/animal-sniffer-annotations-1.17.jar
Progress (1): 4.1/14 kB
Progress (1): 7.7/14 kB
Progress (2): 7.7/14 kB | 4.1/4.6 kB
Progress (2): 7.7/14 kB | 4.6 kB    
                                
Downloaded from eclipse.maven.central.mirror: https://repo.eclipse.org/content/repositories/maven_central/com/google/guava/failureaccess/1.0.1/failureaccess-1.0.1.jar (4.6 kB at 14 kB/s)
Progress (2): 7.7/14 kB | 2.2 kB
                                
Downloaded from eclipse.maven.central.mirror: https://repo.eclipse.org/content/repositories/maven_central/com/google/guava/listenablefuture/9999.0-empty-to-avoid-conflict-with-guava/listenablefuture-9999.0-empty-to-avoid-conflict-with-guava.jar (2.2 kB at 6.0 kB/s)
Progress (2): 7.7/14 kB | 3.4 kB
                                
Downloaded from eclipse.maven.central.mirror: https://repo.eclipse.org/content/repositories/maven_central/org/codehaus/mojo/animal-sniffer-annotations/1.17/animal-sniffer-annotations-1.17.jar (3.4 kB at 9.0 kB/s)
Progress (1): 12/14 kB
Progress (1): 14 kB   
                   
Downloaded from eclipse.maven.central.mirror: https://repo.eclipse.org/content/repositories/maven_central/com/google/errorprone/error_prone_annotations/2.2.0/error_prone_annotations-2.2.0.jar (14 kB at 26 kB/s)
Progress (1): 0/2.7 MB
Progress (1): 0/2.7 MB
Progress (1): 0/2.7 MB
Progress (1): 0/2.7 MB
Progress (1): 0/2.7 MB
Progress (1): 0/2.7 MB
Progress (1): 0/2.7 MB
Progress (1): 0/2.7 MB
Progress (1): 0/2.7 MB
Progress (1): 0/2.7 MB
Progress (1): 0/2.7 MB
Progress (1): 0/2.7 MB
Progress (1): 0.1/2.7 MB
Progress (1): 0.1/2.7 MB
Progress (1): 0.1/2.7 MB
Progress (1): 0.1/2.7 MB
Progress (1): 0.1/2.7 MB
Progress (1): 0.1/2.7 MB
Progress (1): 0.1/2.7 MB
Progress (1): 0.1/2.7 MB
Progress (1): 0.1/2.7 MB
Progress (1): 0.1/2.7 MB
Progress (1): 0.1/2.7 MB
Progress (1): 0.1/2.7 MB
Progress (1): 0.1/2.7 MB
Progress (1): 0.1/2.7 MB
Progress (1): 0.1/2.7 MB
Progress (1): 0.1/2.7 MB
Progress (1): 0.1/2.7 MB
Progress (1): 0.1/2.7 MB
Progress (1): 0.1/2.7 MB
Progress (1): 0.1/2.7 MB
Progress (1): 0.1/2.7 MB
Progress (1): 0.1/2.7 MB
Progress (1): 0.1/2.7 MB
Progress (1): 0.1/2.7 MB
Progress (1): 0.1/2.7 MB
Progress (1): 0.2/2.7 MB
Progress (1): 0.2/2.7 MB
Progress (1): 0.2/2.7 MB
Progress (1): 0.2/2.7 MB
Progress (1): 0.2/2.7 MB
Progress (1): 0.2/2.7 MB
Progress (1): 0.2/2.7 MB
Progress (1): 0.2/2.7 MB
Progress (1): 0.2/2.7 MB
Progress (1): 0.2/2.7 MB
Progress (1): 0.2/2.7 MB
Progress (1): 0.2/2.7 MB
Progress (1): 0.2/2.7 MB
Progress (1): 0.2/2.7 MB
Progress (1): 0.2/2.7 MB
Progress (1): 0.2/2.7 MB
Progress (1): 0.2/2.7 MB
Progress (1): 0.2/2.7 MB
Progress (1): 0.2/2.7 MB
Progress (1): 0.2/2.7 MB
Progress (1): 0.2/2.7 MB
Progress (1): 0.2/2.7 MB
Progress (1): 0.2/2.7 MB
Progress (1): 0.2/2.7 MB
Progress (1): 0.2/2.7 MB
Progress (1): 0.3/2.7 MB
Progress (1): 0.3/2.7 MB
Progress (1): 0.3/2.7 MB
Progress (1): 0.3/2.7 MB
Progress (1): 0.3/2.7 MB
Progress (1): 0.3/2.7 MB
Progress (1): 0.3/2.7 MB
Progress (1): 0.3/2.7 MB
Progress (1): 0.3/2.7 MB
Progress (1): 0.3/2.7 MB
Progress (1): 0.3/2.7 MB
Progress (1): 0.3/2.7 MB
Progress (1): 0.3/2.7 MB
Progress (1): 0.3/2.7 MB
Progress (1): 0.3/2.7 MB
Progress (1): 0.3/2.7 MB
Progress (1): 0.3/2.7 MB
Progress (1): 0.3/2.7 MB
Progress (1): 0.3/2.7 MB
Progress (1): 0.3/2.7 MB
Progress (1): 0.3/2.7 MB
Progress (1): 0.3/2.7 MB
Progress (1): 0.3/2.7 MB
Progress (1): 0.3/2.7 MB
Progress (1): 0.3/2.7 MB
Progress (1): 0.4/2.7 MB
Progress (1): 0.4/2.7 MB
Progress (1): 0.4/2.7 MB
Progress (1): 0.4/2.7 MB
Progress (1): 0.4/2.7 MB
Progress (1): 0.4/2.7 MB
Progress (1): 0.4/2.7 MB
Progress (1): 0.4/2.7 MB
Progress (1): 0.4/2.7 MB
Progress (1): 0.4/2.7 MB
Progress (1): 0.4/2.7 MB
Progress (1): 0.4/2.7 MB
Progress (1): 0.4/2.7 MB
Progress (1): 0.4/2.7 MB
Progress (1): 0.4/2.7 MB
Progress (1): 0.4/2.7 MB
Progress (1): 0.4/2.7 MB
Progress (1): 0.4/2.7 MB
Progress (1): 0.4/2.7 MB
Progress (1): 0.4/2.7 MB
Progress (1): 0.4/2.7 MB
Progress (1): 0.4/2.7 MB
Progress (1): 0.4/2.7 MB
Progress (1): 0.4/2.7 MB
Progress (1): 0.4/2.7 MB
Progress (1): 0.5/2.7 MB
Progress (1): 0.5/2.7 MB
Progress (1): 0.5/2.7 MB
Progress (1): 0.5/2.7 MB
Progress (1): 0.5/2.7 MB
Progress (1): 0.5/2.7 MB
Progress (1): 0.5/2.7 MB
Progress (1): 0.5/2.7 MB
Progress (1): 0.5/2.7 MB
Progress (1): 0.5/2.7 MB
Progress (1): 0.5/2.7 MB
Progress (1): 0.5/2.7 MB
Progress (1): 0.5/2.7 MB
Progress (1): 0.5/2.7 MB
Progress (1): 0.5/2.7 MB
Progress (1): 0.5/2.7 MB
Progress (1): 0.5/2.7 MB
Progress (1): 0.5/2.7 MB
Progress (1): 0.5/2.7 MB
Progress (1): 0.5/2.7 MB
Progress (1): 0.5/2.7 MB
Progress (1): 0.5/2.7 MB
Progress (1): 0.5/2.7 MB
Progress (1): 0.5/2.7 MB
Progress (1): 0.5/2.7 MB
Progress (1): 0.6/2.7 MB
Progress (1): 0.6/2.7 MB
Progress (1): 0.6/2.7 MB
Progress (1): 0.6/2.7 MB
Progress (1): 0.6/2.7 MB
Progress (1): 0.6/2.7 MB
Progress (1): 0.6/2.7 MB
Progress (1): 0.6/2.7 MB
Progress (1): 0.6/2.7 MB
Progress (1): 0.6/2.7 MB
Progress (1): 0.6/2.7 MB
Progress (1): 0.6/2.7 MB
Progress (1): 0.6/2.7 MB
Progress (1): 0.6/2.7 MB
Progress (1): 0.6/2.7 MB
Progress (1): 0.6/2.7 MB
Progress (1): 0.6/2.7 MB
Progress (1): 0.6/2.7 MB
Progress (1): 0.6/2.7 MB
Progress (1): 0.6/2.7 MB
Progress (1): 0.6/2.7 MB
Progress (1): 0.6/2.7 MB
Progress (1): 0.6/2.7 MB
Progress (1): 0.6/2.7 MB
Progress (1): 0.6/2.7 MB
Progress (1): 0.7/2.7 MB
Progress (1): 0.7/2.7 MB
Progress (1): 0.7/2.7 MB
Progress (1): 0.7/2.7 MB
Progress (1): 0.7/2.7 MB
Progress (1): 0.7/2.7 MB
Progress (1): 0.7/2.7 MB
Progress (1): 0.7/2.7 MB
Progress (1): 0.7/2.7 MB
Progress (1): 0.7/2.7 MB
Progress (1): 0.7/2.7 MB
Progress (1): 0.7/2.7 MB
Progress (1): 0.7/2.7 MB
Progress (1): 0.7/2.7 MB
Progress (1): 0.7/2.7 MB
Progress (1): 0.7/2.7 MB
Progress (1): 0.7/2.7 MB
Progress (1): 0.7/2.7 MB
Progress (1): 0.7/2.7 MB
Progress (1): 0.7/2.7 MB
Progress (1): 0.7/2.7 MB
Progress (1): 0.7/2.7 MB
Progress (1): 0.7/2.7 MB
Progress (1): 0.7/2.7 MB
Progress (1): 0.7/2.7 MB
Progress (1): 0.8/2.7 MB
Progress (1): 0.8/2.7 MB
Progress (1): 0.8/2.7 MB
Progress (1): 0.8/2.7 MB
Progress (1): 0.8/2.7 MB
Progress (1): 0.8/2.7 MB
Progress (1): 0.8/2.7 MB
Progress (1): 0.8/2.7 MB
Progress (1): 0.8/2.7 MB
Progress (1): 0.8/2.7 MB
Progress (1): 0.8/2.7 MB
Progress (1): 0.8/2.7 MB
Progress (1): 0.8/2.7 MB
Progress (1): 0.8/2.7 MB
Progress (1): 0.8/2.7 MB
Progress (1): 0.8/2.7 MB
Progress (1): 0.8/2.7 MB
Progress (1): 0.8/2.7 MB
Progress (1): 0.8/2.7 MB
Progress (1): 0.8/2.7 MB
Progress (1): 0.8/2.7 MB
Progress (1): 0.8/2.7 MB
Progress (1): 0.8/2.7 MB
Progress (1): 0.8/2.7 MB
Progress (1): 0.8/2.7 MB
Progress (1): 0.9/2.7 MB
Progress (1): 0.9/2.7 MB
Progress (1): 0.9/2.7 MB
Progress (1): 0.9/2.7 MB
Progress (1): 0.9/2.7 MB
Progress (1): 0.9/2.7 MB
Progress (1): 0.9/2.7 MB
Progress (1): 0.9/2.7 MB
Progress (1): 0.9/2.7 MB
Progress (1): 0.9/2.7 MB
Progress (1): 0.9/2.7 MB
Progress (1): 0.9/2.7 MB
Progress (1): 0.9/2.7 MB
Progress (1): 0.9/2.7 MB
Progress (1): 0.9/2.7 MB
Progress (1): 0.9/2.7 MB
Progress (1): 0.9/2.7 MB
Progress (1): 0.9/2.7 MB
Progress (1): 0.9/2.7 MB
Progress (1): 0.9/2.7 MB
Progress (1): 0.9/2.7 MB
Progress (1): 0.9/2.7 MB
Progress (1): 0.9/2.7 MB
Progress (1): 0.9/2.7 MB
Progress (1): 0.9/2.7 MB
Progress (1): 1.0/2.7 MB
Progress (1): 1.0/2.7 MB
Progress (1): 1.0/2.7 MB
Progress (1): 1.0/2.7 MB
Progress (1): 1.0/2.7 MB
Progress (1): 1.0/2.7 MB
Progress (1): 1.0/2.7 MB
Progress (1): 1.0/2.7 MB
Progress (1): 1.0/2.7 MB
Progress (1): 1.0/2.7 MB
Progress (1): 1.0/2.7 MB
Progress (1): 1.0/2.7 MB
Progress (1): 1.0/2.7 MB
Progress (1): 1.0/2.7 MB
Progress (1): 1.0/2.7 MB
Progress (1): 1.0/2.7 MB
Progress (1): 1.0/2.7 MB
Progress (1): 1.0/2.7 MB
Progress (1): 1.0/2.7 MB
Progress (1): 1.0/2.7 MB
Progress (1): 1.0/2.7 MB
Progress (1): 1.0/2.7 MB
Progress (1): 1.0/2.7 MB
Progress (1): 1.0/2.7 MB
Progress (1): 1.0/2.7 MB
Progress (1): 1.1/2.7 MB
Progress (1): 1.1/2.7 MB
Progress (1): 1.1/2.7 MB
Progress (1): 1.1/2.7 MB
Progress (1): 1.1/2.7 MB
Progress (1): 1.1/2.7 MB
Progress (1): 1.1/2.7 MB
Progress (1): 1.1/2.7 MB
Progress (1): 1.1/2.7 MB
Progress (1): 1.1/2.7 MB
Progress (1): 1.1/2.7 MB
Progress (1): 1.1/2.7 MB
Progress (1): 1.1/2.7 MB
Progress (1): 1.1/2.7 MB
Progress (1): 1.1/2.7 MB
Progress (1): 1.1/2.7 MB
Progress (1): 1.1/2.7 MB
Progress (1): 1.1/2.7 MB
Progress (1): 1.1/2.7 MB
Progress (1): 1.1/2.7 MB
Progress (1): 1.1/2.7 MB
Progress (1): 1.1/2.7 MB
Progress (1): 1.1/2.7 MB
Progress (1): 1.1/2.7 MB
Progress (1): 1.1/2.7 MB
Progress (1): 1.2/2.7 MB
Progress (1): 1.2/2.7 MB
Progress (1): 1.2/2.7 MB
Progress (1): 1.2/2.7 MB
Progress (1): 1.2/2.7 MB
Progress (1): 1.2/2.7 MB
Progress (1): 1.2/2.7 MB
Progress (1): 1.2/2.7 MB
Progress (1): 1.2/2.7 MB
Progress (1): 1.2/2.7 MB
Progress (1): 1.2/2.7 MB
Progress (1): 1.2/2.7 MB
Progress (1): 1.2/2.7 MB
Progress (1): 1.2/2.7 MB
Progress (1): 1.2/2.7 MB
Progress (1): 1.2/2.7 MB
Progress (1): 1.2/2.7 MB
Progress (1): 1.2/2.7 MB
Progress (1): 1.2/2.7 MB
Progress (1): 1.2/2.7 MB
Progress (1): 1.2/2.7 MB
Progress (1): 1.2/2.7 MB
Progress (1): 1.2/2.7 MB
Progress (1): 1.2/2.7 MB
Progress (1): 1.2/2.7 MB
Progress (1): 1.3/2.7 MB
Progress (1): 1.3/2.7 MB
Progress (1): 1.3/2.7 MB
Progress (1): 1.3/2.7 MB
Progress (1): 1.3/2.7 MB
Progress (1): 1.3/2.7 MB
Progress (1): 1.3/2.7 MB
Progress (1): 1.3/2.7 MB
Progress (1): 1.3/2.7 MB
Progress (1): 1.3/2.7 MB
Progress (1): 1.3/2.7 MB
Progress (1): 1.3/2.7 MB
Progress (1): 1.3/2.7 MB
Progress (1): 1.3/2.7 MB
Progress (1): 1.3/2.7 MB
Progress (1): 1.3/2.7 MB
Progress (1): 1.3/2.7 MB
Progress (1): 1.3/2.7 MB
Progress (1): 1.3/2.7 MB
Progress (1): 1.3/2.7 MB
Progress (1): 1.3/2.7 MB
Progress (1): 1.3/2.7 MB
Progress (1): 1.3/2.7 MB
Progress (1): 1.3/2.7 MB
Progress (1): 1.3/2.7 MB
Progress (1): 1.4/2.7 MB
Progress (1): 1.4/2.7 MB
Progress (1): 1.4/2.7 MB
Progress (1): 1.4/2.7 MB
Progress (1): 1.4/2.7 MB
Progress (1): 1.4/2.7 MB
Progress (1): 1.4/2.7 MB
Progress (1): 1.4/2.7 MB
Progress (1): 1.4/2.7 MB
Progress (1): 1.4/2.7 MB
Progress (1): 1.4/2.7 MB
Progress (1): 1.4/2.7 MB
Progress (1): 1.4/2.7 MB
Progress (1): 1.4/2.7 MB
Progress (1): 1.4/2.7 MB
Progress (1): 1.4/2.7 MB
Progress (1): 1.4/2.7 MB
Progress (1): 1.4/2.7 MB
Progress (1): 1.4/2.7 MB
Progress (1): 1.4/2.7 MB
Progress (1): 1.4/2.7 MB
Progress (1): 1.4/2.7 MB
Progress (1): 1.4/2.7 MB
Progress (1): 1.4/2.7 MB
Progress (1): 1.4/2.7 MB
Progress (1): 1.5/2.7 MB
Progress (1): 1.5/2.7 MB
Progress (1): 1.5/2.7 MB
Progress (1): 1.5/2.7 MB
Progress (1): 1.5/2.7 MB
Progress (1): 1.5/2.7 MB
Progress (1): 1.5/2.7 MB
Progress (1): 1.5/2.7 MB
Progress (1): 1.5/2.7 MB
Progress (1): 1.5/2.7 MB
Progress (1): 1.5/2.7 MB
Progress (1): 1.5/2.7 MB
Progress (1): 1.5/2.7 MB
Progress (1): 1.5/2.7 MB
Progress (1): 1.5/2.7 MB
Progress (1): 1.5/2.7 MB
Progress (1): 1.5/2.7 MB
Progress (1): 1.5/2.7 MB
Progress (1): 1.5/2.7 MB
Progress (1): 1.5/2.7 MB
Progress (1): 1.5/2.7 MB
Progress (1): 1.5/2.7 MB
Progress (1): 1.5/2.7 MB
Progress (1): 1.5/2.7 MB
Progress (1): 1.5/2.7 MB
Progress (1): 1.6/2.7 MB
Progress (1): 1.6/2.7 MB
Progress (1): 1.6/2.7 MB
Progress (1): 1.6/2.7 MB
Progress (1): 1.6/2.7 MB
Progress (1): 1.6/2.7 MB
Progress (1): 1.6/2.7 MB
Progress (1): 1.6/2.7 MB
Progress (1): 1.6/2.7 MB
Progress (1): 1.6/2.7 MB
Progress (1): 1.6/2.7 MB
Progress (1): 1.6/2.7 MB
Progress (1): 1.6/2.7 MB
Progress (1): 1.6/2.7 MB
Progress (1): 1.6/2.7 MB
Progress (1): 1.6/2.7 MB
Progress (1): 1.6/2.7 MB
Progress (1): 1.6/2.7 MB
Progress (1): 1.6/2.7 MB
Progress (1): 1.6/2.7 MB
Progress (1): 1.6/2.7 MB
Progress (1): 1.6/2.7 MB
Progress (1): 1.6/2.7 MB
Progress (1): 1.6/2.7 MB
Progress (1): 1.6/2.7 MB
Progress (1): 1.7/2.7 MB
Progress (1): 1.7/2.7 MB
Progress (1): 1.7/2.7 MB
Progress (1): 1.7/2.7 MB
Progress (1): 1.7/2.7 MB
Progress (1): 1.7/2.7 MB
Progress (1): 1.7/2.7 MB
Progress (1): 1.7/2.7 MB
Progress (1): 1.7/2.7 MB
Progress (1): 1.7/2.7 MB
Progress (1): 1.7/2.7 MB
Progress (1): 1.7/2.7 MB
Progress (1): 1.7/2.7 MB
Progress (1): 1.7/2.7 MB
Progress (1): 1.7/2.7 MB
Progress (1): 1.7/2.7 MB
Progress (1): 1.7/2.7 MB
Progress (1): 1.7/2.7 MB
Progress (1): 1.7/2.7 MB
Progress (1): 1.7/2.7 MB
Progress (1): 1.7/2.7 MB
Progress (1): 1.7/2.7 MB
Progress (1): 1.7/2.7 MB
Progress (1): 1.7/2.7 MB
Progress (1): 1.7/2.7 MB
Progress (1): 1.8/2.7 MB
Progress (1): 1.8/2.7 MB
Progress (1): 1.8/2.7 MB
Progress (1): 1.8/2.7 MB
Progress (1): 1.8/2.7 MB
Progress (1): 1.8/2.7 MB
Progress (1): 1.8/2.7 MB
Progress (1): 1.8/2.7 MB
Progress (1): 1.8/2.7 MB
Progress (1): 1.8/2.7 MB
Progress (1): 1.8/2.7 MB
Progress (1): 1.8/2.7 MB
Progress (1): 1.8/2.7 MB
Progress (1): 1.8/2.7 MB
Progress (1): 1.8/2.7 MB
Progress (1): 1.8/2.7 MB
Progress (1): 1.8/2.7 MB
Progress (1): 1.8/2.7 MB
Progress (1): 1.8/2.7 MB
Progress (1): 1.8/2.7 MB
Progress (1): 1.8/2.7 MB
Progress (1): 1.8/2.7 MB
Progress (1): 1.8/2.7 MB
Progress (1): 1.8/2.7 MB
Progress (1): 1.8/2.7 MB
Progress (1): 1.9/2.7 MB
Progress (1): 1.9/2.7 MB
Progress (1): 1.9/2.7 MB
Progress (1): 1.9/2.7 MB
Progress (1): 1.9/2.7 MB
Progress (1): 1.9/2.7 MB
Progress (1): 1.9/2.7 MB
Progress (1): 1.9/2.7 MB
Progress (1): 1.9/2.7 MB
Progress (1): 1.9/2.7 MB
Progress (1): 1.9/2.7 MB
Progress (1): 1.9/2.7 MB
Progress (1): 1.9/2.7 MB
Progress (1): 1.9/2.7 MB
Progress (1): 1.9/2.7 MB
Progress (1): 1.9/2.7 MB
Progress (1): 1.9/2.7 MB
Progress (1): 1.9/2.7 MB
Progress (1): 1.9/2.7 MB
Progress (1): 1.9/2.7 MB
Progress (1): 1.9/2.7 MB
Progress (1): 1.9/2.7 MB
Progress (1): 1.9/2.7 MB
Progress (1): 1.9/2.7 MB
Progress (1): 1.9/2.7 MB
Progress (1): 2.0/2.7 MB
Progress (1): 2.0/2.7 MB
Progress (1): 2.0/2.7 MB
Progress (1): 2.0/2.7 MB
Progress (1): 2.0/2.7 MB
Progress (1): 2.0/2.7 MB
Progress (1): 2.0/2.7 MB
Progress (1): 2.0/2.7 MB
Progress (1): 2.0/2.7 MB
Progress (1): 2.0/2.7 MB
Progress (1): 2.0/2.7 MB
Progress (1): 2.0/2.7 MB
Progress (1): 2.0/2.7 MB
Progress (1): 2.0/2.7 MB
Progress (1): 2.0/2.7 MB
Progress (1): 2.0/2.7 MB
Progress (1): 2.0/2.7 MB
Progress (1): 2.0/2.7 MB
Progress (1): 2.0/2.7 MB
Progress (1): 2.0/2.7 MB
Progress (1): 2.0/2.7 MB
Progress (1): 2.0/2.7 MB
Progress (1): 2.0/2.7 MB
Progress (1): 2.0/2.7 MB
Progress (1): 2.0/2.7 MB
Progress (1): 2.1/2.7 MB
Progress (1): 2.1/2.7 MB
Progress (1): 2.1/2.7 MB
Progress (1): 2.1/2.7 MB
Progress (1): 2.1/2.7 MB
Progress (1): 2.1/2.7 MB
Progress (1): 2.1/2.7 MB
Progress (1): 2.1/2.7 MB
Progress (1): 2.1/2.7 MB
Progress (1): 2.1/2.7 MB
Progress (1): 2.1/2.7 MB
Progress (1): 2.1/2.7 MB
Progress (1): 2.1/2.7 MB
Progress (1): 2.1/2.7 MB
Progress (1): 2.1/2.7 MB
Progress (1): 2.1/2.7 MB
Progress (1): 2.1/2.7 MB
Progress (1): 2.1/2.7 MB
Progress (1): 2.1/2.7 MB
Progress (1): 2.1/2.7 MB
Progress (1): 2.1/2.7 MB
Progress (1): 2.1/2.7 MB
Progress (1): 2.1/2.7 MB
Progress (1): 2.1/2.7 MB
Progress (1): 2.1/2.7 MB
Progress (1): 2.2/2.7 MB
Progress (1): 2.2/2.7 MB
Progress (1): 2.2/2.7 MB
Progress (1): 2.2/2.7 MB
Progress (1): 2.2/2.7 MB
Progress (1): 2.2/2.7 MB
Progress (1): 2.2/2.7 MB
Progress (1): 2.2/2.7 MB
Progress (1): 2.2/2.7 MB
Progress (1): 2.2/2.7 MB
Progress (1): 2.2/2.7 MB
Progress (1): 2.2/2.7 MB
Progress (1): 2.2/2.7 MB
Progress (1): 2.2/2.7 MB
Progress (1): 2.2/2.7 MB
Progress (1): 2.2/2.7 MB
Progress (1): 2.2/2.7 MB
Progress (1): 2.2/2.7 MB
Progress (1): 2.2/2.7 MB
Progress (1): 2.2/2.7 MB
Progress (1): 2.2/2.7 MB
Progress (1): 2.2/2.7 MB
Progress (1): 2.2/2.7 MB
Progress (1): 2.2/2.7 MB
Progress (1): 2.2/2.7 MB
Progress (1): 2.3/2.7 MB
Progress (1): 2.3/2.7 MB
Progress (1): 2.3/2.7 MB
Progress (1): 2.3/2.7 MB
Progress (1): 2.3/2.7 MB
Progress (1): 2.3/2.7 MB
Progress (1): 2.3/2.7 MB
Progress (1): 2.3/2.7 MB
Progress (1): 2.3/2.7 MB
Progress (1): 2.3/2.7 MB
Progress (1): 2.3/2.7 MB
Progress (1): 2.3/2.7 MB
Progress (1): 2.3/2.7 MB
Progress (1): 2.3/2.7 MB
Progress (1): 2.3/2.7 MB
Progress (1): 2.3/2.7 MB
Progress (1): 2.3/2.7 MB
Progress (1): 2.3/2.7 MB
Progress (1): 2.3/2.7 MB
Progress (1): 2.3/2.7 MB
Progress (1): 2.3/2.7 MB
Progress (1): 2.3/2.7 MB
Progress (1): 2.3/2.7 MB
Progress (1): 2.3/2.7 MB
Progress (1): 2.3/2.7 MB
Progress (1): 2.4/2.7 MB
Progress (1): 2.4/2.7 MB
Progress (1): 2.4/2.7 MB
Progress (1): 2.4/2.7 MB
Progress (1): 2.4/2.7 MB
Progress (1): 2.4/2.7 MB
Progress (1): 2.4/2.7 MB
Progress (1): 2.4/2.7 MB
Progress (1): 2.4/2.7 MB
Progress (1): 2.4/2.7 MB
Progress (1): 2.4/2.7 MB
Progress (1): 2.4/2.7 MB
Progress (1): 2.4/2.7 MB
Progress (1): 2.4/2.7 MB
Progress (1): 2.4/2.7 MB
Progress (1): 2.4/2.7 MB
Progress (1): 2.4/2.7 MB
Progress (1): 2.4/2.7 MB
Progress (1): 2.4/2.7 MB
Progress (1): 2.4/2.7 MB
Progress (1): 2.4/2.7 MB
Progress (1): 2.4/2.7 MB
Progress (1): 2.4/2.7 MB
Progress (1): 2.4/2.7 MB
Progress (1): 2.4/2.7 MB
Progress (1): 2.5/2.7 MB
Progress (1): 2.5/2.7 MB
Progress (1): 2.5/2.7 MB
Progress (1): 2.5/2.7 MB
Progress (1): 2.5/2.7 MB
Progress (1): 2.5/2.7 MB
Progress (1): 2.5/2.7 MB
Progress (1): 2.5/2.7 MB
Progress (1): 2.5/2.7 MB
Progress (1): 2.5/2.7 MB
Progress (1): 2.5/2.7 MB
Progress (1): 2.5/2.7 MB
Progress (1): 2.5/2.7 MB
Progress (1): 2.5/2.7 MB
Progress (1): 2.5/2.7 MB
Progress (1): 2.5/2.7 MB
Progress (1): 2.5/2.7 MB
Progress (1): 2.5/2.7 MB
Progress (1): 2.5/2.7 MB
Progress (1): 2.5/2.7 MB
Progress (1): 2.5/2.7 MB
Progress (1): 2.5/2.7 MB
Progress (1): 2.5/2.7 MB
Progress (1): 2.5/2.7 MB
Progress (1): 2.5/2.7 MB
Progress (1): 2.6/2.7 MB
Progress (1): 2.6/2.7 MB
Progress (1): 2.6/2.7 MB
Progress (1): 2.6/2.7 MB
Progress (1): 2.6/2.7 MB
Progress (1): 2.6/2.7 MB
Progress (1): 2.6/2.7 MB
Progress (1): 2.6/2.7 MB
Progress (1): 2.6/2.7 MB
Progress (1): 2.6/2.7 MB
Progress (1): 2.6/2.7 MB
Progress (1): 2.6/2.7 MB
Progress (1): 2.6/2.7 MB
Progress (1): 2.6/2.7 MB
Progress (1): 2.6/2.7 MB
Progress (1): 2.6/2.7 MB
Progress (1): 2.6/2.7 MB
Progress (1): 2.6/2.7 MB
Progress (1): 2.6/2.7 MB
Progress (1): 2.6/2.7 MB
Progress (1): 2.6/2.7 MB
Progress (1): 2.6/2.7 MB
Progress (1): 2.6/2.7 MB
Progress (1): 2.6/2.7 MB
Progress (1): 2.6/2.7 MB
Progress (1): 2.7/2.7 MB
Progress (1): 2.7/2.7 MB
Progress (1): 2.7/2.7 MB
Progress (1): 2.7/2.7 MB
Progress (1): 2.7/2.7 MB
Progress (1): 2.7/2.7 MB
Progress (1): 2.7/2.7 MB
Progress (1): 2.7/2.7 MB
Progress (1): 2.7/2.7 MB
Progress (1): 2.7/2.7 MB
Progress (1): 2.7/2.7 MB
Progress (1): 2.7/2.7 MB
Progress (1): 2.7/2.7 MB
Progress (1): 2.7/2.7 MB
Progress (1): 2.7/2.7 MB
Progress (1): 2.7/2.7 MB
Progress (1): 2.7/2.7 MB
Progress (1): 2.7/2.7 MB
Progress (1): 2.7/2.7 MB
Progress (1): 2.7/2.7 MB
Progress (1): 2.7/2.7 MB
Progress (1): 2.7/2.7 MB
Progress (1): 2.7/2.7 MB
Progress (1): 2.7/2.7 MB
Progress (1): 2.7 MB    
                    
Downloaded from eclipse.maven.central.mirror: https://repo.eclipse.org/content/repositories/maven_central/com/google/guava/guava/27.0.1-jre/guava-27.0.1-jre.jar (2.7 MB at 1.6 MB/s)
[INFO] 
[INFO] --- maven-clean-plugin:3.1.0:clean (default-clean) @ cbi-common ---
[INFO] Deleting /jobs/genie.cbi/signing-packaging-common-gerrit/workspace/org.eclipse.cbi/common/target
[INFO] 
[INFO] --- maven-enforcer-plugin:3.0.0-M2:enforce (enforce-maven) @ cbi-common ---
[INFO] 
[INFO] --- maven-checkstyle-plugin:3.0.0:check (default) @ cbi-common ---
[INFO] Starting audit...
Audit done.
[INFO] 
[INFO] --- maven-resources-plugin:3.1.0:resources (default-resources) @ cbi-common ---
[INFO] Using 'UTF-8' encoding to copy filtered resources.
[INFO] Copying 4 resources
[INFO] 
[INFO] --- maven-compiler-plugin:3.8.0:compile (default-compile) @ cbi-common ---
[INFO] Compiling 10 source files to /jobs/genie.cbi/signing-packaging-common-gerrit/workspace/org.eclipse.cbi/common/target/classes
[INFO] 
[INFO] --- maven-resources-plugin:3.1.0:testResources (default-testResources) @ cbi-common ---
[INFO] Using 'UTF-8' encoding to copy filtered resources.
[INFO] Copying 3 resources
[INFO] 
[INFO] --- maven-compiler-plugin:3.8.0:testCompile (default-testCompile) @ cbi-common ---
[INFO] Compiling 4 source files to /jobs/genie.cbi/signing-packaging-common-gerrit/workspace/org.eclipse.cbi/common/target/test-classes
[INFO] 
[INFO] --- maven-surefire-plugin:2.22.0:test (default-test) @ cbi-common ---
[INFO] 
[INFO] -------------------------------------------------------
[INFO]  T E S T S
[INFO] -------------------------------------------------------
[INFO] Running org.eclipse.cbi.common.util.ZipsTest
[INFO] Tests run: 17, Failures: 0, Errors: 0, Skipped: 0, Time elapsed: 0.643 s - in org.eclipse.cbi.common.util.ZipsTest
[INFO] Running org.eclipse.cbi.common.util.MorePosixFilePermissionsTest
[INFO] Tests run: 8, Failures: 0, Errors: 0, Skipped: 0, Time elapsed: 0.001 s - in org.eclipse.cbi.common.util.MorePosixFilePermissionsTest
[INFO] Running org.eclipse.cbi.common.util.PathsTest
[INFO] Tests run: 10, Failures: 0, Errors: 0, Skipped: 0, Time elapsed: 0.001 s - in org.eclipse.cbi.common.util.PathsTest
[INFO] 
[INFO] Results:
[INFO] 
[INFO] Tests run: 35, Failures: 0, Errors: 0, Skipped: 0
[INFO] 
[INFO] 
[INFO] --- maven-jar-plugin:3.1.1:jar (default-jar) @ cbi-common ---
[INFO] Building jar: /jobs/genie.cbi/signing-packaging-common-gerrit/workspace/org.eclipse.cbi/common/target/cbi-common-1.2.3-SNAPSHOT.jar
[INFO] 
[INFO] --- maven-jar-plugin:3.1.1:test-jar (default) @ cbi-common ---
[INFO] Building jar: /jobs/genie.cbi/signing-packaging-common-gerrit/workspace/org.eclipse.cbi/common/target/cbi-common-1.2.3-SNAPSHOT-tests.jar
[INFO] 
[INFO] >>> spotbugs-maven-plugin:3.1.10:check (default) > :spotbugs @ cbi-common >>>
[INFO] 
[INFO] --- spotbugs-maven-plugin:3.1.10:spotbugs (spotbugs) @ cbi-common ---
[INFO] Fork Value is true
     [java] Picked up JAVA_TOOL_OPTIONS: -Xmx2G -Djava.io.tmpdir=/tmp/genie.cbi
     [java] Warnings generated: 2
[INFO] Done SpotBugs Analysis....
[INFO] 
[INFO] <<< spotbugs-maven-plugin:3.1.10:check (default) < :spotbugs @ cbi-common <<<
[INFO] 
[INFO] 
[INFO] --- spotbugs-maven-plugin:3.1.10:check (default) @ cbi-common ---
[INFO] BugInstance size is 2
[INFO] Error size is 0
[INFO] Total bugs: 2
[ERROR] d must be non-null but is marked as nullable [org.eclipse.cbi.common.security.MessageDigestAlgorithm$1] At MessageDigestAlgorithm.java:[line 75] NP_PARAMETER_MUST_BE_NONNULL_BUT_MARKED_AS_NULLABLE
[ERROR] d must be non-null but is marked as nullable [org.eclipse.cbi.common.security.SignatureAlgorithm$1] At SignatureAlgorithm.java:[line 79] NP_PARAMETER_MUST_BE_NONNULL_BUT_MARKED_AS_NULLABLE
[INFO] 


To see bug detail using the Spotbugs GUI, use the following command "mvn spotbugs:gui"



[INFO] ------------------------------------------------------------------------
[INFO] BUILD FAILURE
[INFO] ------------------------------------------------------------------------
[INFO] Total time: 18.086 s
[INFO] Finished at: 2019-01-22T10:29:16-05:00
[INFO] ------------------------------------------------------------------------
[ERROR] Failed to execute goal com.github.spotbugs:spotbugs-maven-plugin:3.1.10:check (default) on project cbi-common: failed with 2 bugs and 0 errors  -> [Help 1]
[ERROR] 
[ERROR] To see the full stack trace of the errors, re-run Maven with the -e switch.
[ERROR] Re-run Maven using the -X switch to enable full debug logging.
[ERROR] 
[ERROR] For more information about the errors and possible solutions, please read the following articles:
[ERROR] [Help 1] http://cwiki.apache.org/confluence/display/MAVEN/MojoExecutionException
Build step 'Invoke top-level Maven targets' marked build as failure
[FINDBUGS] Skipping publisher since build result is FAILURE
Archiving artifacts
Recording test results
Started calculate disk usage of build
Finished Calculation of disk usage of build in 0 seconds
Started calculate disk usage of workspace
Finished Calculation of disk usage of workspace in 0 seconds
Finished: FAILURE