FailedConsole Output

Retriggered by user frederic.gurr@eclipse-foundation.org for Gerrit: https://git.eclipse.org/r/146872
Running as SYSTEM
Agent default-agent-w2r9q is provisioned from template Kubernetes Pod Template
---
apiVersion: "v1"
kind: "Pod"
metadata:
  annotations: {}
  labels:
    jenkins: "slave"
  name: "default-agent-w2r9q"
spec:
  containers:
  - env:
    - name: "MAVEN_OPTS"
      value: "-Dorg.slf4j.simpleLogger.log.org.apache.maven.cli.transfer.Slf4jMavenTransferListener=warn"
    - name: "JENKINS_SECRET"
      value: "********"
    - name: "JENKINS_TUNNEL"
      value: "jenkins-discovery.cbi.svc.cluster.local:50000"
    - name: "JENKINS_AGENT_NAME"
      value: "default-agent-w2r9q"
    - name: "MAVEN_CONFIG"
      value: "-B -e"
    - name: "JENKINS_NAME"
      value: "default-agent-w2r9q"
    - name: "JENKINS_AGENT_WORKDIR"
      value: "/home/jenkins/agent"
    - name: "JENKINS_URL"
      value: "http://jenkins-ui.cbi.svc.cluster.local/cbi/"
    - name: "HOME"
      value: "/home/jenkins"
    image: "eclipsecbijenkins/jenkins-agent:3.35@sha256:5d06ebec6e9dffc44fb41009a51d085a83944a23f651416531b960143d186340"
    imagePullPolicy: "IfNotPresent"
    name: "jnlp"
    resources:
      limits:
        memory: "4096Mi"
        cpu: "2000m"
      requests:
        memory: "4096Mi"
        cpu: "1000m"
    securityContext:
      privileged: false
    tty: true
    volumeMounts:
    - mountPath: "/home/jenkins/.m2/toolchains.xml"
      name: "toolchains-xml"
      readOnly: true
      subPath: "toolchains.xml"
    - mountPath: "/opt/tools"
      name: "volume-0"
      readOnly: false
    - mountPath: "/home/jenkins"
      name: "volume-2"
      readOnly: false
    - mountPath: "/home/jenkins/.m2/repository"
      name: "volume-3"
      readOnly: false
    - mountPath: "/home/jenkins/.m2/settings-security.xml"
      name: "settings-security-xml"
      readOnly: true
      subPath: "settings-security.xml"
    - mountPath: "/home/jenkins/.m2/settings.xml"
      name: "settings-xml"
      readOnly: true
      subPath: "settings.xml"
    - mountPath: "/home/jenkins/.ssh"
      name: "volume-1"
      readOnly: false
    - mountPath: "/home/jenkins/agent"
      name: "workspace-volume"
      readOnly: false
    workingDir: "/home/jenkins/agent"
  nodeSelector: {}
  restartPolicy: "Never"
  volumes:
  - name: "settings-security-xml"
    secret:
      items:
      - key: "settings-security.xml"
        path: "settings-security.xml"
      secretName: "m2-secret-dir"
  - name: "volume-0"
    persistentVolumeClaim:
      claimName: "tools-claim-jiro-cbi"
      readOnly: true
  - configMap:
      items:
      - key: "toolchains.xml"
        path: "toolchains.xml"
      name: "m2-dir"
    name: "toolchains-xml"
  - emptyDir:
      medium: ""
    name: "volume-2"
  - configMap:
      name: "known-hosts"
    name: "volume-1"
  - name: "settings-xml"
    secret:
      items:
      - key: "settings.xml"
        path: "settings.xml"
      secretName: "m2-secret-dir"
  - emptyDir:
      medium: ""
    name: "workspace-volume"
  - emptyDir:
      medium: ""
    name: "volume-3"

Building remotely on default-agent-w2r9q in workspace /home/jenkins/agent/workspace/signing-packaging-common-gerrit
No credentials specified
Cloning the remote Git repository
Cloning repository git://git.eclipse.org/gitroot/cbi/org.eclipse.cbi.git
 > git init /home/jenkins/agent/workspace/signing-packaging-common-gerrit/org.eclipse.cbi # timeout=10
Fetching upstream changes from git://git.eclipse.org/gitroot/cbi/org.eclipse.cbi.git
 > git --version # timeout=10
 > git fetch --tags --force --progress -- git://git.eclipse.org/gitroot/cbi/org.eclipse.cbi.git +refs/heads/*:refs/remotes/origin/*
 > git config remote.origin.url git://git.eclipse.org/gitroot/cbi/org.eclipse.cbi.git # timeout=10
 > git config --add remote.origin.fetch +refs/heads/*:refs/remotes/origin/* # timeout=10
 > git config remote.origin.url git://git.eclipse.org/gitroot/cbi/org.eclipse.cbi.git # timeout=10
Fetching upstream changes from git://git.eclipse.org/gitroot/cbi/org.eclipse.cbi.git
 > git fetch --tags --force --progress -- git://git.eclipse.org/gitroot/cbi/org.eclipse.cbi.git refs/changes/72/146872/1
 > git rev-parse b0db152aaeccc4f874315bb8269f38a4a5d922e2^{commit} # timeout=10
Checking out Revision b0db152aaeccc4f874315bb8269f38a4a5d922e2 (refs/changes/72/146872/1)
 > git config core.sparsecheckout # timeout=10
 > git checkout -f b0db152aaeccc4f874315bb8269f38a4a5d922e2
Commit message: "Fixed checkstyle deps: 1.0.2 is not released yet"
 > git rev-parse FETCH_HEAD^{commit} # timeout=10
 > git rev-list --no-walk 8d344d494874db659ba6476f1d092befa61ebaf8 # timeout=10
[signing-packaging-common-gerrit] $ /opt/tools/apache-maven/latest/bin/mvn -f org.eclipse.cbi/common/pom.xml -Dmaven.repo.local=/home/jenkins/agent/workspace/signing-packaging-common-gerrit/.repository clean install -B
Picked up JAVA_TOOL_OPTIONS: -XX:+IgnoreUnrecognizedVMOptions -XX:+UseContainerSupport -XX:+UnlockExperimentalVMOptions -XX:+UseCGroupMemoryLimitForHeap
Picked up _JAVA_OPTIONS: -XX:MaxRAMPercentage=64.0
[INFO] Scanning for projects...
[INFO] 
[INFO] ---------------------< org.eclipse.cbi:cbi-common >---------------------
[INFO] Building cbi-common 1.2.3-SNAPSHOT
[INFO] --------------------------------[ jar ]---------------------------------
[WARNING] The POM for org.eclipse.cbi:checkstyle:jar:1.0.2-SNAPSHOT is missing, no dependency information available
[INFO] ------------------------------------------------------------------------
[INFO] BUILD FAILURE
[INFO] ------------------------------------------------------------------------
[INFO] Total time:  7.382 s
[INFO] Finished at: 2020-02-27T10:17:19Z
[INFO] ------------------------------------------------------------------------
[ERROR] Failed to execute goal on project cbi-common: Could not resolve dependencies for project org.eclipse.cbi:cbi-common:jar:1.2.3-SNAPSHOT: Could not find artifact org.eclipse.cbi:checkstyle:jar:1.0.2-SNAPSHOT in repo.eclipse.org (https://repo.eclipse.org/content/repositories/cbi) -> [Help 1]
[ERROR] 
[ERROR] To see the full stack trace of the errors, re-run Maven with the -e switch.
[ERROR] Re-run Maven using the -X switch to enable full debug logging.
[ERROR] 
[ERROR] For more information about the errors and possible solutions, please read the following articles:
[ERROR] [Help 1] http://cwiki.apache.org/confluence/display/MAVEN/DependencyResolutionException
Build step 'Invoke top-level Maven targets' marked build as failure
[FINDBUGS] Skipping publisher since build result is FAILURE
Archiving artifacts
Recording test results
ERROR: Step ‘Publish JUnit test result report’ failed: No test report files were found. Configuration error?
Started calculate disk usage of build
Finished Calculation of disk usage of build in 0 seconds
Started calculate disk usage of workspace
Finished Calculation of disk usage of workspace in 0 seconds
Finished: FAILURE