FailedConsole Output

Started by user frederic.gurr@eclipse-foundation.org
Building on master in workspace /home/hudson/genie.cbi/.jenkins/jobs/hipp2jipp_sonar-test/workspace
 > /usr/local/bin/git rev-parse --is-inside-work-tree # timeout=10
Fetching changes from the remote Git repository
 > /usr/local/bin/git config remote.origin.url https://github.com/eclipse/hipp2jipp # timeout=10
Fetching upstream changes from https://github.com/eclipse/hipp2jipp
 > /usr/local/bin/git --version # timeout=10
 > /usr/local/bin/git fetch --tags --progress https://github.com/eclipse/hipp2jipp +refs/heads/*:refs/remotes/origin/*
 > /usr/local/bin/git rev-parse refs/remotes/origin/master^{commit} # timeout=10
 > /usr/local/bin/git rev-parse refs/remotes/origin/origin/master^{commit} # timeout=10
Checking out Revision 53aec1c2fe4a71024e124b30fb0d26f68d8a6ffb (refs/remotes/origin/master)
Commit message: "Add Jenkinsfile"
 > /usr/local/bin/git config core.sparsecheckout # timeout=10
 > /usr/local/bin/git checkout -f 53aec1c2fe4a71024e124b30fb0d26f68d8a6ffb
 > /usr/local/bin/git rev-list 53aec1c2fe4a71024e124b30fb0d26f68d8a6ffb # timeout=10
Injecting SonarQube environment variables using the configuration: Eclipse Sonar
[workspace] $ /shared/common/apache-maven-latest/bin/mvn clean verify org.sonarsource.scanner.maven:sonar-maven-plugin:3.0.1:sonar -Dsonar.host.url=http://sonar.eclipse.org -Dsonar.jdbc.url=jdbc:mysql://dbmaster:3306/sonar?autoReconnect=true&useUnicode=true&characterEncoding=utf8 -Dsonar.jdbc.username=sonar_rw -Dsonar.jdbc.password=******
[INFO] Scanning for projects...
Downloading: https://repo.maven.apache.org/maven2/org/sonarsource/scanner/maven/sonar-maven-plugin/3.0.1/sonar-maven-plugin-3.0.1.pom
3/9 KB   
5/9 KB   
8/9 KB   
9/9 KB   
         
Downloaded: https://repo.maven.apache.org/maven2/org/sonarsource/scanner/maven/sonar-maven-plugin/3.0.1/sonar-maven-plugin-3.0.1.pom (9 KB at 35.1 KB/sec)
Downloading: https://repo.maven.apache.org/maven2/org/sonarsource/parent/parent/26/parent-26.pom
3/26 KB   
5/26 KB   
8/26 KB   
11/26 KB   
13/26 KB   
16/26 KB   
19/26 KB   
21/26 KB   
24/26 KB   
26/26 KB   
           
Downloaded: https://repo.maven.apache.org/maven2/org/sonarsource/parent/parent/26/parent-26.pom (26 KB at 341.2 KB/sec)
Downloading: https://repo.maven.apache.org/maven2/org/sonarsource/scanner/maven/sonar-maven-plugin/3.0.1/sonar-maven-plugin-3.0.1.jar
3/49 KB    
5/49 KB   
8/49 KB   
11/49 KB   
13/49 KB   
16/49 KB   
19/49 KB   
21/49 KB   
24/49 KB   
27/49 KB   
29/49 KB   
32/49 KB   
36/49 KB   
40/49 KB   
44/49 KB   
48/49 KB   
49/49 KB   
           
Downloaded: https://repo.maven.apache.org/maven2/org/sonarsource/scanner/maven/sonar-maven-plugin/3.0.1/sonar-maven-plugin-3.0.1.jar (49 KB at 664.4 KB/sec)
[INFO]                                                                         
[INFO] ------------------------------------------------------------------------
[INFO] Building hipp2jipp 0.0.2-SNAPSHOT
[INFO] ------------------------------------------------------------------------
[INFO] 
[INFO] --- maven-clean-plugin:2.5:clean (default-clean) @ hipp2jipp ---
[INFO] Deleting /jobs/genie.cbi/hipp2jipp_sonar-test/workspace/target
[INFO] 
[INFO] --- maven-resources-plugin:2.6:resources (default-resources) @ hipp2jipp ---
[INFO] Using 'UTF-8' encoding to copy filtered resources.
[INFO] Copying 4 resources
[INFO] 
[INFO] --- maven-compiler-plugin:2.3.2:compile (default-compile) @ hipp2jipp ---
[INFO] Compiling 2 source files to /jobs/genie.cbi/hipp2jipp_sonar-test/workspace/target/classes
[INFO] 
[INFO] --- maven-resources-plugin:2.6:testResources (default-testResources) @ hipp2jipp ---
[INFO] Using 'UTF-8' encoding to copy filtered resources.
[INFO] skip non existing resourceDirectory /jobs/genie.cbi/hipp2jipp_sonar-test/workspace/src/test/resources
[INFO] 
[INFO] --- maven-compiler-plugin:2.3.2:testCompile (default-testCompile) @ hipp2jipp ---
[INFO] Compiling 1 source file to /jobs/genie.cbi/hipp2jipp_sonar-test/workspace/target/test-classes
[INFO] 
[INFO] --- maven-surefire-plugin:2.12.4:test (default-test) @ hipp2jipp ---
[INFO] Surefire report directory: /jobs/genie.cbi/hipp2jipp_sonar-test/workspace/target/surefire-reports

-------------------------------------------------------
 T E S T S
-------------------------------------------------------
Running org.eclipse.cbi.hipp2jipp.XslTransformerTest
Done. File written: /jobs/genie.cbi/hipp2jipp_sonar-test/workspace/xml/original/timestamp/2016-11-30_14-56-00/build.transformed.xml
Done. File written: /jobs/genie.cbi/hipp2jipp_sonar-test/workspace/xml/transformed/config.job.hudson-package-drone.transformed.xml
Done. File written: /jobs/genie.cbi/hipp2jipp_sonar-test/workspace/xml/transformed/build.hudson-kapua.transformed.xml
Done. File written: /jobs/genie.cbi/hipp2jipp_sonar-test/workspace/xml/transformed/build.hudson-query.transformed.xml
Done. File written: /jobs/genie.cbi/hipp2jipp_sonar-test/workspace/xml/transformed/config.job.hudson-cbi1.transformed.xml
Done. File written: /jobs/genie.cbi/hipp2jipp_sonar-test/workspace/xml/transformed/config.job.hudson-cbi2.transformed.xml
Done. File written: /jobs/genie.cbi/hipp2jipp_sonar-test/workspace/xml/transformed/config.job.hudson-cbi3.transformed.xml
Done. File written: /jobs/genie.cbi/hipp2jipp_sonar-test/workspace/xml/transformed/config.job.hudson-cbi4.transformed.xml
Done. File written: /jobs/genie.cbi/hipp2jipp_sonar-test/workspace/xml/transformed/config.job.hudson-app4mc.transformed.xml
Done. File written: /jobs/genie.cbi/hipp2jipp_sonar-test/workspace/xml/transformed/config.job.hudson-omr.transformed.xml
Done. File written: /jobs/genie.cbi/hipp2jipp_sonar-test/workspace/xml/transformed/config.job.hudson-transaction.transformed.xml
Done. File written: /jobs/genie.cbi/hipp2jipp_sonar-test/workspace/xml/transformed/config.job.hudson-jgit1.transformed.xml
Done. File written: /jobs/genie.cbi/hipp2jipp_sonar-test/workspace/xml/transformed/config.job.hudson-jgit2.transformed.xml
Done. File written: /jobs/genie.cbi/hipp2jipp_sonar-test/workspace/xml/transformed/config.job.hudson-jgit3.transformed.xml
Done. File written: /jobs/genie.cbi/hipp2jipp_sonar-test/workspace/xml/transformed/config.job.hudson-kapua.transformed.xml
Done. File written: /jobs/genie.cbi/hipp2jipp_sonar-test/workspace/xml/transformed/config.job.hudson-kura1.transformed.xml
Done. File written: /jobs/genie.cbi/hipp2jipp_sonar-test/workspace/xml/transformed/config.job.hudson-kura2.transformed.xml
Done. File written: /jobs/genie.cbi/hipp2jipp_sonar-test/workspace/xml/transformed/config.job.hudson-query.transformed.xml
Done. File written: /jobs/genie.cbi/hipp2jipp_sonar-test/workspace/xml/transformed/config.job.hudson-simrel1.transformed.xml
Done. File written: /jobs/genie.cbi/hipp2jipp_sonar-test/workspace/xml/transformed/config.job.hudson-simrel2.transformed.xml
 2017-02-16_12-35-13 -> epoch date: 1487266513000Tests run: 23, Failures: 0, Errors: 0, Skipped: 0, Time elapsed: 1.587 sec

Results :

Tests run: 23, Failures: 0, Errors: 0, Skipped: 0

[INFO] 
[INFO] --- maven-jar-plugin:2.4:jar (default-jar) @ hipp2jipp ---
[INFO] Building jar: /jobs/genie.cbi/hipp2jipp_sonar-test/workspace/target/hipp2jipp-0.0.2-SNAPSHOT.jar
[INFO]                                                                         
[INFO] ------------------------------------------------------------------------
[INFO] Building hipp2jipp 0.0.2-SNAPSHOT
[INFO] ------------------------------------------------------------------------
[INFO] 
[INFO] --- sonar-maven-plugin:3.0.1:sonar (default-cli) @ hipp2jipp ---
Downloading: https://repo.maven.apache.org/maven2/org/sonarsource/sonar-runner/sonar-runner-api/2.5.1/sonar-runner-api-2.5.1.pom
3/8 KB     
5/8 KB   
8/8 KB   
8/8 KB   
         
Downloaded: https://repo.maven.apache.org/maven2/org/sonarsource/sonar-runner/sonar-runner-api/2.5.1/sonar-runner-api-2.5.1.pom (8 KB at 136.2 KB/sec)
Downloading: https://repo.maven.apache.org/maven2/org/sonarsource/sonar-runner/sonar-runner/2.5.1/sonar-runner-2.5.1.pom
3/5 KB   
5/5 KB   
         
Downloaded: https://repo.maven.apache.org/maven2/org/sonarsource/sonar-runner/sonar-runner/2.5.1/sonar-runner-2.5.1.pom (5 KB at 83.0 KB/sec)
Downloading: https://repo.maven.apache.org/maven2/org/sonarsource/sonar-runner/sonar-runner-api/2.5.1/sonar-runner-api-2.5.1.jar
3/554 KB   
5/554 KB   
8/554 KB   
11/554 KB   
13/554 KB   
16/554 KB   
19/554 KB   
21/554 KB   
24/554 KB   
27/554 KB   
29/554 KB   
32/554 KB   
36/554 KB   
40/554 KB   
44/554 KB   
48/554 KB   
52/554 KB   
56/554 KB   
60/554 KB   
64/554 KB   
68/554 KB   
72/554 KB   
76/554 KB   
80/554 KB   
84/554 KB   
88/554 KB   
92/554 KB   
96/554 KB   
100/554 KB   
104/554 KB   
108/554 KB   
112/554 KB   
116/554 KB   
120/554 KB   
124/554 KB   
128/554 KB   
132/554 KB   
136/554 KB   
140/554 KB   
144/554 KB   
148/554 KB   
152/554 KB   
156/554 KB   
160/554 KB   
164/554 KB   
168/554 KB   
172/554 KB   
176/554 KB   
180/554 KB   
184/554 KB   
188/554 KB   
192/554 KB   
196/554 KB   
200/554 KB   
204/554 KB   
208/554 KB   
212/554 KB   
216/554 KB   
220/554 KB   
224/554 KB   
228/554 KB   
232/554 KB   
236/554 KB   
240/554 KB   
244/554 KB   
248/554 KB   
252/554 KB   
256/554 KB   
260/554 KB   
264/554 KB   
268/554 KB   
272/554 KB   
276/554 KB   
280/554 KB   
284/554 KB   
288/554 KB   
292/554 KB   
296/554 KB   
300/554 KB   
304/554 KB   
308/554 KB   
312/554 KB   
316/554 KB   
320/554 KB   
324/554 KB   
328/554 KB   
332/554 KB   
336/554 KB   
340/554 KB   
344/554 KB   
348/554 KB   
352/554 KB   
356/554 KB   
360/554 KB   
364/554 KB   
368/554 KB   
372/554 KB   
376/554 KB   
380/554 KB   
384/554 KB   
388/554 KB   
392/554 KB   
396/554 KB   
400/554 KB   
404/554 KB   
408/554 KB   
412/554 KB   
416/554 KB   
420/554 KB   
424/554 KB   
428/554 KB   
428/554 KB   
432/554 KB   
436/554 KB   
440/554 KB   
444/554 KB   
448/554 KB   
452/554 KB   
456/554 KB   
460/554 KB   
464/554 KB   
468/554 KB   
472/554 KB   
476/554 KB   
480/554 KB   
484/554 KB   
488/554 KB   
492/554 KB   
496/554 KB   
500/554 KB   
504/554 KB   
508/554 KB   
512/554 KB   
516/554 KB   
520/554 KB   
524/554 KB   
528/554 KB   
532/554 KB   
536/554 KB   
540/554 KB   
544/554 KB   
548/554 KB   
552/554 KB   
554/554 KB   
             
Downloaded: https://repo.maven.apache.org/maven2/org/sonarsource/sonar-runner/sonar-runner-api/2.5.1/sonar-runner-api-2.5.1.jar (554 KB at 2783.7 KB/sec)
[INFO] User cache: /opt/public/hipp/homes/genie.cbi/.sonar/cache
[INFO] SonarQube version: 4.5.7
[INFO] Default locale: "en_US", source code encoding: "UTF-8"
[INFO] [13:25:09.095] Load global referentials...
[INFO] [13:25:09.172] Load global referentials done: 79 ms
[INFO] ------------------------------------------------------------------------
[INFO] BUILD FAILURE
[INFO] ------------------------------------------------------------------------
[INFO] Total time: 7.186 s
[INFO] Finished at: 2017-09-08T13:25:09-04:00
[INFO] Final Memory: 44M/2245M
[INFO] ------------------------------------------------------------------------
[ERROR] Failed to execute goal org.sonarsource.scanner.maven:sonar-maven-plugin:3.0.1:sonar (default-cli) on project hipp2jipp: java.lang.IllegalStateException: Expected BEGIN_OBJECT but was STRING at line 1 column 1 -> [Help 1]
[ERROR] 
[ERROR] To see the full stack trace of the errors, re-run Maven with the -e switch.
[ERROR] Re-run Maven using the -X switch to enable full debug logging.
[ERROR] 
[ERROR] For more information about the errors and possible solutions, please read the following articles:
[ERROR] [Help 1] http://cwiki.apache.org/confluence/display/MAVEN/MojoExecutionException
Build step 'Invoke top-level Maven targets' marked build as failure
Started calculate disk usage of build
Finished Calculation of disk usage of build in 0 seconds
Started calculate disk usage of workspace
Finished Calculation of disk usage of workspace in 0 seconds
Finished: FAILURE