FailedConsole Output

Started by user frederic.gurr@eclipse-foundation.org
Building on master in workspace /home/hudson/genie.cbi/.jenkins/jobs/hipp2jipp_sonar-test/workspace
 > /usr/local/bin/git rev-parse --is-inside-work-tree # timeout=10
Fetching changes from the remote Git repository
 > /usr/local/bin/git config remote.origin.url https://github.com/eclipse/hipp2jipp # timeout=10
Fetching upstream changes from https://github.com/eclipse/hipp2jipp
 > /usr/local/bin/git --version # timeout=10
 > /usr/local/bin/git fetch --tags --progress https://github.com/eclipse/hipp2jipp +refs/heads/*:refs/remotes/origin/*
 > /usr/local/bin/git rev-parse refs/remotes/origin/master^{commit} # timeout=10
 > /usr/local/bin/git rev-parse refs/remotes/origin/origin/master^{commit} # timeout=10
Checking out Revision 53aec1c2fe4a71024e124b30fb0d26f68d8a6ffb (refs/remotes/origin/master)
Commit message: "Add Jenkinsfile"
 > /usr/local/bin/git config core.sparsecheckout # timeout=10
 > /usr/local/bin/git checkout -f 53aec1c2fe4a71024e124b30fb0d26f68d8a6ffb
 > /usr/local/bin/git rev-list 53aec1c2fe4a71024e124b30fb0d26f68d8a6ffb # timeout=10
Injecting SonarQube environment variables using the configuration: Eclipse Sonar
[workspace] $ /shared/common/apache-maven-latest/bin/mvn clean verify org.sonarsource.scanner.maven:sonar-maven-plugin:3.1:sonar -Dsonar.host.url=http://sonar.eclipse.org -Dsonar.jdbc.url=jdbc:mysql://dbmaster:3306/sonar?autoReconnect=true&useUnicode=true&characterEncoding=utf8 -Dsonar.jdbc.username=sonar_rw -Dsonar.jdbc.password=******
[INFO] Scanning for projects...
Downloading: https://repo.maven.apache.org/maven2/org/sonarsource/scanner/maven/sonar-maven-plugin/3.1/sonar-maven-plugin-3.1.pom
3/9 KB   
5/9 KB   
8/9 KB   
9/9 KB   
         
Downloaded: https://repo.maven.apache.org/maven2/org/sonarsource/scanner/maven/sonar-maven-plugin/3.1/sonar-maven-plugin-3.1.pom (9 KB at 31.0 KB/sec)
Downloading: https://repo.maven.apache.org/maven2/org/sonarsource/scanner/maven/sonar-maven-plugin/3.1/sonar-maven-plugin-3.1.jar
3/51 KB   
5/51 KB   
8/51 KB   
11/51 KB   
13/51 KB   
16/51 KB   
19/51 KB   
21/51 KB   
24/51 KB   
27/51 KB   
29/51 KB   
32/51 KB   
36/51 KB   
40/51 KB   
44/51 KB   
48/51 KB   
51/51 KB   
           
Downloaded: https://repo.maven.apache.org/maven2/org/sonarsource/scanner/maven/sonar-maven-plugin/3.1/sonar-maven-plugin-3.1.jar (51 KB at 360.1 KB/sec)
[INFO]                                                                         
[INFO] ------------------------------------------------------------------------
[INFO] Building hipp2jipp 0.0.2-SNAPSHOT
[INFO] ------------------------------------------------------------------------
[INFO] 
[INFO] --- maven-clean-plugin:2.5:clean (default-clean) @ hipp2jipp ---
[INFO] Deleting /jobs/genie.cbi/hipp2jipp_sonar-test/workspace/target
[INFO] 
[INFO] --- maven-resources-plugin:2.6:resources (default-resources) @ hipp2jipp ---
[INFO] Using 'UTF-8' encoding to copy filtered resources.
[INFO] Copying 4 resources
[INFO] 
[INFO] --- maven-compiler-plugin:2.3.2:compile (default-compile) @ hipp2jipp ---
[INFO] Compiling 2 source files to /jobs/genie.cbi/hipp2jipp_sonar-test/workspace/target/classes
[INFO] 
[INFO] --- maven-resources-plugin:2.6:testResources (default-testResources) @ hipp2jipp ---
[INFO] Using 'UTF-8' encoding to copy filtered resources.
[INFO] skip non existing resourceDirectory /jobs/genie.cbi/hipp2jipp_sonar-test/workspace/src/test/resources
[INFO] 
[INFO] --- maven-compiler-plugin:2.3.2:testCompile (default-testCompile) @ hipp2jipp ---
[INFO] Compiling 1 source file to /jobs/genie.cbi/hipp2jipp_sonar-test/workspace/target/test-classes
[INFO] 
[INFO] --- maven-surefire-plugin:2.12.4:test (default-test) @ hipp2jipp ---
[INFO] Surefire report directory: /jobs/genie.cbi/hipp2jipp_sonar-test/workspace/target/surefire-reports

-------------------------------------------------------
 T E S T S
-------------------------------------------------------
Running org.eclipse.cbi.hipp2jipp.XslTransformerTest
Done. File written: /jobs/genie.cbi/hipp2jipp_sonar-test/workspace/xml/original/timestamp/2016-11-30_14-56-00/build.transformed.xml
Done. File written: /jobs/genie.cbi/hipp2jipp_sonar-test/workspace/xml/transformed/config.job.hudson-package-drone.transformed.xml
Done. File written: /jobs/genie.cbi/hipp2jipp_sonar-test/workspace/xml/transformed/build.hudson-kapua.transformed.xml
Done. File written: /jobs/genie.cbi/hipp2jipp_sonar-test/workspace/xml/transformed/build.hudson-query.transformed.xml
Done. File written: /jobs/genie.cbi/hipp2jipp_sonar-test/workspace/xml/transformed/config.job.hudson-cbi1.transformed.xml
Done. File written: /jobs/genie.cbi/hipp2jipp_sonar-test/workspace/xml/transformed/config.job.hudson-cbi2.transformed.xml
Done. File written: /jobs/genie.cbi/hipp2jipp_sonar-test/workspace/xml/transformed/config.job.hudson-cbi3.transformed.xml
Done. File written: /jobs/genie.cbi/hipp2jipp_sonar-test/workspace/xml/transformed/config.job.hudson-cbi4.transformed.xml
Done. File written: /jobs/genie.cbi/hipp2jipp_sonar-test/workspace/xml/transformed/config.job.hudson-app4mc.transformed.xml
Done. File written: /jobs/genie.cbi/hipp2jipp_sonar-test/workspace/xml/transformed/config.job.hudson-omr.transformed.xml
Done. File written: /jobs/genie.cbi/hipp2jipp_sonar-test/workspace/xml/transformed/config.job.hudson-transaction.transformed.xml
Done. File written: /jobs/genie.cbi/hipp2jipp_sonar-test/workspace/xml/transformed/config.job.hudson-jgit1.transformed.xml
Done. File written: /jobs/genie.cbi/hipp2jipp_sonar-test/workspace/xml/transformed/config.job.hudson-jgit2.transformed.xml
Done. File written: /jobs/genie.cbi/hipp2jipp_sonar-test/workspace/xml/transformed/config.job.hudson-jgit3.transformed.xml
Done. File written: /jobs/genie.cbi/hipp2jipp_sonar-test/workspace/xml/transformed/config.job.hudson-kapua.transformed.xml
Done. File written: /jobs/genie.cbi/hipp2jipp_sonar-test/workspace/xml/transformed/config.job.hudson-kura1.transformed.xml
Done. File written: /jobs/genie.cbi/hipp2jipp_sonar-test/workspace/xml/transformed/config.job.hudson-kura2.transformed.xml
Done. File written: /jobs/genie.cbi/hipp2jipp_sonar-test/workspace/xml/transformed/config.job.hudson-query.transformed.xml
Done. File written: /jobs/genie.cbi/hipp2jipp_sonar-test/workspace/xml/transformed/config.job.hudson-simrel1.transformed.xml
Done. File written: /jobs/genie.cbi/hipp2jipp_sonar-test/workspace/xml/transformed/config.job.hudson-simrel2.transformed.xml
 2017-02-16_12-35-13 -> epoch date: 1487266513000Tests run: 23, Failures: 0, Errors: 0, Skipped: 0, Time elapsed: 1.6 sec

Results :

Tests run: 23, Failures: 0, Errors: 0, Skipped: 0

[INFO] 
[INFO] --- maven-jar-plugin:2.4:jar (default-jar) @ hipp2jipp ---
[INFO] Building jar: /jobs/genie.cbi/hipp2jipp_sonar-test/workspace/target/hipp2jipp-0.0.2-SNAPSHOT.jar
[INFO]                                                                         
[INFO] ------------------------------------------------------------------------
[INFO] Building hipp2jipp 0.0.2-SNAPSHOT
[INFO] ------------------------------------------------------------------------
[INFO] 
[INFO] --- sonar-maven-plugin:3.1:sonar (default-cli) @ hipp2jipp ---
Downloading: https://repo.maven.apache.org/maven2/org/sonarsource/scanner/api/sonar-scanner-api/2.7-build645/sonar-scanner-api-2.7-build645.pom
           
[WARNING] The POM for org.sonarsource.scanner.api:sonar-scanner-api:jar:2.7-build645 is missing, no dependency information available
Downloading: https://repo.maven.apache.org/maven2/org/sonarsource/scanner/api/sonar-scanner-api/2.7-build645/sonar-scanner-api-2.7-build645.jar
           
[INFO] ------------------------------------------------------------------------
[INFO] BUILD FAILURE
[INFO] ------------------------------------------------------------------------
[INFO] Total time: 5.654 s
[INFO] Finished at: 2017-09-08T13:21:26-04:00
[INFO] Final Memory: 37M/1547M
[INFO] ------------------------------------------------------------------------
[ERROR] Failed to execute goal org.sonarsource.scanner.maven:sonar-maven-plugin:3.1:sonar (default-cli) on project hipp2jipp: Execution default-cli of goal org.sonarsource.scanner.maven:sonar-maven-plugin:3.1:sonar failed: Plugin org.sonarsource.scanner.maven:sonar-maven-plugin:3.1 or one of its dependencies could not be resolved: Could not find artifact org.sonarsource.scanner.api:sonar-scanner-api:jar:2.7-build645 in central (https://repo.maven.apache.org/maven2) -> [Help 1]
[ERROR] 
[ERROR] To see the full stack trace of the errors, re-run Maven with the -e switch.
[ERROR] Re-run Maven using the -X switch to enable full debug logging.
[ERROR] 
[ERROR] For more information about the errors and possible solutions, please read the following articles:
[ERROR] [Help 1] http://cwiki.apache.org/confluence/display/MAVEN/PluginResolutionException
Build step 'Invoke top-level Maven targets' marked build as failure
Started calculate disk usage of build
Finished Calculation of disk usage of build in 0 seconds
Started calculate disk usage of workspace
Finished Calculation of disk usage of workspace in 0 seconds
Finished: FAILURE