FailedConsole Output

Started by user frederic.gurr@eclipse-foundation.org
Building on master in workspace /home/hudson/genie.cbi/.jenkins/jobs/hipp2jipp_sonar-test/workspace
 > /usr/local/bin/git rev-parse --is-inside-work-tree # timeout=10
Fetching changes from the remote Git repository
 > /usr/local/bin/git config remote.origin.url https://github.com/eclipse/hipp2jipp # timeout=10
Fetching upstream changes from https://github.com/eclipse/hipp2jipp
 > /usr/local/bin/git --version # timeout=10
 > /usr/local/bin/git fetch --tags --progress https://github.com/eclipse/hipp2jipp +refs/heads/*:refs/remotes/origin/*
 > /usr/local/bin/git rev-parse refs/remotes/origin/master^{commit} # timeout=10
 > /usr/local/bin/git rev-parse refs/remotes/origin/origin/master^{commit} # timeout=10
Checking out Revision 53aec1c2fe4a71024e124b30fb0d26f68d8a6ffb (refs/remotes/origin/master)
Commit message: "Add Jenkinsfile"
 > /usr/local/bin/git config core.sparsecheckout # timeout=10
 > /usr/local/bin/git checkout -f 53aec1c2fe4a71024e124b30fb0d26f68d8a6ffb
 > /usr/local/bin/git rev-list 53aec1c2fe4a71024e124b30fb0d26f68d8a6ffb # timeout=10
Injecting SonarQube environment variables using the configuration: Eclipse Sonar
[workspace] $ /shared/common/apache-maven-latest/bin/mvn clean verify org.sonarsource.scanner.maven:sonar-maven-plugin:3.2:sonar -Dsonar.host.url=http://sonar.eclipse.org -Dsonar.jdbc.url=jdbc:mysql://dbmaster:3306/sonar?autoReconnect=true&useUnicode=true&characterEncoding=utf8 -Dsonar.jdbc.username=sonar_rw -Dsonar.jdbc.password=******
[INFO] Scanning for projects...
Downloading: https://repo.maven.apache.org/maven2/org/sonarsource/scanner/maven/sonar-maven-plugin/3.2/sonar-maven-plugin-3.2.pom
3/9 KB   
5/9 KB   
8/9 KB   
9/9 KB   
         
Downloaded: https://repo.maven.apache.org/maven2/org/sonarsource/scanner/maven/sonar-maven-plugin/3.2/sonar-maven-plugin-3.2.pom (9 KB at 23.8 KB/sec)
Downloading: https://repo.maven.apache.org/maven2/org/sonarsource/parent/parent/36/parent-36.pom
3/29 KB   
5/29 KB   
8/29 KB   
11/29 KB   
13/29 KB   
16/29 KB   
19/29 KB   
21/29 KB   
24/29 KB   
27/29 KB   
29/29 KB   
           
Downloaded: https://repo.maven.apache.org/maven2/org/sonarsource/parent/parent/36/parent-36.pom (29 KB at 364.8 KB/sec)
Downloading: https://repo.maven.apache.org/maven2/org/sonarsource/scanner/maven/sonar-maven-plugin/3.2/sonar-maven-plugin-3.2.jar
3/52 KB    
5/52 KB   
8/52 KB   
11/52 KB   
13/52 KB   
16/52 KB   
19/52 KB   
21/52 KB   
24/52 KB   
27/52 KB   
29/52 KB   
32/52 KB   
36/52 KB   
40/52 KB   
44/52 KB   
48/52 KB   
52/52 KB   
52/52 KB   
           
Downloaded: https://repo.maven.apache.org/maven2/org/sonarsource/scanner/maven/sonar-maven-plugin/3.2/sonar-maven-plugin-3.2.jar (52 KB at 683.5 KB/sec)
[INFO]                                                                         
[INFO] ------------------------------------------------------------------------
[INFO] Building hipp2jipp 0.0.2-SNAPSHOT
[INFO] ------------------------------------------------------------------------
[INFO] 
[INFO] --- maven-clean-plugin:2.5:clean (default-clean) @ hipp2jipp ---
[INFO] Deleting /jobs/genie.cbi/hipp2jipp_sonar-test/workspace/target
[INFO] 
[INFO] --- maven-resources-plugin:2.6:resources (default-resources) @ hipp2jipp ---
[INFO] Using 'UTF-8' encoding to copy filtered resources.
[INFO] Copying 4 resources
[INFO] 
[INFO] --- maven-compiler-plugin:2.3.2:compile (default-compile) @ hipp2jipp ---
[INFO] Compiling 2 source files to /jobs/genie.cbi/hipp2jipp_sonar-test/workspace/target/classes
[INFO] 
[INFO] --- maven-resources-plugin:2.6:testResources (default-testResources) @ hipp2jipp ---
[INFO] Using 'UTF-8' encoding to copy filtered resources.
[INFO] skip non existing resourceDirectory /jobs/genie.cbi/hipp2jipp_sonar-test/workspace/src/test/resources
[INFO] 
[INFO] --- maven-compiler-plugin:2.3.2:testCompile (default-testCompile) @ hipp2jipp ---
[INFO] Compiling 1 source file to /jobs/genie.cbi/hipp2jipp_sonar-test/workspace/target/test-classes
[INFO] 
[INFO] --- maven-surefire-plugin:2.12.4:test (default-test) @ hipp2jipp ---
[INFO] Surefire report directory: /jobs/genie.cbi/hipp2jipp_sonar-test/workspace/target/surefire-reports

-------------------------------------------------------
 T E S T S
-------------------------------------------------------
Running org.eclipse.cbi.hipp2jipp.XslTransformerTest
Done. File written: /jobs/genie.cbi/hipp2jipp_sonar-test/workspace/xml/original/timestamp/2016-11-30_14-56-00/build.transformed.xml
Done. File written: /jobs/genie.cbi/hipp2jipp_sonar-test/workspace/xml/transformed/config.job.hudson-package-drone.transformed.xml
Done. File written: /jobs/genie.cbi/hipp2jipp_sonar-test/workspace/xml/transformed/build.hudson-kapua.transformed.xml
Done. File written: /jobs/genie.cbi/hipp2jipp_sonar-test/workspace/xml/transformed/build.hudson-query.transformed.xml
Done. File written: /jobs/genie.cbi/hipp2jipp_sonar-test/workspace/xml/transformed/config.job.hudson-cbi1.transformed.xml
Done. File written: /jobs/genie.cbi/hipp2jipp_sonar-test/workspace/xml/transformed/config.job.hudson-cbi2.transformed.xml
Done. File written: /jobs/genie.cbi/hipp2jipp_sonar-test/workspace/xml/transformed/config.job.hudson-cbi3.transformed.xml
Done. File written: /jobs/genie.cbi/hipp2jipp_sonar-test/workspace/xml/transformed/config.job.hudson-cbi4.transformed.xml
Done. File written: /jobs/genie.cbi/hipp2jipp_sonar-test/workspace/xml/transformed/config.job.hudson-app4mc.transformed.xml
Done. File written: /jobs/genie.cbi/hipp2jipp_sonar-test/workspace/xml/transformed/config.job.hudson-omr.transformed.xml
Done. File written: /jobs/genie.cbi/hipp2jipp_sonar-test/workspace/xml/transformed/config.job.hudson-transaction.transformed.xml
Done. File written: /jobs/genie.cbi/hipp2jipp_sonar-test/workspace/xml/transformed/config.job.hudson-jgit1.transformed.xml
Done. File written: /jobs/genie.cbi/hipp2jipp_sonar-test/workspace/xml/transformed/config.job.hudson-jgit2.transformed.xml
Done. File written: /jobs/genie.cbi/hipp2jipp_sonar-test/workspace/xml/transformed/config.job.hudson-jgit3.transformed.xml
Done. File written: /jobs/genie.cbi/hipp2jipp_sonar-test/workspace/xml/transformed/config.job.hudson-kapua.transformed.xml
Done. File written: /jobs/genie.cbi/hipp2jipp_sonar-test/workspace/xml/transformed/config.job.hudson-kura1.transformed.xml
Done. File written: /jobs/genie.cbi/hipp2jipp_sonar-test/workspace/xml/transformed/config.job.hudson-kura2.transformed.xml
Done. File written: /jobs/genie.cbi/hipp2jipp_sonar-test/workspace/xml/transformed/config.job.hudson-query.transformed.xml
Done. File written: /jobs/genie.cbi/hipp2jipp_sonar-test/workspace/xml/transformed/config.job.hudson-simrel1.transformed.xml
Done. File written: /jobs/genie.cbi/hipp2jipp_sonar-test/workspace/xml/transformed/config.job.hudson-simrel2.transformed.xml
 2017-02-16_12-35-13 -> epoch date: 1487266513000Tests run: 23, Failures: 0, Errors: 0, Skipped: 0, Time elapsed: 1.564 sec

Results :

Tests run: 23, Failures: 0, Errors: 0, Skipped: 0

[INFO] 
[INFO] --- maven-jar-plugin:2.4:jar (default-jar) @ hipp2jipp ---
[INFO] Building jar: /jobs/genie.cbi/hipp2jipp_sonar-test/workspace/target/hipp2jipp-0.0.2-SNAPSHOT.jar
[INFO]                                                                         
[INFO] ------------------------------------------------------------------------
[INFO] Building hipp2jipp 0.0.2-SNAPSHOT
[INFO] ------------------------------------------------------------------------
[INFO] 
[INFO] --- sonar-maven-plugin:3.2:sonar (default-cli) @ hipp2jipp ---
Downloading: https://repo.maven.apache.org/maven2/org/sonarsource/scanner/api/sonar-scanner-api/2.8/sonar-scanner-api-2.8.pom
3/5 KB     
5/5 KB   
         
Downloaded: https://repo.maven.apache.org/maven2/org/sonarsource/scanner/api/sonar-scanner-api/2.8/sonar-scanner-api-2.8.pom (5 KB at 95.7 KB/sec)
Downloading: https://repo.maven.apache.org/maven2/org/sonarsource/scanner/api/sonar-scanner-api-parent/2.8/sonar-scanner-api-parent-2.8.pom
3/5 KB   
5/5 KB   
         
Downloaded: https://repo.maven.apache.org/maven2/org/sonarsource/scanner/api/sonar-scanner-api-parent/2.8/sonar-scanner-api-parent-2.8.pom (5 KB at 87.0 KB/sec)
Downloading: https://repo.maven.apache.org/maven2/org/sonarsource/scanner/api/sonar-scanner-api/2.8/sonar-scanner-api-2.8.jar
3/516 KB   
5/516 KB   
8/516 KB   
11/516 KB   
13/516 KB   
16/516 KB   
19/516 KB   
21/516 KB   
24/516 KB   
27/516 KB   
29/516 KB   
32/516 KB   
36/516 KB   
40/516 KB   
44/516 KB   
48/516 KB   
52/516 KB   
56/516 KB   
60/516 KB   
64/516 KB   
68/516 KB   
72/516 KB   
76/516 KB   
80/516 KB   
84/516 KB   
88/516 KB   
92/516 KB   
96/516 KB   
100/516 KB   
104/516 KB   
108/516 KB   
112/516 KB   
116/516 KB   
120/516 KB   
124/516 KB   
128/516 KB   
132/516 KB   
136/516 KB   
140/516 KB   
144/516 KB   
148/516 KB   
152/516 KB   
156/516 KB   
160/516 KB   
164/516 KB   
168/516 KB   
172/516 KB   
176/516 KB   
180/516 KB   
184/516 KB   
188/516 KB   
192/516 KB   
196/516 KB   
200/516 KB   
204/516 KB   
208/516 KB   
212/516 KB   
216/516 KB   
220/516 KB   
224/516 KB   
228/516 KB   
232/516 KB   
236/516 KB   
240/516 KB   
244/516 KB   
248/516 KB   
252/516 KB   
256/516 KB   
260/516 KB   
264/516 KB   
268/516 KB   
272/516 KB   
276/516 KB   
280/516 KB   
284/516 KB   
288/516 KB   
292/516 KB   
296/516 KB   
300/516 KB   
304/516 KB   
308/516 KB   
312/516 KB   
316/516 KB   
320/516 KB   
324/516 KB   
328/516 KB   
332/516 KB   
336/516 KB   
340/516 KB   
344/516 KB   
348/516 KB   
352/516 KB   
356/516 KB   
360/516 KB   
364/516 KB   
368/516 KB   
372/516 KB   
376/516 KB   
380/516 KB   
384/516 KB   
388/516 KB   
392/516 KB   
396/516 KB   
400/516 KB   
404/516 KB   
408/516 KB   
412/516 KB   
416/516 KB   
420/516 KB   
424/516 KB   
428/516 KB   
432/516 KB   
436/516 KB   
440/516 KB   
444/516 KB   
448/516 KB   
452/516 KB   
456/516 KB   
460/516 KB   
464/516 KB   
468/516 KB   
472/516 KB   
476/516 KB   
480/516 KB   
484/516 KB   
488/516 KB   
492/516 KB   
496/516 KB   
500/516 KB   
504/516 KB   
508/516 KB   
512/516 KB   
516/516 KB   
             
Downloaded: https://repo.maven.apache.org/maven2/org/sonarsource/scanner/api/sonar-scanner-api/2.8/sonar-scanner-api-2.8.jar (516 KB at 3458.4 KB/sec)
[INFO] User cache: /opt/public/hipp/homes/genie.cbi/.sonar/cache
[INFO] SonarQube version: 4.5.7
[INFO] Default locale: "en_US", source code encoding: "UTF-8"
13:18:32.910 INFO  - Load global referentials...
13:18:32.986 INFO  - Load global referentials done: 79 ms
[INFO] ------------------------------------------------------------------------
[INFO] BUILD FAILURE
[INFO] ------------------------------------------------------------------------
[INFO] Total time: 6.746 s
[INFO] Finished at: 2017-09-08T13:18:32-04:00
[INFO] Final Memory: 42M/2257M
[INFO] ------------------------------------------------------------------------
[ERROR] Failed to execute goal org.sonarsource.scanner.maven:sonar-maven-plugin:3.2:sonar (default-cli) on project hipp2jipp: java.lang.IllegalStateException: Expected BEGIN_OBJECT but was STRING at line 1 column 1 -> [Help 1]
[ERROR] 
[ERROR] To see the full stack trace of the errors, re-run Maven with the -e switch.
[ERROR] Re-run Maven using the -X switch to enable full debug logging.
[ERROR] 
[ERROR] For more information about the errors and possible solutions, please read the following articles:
[ERROR] [Help 1] http://cwiki.apache.org/confluence/display/MAVEN/MojoExecutionException
Build step 'Invoke top-level Maven targets' marked build as failure
Started calculate disk usage of build
Finished Calculation of disk usage of build in 0 seconds
Started calculate disk usage of workspace
Finished Calculation of disk usage of workspace in 0 seconds
Finished: FAILURE