FailedConsole Output

Started by user frederic.gurr@eclipse-foundation.org
Building on master in workspace /home/hudson/genie.cbi/.jenkins/jobs/hipp2jipp_sonar-test/workspace
 > /usr/local/bin/git rev-parse --is-inside-work-tree # timeout=10
Fetching changes from the remote Git repository
 > /usr/local/bin/git config remote.origin.url https://github.com/eclipse/hipp2jipp # timeout=10
Fetching upstream changes from https://github.com/eclipse/hipp2jipp
 > /usr/local/bin/git --version # timeout=10
 > /usr/local/bin/git fetch --tags --progress https://github.com/eclipse/hipp2jipp +refs/heads/*:refs/remotes/origin/*
 > /usr/local/bin/git rev-parse refs/remotes/origin/master^{commit} # timeout=10
 > /usr/local/bin/git rev-parse refs/remotes/origin/origin/master^{commit} # timeout=10
Checking out Revision a388d1a2b2da0bd46b28efedea2bb8d008542622 (refs/remotes/origin/master)
 > /usr/local/bin/git config core.sparsecheckout # timeout=10
 > /usr/local/bin/git checkout -f a388d1a2b2da0bd46b28efedea2bb8d008542622
Commit message: "[maven-release-plugin] prepare for next development iteration"
 > /usr/local/bin/git rev-list --no-walk a388d1a2b2da0bd46b28efedea2bb8d008542622 # timeout=10
Injecting SonarQube environment variables using the configuration: Eclipse Sonar
[workspace] $ /shared/common/apache-maven-latest/bin/mvn clean verify org.sonarsource.scanner.maven:sonar-maven-plugin:3.3.0.603:sonar -Dsonar.host.url=https://sonar.eclipse.org -Dsonar.jdbc.url=jdbc:mysql://dbmaster:3306/sonar?autoReconnect=true&useUnicode=true&characterEncoding=utf8 -Dsonar.jdbc.username=sonar_rw -Dsonar.jdbc.password=******
Picked up JAVA_TOOL_OPTIONS: -Xmx2G -Djava.io.tmpdir=/tmp/genie.cbi
[INFO] Scanning for projects...
[INFO] 
[INFO] ------------------------------------------------------------------------
[INFO] Building hipp2jipp 0.0.8-SNAPSHOT
[INFO] ------------------------------------------------------------------------
[INFO] 
[INFO] --- maven-clean-plugin:2.5:clean (default-clean) @ hipp2jipp ---
[INFO] Deleting /jobs/genie.cbi/hipp2jipp_sonar-test/workspace/target
[INFO] 
[INFO] --- maven-resources-plugin:2.6:resources (default-resources) @ hipp2jipp ---
[INFO] Using 'UTF-8' encoding to copy filtered resources.
[INFO] Copying 5 resources
[INFO] 
[INFO] --- maven-compiler-plugin:2.3.2:compile (default-compile) @ hipp2jipp ---
[INFO] Compiling 5 source files to /jobs/genie.cbi/hipp2jipp_sonar-test/workspace/target/classes
[INFO] 
[INFO] --- maven-resources-plugin:2.6:testResources (default-testResources) @ hipp2jipp ---
[INFO] Using 'UTF-8' encoding to copy filtered resources.
[INFO] skip non existing resourceDirectory /jobs/genie.cbi/hipp2jipp_sonar-test/workspace/src/test/resources
[INFO] 
[INFO] --- maven-compiler-plugin:2.3.2:testCompile (default-testCompile) @ hipp2jipp ---
[INFO] Compiling 1 source file to /jobs/genie.cbi/hipp2jipp_sonar-test/workspace/target/test-classes
[INFO] 
[INFO] --- maven-surefire-plugin:2.12.4:test (default-test) @ hipp2jipp ---
[INFO] Surefire report directory: /jobs/genie.cbi/hipp2jipp_sonar-test/workspace/target/surefire-reports

-------------------------------------------------------
 T E S T S
-------------------------------------------------------
Picked up JAVA_TOOL_OPTIONS: -Xmx2G -Djava.io.tmpdir=/tmp/genie.cbi
Running org.eclipse.cbi.hipp2jipp.XslTransformerTest
Known rootNodeName: hudson.maven.MavenModuleSetBuild, but will not be converted!
Skipping...
Error(s) during transformation.
Done. File written: /jobs/genie.cbi/hipp2jipp_sonar-test/workspace/xml/transformed/config.job.hudson-recommenders.transformed.xml
Done. File written: /jobs/genie.cbi/hipp2jipp_sonar-test/workspace/xml/transformed/config.job.hudson-andmore.transformed.xml
Trying to fix missing build time stamp...
 2016-11-30_14-56-00 -> epoch date: 1480535760000 -> fixed.
Done. File written: /jobs/genie.cbi/hipp2jipp_sonar-test/workspace/xml/original/timestamp/2016-11-30_14-56-00/build.transformed.xml
Expected text value '1480514160000' but was '1480535760000' - comparing <timestamp ...>1480514160000</timestamp> at /build[1]/timestamp[1]/text()[1] to <timestamp ...>1480535760000</timestamp> at /build[1]/timestamp[1]/text()[1]
Trying to fix missing build time stamp...
 2016-11-30_14-56-00 -> epoch date: 1480535760000 -> fixed.
Expected text value '1480514160000' but was '1480535760000' - comparing <timestamp ...>1480514160000</timestamp> at /build[1]/timestamp[1]/text()[1] to <timestamp ...>1480535760000</timestamp> at /build[1]/timestamp[1]/text()[1]
Done. File written: /jobs/genie.cbi/hipp2jipp_sonar-test/workspace/xml/transformed/config.job.hudson-package-drone.transformed.xml
Slave name: hippcentos
Writing XML... Done.
Slave name: mac-tests2
Writing XML... Done.
Slave name: external-sample
Writing XML... Done.
Trying to fix missing build time stamp...
File already contains a timestamp tag, skipping...
Expected text value '1480514160000' but was '1480535760000' - comparing <timestamp ...>1480514160000</timestamp> at /build[1]/timestamp[1]/text()[1] to <timestamp ...>1480535760000</timestamp> at /build[1]/timestamp[1]/text()[1]
Trying to fix missing build time stamp...
 -> Parsing exception. Skipping conversion...
Done. File written: /jobs/genie.cbi/hipp2jipp_sonar-test/workspace/xml/transformed/build.hudson-kapua.transformed.xml
Trying to fix missing build time stamp...
 -> Parsing exception. Skipping conversion...
Done. File written: /jobs/genie.cbi/hipp2jipp_sonar-test/workspace/xml/transformed/build.hudson-query.transformed.xml
Done. File written: /jobs/genie.cbi/hipp2jipp_sonar-test/workspace/xml/transformed/config.job.hudson-cbi1.transformed.xml
Done. File written: /jobs/genie.cbi/hipp2jipp_sonar-test/workspace/xml/transformed/config.job.hudson-cbi2.transformed.xml
Done. File written: /jobs/genie.cbi/hipp2jipp_sonar-test/workspace/xml/transformed/config.job.hudson-cbi3.transformed.xml
Done. File written: /jobs/genie.cbi/hipp2jipp_sonar-test/workspace/xml/transformed/config.job.hudson-cbi4.transformed.xml
Done. File written: /jobs/genie.cbi/hipp2jipp_sonar-test/workspace/xml/transformed/config.job.hudson-hono.transformed.xml
Done. File written: /jobs/genie.cbi/hipp2jipp_sonar-test/workspace/xml/transformed/config.job.hudson-qvtd.transformed.xml
Done. File written: /jobs/genie.cbi/hipp2jipp_sonar-test/workspace/xml/transformed/config.job.hudson-app4mc.transformed.xml
Done. File written: /jobs/genie.cbi/hipp2jipp_sonar-test/workspace/xml/transformed/config.job.hudson-gendoc.transformed.xml
Slave name: hippcentos
Writing XML... Done.
Slave name: mac-tests2
Writing XML... Done.
Slave name: external-sample
Writing XML... Done.
Done. File written: /jobs/genie.cbi/hipp2jipp_sonar-test/workspace/xml/transformed/config.job.hudson-jwt.transformed.xml
Done. File written: /jobs/genie.cbi/hipp2jipp_sonar-test/workspace/xml/transformed/config.job.hudson-lyo.transformed.xml
Done. File written: /jobs/genie.cbi/hipp2jipp_sonar-test/workspace/xml/transformed/config.job.hudson-omr.transformed.xml
Setting Hudson config file to xml/original/config.main.hudson-cbi.xml
Found xml/original/config.main.hudson-cbi.xml
Setting Jenkins config file to xml/original/config.main.jenkins-cbi.xml
Found xml/original/config.main.jenkins-cbi.xml
Setting output file to xml/transformed/config.main.jenkins-cbi.transformed.xml
Setting Hudson config file to xml/original/copyViews/.hudson
Directory given, looking for xml/original/copyViews/.hudson/config.xml ...
Found xml/original/copyViews/.hudson/config.xml
Setting Jenkins config file to xml/original/copyViews/.jenkins
Directory given, looking for xml/original/copyViews/.jenkins/config.xml ...
Found xml/original/copyViews/.jenkins/config.xml
Setting output file to xml/original/copyViews/.jenkins/config.transformed.xml
No Hudson config file given, default is /jobs/genie.cbi/hipp2jipp_sonar-test/workspace/xml/original/copyViews/.hudson/config.xml ...
Found /jobs/genie.cbi/hipp2jipp_sonar-test/workspace/xml/original/copyViews/.hudson/config.xml
No Jenkins config file given, default is /jobs/genie.cbi/hipp2jipp_sonar-test/workspace/xml/original/copyViews/.jenkins/config.xml ...
Found /jobs/genie.cbi/hipp2jipp_sonar-test/workspace/xml/original/copyViews/.jenkins/config.xml
No output file given. Replacing Jenkins config file.
Err Output: No slaves found.

Done. File written: /jobs/genie.cbi/hipp2jipp_sonar-test/workspace/xml/transformed/config.job.hudson-xtext1.transformed.xml
Done. File written: /jobs/genie.cbi/hipp2jipp_sonar-test/workspace/xml/transformed/config.job.hudson-xtext2.transformed.xml
Done. File written: /jobs/genie.cbi/hipp2jipp_sonar-test/workspace/xml/transformed/config.job.hudson-xtext3.transformed.xml
Done. File written: /jobs/genie.cbi/hipp2jipp_sonar-test/workspace/xml/transformed/config.job.hudson-modisco.transformed.xml
Done. File written: /jobs/genie.cbi/hipp2jipp_sonar-test/workspace/xml/transformed/config.job.hudson-collections.transformed.xml
Done. File written: /jobs/genie.cbi/hipp2jipp_sonar-test/workspace/xml/transformed/config.job.hudson-transaction.transformed.xml
Converting /jobs/genie.cbi/hipp2jipp_sonar-test/workspace/xml/transformed/promotions/epp-logging.head/builds/2018-01-24_00-01-16/build.xml...Trying to fix missing build time stamp...
File already contains a timestamp tag, skipping...
 Done.
Converting /jobs/genie.cbi/hipp2jipp_sonar-test/workspace/xml/transformed/promotions/epp-logging.head/builds/2018-01-24_00-04-47/build.xml...Trying to fix missing build time stamp...
File already contains a timestamp tag, skipping...
 Done.
Converting /jobs/genie.cbi/hipp2jipp_sonar-test/workspace/xml/transformed/promotions/epp-logging.head/promotions/head/builds/2018-01-24_00-04-49/build.xml...Known rootNodeName: hudson.plugins.promoted__builds.Promotion, but will not be converted!
Skipping...
 Error.
Converting /jobs/genie.cbi/hipp2jipp_sonar-test/workspace/xml/transformed/promotions/epp-logging.head/promotions/head/builds/2018-01-24_00-07-02/build.xml...Known rootNodeName: hudson.plugins.promoted__builds.Promotion, but will not be converted!
Skipping...
 Error.
Converting /jobs/genie.cbi/hipp2jipp_sonar-test/workspace/xml/transformed/promotions/epp-logging.head/promotions/head/config.xml... Done.
Converting /jobs/genie.cbi/hipp2jipp_sonar-test/workspace/xml/transformed/promotions/epp-logging.head/promotions/milestones/builds/2017-09-06_04-15-34/build.xml...Known rootNodeName: hudson.plugins.promoted__builds.Promotion, but will not be converted!
Skipping...
 Error.
Converting /jobs/genie.cbi/hipp2jipp_sonar-test/workspace/xml/transformed/promotions/epp-logging.head/promotions/milestones/builds/2017-09-12_09-00-16/build.xml...Known rootNodeName: hudson.plugins.promoted__builds.Promotion, but will not be converted!
Skipping...
 Error.
Converting /jobs/genie.cbi/hipp2jipp_sonar-test/workspace/xml/transformed/promotions/epp-logging.head/promotions/milestones/config.xml... Done.
Converting /jobs/genie.cbi/hipp2jipp_sonar-test/workspace/xml/transformed/promotions/epp-logging.head/promotions/stable/builds/2017-06-13_08-25-13/build.xml...Known rootNodeName: hudson.plugins.promoted__builds.Promotion, but will not be converted!
Skipping...
 Error.
Converting /jobs/genie.cbi/hipp2jipp_sonar-test/workspace/xml/transformed/promotions/epp-logging.head/promotions/stable/builds/2017-09-12_09-00-24/build.xml...Known rootNodeName: hudson.plugins.promoted__builds.Promotion, but will not be converted!
Skipping...
 Error.
Converting /jobs/genie.cbi/hipp2jipp_sonar-test/workspace/xml/transformed/promotions/epp-logging.head/promotions/stable/config.xml... Done.
Converting /jobs/genie.cbi/hipp2jipp_sonar-test/workspace/xml/transformed/promotions/epp-logging.head/config.xml... Done.
Known rootNodeName: hudson.maven.MavenBuild, but will not be converted!
Skipping...
Error(s) during transformation.
Done. File written: /jobs/genie.cbi/hipp2jipp_sonar-test/workspace/xml/transformed/config.job.hudson-jgit1.transformed.xml
Done. File written: /jobs/genie.cbi/hipp2jipp_sonar-test/workspace/xml/transformed/config.job.hudson-jgit2.transformed.xml
Done. File written: /jobs/genie.cbi/hipp2jipp_sonar-test/workspace/xml/transformed/config.job.hudson-jgit3.transformed.xml
Done. File written: /jobs/genie.cbi/hipp2jipp_sonar-test/workspace/xml/transformed/config.job.hudson-kapua.transformed.xml
Done. File written: /jobs/genie.cbi/hipp2jipp_sonar-test/workspace/xml/transformed/config.job.hudson-kura1.transformed.xml
Done. File written: /jobs/genie.cbi/hipp2jipp_sonar-test/workspace/xml/transformed/config.job.hudson-kura2.transformed.xml
Done. File written: /jobs/genie.cbi/hipp2jipp_sonar-test/workspace/xml/transformed/config.job.hudson-query.transformed.xml
Done. File written: /jobs/genie.cbi/hipp2jipp_sonar-test/workspace/xml/transformed/config.job.hudson-simrel1.transformed.xml
Done. File written: /jobs/genie.cbi/hipp2jipp_sonar-test/workspace/xml/transformed/config.job.hudson-simrel2.transformed.xml
 2017-02-16_12-35-13 -> epoch date: 1487266513000Done. File written: /jobs/genie.cbi/hipp2jipp_sonar-test/workspace/xml/transformed/config.job.hudson-recommenders2.transformed.xml
Tests run: 51, Failures: 3, Errors: 0, Skipped: 0, Time elapsed: 5.153 sec <<< FAILURE!
buildTest_timestamp(org.eclipse.cbi.hipp2jipp.XslTransformerTest)  Time elapsed: 0.065 sec  <<< FAILURE!
java.lang.AssertionError: found a difference: Expected text value '1480514160000' but was '1480535760000' - comparing <timestamp ...>1480514160000</timestamp> at /build[1]/timestamp[1]/text()[1] to <timestamp ...>1480535760000</timestamp> at /build[1]/timestamp[1]/text()[1]
	at org.junit.Assert.fail(Assert.java:88)
	at org.eclipse.cbi.hipp2jipp.XslTransformerTest$1.comparisonPerformed(XslTransformerTest.java:550)
	at org.xmlunit.diff.ComparisonListenerSupport.fire(ComparisonListenerSupport.java:72)
	at org.xmlunit.diff.ComparisonListenerSupport.fireComparisonPerformed(ComparisonListenerSupport.java:64)
	at org.xmlunit.diff.AbstractDifferenceEngine.compare(AbstractDifferenceEngine.java:177)
	at org.xmlunit.diff.DOMDifferenceEngine.compareCharacterData(DOMDifferenceEngine.java:235)
	at org.xmlunit.diff.DOMDifferenceEngine.nodeTypeSpecificComparison(DOMDifferenceEngine.java:167)
	at org.xmlunit.diff.DOMDifferenceEngine.access$000(DOMDifferenceEngine.java:44)
	at org.xmlunit.diff.DOMDifferenceEngine$2.apply(DOMDifferenceEngine.java:142)
	at org.xmlunit.diff.AbstractDifferenceEngine$ComparisonState.andThen(AbstractDifferenceEngine.java:222)
	at org.xmlunit.diff.DOMDifferenceEngine.compareNodes(DOMDifferenceEngine.java:118)
	at org.xmlunit.diff.DOMDifferenceEngine$8.apply(DOMDifferenceEngine.java:563)
	at org.xmlunit.diff.AbstractDifferenceEngine$ComparisonState.andThen(AbstractDifferenceEngine.java:222)
	at org.xmlunit.diff.DOMDifferenceEngine.compareNodeLists(DOMDifferenceEngine.java:554)
	at org.xmlunit.diff.DOMDifferenceEngine.access$100(DOMDifferenceEngine.java:44)
	at org.xmlunit.diff.DOMDifferenceEngine$3.apply(DOMDifferenceEngine.java:222)
	at org.xmlunit.diff.AbstractDifferenceEngine$ComparisonState.andThen(AbstractDifferenceEngine.java:222)
	at org.xmlunit.diff.AbstractDifferenceEngine$ComparisonState.andIfTrueThen(AbstractDifferenceEngine.java:226)
	at org.xmlunit.diff.DOMDifferenceEngine.compareNodes(DOMDifferenceEngine.java:118)
	at org.xmlunit.diff.DOMDifferenceEngine$8.apply(DOMDifferenceEngine.java:563)
	at org.xmlunit.diff.AbstractDifferenceEngine$ComparisonState.andThen(AbstractDifferenceEngine.java:222)
	at org.xmlunit.diff.DOMDifferenceEngine.compareNodeLists(DOMDifferenceEngine.java:554)
	at org.xmlunit.diff.DOMDifferenceEngine.access$100(DOMDifferenceEngine.java:44)
	at org.xmlunit.diff.DOMDifferenceEngine$3.apply(DOMDifferenceEngine.java:222)
	at org.xmlunit.diff.AbstractDifferenceEngine$ComparisonState.andThen(AbstractDifferenceEngine.java:222)
	at org.xmlunit.diff.AbstractDifferenceEngine$ComparisonState.andIfTrueThen(AbstractDifferenceEngine.java:226)
	at org.xmlunit.diff.DOMDifferenceEngine.compareNodes(DOMDifferenceEngine.java:118)
	at org.xmlunit.diff.DOMDifferenceEngine$8.apply(DOMDifferenceEngine.java:563)
	at org.xmlunit.diff.AbstractDifferenceEngine$ComparisonState.andThen(AbstractDifferenceEngine.java:222)
	at org.xmlunit.diff.DOMDifferenceEngine.compareNodeLists(DOMDifferenceEngine.java:554)
	at org.xmlunit.diff.DOMDifferenceEngine.access$100(DOMDifferenceEngine.java:44)
	at org.xmlunit.diff.DOMDifferenceEngine$3.apply(DOMDifferenceEngine.java:222)
	at org.xmlunit.diff.AbstractDifferenceEngine$ComparisonState.andThen(AbstractDifferenceEngine.java:222)
	at org.xmlunit.diff.AbstractDifferenceEngine$ComparisonState.andIfTrueThen(AbstractDifferenceEngine.java:226)
	at org.xmlunit.diff.DOMDifferenceEngine.compareNodes(DOMDifferenceEngine.java:118)
	at org.xmlunit.diff.DOMDifferenceEngine.compare(DOMDifferenceEngine.java:85)
	at org.eclipse.cbi.hipp2jipp.XslTransformerTest.compareWithReferenceFile(XslTransformerTest.java:553)
	at org.eclipse.cbi.hipp2jipp.XslTransformerTest.buildTest_timestamp(XslTransformerTest.java:146)
	at sun.reflect.NativeMethodAccessorImpl.invoke0(Native Method)
	at sun.reflect.NativeMethodAccessorImpl.invoke(NativeMethodAccessorImpl.java:57)
	at sun.reflect.DelegatingMethodAccessorImpl.invoke(DelegatingMethodAccessorImpl.java:43)
	at java.lang.reflect.Method.invoke(Method.java:606)
	at org.junit.runners.model.FrameworkMethod$1.runReflectiveCall(FrameworkMethod.java:50)
	at org.junit.internal.runners.model.ReflectiveCallable.run(ReflectiveCallable.java:12)
	at org.junit.runners.model.FrameworkMethod.invokeExplosively(FrameworkMethod.java:47)
	at org.junit.internal.runners.statements.InvokeMethod.evaluate(InvokeMethod.java:17)
	at org.junit.runners.ParentRunner.runLeaf(ParentRunner.java:325)
	at org.junit.runners.BlockJUnit4ClassRunner.runChild(BlockJUnit4ClassRunner.java:78)
	at org.junit.runners.BlockJUnit4ClassRunner.runChild(BlockJUnit4ClassRunner.java:57)
	at org.junit.runners.ParentRunner$3.run(ParentRunner.java:290)
	at org.junit.runners.ParentRunner$1.schedule(ParentRunner.java:71)
	at org.junit.runners.ParentRunner.runChildren(ParentRunner.java:288)
	at org.junit.runners.ParentRunner.access$000(ParentRunner.java:58)
	at org.junit.runners.ParentRunner$2.evaluate(ParentRunner.java:268)
	at org.junit.internal.runners.statements.RunBefores.evaluate(RunBefores.java:26)
	at org.junit.internal.runners.statements.RunAfters.evaluate(RunAfters.java:27)
	at org.junit.runners.ParentRunner.run(ParentRunner.java:363)
	at org.apache.maven.surefire.junit4.JUnit4Provider.execute(JUnit4Provider.java:252)
	at org.apache.maven.surefire.junit4.JUnit4Provider.executeTestSet(JUnit4Provider.java:141)
	at org.apache.maven.surefire.junit4.JUnit4Provider.invoke(JUnit4Provider.java:112)
	at sun.reflect.NativeMethodAccessorImpl.invoke0(Native Method)
	at sun.reflect.NativeMethodAccessorImpl.invoke(NativeMethodAccessorImpl.java:57)
	at sun.reflect.DelegatingMethodAccessorImpl.invoke(DelegatingMethodAccessorImpl.java:43)
	at java.lang.reflect.Method.invoke(Method.java:606)
	at org.apache.maven.surefire.util.ReflectionUtils.invokeMethodWithArray(ReflectionUtils.java:189)
	at org.apache.maven.surefire.booter.ProviderFactory$ProviderProxy.invoke(ProviderFactory.java:165)
	at org.apache.maven.surefire.booter.ProviderFactory.invokeProvider(ProviderFactory.java:85)
	at org.apache.maven.surefire.booter.ForkedBooter.runSuitesInProcess(ForkedBooter.java:115)
	at org.apache.maven.surefire.booter.ForkedBooter.main(ForkedBooter.java:75)

buildTest_timestamp_cli_dir(org.eclipse.cbi.hipp2jipp.XslTransformerTest)  Time elapsed: 0.019 sec  <<< FAILURE!
java.lang.AssertionError: found a difference: Expected text value '1480514160000' but was '1480535760000' - comparing <timestamp ...>1480514160000</timestamp> at /build[1]/timestamp[1]/text()[1] to <timestamp ...>1480535760000</timestamp> at /build[1]/timestamp[1]/text()[1]
	at org.junit.Assert.fail(Assert.java:88)
	at org.eclipse.cbi.hipp2jipp.XslTransformerTest$1.comparisonPerformed(XslTransformerTest.java:550)
	at org.xmlunit.diff.ComparisonListenerSupport.fire(ComparisonListenerSupport.java:72)
	at org.xmlunit.diff.ComparisonListenerSupport.fireComparisonPerformed(ComparisonListenerSupport.java:64)
	at org.xmlunit.diff.AbstractDifferenceEngine.compare(AbstractDifferenceEngine.java:177)
	at org.xmlunit.diff.DOMDifferenceEngine.compareCharacterData(DOMDifferenceEngine.java:235)
	at org.xmlunit.diff.DOMDifferenceEngine.nodeTypeSpecificComparison(DOMDifferenceEngine.java:167)
	at org.xmlunit.diff.DOMDifferenceEngine.access$000(DOMDifferenceEngine.java:44)
	at org.xmlunit.diff.DOMDifferenceEngine$2.apply(DOMDifferenceEngine.java:142)
	at org.xmlunit.diff.AbstractDifferenceEngine$ComparisonState.andThen(AbstractDifferenceEngine.java:222)
	at org.xmlunit.diff.DOMDifferenceEngine.compareNodes(DOMDifferenceEngine.java:118)
	at org.xmlunit.diff.DOMDifferenceEngine$8.apply(DOMDifferenceEngine.java:563)
	at org.xmlunit.diff.AbstractDifferenceEngine$ComparisonState.andThen(AbstractDifferenceEngine.java:222)
	at org.xmlunit.diff.DOMDifferenceEngine.compareNodeLists(DOMDifferenceEngine.java:554)
	at org.xmlunit.diff.DOMDifferenceEngine.access$100(DOMDifferenceEngine.java:44)
	at org.xmlunit.diff.DOMDifferenceEngine$3.apply(DOMDifferenceEngine.java:222)
	at org.xmlunit.diff.AbstractDifferenceEngine$ComparisonState.andThen(AbstractDifferenceEngine.java:222)
	at org.xmlunit.diff.AbstractDifferenceEngine$ComparisonState.andIfTrueThen(AbstractDifferenceEngine.java:226)
	at org.xmlunit.diff.DOMDifferenceEngine.compareNodes(DOMDifferenceEngine.java:118)
	at org.xmlunit.diff.DOMDifferenceEngine$8.apply(DOMDifferenceEngine.java:563)
	at org.xmlunit.diff.AbstractDifferenceEngine$ComparisonState.andThen(AbstractDifferenceEngine.java:222)
	at org.xmlunit.diff.DOMDifferenceEngine.compareNodeLists(DOMDifferenceEngine.java:554)
	at org.xmlunit.diff.DOMDifferenceEngine.access$100(DOMDifferenceEngine.java:44)
	at org.xmlunit.diff.DOMDifferenceEngine$3.apply(DOMDifferenceEngine.java:222)
	at org.xmlunit.diff.AbstractDifferenceEngine$ComparisonState.andThen(AbstractDifferenceEngine.java:222)
	at org.xmlunit.diff.AbstractDifferenceEngine$ComparisonState.andIfTrueThen(AbstractDifferenceEngine.java:226)
	at org.xmlunit.diff.DOMDifferenceEngine.compareNodes(DOMDifferenceEngine.java:118)
	at org.xmlunit.diff.DOMDifferenceEngine$8.apply(DOMDifferenceEngine.java:563)
	at org.xmlunit.diff.AbstractDifferenceEngine$ComparisonState.andThen(AbstractDifferenceEngine.java:222)
	at org.xmlunit.diff.DOMDifferenceEngine.compareNodeLists(DOMDifferenceEngine.java:554)
	at org.xmlunit.diff.DOMDifferenceEngine.access$100(DOMDifferenceEngine.java:44)
	at org.xmlunit.diff.DOMDifferenceEngine$3.apply(DOMDifferenceEngine.java:222)
	at org.xmlunit.diff.AbstractDifferenceEngine$ComparisonState.andThen(AbstractDifferenceEngine.java:222)
	at org.xmlunit.diff.AbstractDifferenceEngine$ComparisonState.andIfTrueThen(AbstractDifferenceEngine.java:226)
	at org.xmlunit.diff.DOMDifferenceEngine.compareNodes(DOMDifferenceEngine.java:118)
	at org.xmlunit.diff.DOMDifferenceEngine.compare(DOMDifferenceEngine.java:85)
	at org.eclipse.cbi.hipp2jipp.XslTransformerTest.compareWithReferenceFile(XslTransformerTest.java:553)
	at org.eclipse.cbi.hipp2jipp.XslTransformerTest.buildTest_timestamp_cli_dir(XslTransformerTest.java:164)
	at sun.reflect.NativeMethodAccessorImpl.invoke0(Native Method)
	at sun.reflect.NativeMethodAccessorImpl.invoke(NativeMethodAccessorImpl.java:57)
	at sun.reflect.DelegatingMethodAccessorImpl.invoke(DelegatingMethodAccessorImpl.java:43)
	at java.lang.reflect.Method.invoke(Method.java:606)
	at org.junit.runners.model.FrameworkMethod$1.runReflectiveCall(FrameworkMethod.java:50)
	at org.junit.internal.runners.model.ReflectiveCallable.run(ReflectiveCallable.java:12)
	at org.junit.runners.model.FrameworkMethod.invokeExplosively(FrameworkMethod.java:47)
	at org.junit.internal.runners.statements.InvokeMethod.evaluate(InvokeMethod.java:17)
	at org.junit.runners.ParentRunner.runLeaf(ParentRunner.java:325)
	at org.junit.runners.BlockJUnit4ClassRunner.runChild(BlockJUnit4ClassRunner.java:78)
	at org.junit.runners.BlockJUnit4ClassRunner.runChild(BlockJUnit4ClassRunner.java:57)
	at org.junit.runners.ParentRunner$3.run(ParentRunner.java:290)
	at org.junit.runners.ParentRunner$1.schedule(ParentRunner.java:71)
	at org.junit.runners.ParentRunner.runChildren(ParentRunner.java:288)
	at org.junit.runners.ParentRunner.access$000(ParentRunner.java:58)
	at org.junit.runners.ParentRunner$2.evaluate(ParentRunner.java:268)
	at org.junit.internal.runners.statements.RunBefores.evaluate(RunBefores.java:26)
	at org.junit.internal.runners.statements.RunAfters.evaluate(RunAfters.java:27)
	at org.junit.runners.ParentRunner.run(ParentRunner.java:363)
	at org.apache.maven.surefire.junit4.JUnit4Provider.execute(JUnit4Provider.java:252)
	at org.apache.maven.surefire.junit4.JUnit4Provider.executeTestSet(JUnit4Provider.java:141)
	at org.apache.maven.surefire.junit4.JUnit4Provider.invoke(JUnit4Provider.java:112)
	at sun.reflect.NativeMethodAccessorImpl.invoke0(Native Method)
	at sun.reflect.NativeMethodAccessorImpl.invoke(NativeMethodAccessorImpl.java:57)
	at sun.reflect.DelegatingMethodAccessorImpl.invoke(DelegatingMethodAccessorImpl.java:43)
	at java.lang.reflect.Method.invoke(Method.java:606)
	at org.apache.maven.surefire.util.ReflectionUtils.invokeMethodWithArray(ReflectionUtils.java:189)
	at org.apache.maven.surefire.booter.ProviderFactory$ProviderProxy.invoke(ProviderFactory.java:165)
	at org.apache.maven.surefire.booter.ProviderFactory.invokeProvider(ProviderFactory.java:85)
	at org.apache.maven.surefire.booter.ForkedBooter.runSuitesInProcess(ForkedBooter.java:115)
	at org.apache.maven.surefire.booter.ForkedBooter.main(ForkedBooter.java:75)

buildTest_timestamp_cli(org.eclipse.cbi.hipp2jipp.XslTransformerTest)  Time elapsed: 0.013 sec  <<< FAILURE!
java.lang.AssertionError: found a difference: Expected text value '1480514160000' but was '1480535760000' - comparing <timestamp ...>1480514160000</timestamp> at /build[1]/timestamp[1]/text()[1] to <timestamp ...>1480535760000</timestamp> at /build[1]/timestamp[1]/text()[1]
	at org.junit.Assert.fail(Assert.java:88)
	at org.eclipse.cbi.hipp2jipp.XslTransformerTest$1.comparisonPerformed(XslTransformerTest.java:550)
	at org.xmlunit.diff.ComparisonListenerSupport.fire(ComparisonListenerSupport.java:72)
	at org.xmlunit.diff.ComparisonListenerSupport.fireComparisonPerformed(ComparisonListenerSupport.java:64)
	at org.xmlunit.diff.AbstractDifferenceEngine.compare(AbstractDifferenceEngine.java:177)
	at org.xmlunit.diff.DOMDifferenceEngine.compareCharacterData(DOMDifferenceEngine.java:235)
	at org.xmlunit.diff.DOMDifferenceEngine.nodeTypeSpecificComparison(DOMDifferenceEngine.java:167)
	at org.xmlunit.diff.DOMDifferenceEngine.access$000(DOMDifferenceEngine.java:44)
	at org.xmlunit.diff.DOMDifferenceEngine$2.apply(DOMDifferenceEngine.java:142)
	at org.xmlunit.diff.AbstractDifferenceEngine$ComparisonState.andThen(AbstractDifferenceEngine.java:222)
	at org.xmlunit.diff.DOMDifferenceEngine.compareNodes(DOMDifferenceEngine.java:118)
	at org.xmlunit.diff.DOMDifferenceEngine$8.apply(DOMDifferenceEngine.java:563)
	at org.xmlunit.diff.AbstractDifferenceEngine$ComparisonState.andThen(AbstractDifferenceEngine.java:222)
	at org.xmlunit.diff.DOMDifferenceEngine.compareNodeLists(DOMDifferenceEngine.java:554)
	at org.xmlunit.diff.DOMDifferenceEngine.access$100(DOMDifferenceEngine.java:44)
	at org.xmlunit.diff.DOMDifferenceEngine$3.apply(DOMDifferenceEngine.java:222)
	at org.xmlunit.diff.AbstractDifferenceEngine$ComparisonState.andThen(AbstractDifferenceEngine.java:222)
	at org.xmlunit.diff.AbstractDifferenceEngine$ComparisonState.andIfTrueThen(AbstractDifferenceEngine.java:226)
	at org.xmlunit.diff.DOMDifferenceEngine.compareNodes(DOMDifferenceEngine.java:118)
	at org.xmlunit.diff.DOMDifferenceEngine$8.apply(DOMDifferenceEngine.java:563)
	at org.xmlunit.diff.AbstractDifferenceEngine$ComparisonState.andThen(AbstractDifferenceEngine.java:222)
	at org.xmlunit.diff.DOMDifferenceEngine.compareNodeLists(DOMDifferenceEngine.java:554)
	at org.xmlunit.diff.DOMDifferenceEngine.access$100(DOMDifferenceEngine.java:44)
	at org.xmlunit.diff.DOMDifferenceEngine$3.apply(DOMDifferenceEngine.java:222)
	at org.xmlunit.diff.AbstractDifferenceEngine$ComparisonState.andThen(AbstractDifferenceEngine.java:222)
	at org.xmlunit.diff.AbstractDifferenceEngine$ComparisonState.andIfTrueThen(AbstractDifferenceEngine.java:226)
	at org.xmlunit.diff.DOMDifferenceEngine.compareNodes(DOMDifferenceEngine.java:118)
	at org.xmlunit.diff.DOMDifferenceEngine$8.apply(DOMDifferenceEngine.java:563)
	at org.xmlunit.diff.AbstractDifferenceEngine$ComparisonState.andThen(AbstractDifferenceEngine.java:222)
	at org.xmlunit.diff.DOMDifferenceEngine.compareNodeLists(DOMDifferenceEngine.java:554)
	at org.xmlunit.diff.DOMDifferenceEngine.access$100(DOMDifferenceEngine.java:44)
	at org.xmlunit.diff.DOMDifferenceEngine$3.apply(DOMDifferenceEngine.java:222)
	at org.xmlunit.diff.AbstractDifferenceEngine$ComparisonState.andThen(AbstractDifferenceEngine.java:222)
	at org.xmlunit.diff.AbstractDifferenceEngine$ComparisonState.andIfTrueThen(AbstractDifferenceEngine.java:226)
	at org.xmlunit.diff.DOMDifferenceEngine.compareNodes(DOMDifferenceEngine.java:118)
	at org.xmlunit.diff.DOMDifferenceEngine.compare(DOMDifferenceEngine.java:85)
	at org.eclipse.cbi.hipp2jipp.XslTransformerTest.compareWithReferenceFile(XslTransformerTest.java:553)
	at org.eclipse.cbi.hipp2jipp.XslTransformerTest.buildTest_timestamp_cli(XslTransformerTest.java:155)
	at sun.reflect.NativeMethodAccessorImpl.invoke0(Native Method)
	at sun.reflect.NativeMethodAccessorImpl.invoke(NativeMethodAccessorImpl.java:57)
	at sun.reflect.DelegatingMethodAccessorImpl.invoke(DelegatingMethodAccessorImpl.java:43)
	at java.lang.reflect.Method.invoke(Method.java:606)
	at org.junit.runners.model.FrameworkMethod$1.runReflectiveCall(FrameworkMethod.java:50)
	at org.junit.internal.runners.model.ReflectiveCallable.run(ReflectiveCallable.java:12)
	at org.junit.runners.model.FrameworkMethod.invokeExplosively(FrameworkMethod.java:47)
	at org.junit.internal.runners.statements.InvokeMethod.evaluate(InvokeMethod.java:17)
	at org.junit.runners.ParentRunner.runLeaf(ParentRunner.java:325)
	at org.junit.runners.BlockJUnit4ClassRunner.runChild(BlockJUnit4ClassRunner.java:78)
	at org.junit.runners.BlockJUnit4ClassRunner.runChild(BlockJUnit4ClassRunner.java:57)
	at org.junit.runners.ParentRunner$3.run(ParentRunner.java:290)
	at org.junit.runners.ParentRunner$1.schedule(ParentRunner.java:71)
	at org.junit.runners.ParentRunner.runChildren(ParentRunner.java:288)
	at org.junit.runners.ParentRunner.access$000(ParentRunner.java:58)
	at org.junit.runners.ParentRunner$2.evaluate(ParentRunner.java:268)
	at org.junit.internal.runners.statements.RunBefores.evaluate(RunBefores.java:26)
	at org.junit.internal.runners.statements.RunAfters.evaluate(RunAfters.java:27)
	at org.junit.runners.ParentRunner.run(ParentRunner.java:363)
	at org.apache.maven.surefire.junit4.JUnit4Provider.execute(JUnit4Provider.java:252)
	at org.apache.maven.surefire.junit4.JUnit4Provider.executeTestSet(JUnit4Provider.java:141)
	at org.apache.maven.surefire.junit4.JUnit4Provider.invoke(JUnit4Provider.java:112)
	at sun.reflect.NativeMethodAccessorImpl.invoke0(Native Method)
	at sun.reflect.NativeMethodAccessorImpl.invoke(NativeMethodAccessorImpl.java:57)
	at sun.reflect.DelegatingMethodAccessorImpl.invoke(DelegatingMethodAccessorImpl.java:43)
	at java.lang.reflect.Method.invoke(Method.java:606)
	at org.apache.maven.surefire.util.ReflectionUtils.invokeMethodWithArray(ReflectionUtils.java:189)
	at org.apache.maven.surefire.booter.ProviderFactory$ProviderProxy.invoke(ProviderFactory.java:165)
	at org.apache.maven.surefire.booter.ProviderFactory.invokeProvider(ProviderFactory.java:85)
	at org.apache.maven.surefire.booter.ForkedBooter.runSuitesInProcess(ForkedBooter.java:115)
	at org.apache.maven.surefire.booter.ForkedBooter.main(ForkedBooter.java:75)


Results :

Failed tests:   buildTest_timestamp(org.eclipse.cbi.hipp2jipp.XslTransformerTest): found a difference: Expected text value '1480514160000' but was '1480535760000' - comparing <timestamp ...>1480514160000</timestamp> at /build[1]/timestamp[1]/text()[1] to <timestamp ...>1480535760000</timestamp> at /build[1]/timestamp[1]/text()[1]
  buildTest_timestamp_cli_dir(org.eclipse.cbi.hipp2jipp.XslTransformerTest): found a difference: Expected text value '1480514160000' but was '1480535760000' - comparing <timestamp ...>1480514160000</timestamp> at /build[1]/timestamp[1]/text()[1] to <timestamp ...>1480535760000</timestamp> at /build[1]/timestamp[1]/text()[1]
  buildTest_timestamp_cli(org.eclipse.cbi.hipp2jipp.XslTransformerTest): found a difference: Expected text value '1480514160000' but was '1480535760000' - comparing <timestamp ...>1480514160000</timestamp> at /build[1]/timestamp[1]/text()[1] to <timestamp ...>1480535760000</timestamp> at /build[1]/timestamp[1]/text()[1]

Tests run: 51, Failures: 3, Errors: 0, Skipped: 0

[INFO] 
[INFO] ------------------------------------------------------------------------
[INFO] Skipping hipp2jipp
[INFO] This project has been banned from the build due to previous failures.
[INFO] ------------------------------------------------------------------------
[INFO] ------------------------------------------------------------------------
[INFO] BUILD FAILURE
[INFO] ------------------------------------------------------------------------
[INFO] Total time: 8.692 s
[INFO] Finished at: 2018-02-02T08:05:06-05:00
[INFO] Final Memory: 33M/1931M
[INFO] ------------------------------------------------------------------------
[ERROR] Failed to execute goal org.apache.maven.plugins:maven-surefire-plugin:2.12.4:test (default-test) on project hipp2jipp: There are test failures.
[ERROR] 
[ERROR] Please refer to /jobs/genie.cbi/hipp2jipp_sonar-test/workspace/target/surefire-reports for the individual test results.
[ERROR] -> [Help 1]
[ERROR] 
[ERROR] To see the full stack trace of the errors, re-run Maven with the -e switch.
[ERROR] Re-run Maven using the -X switch to enable full debug logging.
[ERROR] 
[ERROR] For more information about the errors and possible solutions, please read the following articles:
[ERROR] [Help 1] http://cwiki.apache.org/confluence/display/MAVEN/MojoFailureException
Build step 'Invoke top-level Maven targets' marked build as failure
Started calculate disk usage of build
Finished Calculation of disk usage of build in 0 seconds
Started calculate disk usage of workspace
Finished Calculation of disk usage of workspace in 0 seconds
Finished: FAILURE