FailedConsole Output

Started by user frederic.gurr@eclipse-foundation.org
Building on master in workspace /home/hudson/genie.cbi/.jenkins/jobs/hipp2jipp_sonar-test/workspace
 > /usr/local/bin/git rev-parse --is-inside-work-tree # timeout=10
Fetching changes from the remote Git repository
 > /usr/local/bin/git config remote.origin.url https://github.com/eclipse/hipp2jipp # timeout=10
Fetching upstream changes from https://github.com/eclipse/hipp2jipp
 > /usr/local/bin/git --version # timeout=10
 > /usr/local/bin/git fetch --tags --progress https://github.com/eclipse/hipp2jipp +refs/heads/*:refs/remotes/origin/*
 > /usr/local/bin/git rev-parse refs/remotes/origin/master^{commit} # timeout=10
 > /usr/local/bin/git rev-parse refs/remotes/origin/origin/master^{commit} # timeout=10
Checking out Revision 53aec1c2fe4a71024e124b30fb0d26f68d8a6ffb (refs/remotes/origin/master)
Commit message: "Add Jenkinsfile"
 > /usr/local/bin/git config core.sparsecheckout # timeout=10
 > /usr/local/bin/git checkout -f 53aec1c2fe4a71024e124b30fb0d26f68d8a6ffb
 > /usr/local/bin/git rev-list 53aec1c2fe4a71024e124b30fb0d26f68d8a6ffb # timeout=10
Injecting SonarQube environment variables using the configuration: Eclipse Sonar
[workspace] $ /shared/common/apache-maven-latest/bin/mvn clean verify
[INFO] Scanning for projects...
[INFO]                                                                         
[INFO] ------------------------------------------------------------------------
[INFO] Building hipp2jipp 0.0.2-SNAPSHOT
[INFO] ------------------------------------------------------------------------
[INFO] 
[INFO] --- maven-clean-plugin:2.5:clean (default-clean) @ hipp2jipp ---
[INFO] Deleting /jobs/genie.cbi/hipp2jipp_sonar-test/workspace/target
[INFO] 
[INFO] --- maven-resources-plugin:2.6:resources (default-resources) @ hipp2jipp ---
[INFO] Using 'UTF-8' encoding to copy filtered resources.
[INFO] Copying 4 resources
[INFO] 
[INFO] --- maven-compiler-plugin:2.3.2:compile (default-compile) @ hipp2jipp ---
[INFO] Compiling 2 source files to /jobs/genie.cbi/hipp2jipp_sonar-test/workspace/target/classes
[INFO] 
[INFO] --- maven-resources-plugin:2.6:testResources (default-testResources) @ hipp2jipp ---
[INFO] Using 'UTF-8' encoding to copy filtered resources.
[INFO] skip non existing resourceDirectory /jobs/genie.cbi/hipp2jipp_sonar-test/workspace/src/test/resources
[INFO] 
[INFO] --- maven-compiler-plugin:2.3.2:testCompile (default-testCompile) @ hipp2jipp ---
[INFO] Compiling 1 source file to /jobs/genie.cbi/hipp2jipp_sonar-test/workspace/target/test-classes
[INFO] 
[INFO] --- maven-surefire-plugin:2.12.4:test (default-test) @ hipp2jipp ---
[INFO] Surefire report directory: /jobs/genie.cbi/hipp2jipp_sonar-test/workspace/target/surefire-reports

-------------------------------------------------------
 T E S T S
-------------------------------------------------------
Running org.eclipse.cbi.hipp2jipp.XslTransformerTest
Done. File written: /jobs/genie.cbi/hipp2jipp_sonar-test/workspace/xml/original/timestamp/2016-11-30_14-56-00/build.transformed.xml
Done. File written: /jobs/genie.cbi/hipp2jipp_sonar-test/workspace/xml/transformed/config.job.hudson-package-drone.transformed.xml
Done. File written: /jobs/genie.cbi/hipp2jipp_sonar-test/workspace/xml/transformed/build.hudson-kapua.transformed.xml
Done. File written: /jobs/genie.cbi/hipp2jipp_sonar-test/workspace/xml/transformed/build.hudson-query.transformed.xml
Done. File written: /jobs/genie.cbi/hipp2jipp_sonar-test/workspace/xml/transformed/config.job.hudson-cbi1.transformed.xml
Done. File written: /jobs/genie.cbi/hipp2jipp_sonar-test/workspace/xml/transformed/config.job.hudson-cbi2.transformed.xml
Done. File written: /jobs/genie.cbi/hipp2jipp_sonar-test/workspace/xml/transformed/config.job.hudson-cbi3.transformed.xml
Done. File written: /jobs/genie.cbi/hipp2jipp_sonar-test/workspace/xml/transformed/config.job.hudson-cbi4.transformed.xml
Done. File written: /jobs/genie.cbi/hipp2jipp_sonar-test/workspace/xml/transformed/config.job.hudson-app4mc.transformed.xml
Done. File written: /jobs/genie.cbi/hipp2jipp_sonar-test/workspace/xml/transformed/config.job.hudson-omr.transformed.xml
Done. File written: /jobs/genie.cbi/hipp2jipp_sonar-test/workspace/xml/transformed/config.job.hudson-transaction.transformed.xml
Done. File written: /jobs/genie.cbi/hipp2jipp_sonar-test/workspace/xml/transformed/config.job.hudson-jgit1.transformed.xml
Done. File written: /jobs/genie.cbi/hipp2jipp_sonar-test/workspace/xml/transformed/config.job.hudson-jgit2.transformed.xml
Done. File written: /jobs/genie.cbi/hipp2jipp_sonar-test/workspace/xml/transformed/config.job.hudson-jgit3.transformed.xml
Done. File written: /jobs/genie.cbi/hipp2jipp_sonar-test/workspace/xml/transformed/config.job.hudson-kapua.transformed.xml
Done. File written: /jobs/genie.cbi/hipp2jipp_sonar-test/workspace/xml/transformed/config.job.hudson-kura1.transformed.xml
Done. File written: /jobs/genie.cbi/hipp2jipp_sonar-test/workspace/xml/transformed/config.job.hudson-kura2.transformed.xml
Done. File written: /jobs/genie.cbi/hipp2jipp_sonar-test/workspace/xml/transformed/config.job.hudson-query.transformed.xml
Done. File written: /jobs/genie.cbi/hipp2jipp_sonar-test/workspace/xml/transformed/config.job.hudson-simrel1.transformed.xml
Done. File written: /jobs/genie.cbi/hipp2jipp_sonar-test/workspace/xml/transformed/config.job.hudson-simrel2.transformed.xml
 2017-02-16_12-35-13 -> epoch date: 1487266513000Tests run: 23, Failures: 0, Errors: 0, Skipped: 0, Time elapsed: 1.739 sec

Results :

Tests run: 23, Failures: 0, Errors: 0, Skipped: 0

[INFO] 
[INFO] --- maven-jar-plugin:2.4:jar (default-jar) @ hipp2jipp ---
[INFO] Building jar: /jobs/genie.cbi/hipp2jipp_sonar-test/workspace/target/hipp2jipp-0.0.2-SNAPSHOT.jar
[INFO] ------------------------------------------------------------------------
[INFO] BUILD SUCCESS
[INFO] ------------------------------------------------------------------------
[INFO] Total time: 8.585 s
[INFO] Finished at: 2017-09-08T14:33:47-04:00
[INFO] Final Memory: 30M/1423M
[INFO] ------------------------------------------------------------------------
[workspace] $ /home/hudson/genie.cbi/.jenkins/tools/hudson.plugins.sonar.SonarRunnerInstallation/SonarQube_Scanner/bin/sonar-scanner -e -Dsonar.jdbc.url=jdbc:mysql://dbmaster:3306/sonar?autoReconnect=true&useUnicode=true&characterEncoding=utf8 ******** ******** -Dsonar.host.url=https://sonar.eclipse.org -Dsonar.projectBaseDir=/home/hudson/genie.cbi/.jenkins/jobs/hipp2jipp_sonar-test/workspace
INFO: Option -e/--errors is no longer supported and will be ignored
INFO: Scanner configuration file: /home/hudson/genie.cbi/.jenkins/tools/hudson.plugins.sonar.SonarRunnerInstallation/SonarQube_Scanner/conf/sonar-scanner.properties
INFO: Project root configuration file: NONE
INFO: SonarQube Scanner 3.0.3.778
INFO: Java 1.8.0_131 Oracle Corporation (64-bit)
INFO: Linux 3.12.62-60.64.8-default amd64
INFO: User cache: /opt/public/hipp/homes/genie.cbi/.sonar/cache
INFO: SonarQube server 4.5.7
INFO: Default locale: "en_US", source code encoding: "UTF-8" (analysis is platform dependent)
14:33:48.921 INFO  - Load global referentials...
14:33:49.059 INFO  - Load global referentials done: 141 ms
14:33:49.068 INFO  - User cache: /opt/public/hipp/homes/genie.cbi/.sonar/cache
14:33:49.076 INFO  - Install plugins
14:33:49.098 INFO  - Download sonar-core-plugin-4.5.7.jar
14:33:49.161 INFO  - Download sonar-email-notifications-plugin-4.5.7.jar
14:33:49.267 INFO  - Download sonar-findbugs-plugin-3.3.jar
14:33:50.043 INFO  - Download sonar-java-plugin-3.9.jar
14:33:50.337 INFO  - Download sonar-pmd-plugin-2.6.jar
14:33:50.991 INFO  - Download sonar-cpd-plugin-4.5.7.jar
14:33:51.000 INFO  - Download sonar-dbcleaner-plugin-4.5.7.jar
14:33:51.009 INFO  - Download sonar-design-plugin-4.5.7.jar
14:33:51.019 INFO  - Download sonar-l10n-en-plugin-4.5.7.jar
14:33:51.099 INFO  - Install JDBC driver
14:33:51.113 INFO  - Create JDBC datasource for jdbc:mysql://dbmaster:3306/sonar?autoReconnect=true&useUnicode=true&characterEncoding=utf8
14:33:52.372 INFO  - Initializing Hibernate
INFO: ------------------------------------------------------------------------
INFO: EXECUTION FAILURE
INFO: ------------------------------------------------------------------------
INFO: Total time: 5.593s
INFO: Final Memory: 48M/1434M
INFO: ------------------------------------------------------------------------
ERROR: Error during SonarQube Scanner execution
java.lang.IllegalStateException: You must define the following mandatory properties for 'Unknown': sonar.projectKey, sonar.projectName, sonar.projectVersion, sonar.sources
	at org.sonar.batch.scan.ProjectReactorBuilder.checkMandatoryProperties(ProjectReactorBuilder.java:289)
	at org.sonar.batch.scan.ProjectReactorBuilder.defineProject(ProjectReactorBuilder.java:125)
	at org.sonar.batch.scan.ProjectReactorBuilder.execute(ProjectReactorBuilder.java:114)
	at org.sonar.batch.scan.ProjectScanContainer.projectBootstrap(ProjectScanContainer.java:120)
	at org.sonar.batch.scan.ProjectScanContainer.doBeforeStart(ProjectScanContainer.java:98)
	at org.sonar.api.platform.ComponentContainer.startComponents(ComponentContainer.java:91)
	at org.sonar.api.platform.ComponentContainer.execute(ComponentContainer.java:78)
	at org.sonar.batch.scan.ScanTask.scan(ScanTask.java:64)
	at org.sonar.batch.scan.ScanTask.execute(ScanTask.java:51)
	at org.sonar.batch.bootstrap.TaskContainer.doAfterStart(TaskContainer.java:125)
	at org.sonar.api.platform.ComponentContainer.startComponents(ComponentContainer.java:93)
	at org.sonar.api.platform.ComponentContainer.execute(ComponentContainer.java:78)
	at org.sonar.batch.bootstrap.BootstrapContainer.executeTask(BootstrapContainer.java:173)
	at org.sonar.batch.bootstrapper.Batch.executeTask(Batch.java:95)
	at org.sonar.batch.bootstrapper.Batch.execute(Batch.java:67)
	at org.sonarsource.scanner.api.internal.batch.BatchIsolatedLauncher.executeOldVersion(BatchIsolatedLauncher.java:71)
	at sun.reflect.NativeMethodAccessorImpl.invoke0(Native Method)
	at sun.reflect.NativeMethodAccessorImpl.invoke(NativeMethodAccessorImpl.java:62)
	at sun.reflect.DelegatingMethodAccessorImpl.invoke(DelegatingMethodAccessorImpl.java:43)
	at java.lang.reflect.Method.invoke(Method.java:498)
	at org.sonarsource.scanner.api.internal.IsolatedLauncherProxy.invoke(IsolatedLauncherProxy.java:60)
	at com.sun.proxy.$Proxy0.executeOldVersion(Unknown Source)
	at org.sonarsource.scanner.api.EmbeddedScanner.doExecute(EmbeddedScanner.java:238)
	at org.sonarsource.scanner.api.EmbeddedScanner.runAnalysis(EmbeddedScanner.java:151)
	at org.sonarsource.scanner.cli.Main.runAnalysis(Main.java:123)
	at org.sonarsource.scanner.cli.Main.execute(Main.java:77)
	at org.sonarsource.scanner.cli.Main.main(Main.java:61)
ERROR: 
ERROR: Re-run SonarQube Scanner using the -X switch to enable full debug logging.
ERROR: SonarQube scanner exited with non-zero code: 1
Started calculate disk usage of build
Finished Calculation of disk usage of build in 0 seconds
Started calculate disk usage of workspace
Finished Calculation of disk usage of workspace in 0 seconds
Finished: FAILURE