FailedConsole Output

Started by user frederic.gurr@eclipse-foundation.org
Building on master in workspace /home/hudson/genie.cbi/.jenkins/jobs/hipp2jipp_sonar-test/workspace
 > /usr/local/bin/git rev-parse --is-inside-work-tree # timeout=10
Fetching changes from the remote Git repository
 > /usr/local/bin/git config remote.origin.url https://github.com/eclipse/hipp2jipp # timeout=10
Fetching upstream changes from https://github.com/eclipse/hipp2jipp
 > /usr/local/bin/git --version # timeout=10
 > /usr/local/bin/git fetch --tags --progress https://github.com/eclipse/hipp2jipp +refs/heads/*:refs/remotes/origin/*
 > /usr/local/bin/git rev-parse refs/remotes/origin/master^{commit} # timeout=10
 > /usr/local/bin/git rev-parse refs/remotes/origin/origin/master^{commit} # timeout=10
Checking out Revision 53aec1c2fe4a71024e124b30fb0d26f68d8a6ffb (refs/remotes/origin/master)
Commit message: "Add Jenkinsfile"
 > /usr/local/bin/git config core.sparsecheckout # timeout=10
 > /usr/local/bin/git checkout -f 53aec1c2fe4a71024e124b30fb0d26f68d8a6ffb
 > /usr/local/bin/git rev-list 53aec1c2fe4a71024e124b30fb0d26f68d8a6ffb # timeout=10
Injecting SonarQube environment variables using the configuration: Eclipse Sonar
[workspace] $ /shared/common/apache-maven-latest/bin/mvn clean verify org.codehaus.mojo:sonar-maven-plugin:2.7.1:sonar -Dsonar.host.url=http://sonar.eclipse.org -Dsonar.jdbc.url=jdbc:mysql://dbmaster:3306/sonar?autoReconnect=true&useUnicode=true&characterEncoding=utf8 -Dsonar.jdbc.username=sonar_rw -Dsonar.jdbc.password=******
[INFO] Scanning for projects...
Downloading: https://repo.maven.apache.org/maven2/org/codehaus/mojo/sonar-maven-plugin/2.7.1/sonar-maven-plugin-2.7.1.pom
3/9 KB   
5/9 KB   
8/9 KB   
9/9 KB   
         
Downloaded: https://repo.maven.apache.org/maven2/org/codehaus/mojo/sonar-maven-plugin/2.7.1/sonar-maven-plugin-2.7.1.pom (9 KB at 28.9 KB/sec)
Downloading: https://repo.maven.apache.org/maven2/org/codehaus/mojo/sonar-maven-plugin/2.7.1/sonar-maven-plugin-2.7.1.jar
3/45 KB   
5/45 KB   
8/45 KB   
11/45 KB   
13/45 KB   
16/45 KB   
19/45 KB   
21/45 KB   
24/45 KB   
27/45 KB   
29/45 KB   
32/45 KB   
36/45 KB   
40/45 KB   
44/45 KB   
45/45 KB   
           
Downloaded: https://repo.maven.apache.org/maven2/org/codehaus/mojo/sonar-maven-plugin/2.7.1/sonar-maven-plugin-2.7.1.jar (45 KB at 521.8 KB/sec)
[INFO]                                                                         
[INFO] ------------------------------------------------------------------------
[INFO] Building hipp2jipp 0.0.2-SNAPSHOT
[INFO] ------------------------------------------------------------------------
[INFO] 
[INFO] --- maven-clean-plugin:2.5:clean (default-clean) @ hipp2jipp ---
[INFO] Deleting /jobs/genie.cbi/hipp2jipp_sonar-test/workspace/target
[INFO] 
[INFO] --- maven-resources-plugin:2.6:resources (default-resources) @ hipp2jipp ---
[INFO] Using 'UTF-8' encoding to copy filtered resources.
[INFO] Copying 4 resources
[INFO] 
[INFO] --- maven-compiler-plugin:2.3.2:compile (default-compile) @ hipp2jipp ---
[INFO] Compiling 2 source files to /jobs/genie.cbi/hipp2jipp_sonar-test/workspace/target/classes
[INFO] 
[INFO] --- maven-resources-plugin:2.6:testResources (default-testResources) @ hipp2jipp ---
[INFO] Using 'UTF-8' encoding to copy filtered resources.
[INFO] skip non existing resourceDirectory /jobs/genie.cbi/hipp2jipp_sonar-test/workspace/src/test/resources
[INFO] 
[INFO] --- maven-compiler-plugin:2.3.2:testCompile (default-testCompile) @ hipp2jipp ---
[INFO] Compiling 1 source file to /jobs/genie.cbi/hipp2jipp_sonar-test/workspace/target/test-classes
[INFO] 
[INFO] --- maven-surefire-plugin:2.12.4:test (default-test) @ hipp2jipp ---
[INFO] Surefire report directory: /jobs/genie.cbi/hipp2jipp_sonar-test/workspace/target/surefire-reports

-------------------------------------------------------
 T E S T S
-------------------------------------------------------
Running org.eclipse.cbi.hipp2jipp.XslTransformerTest
Done. File written: /jobs/genie.cbi/hipp2jipp_sonar-test/workspace/xml/original/timestamp/2016-11-30_14-56-00/build.transformed.xml
Done. File written: /jobs/genie.cbi/hipp2jipp_sonar-test/workspace/xml/transformed/config.job.hudson-package-drone.transformed.xml
Done. File written: /jobs/genie.cbi/hipp2jipp_sonar-test/workspace/xml/transformed/build.hudson-kapua.transformed.xml
Done. File written: /jobs/genie.cbi/hipp2jipp_sonar-test/workspace/xml/transformed/build.hudson-query.transformed.xml
Done. File written: /jobs/genie.cbi/hipp2jipp_sonar-test/workspace/xml/transformed/config.job.hudson-cbi1.transformed.xml
Done. File written: /jobs/genie.cbi/hipp2jipp_sonar-test/workspace/xml/transformed/config.job.hudson-cbi2.transformed.xml
Done. File written: /jobs/genie.cbi/hipp2jipp_sonar-test/workspace/xml/transformed/config.job.hudson-cbi3.transformed.xml
Done. File written: /jobs/genie.cbi/hipp2jipp_sonar-test/workspace/xml/transformed/config.job.hudson-cbi4.transformed.xml
Done. File written: /jobs/genie.cbi/hipp2jipp_sonar-test/workspace/xml/transformed/config.job.hudson-app4mc.transformed.xml
Done. File written: /jobs/genie.cbi/hipp2jipp_sonar-test/workspace/xml/transformed/config.job.hudson-omr.transformed.xml
Done. File written: /jobs/genie.cbi/hipp2jipp_sonar-test/workspace/xml/transformed/config.job.hudson-transaction.transformed.xml
Done. File written: /jobs/genie.cbi/hipp2jipp_sonar-test/workspace/xml/transformed/config.job.hudson-jgit1.transformed.xml
Done. File written: /jobs/genie.cbi/hipp2jipp_sonar-test/workspace/xml/transformed/config.job.hudson-jgit2.transformed.xml
Done. File written: /jobs/genie.cbi/hipp2jipp_sonar-test/workspace/xml/transformed/config.job.hudson-jgit3.transformed.xml
Done. File written: /jobs/genie.cbi/hipp2jipp_sonar-test/workspace/xml/transformed/config.job.hudson-kapua.transformed.xml
Done. File written: /jobs/genie.cbi/hipp2jipp_sonar-test/workspace/xml/transformed/config.job.hudson-kura1.transformed.xml
Done. File written: /jobs/genie.cbi/hipp2jipp_sonar-test/workspace/xml/transformed/config.job.hudson-kura2.transformed.xml
Done. File written: /jobs/genie.cbi/hipp2jipp_sonar-test/workspace/xml/transformed/config.job.hudson-query.transformed.xml
Done. File written: /jobs/genie.cbi/hipp2jipp_sonar-test/workspace/xml/transformed/config.job.hudson-simrel1.transformed.xml
Done. File written: /jobs/genie.cbi/hipp2jipp_sonar-test/workspace/xml/transformed/config.job.hudson-simrel2.transformed.xml
 2017-02-16_12-35-13 -> epoch date: 1487266513000Tests run: 23, Failures: 0, Errors: 0, Skipped: 0, Time elapsed: 1.583 sec

Results :

Tests run: 23, Failures: 0, Errors: 0, Skipped: 0

[INFO] 
[INFO] --- maven-jar-plugin:2.4:jar (default-jar) @ hipp2jipp ---
[INFO] Building jar: /jobs/genie.cbi/hipp2jipp_sonar-test/workspace/target/hipp2jipp-0.0.2-SNAPSHOT.jar
[INFO]                                                                         
[INFO] ------------------------------------------------------------------------
[INFO] Building hipp2jipp 0.0.2-SNAPSHOT
[INFO] ------------------------------------------------------------------------
[INFO] 
[INFO] --- sonar-maven-plugin:2.7.1:sonar (default-cli) @ hipp2jipp ---
Downloading: https://repo.maven.apache.org/maven2/org/sonarsource/sonar-runner/sonar-runner-api/2.5-RC1/sonar-runner-api-2.5-RC1.pom
3/7 KB     
5/7 KB   
7/7 KB   
         
Downloaded: https://repo.maven.apache.org/maven2/org/sonarsource/sonar-runner/sonar-runner-api/2.5-RC1/sonar-runner-api-2.5-RC1.pom (7 KB at 120.7 KB/sec)
Downloading: https://repo.maven.apache.org/maven2/org/sonarsource/sonar-runner/sonar-runner/2.5-RC1/sonar-runner-2.5-RC1.pom
3/4 KB   
4/4 KB   
         
Downloaded: https://repo.maven.apache.org/maven2/org/sonarsource/sonar-runner/sonar-runner/2.5-RC1/sonar-runner-2.5-RC1.pom (4 KB at 77.9 KB/sec)
Downloading: https://repo.maven.apache.org/maven2/org/sonarsource/parent/parent/23/parent-23.pom
3/23 KB   
5/23 KB   
8/23 KB   
11/23 KB   
13/23 KB   
16/23 KB   
19/23 KB   
21/23 KB   
23/23 KB   
           
Downloaded: https://repo.maven.apache.org/maven2/org/sonarsource/parent/parent/23/parent-23.pom (23 KB at 386.2 KB/sec)
Downloading: https://repo.maven.apache.org/maven2/org/sonarsource/sonar-runner/sonar-runner-api/2.5-RC1/sonar-runner-api-2.5-RC1.jar
3/173 KB   
5/173 KB   
8/173 KB   
11/173 KB   
13/173 KB   
16/173 KB   
19/173 KB   
21/173 KB   
24/173 KB   
27/173 KB   
29/173 KB   
32/173 KB   
36/173 KB   
40/173 KB   
44/173 KB   
48/173 KB   
52/173 KB   
56/173 KB   
60/173 KB   
64/173 KB   
68/173 KB   
72/173 KB   
76/173 KB   
80/173 KB   
84/173 KB   
88/173 KB   
92/173 KB   
96/173 KB   
100/173 KB   
104/173 KB   
108/173 KB   
112/173 KB   
116/173 KB   
120/173 KB   
124/173 KB   
128/173 KB   
132/173 KB   
136/173 KB   
140/173 KB   
144/173 KB   
148/173 KB   
152/173 KB   
156/173 KB   
160/173 KB   
164/173 KB   
168/173 KB   
172/173 KB   
173/173 KB   
             
Downloaded: https://repo.maven.apache.org/maven2/org/sonarsource/sonar-runner/sonar-runner-api/2.5-RC1/sonar-runner-api-2.5-RC1.jar (173 KB at 1483.9 KB/sec)
[INFO] User cache: /opt/public/hipp/homes/genie.cbi/.sonar/cache
[INFO] ------------------------------------------------------------------------
[INFO] BUILD FAILURE
[INFO] ------------------------------------------------------------------------
[INFO] Total time: 6.135 s
[INFO] Finished at: 2017-09-08T13:31:09-04:00
[INFO] Final Memory: 30M/2017M
[INFO] ------------------------------------------------------------------------
[ERROR] Failed to execute goal org.codehaus.mojo:sonar-maven-plugin:2.7.1:sonar (default-cli) on project hipp2jipp: Fail to download libraries from server: Status returned by url : 'http://sonar.eclipse.org/batch_bootstrap/index' is invalid : 302 -> [Help 1]
[ERROR] 
[ERROR] To see the full stack trace of the errors, re-run Maven with the -e switch.
[ERROR] Re-run Maven using the -X switch to enable full debug logging.
[ERROR] 
[ERROR] For more information about the errors and possible solutions, please read the following articles:
[ERROR] [Help 1] http://cwiki.apache.org/confluence/display/MAVEN/MojoExecutionException
Build step 'Invoke top-level Maven targets' marked build as failure
Started calculate disk usage of build
Finished Calculation of disk usage of build in 0 seconds
Started calculate disk usage of workspace
Finished Calculation of disk usage of workspace in 0 seconds
Finished: FAILURE