FailedConsole Output

Started by user frederic.gurr@eclipse-foundation.org
Building on master in workspace /home/hudson/genie.cbi/.jenkins/jobs/hipp2jipp_sonar-test/workspace
 > /usr/local/bin/git rev-parse --is-inside-work-tree # timeout=10
Fetching changes from the remote Git repository
 > /usr/local/bin/git config remote.origin.url https://github.com/eclipse/hipp2jipp # timeout=10
Fetching upstream changes from https://github.com/eclipse/hipp2jipp
 > /usr/local/bin/git --version # timeout=10
 > /usr/local/bin/git fetch --tags --progress https://github.com/eclipse/hipp2jipp +refs/heads/*:refs/remotes/origin/*
 > /usr/local/bin/git rev-parse refs/remotes/origin/master^{commit} # timeout=10
 > /usr/local/bin/git rev-parse refs/remotes/origin/origin/master^{commit} # timeout=10
Checking out Revision 53aec1c2fe4a71024e124b30fb0d26f68d8a6ffb (refs/remotes/origin/master)
Commit message: "Add Jenkinsfile"
 > /usr/local/bin/git config core.sparsecheckout # timeout=10
 > /usr/local/bin/git checkout -f 53aec1c2fe4a71024e124b30fb0d26f68d8a6ffb
 > /usr/local/bin/git rev-list 53aec1c2fe4a71024e124b30fb0d26f68d8a6ffb # timeout=10
Injecting SonarQube environment variables using the configuration: Eclipse Sonar
[workspace] $ /shared/common/apache-maven-latest/bin/mvn clean verify org.codehaus.mojo:sonar-maven-plugin:jar:2.7.1:sonar -Dsonar.host.url=http://sonar.eclipse.org -Dsonar.jdbc.url=jdbc:mysql://dbmaster:3306/sonar?autoReconnect=true&useUnicode=true&characterEncoding=utf8 -Dsonar.jdbc.username=sonar_rw -Dsonar.jdbc.password=******
[INFO] Scanning for projects...
Downloading: https://repo.maven.apache.org/maven2/org/codehaus/mojo/sonar-maven-plugin/jar/sonar-maven-plugin-jar.pom

[WARNING] The POM for org.codehaus.mojo:sonar-maven-plugin:jar:jar is missing, no dependency information available
Downloading: https://repo.maven.apache.org/maven2/org/codehaus/mojo/sonar-maven-plugin/jar/sonar-maven-plugin-jar.jar

[INFO] ------------------------------------------------------------------------
[INFO] BUILD FAILURE
[INFO] ------------------------------------------------------------------------
[INFO] Total time: 1.063 s
[INFO] Finished at: 2017-09-08T13:30:07-04:00
[INFO] Final Memory: 26M/1932M
[INFO] ------------------------------------------------------------------------
[ERROR] Plugin org.codehaus.mojo:sonar-maven-plugin:jar or one of its dependencies could not be resolved: Could not find artifact org.codehaus.mojo:sonar-maven-plugin:jar:jar in central (https://repo.maven.apache.org/maven2) -> [Help 1]
[ERROR] 
[ERROR] To see the full stack trace of the errors, re-run Maven with the -e switch.
[ERROR] Re-run Maven using the -X switch to enable full debug logging.
[ERROR] 
[ERROR] For more information about the errors and possible solutions, please read the following articles:
[ERROR] [Help 1] http://cwiki.apache.org/confluence/display/MAVEN/PluginResolutionException
Build step 'Invoke top-level Maven targets' marked build as failure
Started calculate disk usage of build
Finished Calculation of disk usage of build in 0 seconds
Started calculate disk usage of workspace
Finished Calculation of disk usage of workspace in 0 seconds
Finished: FAILURE