FailedConsole Output

Skipping 2,808 KB.. Full Log
sult.zip
[INFO] aut1/out.txt already added, skipping
[INFO] 
[INFO] --- tycho-source-plugin:1.1.0:plugin-source (plugin-source) @ org.polarsys.capella.studio.ad.viewpoint.rcptt ---
[INFO] 
[INFO] --- tycho-source-feature-plugin:1.1.0:source-feature (source-feature) @ org.polarsys.capella.studio.ad.viewpoint.rcptt ---
[INFO]                                                                         
[INFO] ------------------------------------------------------------------------
[INFO] Building capellastudio.vpdsl.qualityassessment.reverse.tests 1.3.1-SNAPSHOT
[INFO] ------------------------------------------------------------------------
[INFO] 
[INFO] --- maven-clean-plugin:2.5:clean (default-clean) @ capellastudio.vpdsl.qualityassessment.reverse.tests ---
[INFO] 
[INFO] --- jacoco-maven-plugin:0.7.9:prepare-agent (default) @ capellastudio.vpdsl.qualityassessment.reverse.tests ---
[INFO] failsafeArgline set to -javaagent:/home/jenkins/.m2/repository/org/jacoco/org.jacoco.agent/0.7.9/org.jacoco.agent-0.7.9-runtime.jar=destfile=/home/jenkins/agent/workspace/capella-studio-v1.3.x/vpdsl/tests/capellastudio.vpdsl.qualityassessment.reverse.tests/target/jacoco.exec
[INFO] 
[INFO] --- rcptt-maven-plugin:2.2.0:resources (default-resources) @ capellastudio.vpdsl.qualityassessment.reverse.tests ---
[INFO] Resolving artifact org.eclipse.rcptt.runner:rcptt.runner:zip:2.2.0, this may take a while ...
[INFO] Artifact org.eclipse.rcptt.runner:rcptt.runner:zip:2.2.0 is resolved to /home/jenkins/.m2/repository/org/eclipse/rcptt/runner/rcptt.runner/2.2.0/rcptt.runner-2.2.0.zip
[INFO] Using AUT from /home/jenkins/agent/workspace/capella-studio-v1.3.x/vpdsl/tests/capellastudio.vpdsl.qualityassessment.reverse.tests/../../../releng/plugins/org.polarsys.capella.studio.releng.product/target/products/org.polarsys.capella.studio.releng.product/linux/gtk/x86_64
[INFO] Extracting RCPTT runner to /home/jenkins/agent/workspace/capella-studio-v1.3.x/vpdsl/tests/capellastudio.vpdsl.qualityassessment.reverse.tests/target/runner
[INFO] Copying project contents to target directory...
[INFO] 
[INFO] --- rcptt-maven-plugin:2.2.0:execute (default-execute) @ capellastudio.vpdsl.qualityassessment.reverse.tests ---
[INFO] Runner command line is /bin/sh -c cd /home/jenkins/agent/workspace/capella-studio-v1.3.x/vpdsl/tests/capellastudio.vpdsl.qualityassessment.reverse.tests/target/runner/eclipse && /opt/tools/java/oracle/jdk-8/1.8.0_202/jre/bin/java -Xms128m -Xmx256m -Dorg.eclipse.rcptt.runner.returnTestFailure=true -jar /home/jenkins/agent/workspace/capella-studio-v1.3.x/vpdsl/tests/capellastudio.vpdsl.qualityassessment.reverse.tests/target/runner/eclipse/plugins/org.eclipse.equinox.launcher_1.4.0.v20161219-1356.jar -application org.eclipse.rcptt.runner.headless -runnerPlatform swt -data /home/jenkins/agent/workspace/capella-studio-v1.3.x/vpdsl/tests/capellastudio.vpdsl.qualityassessment.reverse.tests/target/runner-workspace -aut /home/jenkins/agent/workspace/capella-studio-v1.3.x/vpdsl/tests/capellastudio.vpdsl.qualityassessment.reverse.tests/../../../releng/plugins/org.polarsys.capella.studio.releng.product/target/products/org.polarsys.capella.studio.releng.product/linux/gtk/x86_64 -autWsPrefix /home/jenkins/agent/workspace/capella-studio-v1.3.x/vpdsl/tests/capellastudio.vpdsl.qualityassessment.reverse.tests/target/aut-ws- -autConsolePrefix /home/jenkins/agent/workspace/capella-studio-v1.3.x/vpdsl/tests/capellastudio.vpdsl.qualityassessment.reverse.tests/target/results/aut-console- -autVMArgs -javaagent:/home/jenkins/.m2/repository/org/jacoco/org.jacoco.agent/0.7.9/org.jacoco.agent-0.7.9-runtime.jar=destfile=/home/jenkins/agent/workspace/capella-studio-v1.3.x/vpdsl/tests/capellastudio.vpdsl.qualityassessment.reverse.tests/target/jacoco.exec -q7report /home/jenkins/agent/workspace/capella-studio-v1.3.x/vpdsl/tests/capellastudio.vpdsl.qualityassessment.reverse.tests/target/results/capellastudio.vpdsl.qualityassessment.reverse.tests.report -htmlReport /home/jenkins/agent/workspace/capella-studio-v1.3.x/vpdsl/tests/capellastudio.vpdsl.qualityassessment.reverse.tests/target/results/capellastudio.vpdsl.qualityassessment.reverse.tests.html -junitReport /home/jenkins/agent/workspace/capella-studio-v1.3.x/vpdsl/tests/capellastudio.vpdsl.qualityassessment.reverse.tests/target/surefire-reports/TEST-capellastudio.vpdsl.qualityassessment.reverse.tests.xml -import /home/jenkins/agent/workspace/capella-studio-v1.3.x/vpdsl/tests/capellastudio.vpdsl.qualityassessment.reverse.tests/target/projects/capellastudio.vpdsl.qualityassessment.reverse.tests -testOptions 'testExecTimeout=300;execTimeout=3600' -timeout 3600 -shutdownListenerPort 9712
[INFO] The execution timeout is set to 3600 seconds
[ERROR] Picked up JAVA_TOOL_OPTIONS: -XX:+IgnoreUnrecognizedVMOptions -XX:+UseContainerSupport -XX:+UnlockExperimentalVMOptions -XX:+UseCGroupMemoryLimitForHeap
[ERROR] Picked up _JAVA_OPTIONS: -XX:MaxRAMPercentage=64.0
[INFO] Started at Tue Jan 21 17:23:34 UTC 2020
[INFO] RCPTT Runner version: 2.2.0
[INFO] Initializing target platform...
[INFO] Begin task: Create AUT configuration
[INFO] progress: Resolving Target Contents...
[INFO] progress: Reading plug-ins
[INFO] progress: Fetching p2.index from platform:/plugin/org.eclipse.rcptt.updates.runtime.e4x/q7/
[INFO] progress: Adding repository platform:///plugin/org.eclipse.rcptt.updates.runtime.e4x/q7/
[INFO] progress: Fetching content.jar from platform:/plugin/org.eclipse.rcptt.updates.runtime.e4x/q7/
[INFO] progress: Fetching p2.index from platform:/plugin/org.eclipse.rcptt.updates.runtime.e4x/q7/
[INFO] progress: Adding repository platform:///plugin/org.eclipse.rcptt.updates.runtime.e4x/q7/
[INFO] progress: Fetching content.jar from platform:/plugin/org.eclipse.rcptt.updates.runtime.e4x/q7/
[INFO] progress: Fetching p2.index from platform:/plugin/org.eclipse.rcptt.updates.runtime.e4x/q7/
[INFO] progress: Adding repository platform:///plugin/org.eclipse.rcptt.updates.runtime.e4x/q7/
[INFO] progress: Fetching artifacts.jar from platform:/plugin/org.eclipse.rcptt.updates.runtime.e4x/q7/
[INFO] progress: Downloading org.antlr.runtime
[INFO] progress: Adding repository platform:///plugin/org.eclipse.rcptt.updates.aspectj.e44x/dependencies/
[INFO] progress: Fetching content.jar from platform:/plugin/org.eclipse.rcptt.updates.aspectj.e44x/dependencies/
[INFO] progress: Adding repository platform:///plugin/org.eclipse.rcptt.updates.aspectj.e44x/dependencies/
[INFO] progress: Fetching artifacts.jar from platform:/plugin/org.eclipse.rcptt.updates.aspectj.e44x/dependencies/
[INFO] progress: Downloading org.aspectj.runtime
[INFO] progress: Downloading org.eclipse.equinox.weaving.aspectj
[INFO] progress: Downloading org.eclipse.equinox.weaving.hook
[INFO] progress: Downloading org.aspectj.weaver
[INFO] progress: Adding repository platform:///plugin/org.eclipse.rcptt.updates.kepler/dependencies/
[INFO] progress: Fetching content.jar from platform:/plugin/org.eclipse.rcptt.updates.kepler/dependencies/
[INFO] progress: Adding repository platform:///plugin/org.eclipse.rcptt.updates.kepler/dependencies/
[INFO] progress: Fetching artifacts.jar from platform:/plugin/org.eclipse.rcptt.updates.kepler/dependencies/
[INFO] progress: Downloading org.eclipse.emf.converter
[INFO] progress: Downloading org.eclipse.emf.ecore.change
[INFO] progress: Downloading org.eclipse.emf.mapping.ecore2ecore
[INFO] progress: Downloading org.eclipse.emf.codegen.ecore
[INFO] progress: Downloading org.eclipse.emf.validation
[INFO] progress: Downloading org.eclipse.emf.transaction.ui
[INFO] progress: Downloading org.eclipse.emf.mapping.ecore.editor
[INFO] progress: Downloading org.eclipse.emf.validation_root
[INFO] progress: Downloading org.eclipse.emf
[INFO] progress: Downloading org.eclipse.emf.ecore.change.edit
[INFO] progress: Downloading org.eclipse.emf.importer.ecore
[INFO] progress: Downloading org.eclipse.emf.codegen.ui
[INFO] progress: Downloading org.eclipse.emf.mapping.ecore2ecore.editor
[INFO] progress: Downloading org.eclipse.emf.ecore.xmi
[INFO] progress: Downloading org.eclipse.emf.mapping.ui
[INFO] progress: Downloading org.eclipse.emf.databinding.edit
[INFO] progress: Downloading org.eclipse.emf.mapping
[INFO] progress: Downloading org.eclipse.emf.ecore
[INFO] progress: Downloading org.eclipse.emf.codegen.ecore.ui
[INFO] progress: Downloading org.eclipse.emf.importer
[INFO] progress: Downloading org.eclipse.emf.mapping.ecore2xml.ui
[INFO] progress: Downloading org.eclipse.emf.databinding
[INFO] progress: Downloading org.eclipse.emf
[INFO] progress: Downloading org.eclipse.emf.ecore.edit
[INFO] progress: Downloading org.eclipse.emf.databinding
[INFO] progress: Downloading org.eclipse.emf.validation.ui
[INFO] progress: Downloading org.eclipse.emf.query
[INFO] progress: Downloading org.eclipse.emf.transaction
[INFO] progress: Downloading org.eclipse.emf.ecore.editor
[INFO] progress: Downloading org.eclipse.emf.codegen.ecore
[INFO] progress: Downloading org.eclipse.emf.common.ui
[INFO] progress: Downloading org.eclipse.emf.mapping.ecore2xml
[INFO] progress: Downloading org.eclipse.emf.mapping.ecore
[INFO] progress: Downloading org.eclipse.emf.ecore
[INFO] progress: Downloading org.eclipse.emf.query
[INFO] progress: Downloading org.eclipse.emf.mapping
[INFO] progress: Downloading org.eclipse.emf.edit.ui
[INFO] progress: Downloading org.eclipse.emf.exporter
[INFO] progress: Downloading org.eclipse.emf.mapping.ui
[INFO] progress: Downloading org.eclipse.emf.converter
[INFO] progress: Downloading org.eclipse.emf.transaction
[INFO] progress: Downloading org.eclipse.emf.transaction_root
[INFO] progress: Downloading org.eclipse.emf.databinding.edit
[INFO] progress: Downloading org.eclipse.emf.ecore.edit
[INFO] progress: Downloading org.eclipse.emf.validation
[INFO] progress: Downloading org.eclipse.emf.importer.rose
[INFO] progress: Downloading org.eclipse.emf.edit.ui
[INFO] progress: Downloading org.eclipse.emf.ant
[INFO] progress: Downloading org.eclipse.emf.importer.java
[INFO] progress: Downloading org.eclipse.emf.codegen.ecore.ui
[INFO] progress: Downloading org.eclipse.emf.edit
[INFO] progress: Downloading org.eclipse.emf.codegen
[INFO] progress: Downloading org.eclipse.emf.common.ui
[INFO] progress: Downloading org.eclipse.emf.common
[INFO] progress: Downloading org.eclipse.emf.ecore.editor
[INFO] progress: Downloading org.eclipse.emf.mapping.ecore
[INFO] progress: Downloading org.eclipse.emf.mapping.ecore.editor
[INFO] progress: Downloading org.eclipse.emf.validation.ui.ide
[INFO] progress: Downloading org.eclipse.emf.edit
[INFO] progress: Downloading org.eclipse.emf.common
[INFO] progress: Downloading org.eclipse.emf.codegen
[INFO] progress: Downloading org.eclipse.emf.query_root
[INFO] progress: Downloading org.eclipse.emf.codegen.ui
[INFO] progress: Adding repository platform:///plugin/org.eclipse.rcptt.module.nebula.updates/runtime/
[INFO] progress: Fetching content.jar from platform:/plugin/org.eclipse.rcptt.module.nebula.updates/runtime/
[INFO] progress: Adding repository platform:///plugin/org.eclipse.rcptt.module.nebula.updates/runtime/
[INFO] progress: Fetching artifacts.jar from platform:/plugin/org.eclipse.rcptt.module.nebula.updates/runtime/
[INFO] progress: Adding repository platform:///plugin/org.eclipse.rcptt.module.testrail.updates/runtime/
[INFO] progress: Fetching content.jar from platform:/plugin/org.eclipse.rcptt.module.testrail.updates/runtime/
[INFO] progress: Adding repository platform:///plugin/org.eclipse.rcptt.module.testrail.updates/runtime/
[INFO] progress: Fetching artifacts.jar from platform:/plugin/org.eclipse.rcptt.module.testrail.updates/runtime/
[INFO] progress: Adding repository platform:///plugin/org.eclipse.rcptt.updates.extra/dependencies/
[INFO] progress: Fetching content.jar from platform:/plugin/org.eclipse.rcptt.updates.extra/dependencies/
[INFO] progress: Adding repository platform:///plugin/org.eclipse.rcptt.updates.extra/dependencies/
[INFO] progress: Fetching artifacts.jar from platform:/plugin/org.eclipse.rcptt.updates.extra/dependencies/
[INFO] progress: Downloading org.apache.poi.ooxml
[INFO] progress: Downloading org.apache.poi.ooxml.schemas
[INFO] progress: Downloading org.dom4j
[INFO] progress: Downloading org.apache.xmlbeans
[INFO] progress: Downloading org.apache.poi
[INFO] progress: Resolving Target Contents...
[INFO] progress: Reading plug-ins
[INFO] progress: Fetching p2.index from platform:/plugin/org.eclipse.rcptt.updates.runtime.e4x/q7/
[INFO] progress: Fetching content.jar from platform:/plugin/org.eclipse.rcptt.updates.runtime.e4x/q7/
[INFO] progress: Fetching content.jar from platform:/plugin/org.eclipse.rcptt.updates.aspectj.e44x/dependencies/
[INFO] progress: Fetching content.jar from platform:/plugin/org.eclipse.rcptt.updates.kepler/dependencies/
[INFO] progress: Fetching content.jar from platform:/plugin/org.eclipse.rcptt.module.nebula.updates/runtime/
[INFO] progress: Fetching content.jar from platform:/plugin/org.eclipse.rcptt.module.testrail.updates/runtime/
[INFO] progress: Fetching content.jar from platform:/plugin/org.eclipse.rcptt.updates.extra/dependencies/
[INFO] progress: Fetching p2.index from platform:/plugin/org.eclipse.rcptt.updates.runtime.e4x/q7/
[INFO] progress: Fetching artifacts.jar from platform:/plugin/org.eclipse.rcptt.updates.runtime.e4x/q7/
[INFO] progress: Fetching artifacts.jar from platform:/plugin/org.eclipse.rcptt.module.testrail.updates/runtime/
[INFO] progress: Fetching artifacts.jar from platform:/plugin/org.eclipse.rcptt.updates.kepler/dependencies/
[INFO] progress: Fetching artifacts.jar from platform:/plugin/org.eclipse.rcptt.module.nebula.updates/runtime/
[INFO] progress: Fetching artifacts.jar from platform:/plugin/org.eclipse.rcptt.updates.aspectj.e44x/dependencies/
[INFO] progress: Fetching artifacts.jar from platform:/plugin/org.eclipse.rcptt.updates.extra/dependencies/
[INFO] progress: Downloading org.eclipse.emf.validation_root
[INFO] progress: Downloading org.eclipse.emf.transaction_root
[INFO] progress: Downloading org.eclipse.emf.query_root
[INFO] progress: Installing org.eclipse.emf.ecore.change
[INFO] progress: Installing org.eclipse.rcptt.tesla.workbench.aspects.e4x
[INFO] progress: Installing org.eclipse.rcptt.tesla.core.am
[INFO] progress: Installing org.eclipse.rcptt.tesla.gmf.aspects
[INFO] progress: Installing org.eclipse.rcptt.watson.aspects.swt
[INFO] progress: Installing org.eclipse.rcptt.ecl.client.tcp
[INFO] progress: Installing org.eclipse.rcptt.tesla.jdt.aspects
[INFO] progress: Installing org.eclipse.rcptt.tesla.ecl.feature.group
[INFO] progress: Installing org.eclipse.rcptt.tesla.recording.aspects.forms
[INFO] progress: Installing org.eclipse.rcptt.watson.jface
[INFO] progress: Installing org.eclipse.emf.ecore.xmi
[INFO] progress: Installing org.eclipse.rcptt.verifications
[INFO] progress: Installing org.eclipse.emf.mapping.feature.jar
[INFO] progress: Installing org.eclipse.rcptt.tesla.jface.fragment
[INFO] progress: Installing org.dom4j
[INFO] progress: Installing org.eclipse.rcptt.testrail.ecl
[INFO] progress: Installing org.eclipse.rcptt.ecl.dispatch
[INFO] progress: Installing org.eclipse.emf.importer
[INFO] progress: Installing org.eclipse.emf.mapping.ecore2xml.ui
[INFO] progress: Installing org.eclipse.rcptt.watson.jobs
[INFO] progress: Installing org.eclipse.rcptt.tesla.runtime.feature.jar
[INFO] progress: Installing org.eclipse.rcptt.verifications.tree
[INFO] progress: Installing org.eclipse.rcptt.reporting
[INFO] progress: Installing org.eclipse.emf.ecore.edit
[INFO] progress: Installing org.eclipse.rcptt.forms.impl
[INFO] progress: Installing org.eclipse.emf.edit.feature.group
[INFO] progress: Installing org.eclipse.emf.transaction
[INFO] progress: Installing org.eclipse.rcptt.tesla.jface.text.reconciler.aspects
[INFO] progress: Installing org.eclipse.rcptt.ecl.perf
[INFO] progress: Installing org.eclipse.emf.codegen.ecore.feature.jar
[INFO] progress: Installing org.eclipse.rcptt.expandbar.runtime
[INFO] progress: Installing org.eclipse.rcptt.tesla.recording.draw2d
[INFO] progress: Installing org.eclipse.emf.mapping.ecore.editor.feature.group
[INFO] progress: Installing org.eclipse.emf.common.ui.feature.jar
[INFO] progress: Installing org.eclipse.rcptt.ecl.platform.ui.feature.jar
[INFO] progress: Installing org.eclipse.emf.ecore.edit.feature.group
[INFO] progress: Installing org.eclipse.rcptt.ctx.debug
[INFO] progress: Installing org.eclipse.rcptt.module.nebula.runtime.feature.group
[INFO] progress: Installing org.eclipse.rcptt.tesla.nebula
[INFO] progress: Installing org.eclipse.rcptt.tesla.recording.aspects.workbench
[INFO] progress: Installing org.eclipse.rcptt.tesla.core.context
[INFO] progress: Installing org.eclipse.emf.transaction.feature.jar
[INFO] progress: Installing org.eclipse.rcptt.tesla.recording.workbench.texteditor
[INFO] progress: Installing org.eclipse.rcptt.tesla.core
[INFO] progress: Installing org.eclipse.rcptt.tesla.nebula.impl
[INFO] progress: Installing org.eclipse.rcptt.ctx.group
[INFO] progress: Installing org.eclipse.emf.ecore.edit.feature.jar
[INFO] progress: Installing org.eclipse.rcptt.runtime.feature.jar
[INFO] progress: Installing org.eclipse.emf.validation
[INFO] progress: Installing org.eclipse.rcptt.ecl.platform.ui.feature.group
[INFO] progress: Installing org.eclipse.emf.edit.ui
[INFO] progress: Installing org.eclipse.rcptt.tesla.workbench.texteditor
[INFO] progress: Installing org.eclipse.emf.edit.feature.jar
[INFO] progress: Installing org.eclipse.equinox.weaving.aspectj
[INFO] progress: Installing org.eclipse.emf.validation.ui.ide
[INFO] progress: Installing org.eclipse.emf.edit
[INFO] progress: Installing org.eclipse.rcptt.ctx.workbench.impl
[INFO] progress: Installing org.eclipse.rcptt.tesla.ecl.impl
[INFO] progress: Installing org.eclipse.rcptt.tesla.gef
[INFO] progress: Installing org.eclipse.rcptt.ecl.interop
[INFO] progress: Installing org.eclipse.rcptt.tesla.ecl.runtime.feature.jar
[INFO] progress: Installing org.eclipse.rcptt.ctx.workbench
[INFO] progress: Installing org.eclipse.rcptt.verifications.text
[INFO] progress: Installing org.eclipse.emf.converter.feature.group
[INFO] progress: Installing org.eclipse.emf.codegen.ecore
[INFO] progress: Installing org.eclipse.emf.validation.feature.jar
[INFO] progress: Installing org.eclipse.emf.transaction.ui
[INFO] progress: Installing org.eclipse.emf.databinding.edit.feature.group
[INFO] progress: Installing org.eclipse.rcptt.logging
[INFO] progress: Installing org.eclipse.rcptt.ctx.resources
[INFO] progress: Installing org.eclipse.rcptt.module.testrail.runtime.feature.group
[INFO] progress: Installing org.eclipse.rcptt.tesla.recording.core.ecl
[INFO] progress: Installing org.eclipse.rcptt.ctx.group.impl
[INFO] progress: Installing org.eclipse.rcptt.tesla.recording.aspects.jface
[INFO] progress: Installing org.eclipse.emf.common.ui.feature.group
[INFO] progress: Installing org.apache.poi.ooxml.schemas
[INFO] progress: Installing org.eclipse.emf.ecore.change.edit
[INFO] progress: Installing org.eclipse.rcptt.core.scenario
[INFO] progress: Installing org.eclipse.emf.mapping.ecore2ecore.editor
[INFO] progress: Installing org.antlr.runtime
[INFO] progress: Installing org.eclipse.rcptt.module.testrail.runtime.feature.jar
[INFO] progress: Installing org.eclipse.rcptt.watson.aspects.jobs
[INFO] progress: Installing org.eclipse.rcptt.ecl.platform.ui
[INFO] progress: Installing org.eclipse.emf.databinding.edit
[INFO] progress: Installing org.eclipse.rcptt.tesla.swt.e4x
[INFO] progress: Installing org.eclipse.rcptt.ecl.filesystem
[INFO] progress: Installing org.eclipse.rcptt.tesla.jobs.aspects
[INFO] progress: Installing org.eclipse.rcptt.tesla.ecl.feature.jar
[INFO] progress: Installing org.eclipse.emf.edit.ui.feature.group
[INFO] progress: Installing org.eclipse.rcptt.verifications.tree.impl
[INFO] progress: Installing org.eclipse.rcptt.watson.runtime.feature.jar
[INFO] progress: Installing org.eclipse.emf
[INFO] progress: Installing org.eclipse.rcptt.ecl.parser
[INFO] progress: Installing org.eclipse.rcptt.tesla.recording.canvas
[INFO] progress: Installing org.eclipse.rcptt.tesla.jface.text
[INFO] progress: Installing org.eclipse.rcptt.ecl.doc
[INFO] progress: Installing org.eclipse.rcptt.tesla.swt.aspects
[INFO] progress: Installing org.eclipse.emf.validation.ui
[INFO] progress: Installing org.eclipse.rcptt.tesla.runtime.feature.group
[INFO] progress: Installing org.eclipse.rcptt.ctx.preferences.aspects
[INFO] progress: Installing org.eclipse.emf.codegen.ecore.feature.group
[INFO] progress: Installing org.apache.xmlbeans
[INFO] progress: Installing org.eclipse.rcptt.ctx.script.impl
[INFO] progress: Installing org.eclipse.rcptt.tesla.recording.aspects.swt
[INFO] progress: Installing org.eclipse.emf.mapping.ecore.feature.jar
[INFO] progress: Installing org.eclipse.rcptt.watson.feature.group
[INFO] progress: Installing org.eclipse.rcptt.tesla.recording.gmf
[INFO] progress: Installing org.eclipse.emf.mapping.feature.group
[INFO] progress: Installing org.eclipse.rcptt.tesla.recording.aspects.gmf
[INFO] progress: Installing org.eclipse.equinox.weaving.hook
[INFO] progress: Installing org.eclipse.emf.edit.ui.feature.jar
[INFO] progress: Installing org.eclipse.rcptt.tesla.recording.aspects.gef
[INFO] progress: Installing org.eclipse.rcptt.util
[INFO] progress: Installing org.eclipse.rcptt.tesla.jface.text.aspects
[INFO] progress: Installing org.eclipse.emf.mapping.ui
[INFO] progress: Installing org.eclipse.rcptt.tesla.jdt
[INFO] progress: Installing org.eclipse.rcptt.ctx.preferences.impl
[INFO] progress: Installing org.eclipse.rcptt.util.resources
[INFO] progress: Installing org.eclipse.rcptt.tesla.recording.gef
[INFO] progress: Installing org.eclipse.rcptt.ecl.server.tcp
[INFO] progress: Installing org.eclipse.rcptt.core.ecl.core
[INFO] progress: Installing org.eclipse.emf.importer.java
[INFO] progress: Installing org.eclipse.rcptt.ctx.parameters.impl
[INFO] progress: Installing org.eclipse.emf.codegen.feature.jar
[INFO] progress: Installing org.eclipse.emf.common
[INFO] progress: Installing org.eclipse.emf.mapping.ecore
[INFO] progress: Installing org.eclipse.emf.mapping.ecore.editor.feature.jar
[INFO] progress: Installing org.eclipse.emf.common.feature.jar
[INFO] progress: Installing org.eclipse.rcptt.tesla.recording.swt
[INFO] progress: Installing org.eclipse.rcptt.tesla.properties.view
[INFO] progress: Installing org.eclipse.emf.mapping.ecore2ecore
[INFO] progress: Installing org.eclipse.emf.mapping.ecore.editor
[INFO] progress: Installing org.eclipse.rcptt.verifications.log.impl
[INFO] progress: Installing org.eclipse.emf.validation_root
[INFO] progress: Installing org.eclipse.emf.feature.jar
[INFO] progress: Installing file:/jobs/genie.rcptt/rcptt-all/workspace/modules/nebula/runtime-site/target/site/site.xml.rcptt
[INFO] progress: Installing org.eclipse.rcptt.tesla.feature.group
[INFO] progress: Installing org.eclipse.rcptt.runtime.ui
[INFO] progress: Installing org.eclipse.emf.importer.ecore
[INFO] progress: Installing org.eclipse.rcptt.runtime.feature.group
[INFO] progress: Installing org.eclipse.rcptt.tesla.ui.ide
[INFO] progress: Installing org.eclipse.emf.codegen.ecore.ui.feature.group
[INFO] progress: Installing org.eclipse.rcptt.tesla.gef.aspects
[INFO] progress: Installing org.eclipse.rcptt.core.swt
[INFO] progress: Installing org.eclipse.rcptt.ctx.resources.impl
[INFO] progress: Installing org.eclipse.emf.codegen.ecore.ui.feature.jar
[INFO] progress: Installing org.eclipse.rcptt.ctx.parameters
[INFO] progress: Installing org.eclipse.rcptt.verifications.log
[INFO] progress: Installing org.eclipse.rcptt.tesla.variables
[INFO] progress: Installing org.eclipse.rcptt.tesla.recording.aspects.jface.text
[INFO] progress: Installing org.eclipse.rcptt.tesla.workbench.texteditor.aspects
[INFO] progress: Installing org.eclipse.rcptt.verifications.text.impl
[INFO] progress: Installing org.eclipse.rcptt.tesla.recording.jface.text
[INFO] progress: Installing org.eclipse.rcptt.ecl.operations
[INFO] progress: Installing org.eclipse.emf.feature.group
[INFO] progress: Installing org.eclipse.rcptt.util.swt
[INFO] progress: Installing org.eclipse.emf.mapping.ecore2xml
[INFO] progress: Installing org.eclipse.rcptt.ecl.debug.runtime
[INFO] progress: Installing org.eclipse.rcptt.tesla.swt
[INFO] progress: Installing org.eclipse.emf.mapping
[INFO] progress: Installing org.eclipse.rcptt.tesla.jface.databinding
[INFO] progress: Installing org.eclipse.rcptt.watson.core
[INFO] progress: Installing org.eclipse.emf.exporter
[INFO] progress: Installing org.eclipse.rcptt.core
[INFO] progress: Installing org.eclipse.rcptt.core.ecl.debug
[INFO] progress: Installing org.eclipse.emf.converter.feature.jar
[INFO] progress: Installing org.eclipse.rcptt.verifications.time.impl
[INFO] progress: Installing file:/jobs/genie.rcptt/rcptt-all/workspace/modules/testrail/runtime-site/target/site/site.xml.rcptt
[INFO] progress: Installing org.eclipse.rcptt.tesla.canvas
[INFO] progress: Installing org.eclipse.rcptt.tesla.jface.databinding.aspects
[INFO] progress: Installing org.eclipse.emf.transaction_root
[INFO] progress: Installing org.eclipse.rcptt.verifications.time
[INFO] progress: Installing org.eclipse.emf.databinding.edit.feature.jar
[INFO] progress: Installing org.eclipse.rcptt.ecl.platform.feature.jar
[INFO] progress: Installing org.eclipse.rcptt.tesla.jface.databinding.observable.aspects
[INFO] progress: Installing 201706090642.Default
[INFO] progress: Installing org.eclipse.emf.ant
[INFO] progress: Installing org.eclipse.rcptt.tesla.jface.aspects
[INFO] progress: Installing org.aspectj.runtime
[INFO] progress: Installing org.eclipse.emf.codegen.ecore.ui
[INFO] progress: Installing org.apache.poi
[INFO] progress: Installing org.eclipse.emf.transaction.feature.group
[INFO] progress: Installing org.eclipse.emf.codegen
[INFO] progress: Installing org.eclipse.emf.query_root
[INFO] progress: Installing org.eclipse.emf.codegen.ui
[INFO] progress: Installing org.eclipse.rcptt.core.swt.win32
[INFO] progress: Installing org.eclipse.emf.query.feature.group
[INFO] progress: Installing org.eclipse.rcptt.testrail.ecl.impl
[INFO] progress: Installing org.eclipse.rcptt.ecl.platform
[INFO] progress: Installing org.eclipse.emf.converter
[INFO] progress: Installing org.eclipse.emf.ecore.feature.group
[INFO] progress: Installing org.eclipse.rcptt.ecl.data.apache.poi
[INFO] progress: Installing org.eclipse.rcptt.ecl.platform.feature.group
[INFO] progress: Installing org.eclipse.rcptt.tesla.recording.aspects.draw2d
[INFO] progress: Installing org.eclipse.rcptt.ecl.data.apache.poi.impl
[INFO] progress: Installing org.eclipse.emf.mapping.ecore.feature.group
[INFO] progress: Installing org.eclipse.emf.mapping.ui.feature.group
[INFO] progress: Installing org.eclipse.rcptt.core.launching
[INFO] progress: Installing org.eclipse.rcptt.watson.feature.jar
[INFO] progress: Installing org.eclipse.rcptt.ecl.core.feature.group
[INFO] progress: Installing org.eclipse.emf.codegen.feature.group
[INFO] progress: Installing org.eclipse.emf.codegen.ui.feature.jar
[INFO] progress: Installing org.eclipse.emf.ecore.editor.feature.group
[INFO] progress: Installing org.eclipse.rcptt.ctx.preferences
[INFO] progress: Installing org.eclipse.rcptt.ctx.filesystem.impl
[INFO] progress: Installing org.eclipse.rcptt.ctx.debug.impl
[INFO] progress: Installing org.eclipse.emf.mapping.ui.feature.jar
[INFO] progress: Installing org.apache.poi.ooxml
[INFO] progress: Installing org.eclipse.emf.ecore
[INFO] progress: Installing org.eclipse.emf.common.feature.group
[INFO] progress: Installing org.eclipse.rcptt.ecl.server.feature.jar
[INFO] progress: Installing org.eclipse.emf.databinding
[INFO] progress: Installing org.eclipse.rcptt.ecl.server.feature.group
[INFO] progress: Installing org.eclipse.emf.databinding.feature.group
[INFO] progress: Installing org.eclipse.rcptt.ctx.workbench.aspect
[INFO] progress: Installing org.eclipse.rcptt.watson.runtime.feature.group
[INFO] progress: Installing org.eclipse.rcptt.ctx.filesystem
[INFO] progress: Installing org.eclipse.emf.databinding.feature.jar
[INFO] progress: Installing org.eclipse.emf.query.feature.jar
[INFO] progress: Installing org.eclipse.rcptt.tesla.recording.nebula
[INFO] progress: Installing org.eclipse.rcptt.tesla.ecl
[INFO] progress: Installing org.eclipse.rcptt.tesla.ecl.runtime.feature.group
[INFO] progress: Installing org.eclipse.emf.ecore.editor.feature.jar
[INFO] progress: Installing org.eclipse.rcptt.tesla.nebula.ecl.impl
[INFO] progress: Installing org.eclipse.rcptt.ecl.core.feature.jar
[INFO] progress: Installing org.eclipse.rcptt.tesla.recording.core
[INFO] progress: Installing org.eclipse.emf.ecore.feature.jar
[INFO] progress: Installing org.aspectj.weaver
[INFO] progress: Installing org.eclipse.emf.query
[INFO] progress: Installing org.eclipse.emf.codegen.ui.feature.group
[INFO] progress: Installing org.eclipse.rcptt.tesla.swt.fragment
[INFO] progress: Installing org.eclipse.emf.validation.feature.group
[INFO] progress: Installing org.eclipse.rcptt.module.nebula.runtime.feature.jar
[INFO] progress: Installing org.eclipse.rcptt.tesla.nebula.ecl
[INFO] progress: Installing org.eclipse.rcptt.ecl.data
[INFO] progress: Installing org.eclipse.rcptt.tesla.gmf
[INFO] progress: Installing org.eclipse.rcptt.tesla.ui.ide.aspects
[INFO] progress: Installing org.eclipse.rcptt.expandbar
[INFO] progress: Installing org.eclipse.rcptt.tesla.feature.jar
[INFO] progress: Installing org.eclipse.rcptt.core.swt.win64
[INFO] progress: Installing org.eclipse.emf.importer.rose
[INFO] progress: Installing org.eclipse.rcptt.ecl.core
[INFO] progress: Installing org.eclipse.emf.common.ui
[INFO] progress: Installing org.eclipse.rcptt.ctx.script
[INFO] progress: Installing org.eclipse.emf.ecore.editor
[INFO] progress: Installing org.eclipse.rcptt.tesla.recording.aspects.workbench.texteditor
[INFO] progress: Downloading org.eclipse.emf.validation_root
[INFO] progress: Downloading org.eclipse.emf.transaction_root
[INFO] progress: Downloading org.eclipse.emf.query_root
[INFO] progress: Preparing to commit the provisioning operation.
[INFO] progress: Committing the provisioning operation.
[INFO] progress: Reading plug-ins
[INFO] Target platform is valid.
[INFO] Looking for tests...
[INFO] Existing projects in workspace:
[INFO]     <none>
[INFO] Importing projects to workspace:
[INFO] Refreshing projects:
[INFO]     /home/jenkins/agent/workspace/capella-studio-v1.3.x/vpdsl/tests/capellastudio.vpdsl.qualityassessment.reverse.tests/target/projects/capellastudio.vpdsl.qualityassessment.reverse.tests... OK
[INFO] Refreshing projects:
[INFO]     capellastudio.vpdsl.qualityassessment.reverse.tests... OK
[INFO] Searching for tests in projects:
[INFO]     capellastudio.vpdsl.qualityassessment.reverse.tests... 
[INFO] Complete OK
[INFO] Testcase Artifacts:1
[INFO] AUT-0:Launching
[INFO] AUT-0:Product: org.polarsys.capella.studio.product.CapellaStudio
[INFO] AUT-0:Application: org.polarsys.capella.studio.product.application
[INFO] AUT-0:Architecture: x86_64
[INFO] 64bit arch is selected because AUT uses launcher library
[INFO] 	"plugins/org.eclipse.equinox.launcher.gtk.linux.x86_64_1.1.551.v20171108-1834" specified in config file: eclipse.ini
[INFO] /home/jenkins/agent/workspace/capella-studio-v1.3.x/vpdsl/tests/capellastudio.vpdsl.qualityassessment.reverse.tests/target/aut-ws-0: AUT arguments: -os ${target.os} -arch ${target.arch} -consoleLog
[INFO] /home/jenkins/agent/workspace/capella-studio-v1.3.x/vpdsl/tests/capellastudio.vpdsl.qualityassessment.reverse.tests/target/aut-ws-0: AUT VM arguments: -Dosgi.requiredJavaVersion=1.8 -Xms512m -Xmx2048m -XX:PermSize=256M -javaagent:/home/jenkins/.m2/repository/org/jacoco/org.jacoco.agent/0.7.9/org.jacoco.agent-0.7.9-runtime.jar=destfile=/home/jenkins/agent/workspace/capella-studio-v1.3.x/vpdsl/tests/capellastudio.vpdsl.qualityassessment.reverse.tests/target/jacoco.exec -XX:MaxPermSize=128m
[INFO] Fail 1 (1) processed. 1 failed. spent: 0:00, 0:00 mins remaining. Reverse from Ecore. time: 169ms  Cause: Id can't be empty
[INFO] Failed Tests:
[INFO] Reverse from Ecore
[INFO] Process terminated. Shut down AUTs
[INFO] Runner exit code is: 56
[ERROR] There are test failures
[INFO] 
[INFO] --- rcptt-maven-plugin:2.2.0:package (default-package) @ capellastudio.vpdsl.qualityassessment.reverse.tests ---
[INFO] Building zip: /home/jenkins/agent/workspace/capella-studio-v1.3.x/vpdsl/tests/capellastudio.vpdsl.qualityassessment.reverse.tests/target/projects/capellastudio.vpdsl.qualityassessment.reverse.tests-1.3.1-SNAPSHOT.zip
[INFO] Building zip: /home/jenkins/agent/workspace/capella-studio-v1.3.x/vpdsl/tests/capellastudio.vpdsl.qualityassessment.reverse.tests/target/org.polarsys.capella-capellastudio.vpdsl.qualityassessment.reverse.tests-1.3.1-SNAPSHOT-result.zip
[INFO] aut1/out.txt already added, skipping
[INFO] 
[INFO] --- tycho-source-plugin:1.1.0:plugin-source (plugin-source) @ capellastudio.vpdsl.qualityassessment.reverse.tests ---
[INFO] 
[INFO] --- tycho-source-feature-plugin:1.1.0:source-feature (source-feature) @ capellastudio.vpdsl.qualityassessment.reverse.tests ---
[INFO]                                                                         
[INFO] ------------------------------------------------------------------------
[INFO] Building capellastudio.vpdsl.qualityassessment.tests 1.3.1-SNAPSHOT
[INFO] ------------------------------------------------------------------------
[INFO] 
[INFO] --- maven-clean-plugin:2.5:clean (default-clean) @ capellastudio.vpdsl.qualityassessment.tests ---
[INFO] 
[INFO] --- jacoco-maven-plugin:0.7.9:prepare-agent (default) @ capellastudio.vpdsl.qualityassessment.tests ---
[INFO] failsafeArgline set to -javaagent:/home/jenkins/.m2/repository/org/jacoco/org.jacoco.agent/0.7.9/org.jacoco.agent-0.7.9-runtime.jar=destfile=/home/jenkins/agent/workspace/capella-studio-v1.3.x/vpdsl/tests/capellastudio.vpdsl.qualityassessment.tests/target/jacoco.exec
[INFO] 
[INFO] --- rcptt-maven-plugin:2.2.0:resources (default-resources) @ capellastudio.vpdsl.qualityassessment.tests ---
[INFO] Resolving artifact org.eclipse.rcptt.runner:rcptt.runner:zip:2.2.0, this may take a while ...
[INFO] Artifact org.eclipse.rcptt.runner:rcptt.runner:zip:2.2.0 is resolved to /home/jenkins/.m2/repository/org/eclipse/rcptt/runner/rcptt.runner/2.2.0/rcptt.runner-2.2.0.zip
[INFO] Using AUT from /home/jenkins/agent/workspace/capella-studio-v1.3.x/vpdsl/tests/capellastudio.vpdsl.qualityassessment.tests/../../../releng/plugins/org.polarsys.capella.studio.releng.product/target/products/org.polarsys.capella.studio.releng.product/linux/gtk/x86_64
[INFO] Extracting RCPTT runner to /home/jenkins/agent/workspace/capella-studio-v1.3.x/vpdsl/tests/capellastudio.vpdsl.qualityassessment.tests/target/runner
[INFO] Copying project contents to target directory...
[INFO] 
[INFO] --- rcptt-maven-plugin:2.2.0:execute (default-execute) @ capellastudio.vpdsl.qualityassessment.tests ---
[INFO] Runner command line is /bin/sh -c cd /home/jenkins/agent/workspace/capella-studio-v1.3.x/vpdsl/tests/capellastudio.vpdsl.qualityassessment.tests/target/runner/eclipse && /opt/tools/java/oracle/jdk-8/1.8.0_202/jre/bin/java -Xms128m -Xmx256m -Dorg.eclipse.rcptt.runner.returnTestFailure=true -jar /home/jenkins/agent/workspace/capella-studio-v1.3.x/vpdsl/tests/capellastudio.vpdsl.qualityassessment.tests/target/runner/eclipse/plugins/org.eclipse.equinox.launcher_1.4.0.v20161219-1356.jar -application org.eclipse.rcptt.runner.headless -runnerPlatform swt -data /home/jenkins/agent/workspace/capella-studio-v1.3.x/vpdsl/tests/capellastudio.vpdsl.qualityassessment.tests/target/runner-workspace -aut /home/jenkins/agent/workspace/capella-studio-v1.3.x/vpdsl/tests/capellastudio.vpdsl.qualityassessment.tests/../../../releng/plugins/org.polarsys.capella.studio.releng.product/target/products/org.polarsys.capella.studio.releng.product/linux/gtk/x86_64 -autWsPrefix /home/jenkins/agent/workspace/capella-studio-v1.3.x/vpdsl/tests/capellastudio.vpdsl.qualityassessment.tests/target/aut-ws- -autConsolePrefix /home/jenkins/agent/workspace/capella-studio-v1.3.x/vpdsl/tests/capellastudio.vpdsl.qualityassessment.tests/target/results/aut-console- -autVMArgs -javaagent:/home/jenkins/.m2/repository/org/jacoco/org.jacoco.agent/0.7.9/org.jacoco.agent-0.7.9-runtime.jar=destfile=/home/jenkins/agent/workspace/capella-studio-v1.3.x/vpdsl/tests/capellastudio.vpdsl.qualityassessment.tests/target/jacoco.exec -q7report /home/jenkins/agent/workspace/capella-studio-v1.3.x/vpdsl/tests/capellastudio.vpdsl.qualityassessment.tests/target/results/capellastudio.vpdsl.qualityassessment.tests.report -htmlReport /home/jenkins/agent/workspace/capella-studio-v1.3.x/vpdsl/tests/capellastudio.vpdsl.qualityassessment.tests/target/results/capellastudio.vpdsl.qualityassessment.tests.html -junitReport /home/jenkins/agent/workspace/capella-studio-v1.3.x/vpdsl/tests/capellastudio.vpdsl.qualityassessment.tests/target/surefire-reports/TEST-capellastudio.vpdsl.qualityassessment.tests.xml -import /home/jenkins/agent/workspace/capella-studio-v1.3.x/vpdsl/tests/capellastudio.vpdsl.qualityassessment.tests/target/projects/capellastudio.vpdsl.qualityassessment.tests -testOptions 'testExecTimeout=300;execTimeout=3600' -timeout 3600 -shutdownListenerPort 9281
[INFO] The execution timeout is set to 3600 seconds
[ERROR] Picked up JAVA_TOOL_OPTIONS: -XX:+IgnoreUnrecognizedVMOptions -XX:+UseContainerSupport -XX:+UnlockExperimentalVMOptions -XX:+UseCGroupMemoryLimitForHeap
[ERROR] Picked up _JAVA_OPTIONS: -XX:MaxRAMPercentage=64.0
[INFO] Started at Tue Jan 21 17:24:35 UTC 2020
[INFO] RCPTT Runner version: 2.2.0
[INFO] Initializing target platform...
[INFO] Begin task: Create AUT configuration
[INFO] progress: Resolving Target Contents...
[INFO] progress: Reading plug-ins
[INFO] progress: Fetching p2.index from platform:/plugin/org.eclipse.rcptt.updates.runtime.e4x/q7/
[INFO] progress: Adding repository platform:///plugin/org.eclipse.rcptt.updates.runtime.e4x/q7/
[INFO] progress: Fetching content.jar from platform:/plugin/org.eclipse.rcptt.updates.runtime.e4x/q7/
[INFO] progress: Fetching p2.index from platform:/plugin/org.eclipse.rcptt.updates.runtime.e4x/q7/
[INFO] progress: Adding repository platform:///plugin/org.eclipse.rcptt.updates.runtime.e4x/q7/
[INFO] progress: Fetching content.jar from platform:/plugin/org.eclipse.rcptt.updates.runtime.e4x/q7/
[INFO] progress: Fetching p2.index from platform:/plugin/org.eclipse.rcptt.updates.runtime.e4x/q7/
[INFO] progress: Adding repository platform:///plugin/org.eclipse.rcptt.updates.runtime.e4x/q7/
[INFO] progress: Fetching artifacts.jar from platform:/plugin/org.eclipse.rcptt.updates.runtime.e4x/q7/
[INFO] progress: Downloading org.antlr.runtime
[INFO] progress: Adding repository platform:///plugin/org.eclipse.rcptt.updates.aspectj.e44x/dependencies/
[INFO] progress: Fetching content.jar from platform:/plugin/org.eclipse.rcptt.updates.aspectj.e44x/dependencies/
[INFO] progress: Adding repository platform:///plugin/org.eclipse.rcptt.updates.aspectj.e44x/dependencies/
[INFO] progress: Fetching artifacts.jar from platform:/plugin/org.eclipse.rcptt.updates.aspectj.e44x/dependencies/
[INFO] progress: Downloading org.aspectj.runtime
[INFO] progress: Downloading org.aspectj.weaver
[INFO] progress: Downloading org.eclipse.equinox.weaving.aspectj
[INFO] progress: Downloading org.eclipse.equinox.weaving.hook
[INFO] progress: Adding repository platform:///plugin/org.eclipse.rcptt.updates.kepler/dependencies/
[INFO] progress: Fetching content.jar from platform:/plugin/org.eclipse.rcptt.updates.kepler/dependencies/
[INFO] progress: Adding repository platform:///plugin/org.eclipse.rcptt.updates.kepler/dependencies/
[INFO] progress: Fetching artifacts.jar from platform:/plugin/org.eclipse.rcptt.updates.kepler/dependencies/
[INFO] progress: Downloading org.eclipse.emf.converter
[INFO] progress: Downloading org.eclipse.emf.codegen.ecore
[INFO] progress: Downloading org.eclipse.emf.mapping.ecore2ecore
[INFO] progress: Downloading org.eclipse.emf.ecore.change
[INFO] progress: Downloading org.eclipse.emf.validation
[INFO] progress: Downloading org.eclipse.emf.transaction.ui
[INFO] progress: Downloading org.eclipse.emf.mapping.ecore.editor
[INFO] progress: Downloading org.eclipse.emf.validation_root
[INFO] progress: Downloading org.eclipse.emf
[INFO] progress: Downloading org.eclipse.emf.ecore.change.edit
[INFO] progress: Downloading org.eclipse.emf.importer.ecore
[INFO] progress: Downloading org.eclipse.emf.codegen.ui
[INFO] progress: Downloading org.eclipse.emf.mapping.ecore2ecore.editor
[INFO] progress: Downloading org.eclipse.emf.ecore.xmi
[INFO] progress: Downloading org.eclipse.emf.mapping.ui
[INFO] progress: Downloading org.eclipse.emf.databinding.edit
[INFO] progress: Downloading org.eclipse.emf.mapping
[INFO] progress: Downloading org.eclipse.emf.ecore
[INFO] progress: Downloading org.eclipse.emf.codegen.ecore.ui
[INFO] progress: Downloading org.eclipse.emf.importer
[INFO] progress: Downloading org.eclipse.emf.mapping.ecore2xml.ui
[INFO] progress: Downloading org.eclipse.emf.databinding
[INFO] progress: Downloading org.eclipse.emf
[INFO] progress: Downloading org.eclipse.emf.ecore.edit
[INFO] progress: Downloading org.eclipse.emf.databinding
[INFO] progress: Downloading org.eclipse.emf.validation.ui
[INFO] progress: Downloading org.eclipse.emf.query
[INFO] progress: Downloading org.eclipse.emf.transaction
[INFO] progress: Downloading org.eclipse.emf.ecore.editor
[INFO] progress: Downloading org.eclipse.emf.codegen.ecore
[INFO] progress: Downloading org.eclipse.emf.common.ui
[INFO] progress: Downloading org.eclipse.emf.mapping.ecore2xml
[INFO] progress: Downloading org.eclipse.emf.mapping.ecore
[INFO] progress: Downloading org.eclipse.emf.ecore
[INFO] progress: Downloading org.eclipse.emf.query
[INFO] progress: Downloading org.eclipse.emf.mapping
[INFO] progress: Downloading org.eclipse.emf.edit.ui
[INFO] progress: Downloading org.eclipse.emf.exporter
[INFO] progress: Downloading org.eclipse.emf.mapping.ui
[INFO] progress: Downloading org.eclipse.emf.converter
[INFO] progress: Downloading org.eclipse.emf.transaction
[INFO] progress: Downloading org.eclipse.emf.transaction_root
[INFO] progress: Downloading org.eclipse.emf.databinding.edit
[INFO] progress: Downloading org.eclipse.emf.ecore.edit
[INFO] progress: Downloading org.eclipse.emf.validation
[INFO] progress: Downloading org.eclipse.emf.importer.rose
[INFO] progress: Downloading org.eclipse.emf.edit.ui
[INFO] progress: Downloading org.eclipse.emf.ant
[INFO] progress: Downloading org.eclipse.emf.importer.java
[INFO] progress: Downloading org.eclipse.emf.codegen.ecore.ui
[INFO] progress: Downloading org.eclipse.emf.edit
[INFO] progress: Downloading org.eclipse.emf.codegen
[INFO] progress: Downloading org.eclipse.emf.common.ui
[INFO] progress: Downloading org.eclipse.emf.common
[INFO] progress: Downloading org.eclipse.emf.ecore.editor
[INFO] progress: Downloading org.eclipse.emf.mapping.ecore
[INFO] progress: Downloading org.eclipse.emf.mapping.ecore.editor
[INFO] progress: Downloading org.eclipse.emf.validation.ui.ide
[INFO] progress: Downloading org.eclipse.emf.edit
[INFO] progress: Downloading org.eclipse.emf.common
[INFO] progress: Downloading org.eclipse.emf.codegen
[INFO] progress: Downloading org.eclipse.emf.query_root
[INFO] progress: Downloading org.eclipse.emf.codegen.ui
[INFO] progress: Adding repository platform:///plugin/org.eclipse.rcptt.module.nebula.updates/runtime/
[INFO] progress: Fetching content.jar from platform:/plugin/org.eclipse.rcptt.module.nebula.updates/runtime/
[INFO] progress: Adding repository platform:///plugin/org.eclipse.rcptt.module.nebula.updates/runtime/
[INFO] progress: Fetching artifacts.jar from platform:/plugin/org.eclipse.rcptt.module.nebula.updates/runtime/
[INFO] progress: Adding repository platform:///plugin/org.eclipse.rcptt.module.testrail.updates/runtime/
[INFO] progress: Fetching content.jar from platform:/plugin/org.eclipse.rcptt.module.testrail.updates/runtime/
[INFO] progress: Adding repository platform:///plugin/org.eclipse.rcptt.module.testrail.updates/runtime/
[INFO] progress: Fetching artifacts.jar from platform:/plugin/org.eclipse.rcptt.module.testrail.updates/runtime/
[INFO] progress: Adding repository platform:///plugin/org.eclipse.rcptt.updates.extra/dependencies/
[INFO] progress: Fetching content.jar from platform:/plugin/org.eclipse.rcptt.updates.extra/dependencies/
[INFO] progress: Adding repository platform:///plugin/org.eclipse.rcptt.updates.extra/dependencies/
[INFO] progress: Fetching artifacts.jar from platform:/plugin/org.eclipse.rcptt.updates.extra/dependencies/
[INFO] progress: Downloading org.apache.poi.ooxml
[INFO] progress: Downloading org.apache.xmlbeans
[INFO] progress: Downloading org.apache.poi.ooxml.schemas
[INFO] progress: Downloading org.dom4j
[INFO] progress: Downloading org.apache.poi
[INFO] progress: Resolving Target Contents...
[INFO] progress: Reading plug-ins
[INFO] progress: Fetching p2.index from platform:/plugin/org.eclipse.rcptt.updates.runtime.e4x/q7/
[INFO] progress: Fetching content.jar from platform:/plugin/org.eclipse.rcptt.updates.runtime.e4x/q7/
[INFO] progress: Fetching content.jar from platform:/plugin/org.eclipse.rcptt.updates.aspectj.e44x/dependencies/
[INFO] progress: Fetching content.jar from platform:/plugin/org.eclipse.rcptt.updates.kepler/dependencies/
[INFO] progress: Fetching content.jar from platform:/plugin/org.eclipse.rcptt.module.nebula.updates/runtime/
[INFO] progress: Fetching content.jar from platform:/plugin/org.eclipse.rcptt.module.testrail.updates/runtime/
[INFO] progress: Fetching content.jar from platform:/plugin/org.eclipse.rcptt.updates.extra/dependencies/
[INFO] progress: Fetching p2.index from platform:/plugin/org.eclipse.rcptt.updates.runtime.e4x/q7/
[INFO] progress: Fetching artifacts.jar from platform:/plugin/org.eclipse.rcptt.updates.runtime.e4x/q7/
[INFO] progress: Fetching artifacts.jar from platform:/plugin/org.eclipse.rcptt.module.testrail.updates/runtime/
[INFO] progress: Fetching artifacts.jar from platform:/plugin/org.eclipse.rcptt.updates.kepler/dependencies/
[INFO] progress: Fetching artifacts.jar from platform:/plugin/org.eclipse.rcptt.module.nebula.updates/runtime/
[INFO] progress: Fetching artifacts.jar from platform:/plugin/org.eclipse.rcptt.updates.aspectj.e44x/dependencies/
[INFO] progress: Fetching artifacts.jar from platform:/plugin/org.eclipse.rcptt.updates.extra/dependencies/
[INFO] progress: Downloading org.eclipse.emf.validation_root
[INFO] progress: Downloading org.eclipse.emf.transaction_root
[INFO] progress: Downloading org.eclipse.emf.query_root
[INFO] progress: Installing org.eclipse.emf.ecore.change
[INFO] progress: Installing org.eclipse.rcptt.tesla.workbench.aspects.e4x
[INFO] progress: Installing org.eclipse.rcptt.tesla.core.am
[INFO] progress: Installing org.eclipse.rcptt.tesla.gmf.aspects
[INFO] progress: Installing org.eclipse.rcptt.watson.aspects.swt
[INFO] progress: Installing org.eclipse.rcptt.ecl.client.tcp
[INFO] progress: Installing org.eclipse.rcptt.tesla.jdt.aspects
[INFO] progress: Installing org.eclipse.rcptt.tesla.ecl.feature.group
[INFO] progress: Installing org.eclipse.rcptt.tesla.recording.aspects.forms
[INFO] progress: Installing org.eclipse.rcptt.watson.jface
[INFO] progress: Installing org.eclipse.emf.ecore.xmi
[INFO] progress: Installing org.eclipse.rcptt.verifications
[INFO] progress: Installing org.eclipse.emf.mapping.feature.jar
[INFO] progress: Installing org.eclipse.rcptt.tesla.jface.fragment
[INFO] progress: Installing org.dom4j
[INFO] progress: Installing org.eclipse.rcptt.testrail.ecl
[INFO] progress: Installing org.eclipse.rcptt.ecl.dispatch
[INFO] progress: Installing org.eclipse.emf.importer
[INFO] progress: Installing org.eclipse.emf.mapping.ecore2xml.ui
[INFO] progress: Installing org.eclipse.rcptt.watson.jobs
[INFO] progress: Installing org.eclipse.rcptt.tesla.runtime.feature.jar
[INFO] progress: Installing org.eclipse.rcptt.verifications.tree
[INFO] progress: Installing org.eclipse.rcptt.reporting
[INFO] progress: Installing org.eclipse.emf.ecore.edit
[INFO] progress: Installing org.eclipse.rcptt.forms.impl
[INFO] progress: Installing org.eclipse.emf.edit.feature.group
[INFO] progress: Installing org.eclipse.emf.transaction
[INFO] progress: Installing org.eclipse.rcptt.tesla.jface.text.reconciler.aspects
[INFO] progress: Installing org.eclipse.rcptt.ecl.perf
[INFO] progress: Installing org.eclipse.emf.codegen.ecore.feature.jar
[INFO] progress: Installing org.eclipse.rcptt.expandbar.runtime
[INFO] progress: Installing org.eclipse.rcptt.tesla.recording.draw2d
[INFO] progress: Installing org.eclipse.emf.mapping.ecore.editor.feature.group
[INFO] progress: Installing org.eclipse.emf.common.ui.feature.jar
[INFO] progress: Installing org.eclipse.rcptt.ecl.platform.ui.feature.jar
[INFO] progress: Installing org.eclipse.emf.ecore.edit.feature.group
[INFO] progress: Installing org.eclipse.rcptt.ctx.debug
[INFO] progress: Installing org.eclipse.rcptt.module.nebula.runtime.feature.group
[INFO] progress: Installing org.eclipse.rcptt.tesla.nebula
[INFO] progress: Installing org.eclipse.rcptt.tesla.recording.aspects.workbench
[INFO] progress: Installing org.eclipse.rcptt.tesla.core.context
[INFO] progress: Installing org.eclipse.emf.transaction.feature.jar
[INFO] progress: Installing org.eclipse.rcptt.tesla.recording.workbench.texteditor
[INFO] progress: Installing org.eclipse.rcptt.tesla.core
[INFO] progress: Installing org.eclipse.rcptt.tesla.nebula.impl
[INFO] progress: Installing org.eclipse.rcptt.ctx.group
[INFO] progress: Installing org.eclipse.emf.ecore.edit.feature.jar
[INFO] progress: Installing org.eclipse.rcptt.runtime.feature.jar
[INFO] progress: Installing org.eclipse.emf.validation
[INFO] progress: Installing org.eclipse.rcptt.ecl.platform.ui.feature.group
[INFO] progress: Installing org.eclipse.emf.edit.ui
[INFO] progress: Installing org.eclipse.rcptt.tesla.workbench.texteditor
[INFO] progress: Installing org.eclipse.emf.edit.feature.jar
[INFO] progress: Installing org.eclipse.equinox.weaving.aspectj
[INFO] progress: Installing org.eclipse.emf.validation.ui.ide
[INFO] progress: Installing org.eclipse.emf.edit
[INFO] progress: Installing org.eclipse.rcptt.ctx.workbench.impl
[INFO] progress: Installing org.eclipse.rcptt.tesla.ecl.impl
[INFO] progress: Installing org.eclipse.rcptt.tesla.gef
[INFO] progress: Installing org.eclipse.rcptt.ecl.interop
[INFO] progress: Installing org.eclipse.rcptt.tesla.ecl.runtime.feature.jar
[INFO] progress: Installing org.eclipse.rcptt.ctx.workbench
[INFO] progress: Installing org.eclipse.rcptt.verifications.text
[INFO] progress: Installing org.eclipse.emf.converter.feature.group
[INFO] progress: Installing org.eclipse.emf.codegen.ecore
[INFO] progress: Installing org.eclipse.emf.validation.feature.jar
[INFO] progress: Installing org.eclipse.emf.transaction.ui
[INFO] progress: Installing org.eclipse.emf.databinding.edit.feature.group
[INFO] progress: Installing org.eclipse.rcptt.logging
[INFO] progress: Installing org.eclipse.rcptt.ctx.resources
[INFO] progress: Installing org.eclipse.rcptt.module.testrail.runtime.feature.group
[INFO] progress: Installing org.eclipse.rcptt.tesla.recording.core.ecl
[INFO] progress: Installing org.eclipse.rcptt.ctx.group.impl
[INFO] progress: Installing org.eclipse.rcptt.tesla.recording.aspects.jface
[INFO] progress: Installing org.eclipse.emf.common.ui.feature.group
[INFO] progress: Installing org.apache.poi.ooxml.schemas
[INFO] progress: Installing org.eclipse.emf.ecore.change.edit
[INFO] progress: Installing org.eclipse.rcptt.core.scenario
[INFO] progress: Installing org.eclipse.emf.mapping.ecore2ecore.editor
[INFO] progress: Installing org.antlr.runtime
[INFO] progress: Installing org.eclipse.rcptt.module.testrail.runtime.feature.jar
[INFO] progress: Installing org.eclipse.rcptt.watson.aspects.jobs
[INFO] progress: Installing org.eclipse.rcptt.ecl.platform.ui
[INFO] progress: Installing org.eclipse.emf.databinding.edit
[INFO] progress: Installing org.eclipse.rcptt.tesla.swt.e4x
[INFO] progress: Installing org.eclipse.rcptt.ecl.filesystem
[INFO] progress: Installing org.eclipse.rcptt.tesla.jobs.aspects
[INFO] progress: Installing org.eclipse.rcptt.tesla.ecl.feature.jar
[INFO] progress: Installing org.eclipse.emf.edit.ui.feature.group
[INFO] progress: Installing org.eclipse.rcptt.verifications.tree.impl
[INFO] progress: Installing org.eclipse.rcptt.watson.runtime.feature.jar
[INFO] progress: Installing org.eclipse.emf
[INFO] progress: Installing org.eclipse.rcptt.ecl.parser
[INFO] progress: Installing org.eclipse.rcptt.tesla.recording.canvas
[INFO] progress: Installing org.eclipse.rcptt.tesla.jface.text
[INFO] progress: Installing org.eclipse.rcptt.ecl.doc
[INFO] progress: Installing org.eclipse.rcptt.tesla.swt.aspects
[INFO] progress: Installing org.eclipse.emf.validation.ui
[INFO] progress: Installing org.eclipse.rcptt.tesla.runtime.feature.group
[INFO] progress: Installing org.eclipse.rcptt.ctx.preferences.aspects
[INFO] progress: Installing org.eclipse.emf.codegen.ecore.feature.group
[INFO] progress: Installing org.apache.xmlbeans
[INFO] progress: Installing org.eclipse.rcptt.ctx.script.impl
[INFO] progress: Installing org.eclipse.rcptt.tesla.recording.aspects.swt
[INFO] progress: Installing org.eclipse.emf.mapping.ecore.feature.jar
[INFO] progress: Installing org.eclipse.rcptt.watson.feature.group
[INFO] progress: Installing org.eclipse.rcptt.tesla.recording.gmf
[INFO] progress: Installing org.eclipse.emf.mapping.feature.group
[INFO] progress: Installing org.eclipse.rcptt.tesla.recording.aspects.gmf
[INFO] progress: Installing org.eclipse.equinox.weaving.hook
[INFO] progress: Installing org.eclipse.emf.edit.ui.feature.jar
[INFO] progress: Installing org.eclipse.rcptt.tesla.recording.aspects.gef
[INFO] progress: Installing org.eclipse.rcptt.util
[INFO] progress: Installing org.eclipse.rcptt.tesla.jface.text.aspects
[INFO] progress: Installing org.eclipse.emf.mapping.ui
[INFO] progress: Installing org.eclipse.rcptt.tesla.jdt
[INFO] progress: Installing org.eclipse.rcptt.ctx.preferences.impl
[INFO] progress: Installing org.eclipse.rcptt.util.resources
[INFO] progress: Installing org.eclipse.rcptt.tesla.recording.gef
[INFO] progress: Installing org.eclipse.rcptt.ecl.server.tcp
[INFO] progress: Installing org.eclipse.rcptt.core.ecl.core
[INFO] progress: Installing org.eclipse.emf.importer.java
[INFO] progress: Installing org.eclipse.rcptt.ctx.parameters.impl
[INFO] progress: Installing org.eclipse.emf.codegen.feature.jar
[INFO] progress: Installing org.eclipse.emf.common
[INFO] progress: Installing org.eclipse.emf.mapping.ecore
[INFO] progress: Installing org.eclipse.emf.mapping.ecore.editor.feature.jar
[INFO] progress: Installing org.eclipse.emf.common.feature.jar
[INFO] progress: Installing org.eclipse.rcptt.tesla.recording.swt
[INFO] progress: Installing org.eclipse.rcptt.tesla.properties.view
[INFO] progress: Installing org.eclipse.emf.mapping.ecore2ecore
[INFO] progress: Installing org.eclipse.emf.mapping.ecore.editor
[INFO] progress: Installing org.eclipse.rcptt.verifications.log.impl
[INFO] progress: Installing org.eclipse.emf.validation_root
[INFO] progress: Installing org.eclipse.emf.feature.jar
[INFO] progress: Installing file:/jobs/genie.rcptt/rcptt-all/workspace/modules/nebula/runtime-site/target/site/site.xml.rcptt
[INFO] progress: Installing org.eclipse.rcptt.tesla.feature.group
[INFO] progress: Installing org.eclipse.rcptt.runtime.ui
[INFO] progress: Installing org.eclipse.emf.importer.ecore
[INFO] progress: Installing org.eclipse.rcptt.runtime.feature.group
[INFO] progress: Installing org.eclipse.rcptt.tesla.ui.ide
[INFO] progress: Installing org.eclipse.emf.codegen.ecore.ui.feature.group
[INFO] progress: Installing org.eclipse.rcptt.tesla.gef.aspects
[INFO] progress: Installing org.eclipse.rcptt.core.swt
[INFO] progress: Installing org.eclipse.rcptt.ctx.resources.impl
[INFO] progress: Installing org.eclipse.emf.codegen.ecore.ui.feature.jar
[INFO] progress: Installing org.eclipse.rcptt.ctx.parameters
[INFO] progress: Installing org.eclipse.rcptt.verifications.log
[INFO] progress: Installing org.eclipse.rcptt.tesla.variables
[INFO] progress: Installing org.eclipse.rcptt.tesla.recording.aspects.jface.text
[INFO] progress: Installing org.eclipse.rcptt.tesla.workbench.texteditor.aspects
[INFO] progress: Installing org.eclipse.rcptt.verifications.text.impl
[INFO] progress: Installing org.eclipse.rcptt.tesla.recording.jface.text
[INFO] progress: Installing org.eclipse.rcptt.ecl.operations
[INFO] progress: Installing org.eclipse.emf.feature.group
[INFO] progress: Installing org.eclipse.rcptt.util.swt
[INFO] progress: Installing org.eclipse.emf.mapping.ecore2xml
[INFO] progress: Installing org.eclipse.rcptt.ecl.debug.runtime
[INFO] progress: Installing org.eclipse.rcptt.tesla.swt
[INFO] progress: Installing org.eclipse.emf.mapping
[INFO] progress: Installing org.eclipse.rcptt.tesla.jface.databinding
[INFO] progress: Installing org.eclipse.rcptt.watson.core
[INFO] progress: Installing org.eclipse.emf.exporter
[INFO] progress: Installing org.eclipse.rcptt.core
[INFO] progress: Installing org.eclipse.rcptt.core.ecl.debug
[INFO] progress: Installing org.eclipse.emf.converter.feature.jar
[INFO] progress: Installing org.eclipse.rcptt.verifications.time.impl
[INFO] progress: Installing file:/jobs/genie.rcptt/rcptt-all/workspace/modules/testrail/runtime-site/target/site/site.xml.rcptt
[INFO] progress: Installing org.eclipse.rcptt.tesla.canvas
[INFO] progress: Installing org.eclipse.rcptt.tesla.jface.databinding.aspects
[INFO] progress: Installing org.eclipse.emf.transaction_root
[INFO] progress: Installing org.eclipse.rcptt.verifications.time
[INFO] progress: Installing org.eclipse.emf.databinding.edit.feature.jar
[INFO] progress: Installing org.eclipse.rcptt.ecl.platform.feature.jar
[INFO] progress: Installing org.eclipse.rcptt.tesla.jface.databinding.observable.aspects
[INFO] progress: Installing 201706090642.Default
[INFO] progress: Installing org.eclipse.emf.ant
[INFO] progress: Installing org.eclipse.rcptt.tesla.jface.aspects
[INFO] progress: Installing org.aspectj.runtime
[INFO] progress: Installing org.eclipse.emf.codegen.ecore.ui
[INFO] progress: Installing org.apache.poi
[INFO] progress: Installing org.eclipse.emf.transaction.feature.group
[INFO] progress: Installing org.eclipse.emf.codegen
[INFO] progress: Installing org.eclipse.emf.query_root
[INFO] progress: Installing org.eclipse.emf.codegen.ui
[INFO] progress: Installing org.eclipse.rcptt.core.swt.win32
[INFO] progress: Installing org.eclipse.emf.query.feature.group
[INFO] progress: Installing org.eclipse.rcptt.testrail.ecl.impl
[INFO] progress: Installing org.eclipse.rcptt.ecl.platform
[INFO] progress: Installing org.eclipse.emf.converter
[INFO] progress: Installing org.eclipse.emf.ecore.feature.group
[INFO] progress: Installing org.eclipse.rcptt.ecl.data.apache.poi
[INFO] progress: Installing org.eclipse.rcptt.ecl.platform.feature.group
[INFO] progress: Installing org.eclipse.rcptt.tesla.recording.aspects.draw2d
[INFO] progress: Installing org.eclipse.rcptt.ecl.data.apache.poi.impl
[INFO] progress: Installing org.eclipse.emf.mapping.ecore.feature.group
[INFO] progress: Installing org.eclipse.emf.mapping.ui.feature.group
[INFO] progress: Installing org.eclipse.rcptt.core.launching
[INFO] progress: Installing org.eclipse.rcptt.watson.feature.jar
[INFO] progress: Installing org.eclipse.rcptt.ecl.core.feature.group
[INFO] progress: Installing org.eclipse.emf.codegen.feature.group
[INFO] progress: Installing org.eclipse.emf.codegen.ui.feature.jar
[INFO] progress: Installing org.eclipse.emf.ecore.editor.feature.group
[INFO] progress: Installing org.eclipse.rcptt.ctx.preferences
[INFO] progress: Installing org.eclipse.rcptt.ctx.filesystem.impl
[INFO] progress: Installing org.eclipse.rcptt.ctx.debug.impl
[INFO] progress: Installing org.eclipse.emf.mapping.ui.feature.jar
[INFO] progress: Installing org.apache.poi.ooxml
[INFO] progress: Installing org.eclipse.emf.ecore
[INFO] progress: Installing org.eclipse.emf.common.feature.group
[INFO] progress: Installing org.eclipse.rcptt.ecl.server.feature.jar
[INFO] progress: Installing org.eclipse.emf.databinding
[INFO] progress: Installing org.eclipse.rcptt.ecl.server.feature.group
[INFO] progress: Installing org.eclipse.emf.databinding.feature.group
[INFO] progress: Installing org.eclipse.rcptt.ctx.workbench.aspect
[INFO] progress: Installing org.eclipse.rcptt.watson.runtime.feature.group
[INFO] progress: Installing org.eclipse.rcptt.ctx.filesystem
[INFO] progress: Installing org.eclipse.emf.databinding.feature.jar
[INFO] progress: Installing org.eclipse.emf.query.feature.jar
[INFO] progress: Installing org.eclipse.rcptt.tesla.recording.nebula
[INFO] progress: Installing org.eclipse.rcptt.tesla.ecl
[INFO] progress: Installing org.eclipse.rcptt.tesla.ecl.runtime.feature.group
[INFO] progress: Installing org.eclipse.emf.ecore.editor.feature.jar
[INFO] progress: Installing org.eclipse.rcptt.tesla.nebula.ecl.impl
[INFO] progress: Installing org.eclipse.rcptt.ecl.core.feature.jar
[INFO] progress: Installing org.eclipse.rcptt.tesla.recording.core
[INFO] progress: Installing org.eclipse.emf.ecore.feature.jar
[INFO] progress: Installing org.aspectj.weaver
[INFO] progress: Installing org.eclipse.emf.query
[INFO] progress: Installing org.eclipse.emf.codegen.ui.feature.group
[INFO] progress: Installing org.eclipse.rcptt.tesla.swt.fragment
[INFO] progress: Installing org.eclipse.emf.validation.feature.group
[INFO] progress: Installing org.eclipse.rcptt.module.nebula.runtime.feature.jar
[INFO] progress: Installing org.eclipse.rcptt.tesla.nebula.ecl
[INFO] progress: Installing org.eclipse.rcptt.ecl.data
[INFO] progress: Installing org.eclipse.rcptt.tesla.gmf
[INFO] progress: Installing org.eclipse.rcptt.tesla.ui.ide.aspects
[INFO] progress: Installing org.eclipse.rcptt.expandbar
[INFO] progress: Installing org.eclipse.rcptt.tesla.feature.jar
[INFO] progress: Installing org.eclipse.rcptt.core.swt.win64
[INFO] progress: Installing org.eclipse.emf.importer.rose
[INFO] progress: Installing org.eclipse.rcptt.ecl.core
[INFO] progress: Installing org.eclipse.emf.common.ui
[INFO] progress: Installing org.eclipse.rcptt.ctx.script
[INFO] progress: Installing org.eclipse.emf.ecore.editor
[INFO] progress: Installing org.eclipse.rcptt.tesla.recording.aspects.workbench.texteditor
[INFO] progress: Downloading org.eclipse.emf.validation_root
[INFO] progress: Downloading org.eclipse.emf.transaction_root
[INFO] progress: Downloading org.eclipse.emf.query_root
[INFO] progress: Preparing to commit the provisioning operation.
[INFO] progress: Committing the provisioning operation.
[INFO] progress: Reading plug-ins
[INFO] Target platform is valid.
[INFO] Looking for tests...
[INFO] Existing projects in workspace:
[INFO]     <none>
[INFO] Importing projects to workspace:
[INFO] Refreshing projects:
[INFO]     /home/jenkins/agent/workspace/capella-studio-v1.3.x/vpdsl/tests/capellastudio.vpdsl.qualityassessment.tests/target/projects/capellastudio.vpdsl.qualityassessment.tests... OK
[INFO] Refreshing projects:
[INFO]     capellastudio.vpdsl.qualityassessment.tests... OK
[INFO] Searching for tests in projects:
[INFO]     capellastudio.vpdsl.qualityassessment.tests... 
[INFO] Complete OK
[INFO] Testcase Artifacts:10
[INFO] AUT-0:Launching
[INFO] AUT-0:Product: org.polarsys.capella.studio.product.CapellaStudio
[INFO] AUT-0:Application: org.polarsys.capella.studio.product.application
[INFO] AUT-0:Architecture: x86_64
[INFO] 64bit arch is selected because AUT uses launcher library
[INFO] 	"plugins/org.eclipse.equinox.launcher.gtk.linux.x86_64_1.1.551.v20171108-1834" specified in config file: eclipse.ini
[INFO] /home/jenkins/agent/workspace/capella-studio-v1.3.x/vpdsl/tests/capellastudio.vpdsl.qualityassessment.tests/target/aut-ws-0: AUT arguments: -os ${target.os} -arch ${target.arch} -consoleLog
[INFO] /home/jenkins/agent/workspace/capella-studio-v1.3.x/vpdsl/tests/capellastudio.vpdsl.qualityassessment.tests/target/aut-ws-0: AUT VM arguments: -Dosgi.requiredJavaVersion=1.8 -Xms512m -Xmx2048m -XX:PermSize=256M -javaagent:/home/jenkins/.m2/repository/org/jacoco/org.jacoco.agent/0.7.9/org.jacoco.agent-0.7.9-runtime.jar=destfile=/home/jenkins/agent/workspace/capella-studio-v1.3.x/vpdsl/tests/capellastudio.vpdsl.qualityassessment.tests/target/jacoco.exec -XX:MaxPermSize=128m
[INFO] Pass 1 (10) processed. 0 failed. spent: 0:28, 2:06 mins remaining. Aspect - Data. time: 27783ms 
[INFO] Fail 2 (10) processed. 1 failed. spent: 0:48, 1:24 mins remaining. Aspect - Diagram. time: 20317ms  Cause: The Item "[platform:/resource/org.polarsys.capella.vp.qualityassessment.vpdsl/model/QualityAssessment.vpdesc, Viewpoint QualityAssessment, Diagram Set QualityAssessment.diagram, Diagram Extension QualityAssessment_PAB]" could not be found.
[INFO] Pass 3 (10) processed. 1 failed. spent: 1:00, 1:12 mins remaining. Aspect - Releng. time: 11219ms 
[INFO] Pass 4 (10) processed. 1 failed. spent: 1:11, 1:25 mins remaining. Aspect - Service. time: 11306ms 
[INFO] Pass 5 (10) processed. 1 failed. spent: 1:23, 0:47 mins remaining. Aspect - UI. time: 11964ms 
[INFO] Pass 6 (10) processed. 1 failed. spent: 2:03, 0:46 mins remaining. Bug - vpui-1275. time: 39779ms 
[INFO] Pass 7 (10) processed. 1 failed. spent: 2:11, 0:29 mins remaining. New Project creation. time: 7260ms 
[INFO] Pass 8 (10) processed. 1 failed. spent: 2:24, 0:14 mins remaining. Reverse from Ecore. time: 12639ms 
[INFO] Fail 9 (10) processed. 2 failed. spent: 3:39, 0:00 mins remaining. Viewpoint Generation and Packaging. time: 74142ms  Cause: Tree widget verification 'Projects - All_Artefacts' failed:
[INFO] Pass 10 (10) processed. 2 failed. spent: 4:29, 0:00 mins remaining. Viewpoint Generation. time: 48541ms 
[INFO] Failed Tests:
[INFO] Aspect - Diagram
[INFO] Viewpoint Generation and Packaging
[INFO] Process terminated. Shut down AUTs
[INFO] Runner exit code is: 56
[ERROR] There are test failures
[INFO] 
[INFO] --- rcptt-maven-plugin:2.2.0:package (default-package) @ capellastudio.vpdsl.qualityassessment.tests ---
[INFO] Building zip: /home/jenkins/agent/workspace/capella-studio-v1.3.x/vpdsl/tests/capellastudio.vpdsl.qualityassessment.tests/target/projects/capellastudio.vpdsl.qualityassessment.tests-1.3.1-SNAPSHOT.zip
[INFO] Building zip: /home/jenkins/agent/workspace/capella-studio-v1.3.x/vpdsl/tests/capellastudio.vpdsl.qualityassessment.tests/target/org.polarsys.capella-capellastudio.vpdsl.qualityassessment.tests-1.3.1-SNAPSHOT-result.zip
[INFO] aut1/out.txt already added, skipping
[INFO] 
[INFO] --- tycho-source-plugin:1.1.0:plugin-source (plugin-source) @ capellastudio.vpdsl.qualityassessment.tests ---
[INFO] 
[INFO] --- tycho-source-feature-plugin:1.1.0:source-feature (source-feature) @ capellastudio.vpdsl.qualityassessment.tests ---
[INFO]                                                                         
[INFO] ------------------------------------------------------------------------
[INFO] Building org.polarsys.capella.studio.test.feature 1.3.1-SNAPSHOT
[INFO] ------------------------------------------------------------------------
[INFO] 
[INFO] --- maven-clean-plugin:2.5:clean (default-clean) @ org.polarsys.capella.studio.test.feature ---
[INFO] Deleting /home/jenkins/agent/workspace/capella-studio-v1.3.x/tests/features/org.polarsys.capella.studio.test.feature/target
[INFO] 
[INFO] --- tycho-packaging-plugin:1.1.0:build-qualifier-aggregator (default-build-qualifier-aggregator) @ org.polarsys.capella.studio.test.feature ---
[INFO] The project's OSGi version is 1.3.1.202001211701
[INFO] 
[INFO] --- tycho-packaging-plugin:1.1.0:validate-id (default-validate-id) @ org.polarsys.capella.studio.test.feature ---
[INFO] 
[INFO] --- tycho-packaging-plugin:1.1.0:validate-version (default-validate-version) @ org.polarsys.capella.studio.test.feature ---
[INFO] 
[INFO] --- jacoco-maven-plugin:0.7.9:prepare-agent (default) @ org.polarsys.capella.studio.test.feature ---
[INFO] failsafeArgline set to -javaagent:/home/jenkins/.m2/repository/org/jacoco/org.jacoco.agent/0.7.9/org.jacoco.agent-0.7.9-runtime.jar=destfile=/home/jenkins/agent/workspace/capella-studio-v1.3.x/tests/features/org.polarsys.capella.studio.test.feature/target/jacoco.exec
[INFO] 
[INFO] --- target-platform-configuration:1.1.0:target-platform (default-target-platform) @ org.polarsys.capella.studio.test.feature ---
[INFO] 
[INFO] --- tycho-packaging-plugin:1.1.0:package-feature (default-package-feature) @ org.polarsys.capella.studio.test.feature ---
[INFO] Building jar: /home/jenkins/agent/workspace/capella-studio-v1.3.x/tests/features/org.polarsys.capella.studio.test.feature/target/org.polarsys.capella.studio.test.feature-1.3.1-SNAPSHOT.jar
[INFO] 
[INFO] --- tycho-p2-plugin:1.1.0:p2-metadata-default (default-p2-metadata-default) @ org.polarsys.capella.studio.test.feature ---
[INFO] 
[INFO] --- tycho-p2-plugin:1.1.0:feature-p2-metadata (default-feature-p2-metadata) @ org.polarsys.capella.studio.test.feature ---
[INFO] 
[INFO] --- tycho-source-plugin:1.1.0:plugin-source (plugin-source) @ org.polarsys.capella.studio.test.feature ---
[INFO] 
[INFO] --- tycho-source-feature-plugin:1.1.0:source-feature (source-feature) @ org.polarsys.capella.studio.test.feature ---
[INFO] Building jar: /home/jenkins/agent/workspace/capella-studio-v1.3.x/tests/features/org.polarsys.capella.studio.test.feature/target/org.polarsys.capella.studio.test.feature-1.3.1-SNAPSHOT-sources-feature.jar
[INFO] 
[INFO] --- tycho-p2-plugin:1.1.0:p2-metadata (p2-metadata) @ org.polarsys.capella.studio.test.feature ---
[INFO]                                                                         
[INFO] ------------------------------------------------------------------------
[INFO] Building Capella Sudio tests Aggregator Module 1.3.1-SNAPSHOT
[INFO] ------------------------------------------------------------------------
[INFO] 
[INFO] --- maven-clean-plugin:2.5:clean (default-clean) @ org.polarsys.capella.studio.releng.aggregator.tests ---
[INFO] 
[INFO] --- jacoco-maven-plugin:0.7.9:prepare-agent (default) @ org.polarsys.capella.studio.releng.aggregator.tests ---
[INFO] failsafeArgline set to -javaagent:/home/jenkins/.m2/repository/org/jacoco/org.jacoco.agent/0.7.9/org.jacoco.agent-0.7.9-runtime.jar=destfile=/home/jenkins/agent/workspace/capella-studio-v1.3.x/releng/plugins/org.polarsys.capella.studio.releng.aggregator.tests/target/jacoco.exec
[INFO] 
[INFO] --- tycho-source-plugin:1.1.0:plugin-source (plugin-source) @ org.polarsys.capella.studio.releng.aggregator.tests ---
[INFO] 
[INFO] --- tycho-source-feature-plugin:1.1.0:source-feature (source-feature) @ org.polarsys.capella.studio.releng.aggregator.tests ---
[INFO]                                                                         
[INFO] ------------------------------------------------------------------------
[INFO] Building Capella Studio Root 1.3.1-SNAPSHOT
[INFO] ------------------------------------------------------------------------
[INFO] 
[INFO] --- maven-clean-plugin:2.5:clean (default-clean) @ org.polarsys.capella.studio.releng.root ---
[INFO] 
[INFO] --- jacoco-maven-plugin:0.7.9:prepare-agent (default) @ org.polarsys.capella.studio.releng.root ---
[INFO] failsafeArgline set to -javaagent:/home/jenkins/.m2/repository/org/jacoco/org.jacoco.agent/0.7.9/org.jacoco.agent-0.7.9-runtime.jar=destfile=/home/jenkins/agent/workspace/capella-studio-v1.3.x/target/jacoco.exec
[INFO] 
[INFO] --- tycho-source-plugin:1.1.0:plugin-source (plugin-source) @ org.polarsys.capella.studio.releng.root ---
[INFO] 
[INFO] --- tycho-source-feature-plugin:1.1.0:source-feature (source-feature) @ org.polarsys.capella.studio.releng.root ---
[INFO] ------------------------------------------------------------------------
[INFO] Reactor Summary:
[INFO] 
[INFO] Capella Studio ..................................... SUCCESS [ 11.924 s]
[INFO] capellastudio ...................................... SUCCESS [  1.343 s]
[INFO] org.polarsys.capella.extension.genchain.model ...... SUCCESS [  2.829 s]
[INFO] org.polarsys.capella.extension.genchain ............ SUCCESS [  0.320 s]
[INFO] org.polarsys.capella.extension.genchain.model.edit . SUCCESS [  0.216 s]
[INFO] org.polarsys.capella.extension.tools ............... SUCCESS [  0.576 s]
[INFO] org.polarsys.capella.extension.tools.ui ............ SUCCESS [  0.380 s]
[INFO] org.polarsys.capella.studio.product ................ SUCCESS [  0.249 s]
[INFO] org.polarsys.capella.ad.viewpoint.dsl.generation.ui  SUCCESS [  0.465 s]
[INFO] org.polarsys.capella.ta ............................ SUCCESS [  0.205 s]
[INFO] org.polarsys.capella.ta.viewpoint.dsl.extension .... SUCCESS [  0.121 s]
[INFO] org.polarsys.capella.extension.sdk.feature ......... SUCCESS [  0.311 s]
[INFO] org.polarsys.capella.studio.product.feature ........ SUCCESS [  0.187 s]
[INFO] org.polarsys.capella.ta.viewpoint.dsl.feature ...... SUCCESS [  0.099 s]
[INFO] org.polarsys.capella.studio.releng.eclipse.feature . SUCCESS [  0.416 s]
[INFO] org.polarsys.capella.studio.releng.capella.feature . SUCCESS [  0.361 s]
[INFO] org.polarsys.capella.studio.releng.kitalpha.feature  SUCCESS [  0.261 s]
[INFO] org.polarsys.capella.studio.releng.updatesite ...... SUCCESS [  2.400 s]
[INFO] Capella studio Product ............................. SUCCESS [03:54 min]
[INFO] Capella Sudio Aggregator Module .................... SUCCESS [  0.021 s]
[INFO] org.polarsys.capella.studio.test ................... SUCCESS [  5.628 s]
[INFO] org.polarsys.capella.extension.rcptt ............... SUCCESS [02:41 min]
[INFO] org.polarsys.capella.ad.viewpoint.dsl.tests ........ SUCCESS [ 29.405 s]
[INFO] org.polarsys.capella.gen.doc.tests ................. SUCCESS [01:39 min]
[INFO] org.polarsys.capella.studio.ad.viewpoint.rcptt ..... SUCCESS [04:43 min]
[INFO] capellastudio.vpdsl.qualityassessment.reverse.tests  SUCCESS [01:02 min]
[INFO] capellastudio.vpdsl.qualityassessment.tests ........ SUCCESS [05:22 min]
[INFO] org.polarsys.capella.studio.test.feature ........... SUCCESS [  0.079 s]
[INFO] Capella Sudio tests Aggregator Module .............. SUCCESS [  0.002 s]
[INFO] Capella Studio Root ................................ SUCCESS [  0.002 s]
[INFO] ------------------------------------------------------------------------
[INFO] BUILD SUCCESS
[INFO] ------------------------------------------------------------------------
[INFO] Total time: 28:30 min
[INFO] Finished at: 2020-01-21T17:29:54+00:00
[INFO] Final Memory: 231M/1226M
[INFO] ------------------------------------------------------------------------
[capella-studio-v1.3.x] $ /bin/sh -xe /tmp/jenkins5655787525089872363.sh
+ echo 'deploy update site'
deploy update site
+ ssh genie.capella@projects-storage.eclipse.org rm -rf /home/data/httpd/download.eclipse.org/capella/capellastudio/updates/nightly/1.3.x
+ ssh genie.capella@projects-storage.eclipse.org mkdir -p /home/data/httpd/download.eclipse.org/capella/capellastudio/updates/nightly/1.3.x
+ scp -r releng/plugins/org.polarsys.capella.studio.releng.updatesite/target/repository/artifacts.jar releng/plugins/org.polarsys.capella.studio.releng.updatesite/target/repository/artifacts.xml.xz releng/plugins/org.polarsys.capella.studio.releng.updatesite/target/repository/content.jar releng/plugins/org.polarsys.capella.studio.releng.updatesite/target/repository/content.xml.xz releng/plugins/org.polarsys.capella.studio.releng.updatesite/target/repository/features releng/plugins/org.polarsys.capella.studio.releng.updatesite/target/repository/p2.index releng/plugins/org.polarsys.capella.studio.releng.updatesite/target/repository/plugins genie.capella@projects-storage.eclipse.org:/home/data/httpd/download.eclipse.org/capella/capellastudio/updates/nightly/1.3.x
+ echo 'deploy product'
deploy product
+ ssh genie.capella@projects-storage.eclipse.org rm -rf /home/data/httpd/download.eclipse.org/capella/capellastudio/products/nightly/1.3.x
+ ssh genie.capella@projects-storage.eclipse.org mkdir -p /home/data/httpd/download.eclipse.org/capella/capellastudio/products/nightly/1.3.x
+ scp -r releng/plugins/org.polarsys.capella.studio.releng.product/target/products/capella-studio-1.3.1.202001211701-linux.gtk.x86_64.zip releng/plugins/org.polarsys.capella.studio.releng.product/target/products/capella-studio-1.3.1.202001211701-macosx.cocoa.x86_64.zip releng/plugins/org.polarsys.capella.studio.releng.product/target/products/capella-studio-1.3.1.202001211701-win32.win32.x86_64.zip genie.capella@projects-storage.eclipse.org:/home/data/httpd/download.eclipse.org/capella/capellastudio/products/nightly/1.3.x
Terminating xvnc.
$ ssh-agent -k
unset SSH_AUTH_SOCK;
unset SSH_AGENT_PID;
echo Agent pid 49 killed;
[ssh-agent] Stopped.
[capella-studio-v1.3.x] $ /opt/tools/apache-maven/3.3.9/bin/mvn -f /home/jenkins/agent/workspace/capella-studio-v1.3.x/releng/plugins/org.polarsys.capella.studio.releng.parent/pom.xml -e -B org.sonarsource.scanner.maven:sonar-maven-plugin:3.3.0.603:sonar -Dsonar.jdbc.url=jdbc:mysql://dbmaster:3306/sonar?autoReconnect=true&useUnicode=true&characterEncoding=utf8 ******** ******** -Dsonar.host.url=https://sonar.eclipse.org
Picked up JAVA_TOOL_OPTIONS: -XX:+IgnoreUnrecognizedVMOptions -XX:+UseContainerSupport -XX:+UnlockExperimentalVMOptions -XX:+UseCGroupMemoryLimitForHeap
Picked up _JAVA_OPTIONS: -XX:MaxRAMPercentage=64.0
[INFO] Error stacktraces are turned on.
[INFO] Scanning for projects...
/home/jenkins/agent/workspace/capella-studio-v1.3.x/extension/plugins/org.polarsys.capella.extension.genchain/.polyglot.build.properties
/home/jenkins/agent/workspace/capella-studio-v1.3.x/extension/plugins/org.polarsys.capella.extension.genchain.model/.polyglot.build.properties
/home/jenkins/agent/workspace/capella-studio-v1.3.x/extension/plugins/org.polarsys.capella.extension.genchain.model.edit/.polyglot.build.properties
/home/jenkins/agent/workspace/capella-studio-v1.3.x/extension/plugins/org.polarsys.capella.extension.tools/.polyglot.build.properties
/home/jenkins/agent/workspace/capella-studio-v1.3.x/extension/plugins/org.polarsys.capella.extension.tools.ui/.polyglot.build.properties
/home/jenkins/agent/workspace/capella-studio-v1.3.x/product/plugins/org.polarsys.capella.studio.product/.polyglot.build.properties
/home/jenkins/agent/workspace/capella-studio-v1.3.x/vpdsl/plugins/org.polarsys.capella.ad.viewpoint.dsl.generation.ui/.polyglot.build.properties
/home/jenkins/agent/workspace/capella-studio-v1.3.x/vpdsl/plugins/org.polarsys.capella.ta/.polyglot.build.properties
/home/jenkins/agent/workspace/capella-studio-v1.3.x/vpdsl/plugins/org.polarsys.capella.ta.viewpoint.dsl.extension/.polyglot.build.properties
/home/jenkins/agent/workspace/capella-studio-v1.3.x/extension/features/org.polarsys.capella.extension.sdk.feature/.polyglot.build.properties
/home/jenkins/agent/workspace/capella-studio-v1.3.x/product/features/org.polarsys.capella.studio.product.feature/.polyglot.build.properties
/home/jenkins/agent/workspace/capella-studio-v1.3.x/vpdsl/features/org.polarsys.capella.ta.viewpoint.dsl.feature/.polyglot.build.properties
/home/jenkins/agent/workspace/capella-studio-v1.3.x/tests/plugins/org.polarsys.capella.studio.test/.polyglot.build.properties
/home/jenkins/agent/workspace/capella-studio-v1.3.x/vpdsl/tests/org.polarsys.capella.ad.viewpoint.dsl.tests/.polyglot.build.properties
/home/jenkins/agent/workspace/capella-studio-v1.3.x/tests/features/org.polarsys.capella.studio.test.feature/.polyglot.build.properties
[INFO] Computing target platform for MavenProject: org.polarsys.capella:org.polarsys.capella.extension.genchain:1.3.1-SNAPSHOT @ /home/jenkins/agent/workspace/capella-studio-v1.3.x/extension/plugins/org.polarsys.capella.extension.genchain/.polyglot.build.properties
[INFO] Fetching p2.index from http://download.eclipse.org/releases/oxygen/201803211000/
[INFO] Fetching p2.index from http://download.eclipse.org/releases/oxygen/201803211000/
[INFO] Adding repository http://download.eclipse.org/releases/oxygen/201803211000
[INFO] Fetching p2.index from https://download.eclipse.org/acceleo/updates/releases/3.7/R201812041426/
[INFO] Fetching p2.index from https://download.eclipse.org/acceleo/updates/releases/3.7/R201812041426/
[INFO] Adding repository https://download.eclipse.org/acceleo/updates/releases/3.7/R201812041426
[INFO] Fetching p2.index from https://download.eclipse.org/sirius/updates/releases/6.1.3/oxygen/
[INFO] Fetching p2.index from https://download.eclipse.org/sirius/updates/releases/6.1.3/oxygen/
[INFO] Adding repository https://download.eclipse.org/sirius/updates/releases/6.1.3/oxygen
[INFO] Fetching p2.index from http://download.eclipse.org/diffmerge/releases/0.11.2/emf-diffmerge-site/
[INFO] Fetching p2.index from http://download.eclipse.org/diffmerge/releases/0.11.2/emf-diffmerge-site/
[INFO] Adding repository http://download.eclipse.org/diffmerge/releases/0.11.2/emf-diffmerge-site
[INFO] Fetching p2.index from http://download.eclipse.org/diffmerge/releases/0.11.0/edm-patterns-site/
[INFO] Fetching p2.index from http://download.eclipse.org/diffmerge/releases/0.11.0/edm-patterns-site/
[INFO] Adding repository http://download.eclipse.org/diffmerge/releases/0.11.0/edm-patterns-site
[INFO] Fetching p2.index from http://download.eclipse.org/diffmerge/releases/0.11.0/edm-coevolution-site/
[INFO] Fetching p2.index from http://download.eclipse.org/diffmerge/releases/0.11.0/edm-coevolution-site/
[INFO] Adding repository http://download.eclipse.org/diffmerge/releases/0.11.0/edm-coevolution-site
[INFO] Adding repository https://download.eclipse.org/modeling/amalgam/updates/stable/1.10.1-S20190510//capella
[INFO] Adding repository http://download.eclipse.org/ecoretools/updates/releases/3.3.0/oxygen
[INFO] Fetching p2.index from http://download.eclipse.org/egf/updates/1.6.0/oxygen/
[INFO] Fetching p2.index from http://download.eclipse.org/egf/updates/1.6.0/oxygen/
[INFO] Adding repository http://download.eclipse.org/egf/updates/1.6.0/oxygen
[INFO] Fetching p2.index from http://download.eclipse.org/nebula/releases/1.4.0/
[INFO] Fetching p2.index from http://download.eclipse.org/nebula/releases/1.4.0/
[INFO] Adding repository http://download.eclipse.org/nebula/releases/1.4.0
[INFO] Fetching p2.index from http://download.eclipse.org/nattable/releases/1.5.0/repository/
[INFO] Fetching p2.index from http://download.eclipse.org/nattable/releases/1.5.0/repository/
[INFO] Adding repository http://download.eclipse.org/nattable/releases/1.5.0/repository
[INFO] Fetching p2.index from http://download.eclipse.org/tools/orbit/downloads/drops/R20180206163158/repository/
[INFO] Fetching p2.index from http://download.eclipse.org/tools/orbit/downloads/drops/R20180206163158/repository/
[INFO] Adding repository http://download.eclipse.org/tools/orbit/downloads/drops/R20180206163158/repository
[INFO] Fetching p2.index from http://download.eclipse.org/tools/orbit/downloads/drops2/R20180206163158/repository/
[INFO] Fetching p2.index from http://download.eclipse.org/tools/orbit/downloads/drops2/R20180206163158/repository/
[INFO] Fetching p2.index from http://download.eclipse.org/tools/orbit/downloads/drops/R20130827064939/repository/
[INFO] Fetching p2.index from http://download.eclipse.org/tools/orbit/downloads/drops/R20130827064939/repository/
[INFO] Adding repository http://download.eclipse.org/tools/orbit/downloads/drops/R20130827064939/repository
[INFO] Fetching p2.index from http://download.eclipse.org/tools/orbit/downloads/drops/R20140525021250/repository/
[INFO] Fetching p2.index from http://download.eclipse.org/tools/orbit/downloads/drops/R20140525021250/repository/
[INFO] Adding repository http://download.eclipse.org/tools/orbit/downloads/drops/R20140525021250/repository
[INFO] Adding repository http://download.eclipse.org/sirius/updates/legacy/1.1.0
[INFO] Fetching p2.index from http://download.polarsys.org/kitalpha/updates/release/sdk/1.3.1/
[INFO] Fetching p2.index from http://download.polarsys.org/kitalpha/updates/release/sdk/1.3.1/
[INFO] Adding repository http://download.polarsys.org/kitalpha/updates/release/sdk/1.3.1
[INFO] Fetching p2.index from http://download.polarsys.org/kitalpha/updates/release/runtime/1.3.1/
[INFO] Fetching p2.index from http://download.polarsys.org/kitalpha/updates/release/runtime/1.3.1/
[INFO] Adding repository http://download.polarsys.org/kitalpha/updates/release/runtime/1.3.1
[INFO] Fetching p2.index from http://download.polarsys.org/kitalpha/updates/release/runtimecore/1.3.1/
[INFO] Fetching p2.index from http://download.polarsys.org/kitalpha/updates/release/runtimecore/1.3.1/
[INFO] Adding repository http://download.polarsys.org/kitalpha/updates/release/runtimecore/1.3.1
[INFO] Adding repository http://download.polarsys.org/capella/core/updates/releases/1.3.1-R20190520-182008/org.polarsys.capella.egf.site
[INFO] Adding repository http://download.polarsys.org/capella/core/updates/releases/1.3.1-R20190520-182008/org.polarsys.capella.rcp.site
[INFO] Fetching p2.index from https://download.eclipse.org/capella/addons/xhtmldocgen/updates/release/1.3.1/
[INFO] Fetching p2.index from https://download.eclipse.org/capella/addons/xhtmldocgen/updates/release/1.3.1/
[INFO] Adding repository https://download.eclipse.org/capella/addons/xhtmldocgen/updates/release/1.3.1
[INFO] Resolving dependencies of MavenProject: org.polarsys.capella:org.polarsys.capella.extension.genchain:1.3.1-SNAPSHOT @ /home/jenkins/agent/workspace/capella-studio-v1.3.x/extension/plugins/org.polarsys.capella.extension.genchain/.polyglot.build.properties
[INFO] Resolving class path of MavenProject: org.polarsys.capella:org.polarsys.capella.extension.genchain:1.3.1-SNAPSHOT @ /home/jenkins/agent/workspace/capella-studio-v1.3.x/extension/plugins/org.polarsys.capella.extension.genchain/.polyglot.build.properties
[INFO] Computing target platform for MavenProject: org.polarsys.capella:org.polarsys.capella.extension.genchain.model:1.3.1-SNAPSHOT @ /home/jenkins/agent/workspace/capella-studio-v1.3.x/extension/plugins/org.polarsys.capella.extension.genchain.model/.polyglot.build.properties
[INFO] Resolving dependencies of MavenProject: org.polarsys.capella:org.polarsys.capella.extension.genchain.model:1.3.1-SNAPSHOT @ /home/jenkins/agent/workspace/capella-studio-v1.3.x/extension/plugins/org.polarsys.capella.extension.genchain.model/.polyglot.build.properties
[INFO] Resolving class path of MavenProject: org.polarsys.capella:org.polarsys.capella.extension.genchain.model:1.3.1-SNAPSHOT @ /home/jenkins/agent/workspace/capella-studio-v1.3.x/extension/plugins/org.polarsys.capella.extension.genchain.model/.polyglot.build.properties
[INFO] Computing target platform for MavenProject: org.polarsys.capella:org.polarsys.capella.extension.genchain.model.edit:1.3.1-SNAPSHOT @ /home/jenkins/agent/workspace/capella-studio-v1.3.x/extension/plugins/org.polarsys.capella.extension.genchain.model.edit/.polyglot.build.properties
[INFO] Resolving dependencies of MavenProject: org.polarsys.capella:org.polarsys.capella.extension.genchain.model.edit:1.3.1-SNAPSHOT @ /home/jenkins/agent/workspace/capella-studio-v1.3.x/extension/plugins/org.polarsys.capella.extension.genchain.model.edit/.polyglot.build.properties
[INFO] Resolving class path of MavenProject: org.polarsys.capella:org.polarsys.capella.extension.genchain.model.edit:1.3.1-SNAPSHOT @ /home/jenkins/agent/workspace/capella-studio-v1.3.x/extension/plugins/org.polarsys.capella.extension.genchain.model.edit/.polyglot.build.properties
[INFO] Computing target platform for MavenProject: org.polarsys.capella:org.polarsys.capella.extension.tools:1.3.1-SNAPSHOT @ /home/jenkins/agent/workspace/capella-studio-v1.3.x/extension/plugins/org.polarsys.capella.extension.tools/.polyglot.build.properties
[INFO] Resolving dependencies of MavenProject: org.polarsys.capella:org.polarsys.capella.extension.tools:1.3.1-SNAPSHOT @ /home/jenkins/agent/workspace/capella-studio-v1.3.x/extension/plugins/org.polarsys.capella.extension.tools/.polyglot.build.properties
[INFO] Resolving class path of MavenProject: org.polarsys.capella:org.polarsys.capella.extension.tools:1.3.1-SNAPSHOT @ /home/jenkins/agent/workspace/capella-studio-v1.3.x/extension/plugins/org.polarsys.capella.extension.tools/.polyglot.build.properties
[INFO] Computing target platform for MavenProject: org.polarsys.capella:org.polarsys.capella.extension.tools.ui:1.3.1-SNAPSHOT @ /home/jenkins/agent/workspace/capella-studio-v1.3.x/extension/plugins/org.polarsys.capella.extension.tools.ui/.polyglot.build.properties
[INFO] Resolving dependencies of MavenProject: org.polarsys.capella:org.polarsys.capella.extension.tools.ui:1.3.1-SNAPSHOT @ /home/jenkins/agent/workspace/capella-studio-v1.3.x/extension/plugins/org.polarsys.capella.extension.tools.ui/.polyglot.build.properties
[INFO] Resolving class path of MavenProject: org.polarsys.capella:org.polarsys.capella.extension.tools.ui:1.3.1-SNAPSHOT @ /home/jenkins/agent/workspace/capella-studio-v1.3.x/extension/plugins/org.polarsys.capella.extension.tools.ui/.polyglot.build.properties
[INFO] Computing target platform for MavenProject: org.polarsys.capella:org.polarsys.capella.studio.product:1.3.1-SNAPSHOT @ /home/jenkins/agent/workspace/capella-studio-v1.3.x/product/plugins/org.polarsys.capella.studio.product/.polyglot.build.properties
[INFO] Resolving dependencies of MavenProject: org.polarsys.capella:org.polarsys.capella.studio.product:1.3.1-SNAPSHOT @ /home/jenkins/agent/workspace/capella-studio-v1.3.x/product/plugins/org.polarsys.capella.studio.product/.polyglot.build.properties
[INFO] Resolving class path of MavenProject: org.polarsys.capella:org.polarsys.capella.studio.product:1.3.1-SNAPSHOT @ /home/jenkins/agent/workspace/capella-studio-v1.3.x/product/plugins/org.polarsys.capella.studio.product/.polyglot.build.properties
[INFO] Computing target platform for MavenProject: org.polarsys.capella:org.polarsys.capella.ad.viewpoint.dsl.generation.ui:1.3.1-SNAPSHOT @ /home/jenkins/agent/workspace/capella-studio-v1.3.x/vpdsl/plugins/org.polarsys.capella.ad.viewpoint.dsl.generation.ui/.polyglot.build.properties
[INFO] Resolving dependencies of MavenProject: org.polarsys.capella:org.polarsys.capella.ad.viewpoint.dsl.generation.ui:1.3.1-SNAPSHOT @ /home/jenkins/agent/workspace/capella-studio-v1.3.x/vpdsl/plugins/org.polarsys.capella.ad.viewpoint.dsl.generation.ui/.polyglot.build.properties
[INFO] Resolving class path of MavenProject: org.polarsys.capella:org.polarsys.capella.ad.viewpoint.dsl.generation.ui:1.3.1-SNAPSHOT @ /home/jenkins/agent/workspace/capella-studio-v1.3.x/vpdsl/plugins/org.polarsys.capella.ad.viewpoint.dsl.generation.ui/.polyglot.build.properties
[INFO] Computing target platform for MavenProject: org.polarsys.capella:org.polarsys.capella.ta:1.3.1-SNAPSHOT @ /home/jenkins/agent/workspace/capella-studio-v1.3.x/vpdsl/plugins/org.polarsys.capella.ta/.polyglot.build.properties
[INFO] Resolving dependencies of MavenProject: org.polarsys.capella:org.polarsys.capella.ta:1.3.1-SNAPSHOT @ /home/jenkins/agent/workspace/capella-studio-v1.3.x/vpdsl/plugins/org.polarsys.capella.ta/.polyglot.build.properties
[INFO] Resolving class path of MavenProject: org.polarsys.capella:org.polarsys.capella.ta:1.3.1-SNAPSHOT @ /home/jenkins/agent/workspace/capella-studio-v1.3.x/vpdsl/plugins/org.polarsys.capella.ta/.polyglot.build.properties
[INFO] Computing target platform for MavenProject: org.polarsys.capella:org.polarsys.capella.ta.viewpoint.dsl.extension:1.3.1-SNAPSHOT @ /home/jenkins/agent/workspace/capella-studio-v1.3.x/vpdsl/plugins/org.polarsys.capella.ta.viewpoint.dsl.extension/.polyglot.build.properties
[INFO] Resolving dependencies of MavenProject: org.polarsys.capella:org.polarsys.capella.ta.viewpoint.dsl.extension:1.3.1-SNAPSHOT @ /home/jenkins/agent/workspace/capella-studio-v1.3.x/vpdsl/plugins/org.polarsys.capella.ta.viewpoint.dsl.extension/.polyglot.build.properties
[INFO] Resolving class path of MavenProject: org.polarsys.capella:org.polarsys.capella.ta.viewpoint.dsl.extension:1.3.1-SNAPSHOT @ /home/jenkins/agent/workspace/capella-studio-v1.3.x/vpdsl/plugins/org.polarsys.capella.ta.viewpoint.dsl.extension/.polyglot.build.properties
[INFO] Computing target platform for MavenProject: org.polarsys.capella:org.polarsys.capella.extension.sdk.feature:1.3.1-SNAPSHOT @ /home/jenkins/agent/workspace/capella-studio-v1.3.x/extension/features/org.polarsys.capella.extension.sdk.feature/.polyglot.build.properties
[INFO] Resolving dependencies of MavenProject: org.polarsys.capella:org.polarsys.capella.extension.sdk.feature:1.3.1-SNAPSHOT @ /home/jenkins/agent/workspace/capella-studio-v1.3.x/extension/features/org.polarsys.capella.extension.sdk.feature/.polyglot.build.properties
[INFO] Resolving class path of MavenProject: org.polarsys.capella:org.polarsys.capella.extension.sdk.feature:1.3.1-SNAPSHOT @ /home/jenkins/agent/workspace/capella-studio-v1.3.x/extension/features/org.polarsys.capella.extension.sdk.feature/.polyglot.build.properties
[INFO] Computing target platform for MavenProject: org.polarsys.capella:org.polarsys.capella.studio.product.feature:1.3.1-SNAPSHOT @ /home/jenkins/agent/workspace/capella-studio-v1.3.x/product/features/org.polarsys.capella.studio.product.feature/.polyglot.build.properties
[INFO] Resolving dependencies of MavenProject: org.polarsys.capella:org.polarsys.capella.studio.product.feature:1.3.1-SNAPSHOT @ /home/jenkins/agent/workspace/capella-studio-v1.3.x/product/features/org.polarsys.capella.studio.product.feature/.polyglot.build.properties
[INFO] Resolving class path of MavenProject: org.polarsys.capella:org.polarsys.capella.studio.product.feature:1.3.1-SNAPSHOT @ /home/jenkins/agent/workspace/capella-studio-v1.3.x/product/features/org.polarsys.capella.studio.product.feature/.polyglot.build.properties
[INFO] Computing target platform for MavenProject: org.polarsys.capella:org.polarsys.capella.ta.viewpoint.dsl.feature:1.3.1-SNAPSHOT @ /home/jenkins/agent/workspace/capella-studio-v1.3.x/vpdsl/features/org.polarsys.capella.ta.viewpoint.dsl.feature/.polyglot.build.properties
[INFO] Resolving dependencies of MavenProject: org.polarsys.capella:org.polarsys.capella.ta.viewpoint.dsl.feature:1.3.1-SNAPSHOT @ /home/jenkins/agent/workspace/capella-studio-v1.3.x/vpdsl/features/org.polarsys.capella.ta.viewpoint.dsl.feature/.polyglot.build.properties
[INFO] Resolving class path of MavenProject: org.polarsys.capella:org.polarsys.capella.ta.viewpoint.dsl.feature:1.3.1-SNAPSHOT @ /home/jenkins/agent/workspace/capella-studio-v1.3.x/vpdsl/features/org.polarsys.capella.ta.viewpoint.dsl.feature/.polyglot.build.properties
[INFO] Computing target platform for MavenProject: org.polarsys.capella:org.polarsys.capella.studio.releng.eclipse.feature:1.3.1-SNAPSHOT @ /home/jenkins/agent/workspace/capella-studio-v1.3.x/releng/features/org.polarsys.capella.studio.releng.eclipse.feature/pom.xml
[INFO] Resolving dependencies of MavenProject: org.polarsys.capella:org.polarsys.capella.studio.releng.eclipse.feature:1.3.1-SNAPSHOT @ /home/jenkins/agent/workspace/capella-studio-v1.3.x/releng/features/org.polarsys.capella.studio.releng.eclipse.feature/pom.xml
[INFO] Resolving class path of MavenProject: org.polarsys.capella:org.polarsys.capella.studio.releng.eclipse.feature:1.3.1-SNAPSHOT @ /home/jenkins/agent/workspace/capella-studio-v1.3.x/releng/features/org.polarsys.capella.studio.releng.eclipse.feature/pom.xml
[INFO] Computing target platform for MavenProject: org.polarsys.capella:org.polarsys.capella.studio.releng.capella.feature:1.3.1-SNAPSHOT @ /home/jenkins/agent/workspace/capella-studio-v1.3.x/releng/features/org.polarsys.capella.studio.releng.capella.feature/pom.xml
[INFO] Resolving dependencies of MavenProject: org.polarsys.capella:org.polarsys.capella.studio.releng.capella.feature:1.3.1-SNAPSHOT @ /home/jenkins/agent/workspace/capella-studio-v1.3.x/releng/features/org.polarsys.capella.studio.releng.capella.feature/pom.xml
[INFO] Resolving class path of MavenProject: org.polarsys.capella:org.polarsys.capella.studio.releng.capella.feature:1.3.1-SNAPSHOT @ /home/jenkins/agent/workspace/capella-studio-v1.3.x/releng/features/org.polarsys.capella.studio.releng.capella.feature/pom.xml
[INFO] Computing target platform for MavenProject: org.polarsys.capella:org.polarsys.capella.studio.releng.kitalpha.feature:1.3.1-SNAPSHOT @ /home/jenkins/agent/workspace/capella-studio-v1.3.x/releng/features/org.polarsys.capella.studio.releng.kitalpha.feature/pom.xml
[INFO] Resolving dependencies of MavenProject: org.polarsys.capella:org.polarsys.capella.studio.releng.kitalpha.feature:1.3.1-SNAPSHOT @ /home/jenkins/agent/workspace/capella-studio-v1.3.x/releng/features/org.polarsys.capella.studio.releng.kitalpha.feature/pom.xml
[INFO] Resolving class path of MavenProject: org.polarsys.capella:org.polarsys.capella.studio.releng.kitalpha.feature:1.3.1-SNAPSHOT @ /home/jenkins/agent/workspace/capella-studio-v1.3.x/releng/features/org.polarsys.capella.studio.releng.kitalpha.feature/pom.xml
[INFO] Computing target platform for MavenProject: org.polarsys.capella:org.polarsys.capella.studio.releng.updatesite:1.3.1-SNAPSHOT @ /home/jenkins/agent/workspace/capella-studio-v1.3.x/releng/plugins/org.polarsys.capella.studio.releng.updatesite/pom.xml
[INFO] Resolving dependencies of MavenProject: org.polarsys.capella:org.polarsys.capella.studio.releng.updatesite:1.3.1-SNAPSHOT @ /home/jenkins/agent/workspace/capella-studio-v1.3.x/releng/plugins/org.polarsys.capella.studio.releng.updatesite/pom.xml
[INFO] Resolving class path of MavenProject: org.polarsys.capella:org.polarsys.capella.studio.releng.updatesite:1.3.1-SNAPSHOT @ /home/jenkins/agent/workspace/capella-studio-v1.3.x/releng/plugins/org.polarsys.capella.studio.releng.updatesite/pom.xml
[INFO] Computing target platform for MavenProject: org.polarsys.capella:org.polarsys.capella.studio.releng.product:1.3.1-SNAPSHOT @ /home/jenkins/agent/workspace/capella-studio-v1.3.x/releng/plugins/org.polarsys.capella.studio.releng.product/pom.xml
[INFO] Resolving dependencies of MavenProject: org.polarsys.capella:org.polarsys.capella.studio.releng.product:1.3.1-SNAPSHOT @ /home/jenkins/agent/workspace/capella-studio-v1.3.x/releng/plugins/org.polarsys.capella.studio.releng.product/pom.xml
[INFO] Resolving class path of MavenProject: org.polarsys.capella:org.polarsys.capella.studio.releng.product:1.3.1-SNAPSHOT @ /home/jenkins/agent/workspace/capella-studio-v1.3.x/releng/plugins/org.polarsys.capella.studio.releng.product/pom.xml
[INFO] Computing target platform for MavenProject: org.polarsys.capella:org.polarsys.capella.studio.test:1.3.1-SNAPSHOT @ /home/jenkins/agent/workspace/capella-studio-v1.3.x/tests/plugins/org.polarsys.capella.studio.test/.polyglot.build.properties
[INFO] Resolving dependencies of MavenProject: org.polarsys.capella:org.polarsys.capella.studio.test:1.3.1-SNAPSHOT @ /home/jenkins/agent/workspace/capella-studio-v1.3.x/tests/plugins/org.polarsys.capella.studio.test/.polyglot.build.properties
[INFO] Resolving class path of MavenProject: org.polarsys.capella:org.polarsys.capella.studio.test:1.3.1-SNAPSHOT @ /home/jenkins/agent/workspace/capella-studio-v1.3.x/tests/plugins/org.polarsys.capella.studio.test/.polyglot.build.properties
[INFO] Computing target platform for MavenProject: org.polarsys.capella:org.polarsys.capella.ad.viewpoint.dsl.tests:1.3.1-SNAPSHOT @ /home/jenkins/agent/workspace/capella-studio-v1.3.x/vpdsl/tests/org.polarsys.capella.ad.viewpoint.dsl.tests/.polyglot.build.properties
[INFO] Resolving dependencies of MavenProject: org.polarsys.capella:org.polarsys.capella.ad.viewpoint.dsl.tests:1.3.1-SNAPSHOT @ /home/jenkins/agent/workspace/capella-studio-v1.3.x/vpdsl/tests/org.polarsys.capella.ad.viewpoint.dsl.tests/.polyglot.build.properties
[INFO] Resolving class path of MavenProject: org.polarsys.capella:org.polarsys.capella.ad.viewpoint.dsl.tests:1.3.1-SNAPSHOT @ /home/jenkins/agent/workspace/capella-studio-v1.3.x/vpdsl/tests/org.polarsys.capella.ad.viewpoint.dsl.tests/.polyglot.build.properties
[INFO] Computing target platform for MavenProject: org.polarsys.capella:org.polarsys.capella.studio.test.feature:1.3.1-SNAPSHOT @ /home/jenkins/agent/workspace/capella-studio-v1.3.x/tests/features/org.polarsys.capella.studio.test.feature/.polyglot.build.properties
[INFO] Resolving dependencies of MavenProject: org.polarsys.capella:org.polarsys.capella.studio.test.feature:1.3.1-SNAPSHOT @ /home/jenkins/agent/workspace/capella-studio-v1.3.x/tests/features/org.polarsys.capella.studio.test.feature/.polyglot.build.properties
[INFO] Resolving class path of MavenProject: org.polarsys.capella:org.polarsys.capella.studio.test.feature:1.3.1-SNAPSHOT @ /home/jenkins/agent/workspace/capella-studio-v1.3.x/tests/features/org.polarsys.capella.studio.test.feature/.polyglot.build.properties
[INFO] ------------------------------------------------------------------------
[INFO] Reactor Build Order:
[INFO] 
[INFO] Capella Studio
[INFO] capellastudio
[INFO] org.polarsys.capella.extension.genchain.model
[INFO] org.polarsys.capella.extension.genchain
[INFO] org.polarsys.capella.extension.genchain.model.edit
[INFO] org.polarsys.capella.extension.tools
[INFO] org.polarsys.capella.extension.tools.ui
[INFO] org.polarsys.capella.studio.product
[INFO] org.polarsys.capella.ad.viewpoint.dsl.generation.ui
[INFO] org.polarsys.capella.ta
[INFO] org.polarsys.capella.ta.viewpoint.dsl.extension
[INFO] org.polarsys.capella.extension.sdk.feature
[INFO] org.polarsys.capella.studio.product.feature
[INFO] org.polarsys.capella.ta.viewpoint.dsl.feature
[INFO] org.polarsys.capella.studio.releng.eclipse.feature
[INFO] org.polarsys.capella.studio.releng.capella.feature
[INFO] org.polarsys.capella.studio.releng.kitalpha.feature
[INFO] org.polarsys.capella.studio.releng.updatesite
[INFO] Capella studio Product
[INFO] Capella Sudio Aggregator Module
[INFO] org.polarsys.capella.studio.test
[INFO] org.polarsys.capella.extension.rcptt
[INFO] org.polarsys.capella.ad.viewpoint.dsl.tests
[INFO] org.polarsys.capella.gen.doc.tests
[INFO] org.polarsys.capella.studio.ad.viewpoint.rcptt
[INFO] capellastudio.vpdsl.qualityassessment.reverse.tests
[INFO] capellastudio.vpdsl.qualityassessment.tests
[INFO] org.polarsys.capella.studio.test.feature
[INFO] Capella Sudio tests Aggregator Module
[INFO]                                                                         
[INFO] ------------------------------------------------------------------------
[INFO] Building Capella Studio 1.3.1-SNAPSHOT
[INFO] ------------------------------------------------------------------------
[WARNING] The following dependencies could not be resolved at this point of the build but seem to be part of the reactor:
[WARNING] o org.polarsys.capella:org.polarsys.capella.extension.genchain.model:jar:1.3.1-SNAPSHOT (provided)
[WARNING] Try running the build up to the lifecycle phase "package"
[WARNING] The following dependencies could not be resolved at this point of the build but seem to be part of the reactor:
[WARNING] o org.polarsys.capella:org.polarsys.capella.extension.genchain.model:jar:1.3.1-SNAPSHOT (provided)
[WARNING] Try running the build up to the lifecycle phase "package"
[WARNING] The following dependencies could not be resolved at this point of the build but seem to be part of the reactor:
[WARNING] o org.polarsys.capella:org.polarsys.capella.extension.genchain:jar:1.3.1-SNAPSHOT (provided)
[WARNING] o org.polarsys.capella:org.polarsys.capella.extension.genchain.model:jar:1.3.1-SNAPSHOT (provided)
[WARNING] o org.polarsys.capella:org.polarsys.capella.extension.tools:jar:1.3.1-SNAPSHOT (provided)
[WARNING] Try running the build up to the lifecycle phase "package"
[WARNING] The following dependencies could not be resolved at this point of the build but seem to be part of the reactor:
[WARNING] o org.polarsys.capella:org.polarsys.capella.ad.viewpoint.dsl.generation.ui:jar:1.3.1-SNAPSHOT (provided)
[WARNING] o org.polarsys.capella:org.polarsys.capella.extension.genchain:jar:1.3.1-SNAPSHOT (provided)
[WARNING] o org.polarsys.capella:org.polarsys.capella.extension.genchain.model:jar:1.3.1-SNAPSHOT (provided)
[WARNING] Try running the build up to the lifecycle phase "package"
[WARNING] The following dependencies could not be resolved at this point of the build but seem to be part of the reactor:
[WARNING] o org.polarsys.capella:org.polarsys.capella.extension.genchain:jar:1.3.1-SNAPSHOT (provided)
[WARNING] o org.polarsys.capella:org.polarsys.capella.extension.genchain.model:jar:1.3.1-SNAPSHOT (provided)
[WARNING] o org.polarsys.capella:org.polarsys.capella.extension.genchain.model.edit:jar:1.3.1-SNAPSHOT (provided)
[WARNING] o org.polarsys.capella:org.polarsys.capella.extension.tools:jar:1.3.1-SNAPSHOT (provided)
[WARNING] o org.polarsys.capella:org.polarsys.capella.extension.tools.ui:jar:1.3.1-SNAPSHOT (provided)
[WARNING] Try running the build up to the lifecycle phase "package"
[WARNING] The following dependencies could not be resolved at this point of the build but seem to be part of the reactor:
[WARNING] o org.polarsys.capella:org.polarsys.capella.studio.product:jar:1.3.1-SNAPSHOT (provided)
[WARNING] Try running the build up to the lifecycle phase "package"
[WARNING] The following dependencies could not be resolved at this point of the build but seem to be part of the reactor:
[WARNING] o org.polarsys.capella:org.polarsys.capella.ad.viewpoint.dsl.generation.ui:jar:1.3.1-SNAPSHOT (provided)
[WARNING] o org.polarsys.capella:org.polarsys.capella.extension.genchain:jar:1.3.1-SNAPSHOT (provided)
[WARNING] o org.polarsys.capella:org.polarsys.capella.extension.genchain.model:jar:1.3.1-SNAPSHOT (provided)
[WARNING] o org.polarsys.capella:org.polarsys.capella.ta:jar:1.3.1-SNAPSHOT (provided)
[WARNING] o org.polarsys.capella:org.polarsys.capella.ta.viewpoint.dsl.extension:jar:1.3.1-SNAPSHOT (provided)
[WARNING] Try running the build up to the lifecycle phase "package"
[WARNING] The following dependencies could not be resolved at this point of the build but seem to be part of the reactor:
[WARNING] o org.polarsys.capella:org.polarsys.capella.ad.viewpoint.dsl.generation.ui:jar:1.3.1-SNAPSHOT (provided)
[WARNING] o org.polarsys.capella:org.polarsys.capella.extension.genchain:jar:1.3.1-SNAPSHOT (provided)
[WARNING] o org.polarsys.capella:org.polarsys.capella.extension.genchain.model:jar:1.3.1-SNAPSHOT (provided)
[WARNING] o org.polarsys.capella:org.polarsys.capella.extension.genchain.model.edit:jar:1.3.1-SNAPSHOT (provided)
[WARNING] o org.polarsys.capella:org.polarsys.capella.extension.sdk.feature:jar:1.3.1-SNAPSHOT (provided)
[WARNING] o org.polarsys.capella:org.polarsys.capella.extension.tools:jar:1.3.1-SNAPSHOT (provided)
[WARNING] o org.polarsys.capella:org.polarsys.capella.extension.tools.ui:jar:1.3.1-SNAPSHOT (provided)
[WARNING] o org.polarsys.capella:org.polarsys.capella.studio.product:jar:1.3.1-SNAPSHOT (provided)
[WARNING] o org.polarsys.capella:org.polarsys.capella.studio.product.feature:jar:1.3.1-SNAPSHOT (provided)
[WARNING] o org.polarsys.capella:org.polarsys.capella.ta.viewpoint.dsl.feature:jar:1.3.1-SNAPSHOT (provided)
[WARNING] o org.polarsys.capella:org.polarsys.capella.ta:jar:1.3.1-SNAPSHOT (provided)
[WARNING] o org.polarsys.capella:org.polarsys.capella.ta.viewpoint.dsl.extension:jar:1.3.1-SNAPSHOT (provided)
[WARNING] Try running the build up to the lifecycle phase "package"
[WARNING] The following dependencies could not be resolved at this point of the build but seem to be part of the reactor:
[WARNING] o org.polarsys.capella:org.polarsys.capella.ad.viewpoint.dsl.generation.ui:jar:1.3.1-SNAPSHOT (provided)
[WARNING] o org.polarsys.capella:org.polarsys.capella.extension.genchain:jar:1.3.1-SNAPSHOT (provided)
[WARNING] o org.polarsys.capella:org.polarsys.capella.extension.genchain.model:jar:1.3.1-SNAPSHOT (provided)
[WARNING] o org.polarsys.capella:org.polarsys.capella.extension.genchain.model.edit:jar:1.3.1-SNAPSHOT (provided)
[WARNING] o org.polarsys.capella:org.polarsys.capella.extension.sdk.feature:jar:1.3.1-SNAPSHOT (provided)
[WARNING] o org.polarsys.capella:org.polarsys.capella.extension.tools:jar:1.3.1-SNAPSHOT (provided)
[WARNING] o org.polarsys.capella:org.polarsys.capella.extension.tools.ui:jar:1.3.1-SNAPSHOT (provided)
[WARNING] o org.polarsys.capella:org.polarsys.capella.studio.product:jar:1.3.1-SNAPSHOT (provided)
[WARNING] o org.polarsys.capella:org.polarsys.capella.studio.product.feature:jar:1.3.1-SNAPSHOT (provided)
[WARNING] o org.polarsys.capella:org.polarsys.capella.ta.viewpoint.dsl.feature:jar:1.3.1-SNAPSHOT (provided)
[WARNING] o org.polarsys.capella:org.polarsys.capella.ta:jar:1.3.1-SNAPSHOT (provided)
[WARNING] o org.polarsys.capella:org.polarsys.capella.ta.viewpoint.dsl.extension:jar:1.3.1-SNAPSHOT (provided)
[WARNING] Try running the build up to the lifecycle phase "package"
[WARNING] The following dependencies could not be resolved at this point of the build but seem to be part of the reactor:
[WARNING] o org.polarsys.capella:org.polarsys.capella.ad.viewpoint.dsl.generation.ui:jar:1.3.1-SNAPSHOT (provided)
[WARNING] o org.polarsys.capella:org.polarsys.capella.extension.genchain:jar:1.3.1-SNAPSHOT (provided)
[WARNING] o org.polarsys.capella:org.polarsys.capella.extension.genchain.model:jar:1.3.1-SNAPSHOT (provided)
[WARNING] o org.polarsys.capella:org.polarsys.capella.extension.genchain.model.edit:jar:1.3.1-SNAPSHOT (provided)
[WARNING] o org.polarsys.capella:org.polarsys.capella.extension.sdk.feature:jar:1.3.1-SNAPSHOT (provided)
[WARNING] o org.polarsys.capella:org.polarsys.capella.extension.tools:jar:1.3.1-SNAPSHOT (provided)
[WARNING] o org.polarsys.capella:org.polarsys.capella.extension.tools.ui:jar:1.3.1-SNAPSHOT (provided)
[WARNING] o org.polarsys.capella:org.polarsys.capella.studio.product:jar:1.3.1-SNAPSHOT (provided)
[WARNING] o org.polarsys.capella:org.polarsys.capella.studio.product.feature:jar:1.3.1-SNAPSHOT (provided)
[WARNING] o org.polarsys.capella:org.polarsys.capella.studio.releng.capella.feature:jar:1.3.1-SNAPSHOT (provided)
[WARNING] o org.polarsys.capella:org.polarsys.capella.ta.viewpoint.dsl.feature:jar:1.3.1-SNAPSHOT (provided)
[WARNING] o org.polarsys.capella:org.polarsys.capella.studio.releng.eclipse.feature:jar:1.3.1-SNAPSHOT (provided)
[WARNING] o org.polarsys.capella:org.polarsys.capella.studio.releng.kitalpha.feature:jar:1.3.1-SNAPSHOT (provided)
[WARNING] o org.polarsys.capella:org.polarsys.capella.ta:jar:1.3.1-SNAPSHOT (provided)
[WARNING] o org.polarsys.capella:org.polarsys.capella.ta.viewpoint.dsl.extension:jar:1.3.1-SNAPSHOT (provided)
[WARNING] Try running the build up to the lifecycle phase "package"
[WARNING] The following dependencies could not be resolved at this point of the build but seem to be part of the reactor:
[WARNING] o org.polarsys.capella:org.polarsys.capella.ad.viewpoint.dsl.generation.ui:jar:1.3.1-SNAPSHOT (provided)
[WARNING] o org.polarsys.capella:org.polarsys.capella.ta:jar:1.3.1-SNAPSHOT (provided)
[WARNING] o org.polarsys.capella:org.polarsys.capella.extension.genchain:jar:1.3.1-SNAPSHOT (provided)
[WARNING] o org.polarsys.capella:org.polarsys.capella.extension.genchain.model:jar:1.3.1-SNAPSHOT (provided)
[WARNING] Try running the build up to the lifecycle phase "package"
[WARNING] The following dependencies could not be resolved at this point of the build but seem to be part of the reactor:
[WARNING] o org.polarsys.capella:org.polarsys.capella.studio.test:jar:1.3.1-SNAPSHOT (provided)
[WARNING] Try running the build up to the lifecycle phase "package"
[INFO] 
[INFO] --- sonar-maven-plugin:3.3.0.603:sonar (default-cli) @ org.polarsys.capella.studio.releng.parent ---
[INFO] User cache: /home/jenkins/.sonar/cache
[INFO] SonarQube version: 4.5.7
/home/jenkins/agent/workspace/capella-studio-v1.3.x/extension/plugins/org.polarsys.capella.extension.genchain.model/.polyglot.build.properties
/home/jenkins/agent/workspace/capella-studio-v1.3.x/extension/plugins/org.polarsys.capella.extension.genchain/.polyglot.build.properties
/home/jenkins/agent/workspace/capella-studio-v1.3.x/extension/plugins/org.polarsys.capella.extension.tools/.polyglot.build.properties
/home/jenkins/agent/workspace/capella-studio-v1.3.x/vpdsl/plugins/org.polarsys.capella.ad.viewpoint.dsl.generation.ui/.polyglot.build.properties
/home/jenkins/agent/workspace/capella-studio-v1.3.x/extension/plugins/org.polarsys.capella.extension.genchain.model.edit/.polyglot.build.properties
/home/jenkins/agent/workspace/capella-studio-v1.3.x/extension/plugins/org.polarsys.capella.extension.tools.ui/.polyglot.build.properties
/home/jenkins/agent/workspace/capella-studio-v1.3.x/product/plugins/org.polarsys.capella.studio.product/.polyglot.build.properties
/home/jenkins/agent/workspace/capella-studio-v1.3.x/vpdsl/plugins/org.polarsys.capella.ta/.polyglot.build.properties
/home/jenkins/agent/workspace/capella-studio-v1.3.x/vpdsl/plugins/org.polarsys.capella.ta.viewpoint.dsl.extension/.polyglot.build.properties
/home/jenkins/agent/workspace/capella-studio-v1.3.x/extension/features/org.polarsys.capella.extension.sdk.feature/.polyglot.build.properties
/home/jenkins/agent/workspace/capella-studio-v1.3.x/product/features/org.polarsys.capella.studio.product.feature/.polyglot.build.properties
/home/jenkins/agent/workspace/capella-studio-v1.3.x/vpdsl/features/org.polarsys.capella.ta.viewpoint.dsl.feature/.polyglot.build.properties
/home/jenkins/agent/workspace/capella-studio-v1.3.x/tests/plugins/org.polarsys.capella.studio.test/.polyglot.build.properties
[INFO] Default locale: "en_US", source code encoding: "UTF-8" (analysis is platform dependent)
17:33:52.973 INFO  - Load global referentials...
17:33:53.054 INFO  - Load global referentials done: 82 ms
17:33:53.155 INFO  - User cache: /home/jenkins/.sonar/cache
17:33:53.163 INFO  - Install plugins
17:33:53.169 INFO  - Download sonar-core-plugin-4.5.7.jar
17:33:53.182 INFO  - Download sonar-email-notifications-plugin-4.5.7.jar
17:33:53.202 INFO  - Download sonar-findbugs-plugin-3.3.jar
17:33:53.367 INFO  - Download sonar-java-plugin-3.9.jar
17:33:53.646 INFO  - Download sonar-ldap-plugin-1.4.jar
17:33:53.650 INFO  - Download sonar-pmd-plugin-2.6.jar
17:33:53.981 INFO  - Download sonar-cpd-plugin-4.5.7.jar
17:33:53.985 INFO  - Download sonar-dbcleaner-plugin-4.5.7.jar
17:33:53.987 INFO  - Download sonar-design-plugin-4.5.7.jar
17:33:53.991 INFO  - Download sonar-l10n-en-plugin-4.5.7.jar
17:33:53.997 INFO  - Download sonar-checkstyle-plugin-2.3.jar
17:33:54.063 INFO  - Install JDBC driver
17:33:54.075 INFO  - Download mysql-connector-java-5.1.27.jar
17:33:54.096 INFO  - Create JDBC datasource for jdbc:mysql://dbmaster:3306/sonar?autoReconnect=true&useUnicode=true&characterEncoding=utf8
17:33:54.742 INFO  - Initializing Hibernate
17:33:56.271 INFO  - Load project referentials...
17:33:56.707 INFO  - Load project referentials done: 436 ms
[INFO] ------------------------------------------------------------------------
[INFO] Reactor Summary:
[INFO] 
[INFO] Capella Studio ..................................... FAILURE [ 12.278 s]
[INFO] capellastudio ...................................... SKIPPED
[INFO] org.polarsys.capella.extension.genchain.model ...... SKIPPED
[INFO] org.polarsys.capella.extension.genchain ............ SKIPPED
[INFO] org.polarsys.capella.extension.genchain.model.edit . SKIPPED
[INFO] org.polarsys.capella.extension.tools ............... SKIPPED
[INFO] org.polarsys.capella.extension.tools.ui ............ SKIPPED
[INFO] org.polarsys.capella.studio.product ................ SKIPPED
[INFO] org.polarsys.capella.ad.viewpoint.dsl.generation.ui  SKIPPED
[INFO] org.polarsys.capella.ta ............................ SKIPPED
[INFO] org.polarsys.capella.ta.viewpoint.dsl.extension .... SKIPPED
[INFO] org.polarsys.capella.extension.sdk.feature ......... SKIPPED
[INFO] org.polarsys.capella.studio.product.feature ........ SKIPPED
[INFO] org.polarsys.capella.ta.viewpoint.dsl.feature ...... SKIPPED
[INFO] org.polarsys.capella.studio.releng.eclipse.feature . SKIPPED
[INFO] org.polarsys.capella.studio.releng.capella.feature . SKIPPED
[INFO] org.polarsys.capella.studio.releng.kitalpha.feature  SKIPPED
[INFO] org.polarsys.capella.studio.releng.updatesite ...... SKIPPED
[INFO] Capella studio Product ............................. SKIPPED
[INFO] Capella Sudio Aggregator Module .................... SKIPPED
[INFO] org.polarsys.capella.studio.test ................... SKIPPED
[INFO] org.polarsys.capella.extension.rcptt ............... SKIPPED
[INFO] org.polarsys.capella.ad.viewpoint.dsl.tests ........ SKIPPED
[INFO] org.polarsys.capella.gen.doc.tests ................. SKIPPED
[INFO] org.polarsys.capella.studio.ad.viewpoint.rcptt ..... SKIPPED
[INFO] capellastudio.vpdsl.qualityassessment.reverse.tests  SKIPPED
[INFO] capellastudio.vpdsl.qualityassessment.tests ........ SKIPPED
[INFO] org.polarsys.capella.studio.test.feature ........... SKIPPED
[INFO] Capella Sudio tests Aggregator Module .............. SKIPPED
[INFO] ------------------------------------------------------------------------
[INFO] BUILD FAILURE
[INFO] ------------------------------------------------------------------------
[INFO] Total time: 53.345 s
[INFO] Finished at: 2020-01-21T17:33:56+00:00
[INFO] Final Memory: 180M/1151M
[INFO] ------------------------------------------------------------------------
[ERROR] Failed to execute goal org.sonarsource.scanner.maven:sonar-maven-plugin:3.3.0.603:sonar (default-cli) on project org.polarsys.capella.studio.releng.parent: Fail to execute request [code=500, url=https://sonar.eclipse.org/batch/project?key=org.polarsys.capella:org.polarsys.capella.studio.releng.parent&amp;preview=false]: Fail to download [https://sonar.eclipse.org/batch/project?key=org.polarsys.capella:org.polarsys.capella.studio.releng.parent&amp;preview=false]. Response code: 500 -> [Help 1]
org.apache.maven.lifecycle.LifecycleExecutionException: Failed to execute goal org.sonarsource.scanner.maven:sonar-maven-plugin:3.3.0.603:sonar (default-cli) on project org.polarsys.capella.studio.releng.parent: Fail to execute request [code=500, url=https://sonar.eclipse.org/batch/project?key=org.polarsys.capella:org.polarsys.capella.studio.releng.parent&amp;preview=false]
	at org.apache.maven.lifecycle.internal.MojoExecutor.execute(MojoExecutor.java:212)
	at org.apache.maven.lifecycle.internal.MojoExecutor.execute(MojoExecutor.java:153)
	at org.apache.maven.lifecycle.internal.MojoExecutor.execute(MojoExecutor.java:145)
	at org.apache.maven.lifecycle.internal.LifecycleModuleBuilder.buildProject(LifecycleModuleBuilder.java:116)
	at org.apache.maven.lifecycle.internal.LifecycleModuleBuilder.buildProject(LifecycleModuleBuilder.java:80)
	at org.apache.maven.lifecycle.internal.builder.singlethreaded.SingleThreadedBuilder.build(SingleThreadedBuilder.java:51)
	at org.apache.maven.lifecycle.internal.LifecycleStarter.execute(LifecycleStarter.java:128)
	at org.apache.maven.DefaultMaven.doExecute(DefaultMaven.java:307)
	at org.apache.maven.DefaultMaven.doExecute(DefaultMaven.java:193)
	at org.apache.maven.DefaultMaven.execute(DefaultMaven.java:106)
	at org.apache.maven.cli.MavenCli.execute(MavenCli.java:863)
	at org.apache.maven.cli.MavenCli.doMain(MavenCli.java:288)
	at org.apache.maven.cli.MavenCli.main(MavenCli.java:199)
	at sun.reflect.NativeMethodAccessorImpl.invoke0(Native Method)
	at sun.reflect.NativeMethodAccessorImpl.invoke(NativeMethodAccessorImpl.java:62)
	at sun.reflect.DelegatingMethodAccessorImpl.invoke(DelegatingMethodAccessorImpl.java:43)
	at java.lang.reflect.Method.invoke(Method.java:498)
	at org.codehaus.plexus.classworlds.launcher.Launcher.launchEnhanced(Launcher.java:289)
	at org.codehaus.plexus.classworlds.launcher.Launcher.launch(Launcher.java:229)
	at org.codehaus.plexus.classworlds.launcher.Launcher.mainWithExitCode(Launcher.java:415)
	at org.codehaus.plexus.classworlds.launcher.Launcher.main(Launcher.java:356)
Caused by: org.apache.maven.plugin.MojoExecutionException: Fail to execute request [code=500, url=https://sonar.eclipse.org/batch/project?key=org.polarsys.capella:org.polarsys.capella.studio.releng.parent&amp;preview=false]
	at org.sonarsource.scanner.maven.bootstrap.ExceptionHandling.handle(ExceptionHandling.java:36)
	at org.sonarsource.scanner.maven.bootstrap.ScannerBootstrapper.execute(ScannerBootstrapper.java:80)
	at org.sonarsource.scanner.maven.SonarQubeMojo.execute(SonarQubeMojo.java:139)
	at org.apache.maven.plugin.DefaultBuildPluginManager.executeMojo(DefaultBuildPluginManager.java:134)
	at org.apache.maven.lifecycle.internal.MojoExecutor.execute(MojoExecutor.java:207)
	... 20 more
Caused by: java.lang.IllegalStateException: Fail to execute request [code=500, url=https://sonar.eclipse.org/batch/project?key=org.polarsys.capella:org.polarsys.capella.studio.releng.parent&amp;preview=false]
	at org.sonar.batch.bootstrap.ServerClient.handleHttpException(ServerClient.java:130)
	at org.sonar.batch.bootstrap.ServerClient.request(ServerClient.java:91)
	at org.sonar.batch.bootstrap.ServerClient.request(ServerClient.java:83)
	at org.sonar.batch.bootstrap.ServerClient.request(ServerClient.java:79)
	at org.sonar.batch.referential.DefaultProjectReferentialsLoader.load(DefaultProjectReferentialsLoader.java:54)
	at org.sonar.batch.referential.ProjectReferentialsProvider.provide(ProjectReferentialsProvider.java:40)
	at sun.reflect.NativeMethodAccessorImpl.invoke0(Native Method)
	at sun.reflect.NativeMethodAccessorImpl.invoke(NativeMethodAccessorImpl.java:62)
	at sun.reflect.DelegatingMethodAccessorImpl.invoke(DelegatingMethodAccessorImpl.java:43)
	at java.lang.reflect.Method.invoke(Method.java:498)
	at org.picocontainer.injectors.MethodInjector.invokeMethod(MethodInjector.java:129)
	at org.picocontainer.injectors.MethodInjector.access$000(MethodInjector.java:39)
	at org.picocontainer.injectors.MethodInjector$2.run(MethodInjector.java:113)
	at org.picocontainer.injectors.AbstractInjector$ThreadLocalCyclicDependencyGuard.observe(AbstractInjector.java:270)
	at org.picocontainer.injectors.MethodInjector.decorateComponentInstance(MethodInjector.java:120)
	at org.picocontainer.injectors.CompositeInjector.decorateComponentInstance(CompositeInjector.java:58)
	at org.picocontainer.injectors.Reinjector.reinject(Reinjector.java:142)
	at org.picocontainer.injectors.ProviderAdapter.getComponentInstance(ProviderAdapter.java:96)
	at org.picocontainer.DefaultPicoContainer.getInstance(DefaultPicoContainer.java:698)
	at org.picocontainer.DefaultPicoContainer.getComponent(DefaultPicoContainer.java:646)
	at org.picocontainer.DefaultPicoContainer.getComponent(DefaultPicoContainer.java:631)
	at org.picocontainer.parameters.BasicComponentParameter$1.resolveInstance(BasicComponentParameter.java:118)
	at org.picocontainer.parameters.ComponentParameter$1.resolveInstance(ComponentParameter.java:136)
	at org.picocontainer.injectors.SingleMemberInjector.getParameter(SingleMemberInjector.java:78)
	at org.picocontainer.injectors.ConstructorInjector$CtorAndAdapters.getParameterArguments(ConstructorInjector.java:309)
	at org.picocontainer.injectors.ConstructorInjector$1.run(ConstructorInjector.java:335)
	at org.picocontainer.injectors.AbstractInjector$ThreadLocalCyclicDependencyGuard.observe(AbstractInjector.java:270)
	at org.picocontainer.injectors.ConstructorInjector.getComponentInstance(ConstructorInjector.java:364)
	at org.picocontainer.injectors.AbstractInjectionFactory$LifecycleAdapter.getComponentInstance(AbstractInjectionFactory.java:56)
	at org.picocontainer.behaviors.AbstractBehavior.getComponentInstance(AbstractBehavior.java:64)
	at org.picocontainer.behaviors.Stored.getComponentInstance(Stored.java:91)
	at org.picocontainer.DefaultPicoContainer.getInstance(DefaultPicoContainer.java:698)
	at org.picocontainer.DefaultPicoContainer.getComponent(DefaultPicoContainer.java:646)
	at org.picocontainer.DefaultPicoContainer.getComponent(DefaultPicoContainer.java:677)
	at org.sonar.api.platform.ComponentContainer.getComponentByType(ComponentContainer.java:209)
	at org.sonar.batch.scan.ProjectScanContainer.doBeforeStart(ProjectScanContainer.java:102)
	at org.sonar.api.platform.ComponentContainer.startComponents(ComponentContainer.java:91)
	at org.sonar.api.platform.ComponentContainer.execute(ComponentContainer.java:78)
	at org.sonar.batch.scan.ScanTask.scan(ScanTask.java:64)
	at org.sonar.batch.scan.ScanTask.execute(ScanTask.java:51)
	at org.sonar.batch.bootstrap.TaskContainer.doAfterStart(TaskContainer.java:125)
	at org.sonar.api.platform.ComponentContainer.startComponents(ComponentContainer.java:93)
	at org.sonar.api.platform.ComponentContainer.execute(ComponentContainer.java:78)
	at org.sonar.batch.bootstrap.BootstrapContainer.executeTask(BootstrapContainer.java:173)
	at org.sonar.batch.bootstrapper.Batch.executeTask(Batch.java:95)
	at org.sonar.batch.bootstrapper.Batch.execute(Batch.java:67)
	at org.sonarsource.scanner.api.internal.batch.BatchIsolatedLauncher.executeOldVersion(BatchIsolatedLauncher.java:71)
	at sun.reflect.NativeMethodAccessorImpl.invoke0(Native Method)
	at sun.reflect.NativeMethodAccessorImpl.invoke(NativeMethodAccessorImpl.java:62)
	at sun.reflect.DelegatingMethodAccessorImpl.invoke(DelegatingMethodAccessorImpl.java:43)
	at java.lang.reflect.Method.invoke(Method.java:498)
	at org.sonarsource.scanner.api.internal.IsolatedLauncherProxy.invoke(IsolatedLauncherProxy.java:60)
	at com.sun.proxy.$Proxy24.executeOldVersion(Unknown Source)
	at org.sonarsource.scanner.api.EmbeddedScanner.doExecute(EmbeddedScanner.java:238)
	at org.sonarsource.scanner.api.EmbeddedScanner.runAnalysis(EmbeddedScanner.java:151)
	at org.sonarsource.scanner.maven.bootstrap.ScannerBootstrapper.execute(ScannerBootstrapper.java:77)
	... 23 more
Caused by: org.sonar.api.utils.HttpDownloader$HttpException: Fail to download [https://sonar.eclipse.org/batch/project?key=org.polarsys.capella:org.polarsys.capella.studio.releng.parent&amp;preview=false]. Response code: 500
	at org.sonar.api.utils.HttpDownloader$BaseHttpDownloader$HttpInputSupplier.getInput(HttpDownloader.java:281)
	at org.sonar.api.utils.HttpDownloader$BaseHttpDownloader$HttpInputSupplier.getInput(HttpDownloader.java:235)
	at org.sonar.batch.bootstrap.ServerClient.request(ServerClient.java:89)
	... 77 more
[ERROR] 
[ERROR] Re-run Maven using the -X switch to enable full debug logging.
[ERROR] 
[ERROR] For more information about the errors and possible solutions, please read the following articles:
[ERROR] [Help 1] http://cwiki.apache.org/confluence/display/MAVEN/MojoExecutionException
SonarQube analysis completed: FAILURE
Build step 'SonarQube analysis with Maven' changed build result to FAILURE
Build step 'SonarQube analysis with Maven' marked build as failure
Recording test results
Archiving artifacts
[WS-CLEANUP] Deleting project workspace...
[WS-CLEANUP] Skipped based on build state FAILURE
Finished: FAILURE