FailedConsole Output

Skipping 2,270 KB.. Full Log
[INFO] progress: The user operation is waiting for background work to complete.
[INFO] progress: Downloading org.eclipse.emf.edit.ui
[INFO] progress: The user operation is waiting for background work to complete.
[INFO] progress: Downloading org.eclipse.emf.exporter
[INFO] progress: The user operation is waiting for background work to complete.
[INFO] progress: Downloading org.eclipse.emf.mapping.ui
[INFO] progress: The user operation is waiting for background work to complete.
[INFO] progress: Downloading org.eclipse.emf.converter
[INFO] progress: The user operation is waiting for background work to complete.
[INFO] progress: Downloading org.eclipse.emf.transaction
[INFO] progress: The user operation is waiting for background work to complete.
[INFO] progress: Downloading org.eclipse.emf.transaction_root
[INFO] progress: The user operation is waiting for background work to complete.
[INFO] progress: Downloading org.eclipse.emf.databinding.edit
[INFO] progress: The user operation is waiting for background work to complete.
[INFO] progress: Downloading org.eclipse.emf.ecore.edit
[INFO] progress: The user operation is waiting for background work to complete.
[INFO] progress: Downloading org.eclipse.emf.validation
[INFO] progress: The user operation is waiting for background work to complete.
[INFO] progress: Downloading org.eclipse.emf.importer.rose
[INFO] progress: The user operation is waiting for background work to complete.
[INFO] progress: Downloading org.eclipse.emf.edit.ui
[INFO] progress: The user operation is waiting for background work to complete.
[INFO] progress: Downloading org.eclipse.emf.ant
[INFO] progress: The user operation is waiting for background work to complete.
[INFO] progress: Downloading org.eclipse.emf.importer.java
[INFO] progress: The user operation is waiting for background work to complete.
[INFO] progress: Downloading org.eclipse.emf.codegen.ecore.ui
[INFO] progress: The user operation is waiting for background work to complete.
[INFO] progress: Downloading org.eclipse.emf.edit
[INFO] progress: The user operation is waiting for background work to complete.
[INFO] progress: Downloading org.eclipse.emf.codegen
[INFO] progress: The user operation is waiting for background work to complete.
[INFO] progress: Downloading org.eclipse.emf.common.ui
[INFO] progress: The user operation is waiting for background work to complete.
[INFO] progress: Downloading org.eclipse.emf.common
[INFO] progress: The user operation is waiting for background work to complete.
[INFO] progress: Downloading org.eclipse.emf.ecore.editor
[INFO] progress: The user operation is waiting for background work to complete.
[INFO] progress: Downloading org.eclipse.emf.mapping.ecore
[INFO] progress: The user operation is waiting for background work to complete.
[INFO] progress: Downloading org.eclipse.emf.mapping.ecore.editor
[INFO] progress: The user operation is waiting for background work to complete.
[INFO] progress: Downloading org.eclipse.emf.validation.ui.ide
[INFO] progress: The user operation is waiting for background work to complete.
[INFO] progress: Downloading org.eclipse.emf.edit
[INFO] progress: The user operation is waiting for background work to complete.
[INFO] progress: Downloading org.eclipse.emf.common
[INFO] progress: The user operation is waiting for background work to complete.
[INFO] progress: Downloading org.eclipse.emf.codegen
[INFO] progress: The user operation is waiting for background work to complete.
[INFO] progress: Downloading org.eclipse.emf.query_root
[INFO] progress: The user operation is waiting for background work to complete.
[INFO] progress: Downloading org.eclipse.emf.codegen.ui
[INFO] progress: The user operation is waiting for background work to complete.
[INFO] progress: Adding repository platform:///plugin/org.eclipse.rcptt.module.nebula.updates/runtime/
[INFO] progress: Fetching content.jar from platform:/plugin/org.eclipse.rcptt.module.nebula.updates/runtime/
[INFO] progress: Adding repository platform:///plugin/org.eclipse.rcptt.module.nebula.updates/runtime/
[INFO] progress: Fetching artifacts.jar from platform:/plugin/org.eclipse.rcptt.module.nebula.updates/runtime/
[INFO] progress: The user operation is waiting for background work to complete.
[INFO] progress: Adding repository platform:///plugin/org.eclipse.rcptt.module.testrail.updates/runtime/
[INFO] progress: Fetching content.jar from platform:/plugin/org.eclipse.rcptt.module.testrail.updates/runtime/
[INFO] progress: Adding repository platform:///plugin/org.eclipse.rcptt.module.testrail.updates/runtime/
[INFO] progress: Fetching artifacts.jar from platform:/plugin/org.eclipse.rcptt.module.testrail.updates/runtime/
[INFO] progress: The user operation is waiting for background work to complete.
[INFO] progress: Adding repository platform:///plugin/org.eclipse.rcptt.updates.extra/dependencies/
[INFO] progress: Fetching content.jar from platform:/plugin/org.eclipse.rcptt.updates.extra/dependencies/
[INFO] progress: Adding repository platform:///plugin/org.eclipse.rcptt.updates.extra/dependencies/
[INFO] progress: Fetching artifacts.jar from platform:/plugin/org.eclipse.rcptt.updates.extra/dependencies/
[INFO] progress: Downloading org.apache.poi.ooxml
[INFO] progress: Downloading org.apache.xmlbeans
[INFO] progress: Downloading org.apache.poi.ooxml.schemas
[INFO] progress: Downloading org.dom4j
[INFO] progress: The user operation is waiting for background work to complete.
[INFO] progress: Downloading org.apache.poi
[INFO] progress: The user operation is waiting for background work to complete.
[INFO] Begin task: Resolving AUT
[INFO] progress: Resolving Target Contents...
[INFO] progress: Reading plug-ins
[INFO] progress: Fetching compositeContent.xml from https://download.eclipse.org/kitalpha/updates/nightly/component/1.4.x/
[INFO] progress: Fetching p2.index from http://download.eclipse.org/kitalpha/updates/nightly/component/1.4.0-N1363/
[INFO] progress: Fetching content.xml.xz from http://download.eclipse.org/kitalpha/updates/nightly/component/1.4.0-N1363/
[INFO] progress: Fetching p2.index from platform:/plugin/org.eclipse.rcptt.updates.runtime.e4x/q7/
[INFO] progress: Fetching content.jar from platform:/plugin/org.eclipse.rcptt.updates.runtime.e4x/q7/
[INFO] progress: Fetching content.jar from platform:/plugin/org.eclipse.rcptt.updates.aspectj.e44x/dependencies/
[INFO] progress: Fetching content.jar from platform:/plugin/org.eclipse.rcptt.updates.kepler/dependencies/
[INFO] progress: Fetching content.jar from platform:/plugin/org.eclipse.rcptt.module.nebula.updates/runtime/
[INFO] progress: Fetching content.jar from platform:/plugin/org.eclipse.rcptt.module.testrail.updates/runtime/
[INFO] progress: Fetching content.jar from platform:/plugin/org.eclipse.rcptt.updates.extra/dependencies/
[INFO] progress: Fetching p2.index from platform:/plugin/org.eclipse.rcptt.updates.runtime.e4x/q7/
[INFO] progress: Fetching artifacts.jar from platform:/plugin/org.eclipse.rcptt.updates.runtime.e4x/q7/
[INFO] progress: Fetching artifacts.jar from platform:/plugin/org.eclipse.rcptt.module.testrail.updates/runtime/
[INFO] progress: Fetching artifacts.jar from platform:/plugin/org.eclipse.rcptt.updates.kepler/dependencies/
[INFO] progress: Fetching compositeArtifacts.xml from https://download.eclipse.org/kitalpha/updates/nightly/component/1.4.x/
[INFO] progress: Fetching p2.index from http://download.eclipse.org/kitalpha/updates/nightly/component/1.4.0-N1363/
[INFO] progress: Fetching artifacts.xml.xz from http://download.eclipse.org/kitalpha/updates/nightly/component/1.4.0-N1363/
[INFO] progress: Fetching artifacts.jar from platform:/plugin/org.eclipse.rcptt.module.nebula.updates/runtime/
[INFO] progress: Fetching artifacts.jar from platform:/plugin/org.eclipse.rcptt.updates.aspectj.e44x/dependencies/
[INFO] progress: Fetching artifacts.jar from platform:/plugin/org.eclipse.rcptt.updates.extra/dependencies/
[INFO] progress: Downloading org.eclipse.emf.validation_root
[INFO] progress: Downloading org.eclipse.emf.query_root
[INFO] progress: Downloading org.eclipse.emf.transaction_root
[INFO] progress: Installing org.polarsys.kitalpha.vp.componentsamplesafetypattern.activity.explorer.source
[INFO] progress: Installing org.polarsys.kitalpha.vp.componentsampleperformance.representation.feature.feature.group
[INFO] progress: Installing org.eclipse.emf.ecore.change
[INFO] progress: Installing org.polarsys.kitalpha.vp.componentsamplesafetypattern
[INFO] progress: Installing org.eclipse.rcptt.core.swt
[INFO] progress: Installing org.polarsys.kitalpha.vp.componentsampleframework.rules.feature.source.feature.jar
[INFO] progress: Installing org.polarsys.kitalpha.vp.componentsampleperformance.model
[INFO] progress: Installing org.polarsys.kitalpha.vp.componentsamplequalityassessment.af.feature.source.feature.jar
[INFO] progress: Installing org.polarsys.kitalpha.vp.componentsamplequalityassessment.rules.validation.source
[INFO] progress: Installing org.polarsys.kitalpha.vp.componentsamplequalityassessment.design
[INFO] progress: Installing org.eclipse.rcptt.ecl.debug.runtime
[INFO] progress: Installing org.eclipse.rcptt.ctx.parameters
[INFO] progress: Installing org.eclipse.rcptt.ecl.core
[INFO] progress: Installing org.polarsys.kitalpha.vp.componentsampleframework.rules.computation.source
[INFO] progress: Installing org.eclipse.rcptt.util
[INFO] progress: Installing org.eclipse.rcptt.ctx.resources.impl
[INFO] progress: Installing org.polarsys.kitalpha.vp.componentsamplequalityassessment.rules.feature.source.feature.group
[INFO] progress: Installing org.polarsys.kitalpha.vp.componentsamplesafety.rules.transformation
[INFO] progress: Installing org.dom4j
[INFO] progress: Installing org.polarsys.kitalpha.vp.componentsample.rules.feature.feature.jar
[INFO] progress: Installing org.polarsys.kitalpha.vp.componentsamplequalityassessment.activity.explorer.source
[INFO] progress: Installing org.eclipse.rcptt.ecl.core.feature.group
[INFO] progress: Installing org.polarsys.kitalpha.vp.componentsamplequalityassessment.rules.validation
[INFO] progress: Installing org.polarsys.kitalpha.vp.componentsample.model.editor
[INFO] progress: Installing org.eclipse.emf.ecore.edit
[INFO] progress: Installing org.polarsys.kitalpha.vp.componentsampleperformance.feature.feature.group
[INFO] progress: Installing org.polarsys.kitalpha.vp.componentsamplesafetypattern.rules.transformation.source
[INFO] progress: Installing org.eclipse.emf.transaction
[INFO] progress: Installing org.eclipse.rcptt.verifications.time
[INFO] progress: Installing org.eclipse.rcptt.tesla.canvas
[INFO] progress: Installing org.eclipse.emf.codegen.ecore.feature.jar
[INFO] progress: Installing org.polarsys.kitalpha.vp.componentsample.representation.feature.feature.jar
[INFO] progress: Installing org.polarsys.kitalpha.vp.componentsamplesafetypattern.af
[INFO] progress: Installing org.eclipse.rcptt.tesla.swt.e4x
[INFO] progress: Installing org.eclipse.rcptt.tesla.recording.core
[INFO] progress: Installing org.polarsys.kitalpha.vp.componentsample.rules.computation.source
[INFO] progress: Installing org.polarsys.kitalpha.vp.componentsampleperformance
[INFO] progress: Installing org.polarsys.kitalpha.vp.componentsamplesafety.af.feature.feature.group
[INFO] progress: Installing org.polarsys.kitalpha.vp.componentsamplequalityassessment.model.source
[INFO] progress: Installing org.polarsys.kitalpha.composer.componentsample.importer
[INFO] progress: Installing org.eclipse.rcptt.tesla.workbench.texteditor.aspects
[INFO] progress: Installing org.polarsys.kitalpha.vp.componentsamplesafety.rules.validation
[INFO] progress: Installing org.eclipse.emf.transaction.feature.jar
[INFO] progress: Installing org.polarsys.kitalpha.vp.componentsample.example.feature.source.feature.jar
[INFO] progress: Installing org.polarsys.kitalpha.vp.componentsampleperformance.feature.feature.jar
[INFO] progress: Installing org.eclipse.rcptt.tesla.jface.text
[INFO] progress: Installing org.polarsys.kitalpha.vp.componentsampleperformance.source
[INFO] progress: Installing org.polarsys.kitalpha.vp.componentsample.vpdsl
[INFO] progress: Installing org.polarsys.kitalpha.vp.componentsampleperformance.design.source
[INFO] progress: Installing org.eclipse.emf.validation
[INFO] progress: Installing org.polarsys.kitalpha.vp.componentsamplequalityassessment.model.edit
[INFO] progress: Installing org.polarsys.kitalpha.vp.componentsampleperformance.contextual.explorer
[INFO] progress: Installing org.polarsys.kitalpha.transposer.componentsample.importer
[INFO] progress: Installing org.eclipse.rcptt.tesla.recording.jface.text
[INFO] progress: Installing org.eclipse.rcptt.ecl.platform.feature.group
[INFO] progress: Installing org.eclipse.rcptt.tesla.ecl.feature.jar
[INFO] progress: Installing org.eclipse.emf.edit.feature.jar
[INFO] progress: Installing org.polarsys.kitalpha.vp.componentsample.wizard.project.source
[INFO] progress: Installing org.eclipse.rcptt.tesla.jobs.aspects
[INFO] progress: Installing org.eclipse.rcptt.tesla.jface.databinding
[INFO] progress: Installing org.polarsys.kitalpha.vp.componentsampleperformance.af.feature.source.feature.jar
[INFO] progress: Installing org.eclipse.emf.edit
[INFO] progress: Installing config.a.jre.javase
[INFO] progress: Installing org.eclipse.rcptt.ecl.platform.ui
[INFO] progress: Installing org.eclipse.rcptt.testrail.ecl.impl
[INFO] progress: Installing org.eclipse.rcptt.watson.aspects.jobs
[INFO] progress: Installing org.eclipse.rcptt.tesla.recording.gef
[INFO] progress: Installing org.eclipse.rcptt.resources.impl
[INFO] progress: Installing org.polarsys.kitalpha.vp.componentsampleframework.feature.feature.jar
[INFO] progress: Installing org.eclipse.emf.validation.feature.jar
[INFO] progress: Installing org.eclipse.emf.transaction.ui
[INFO] progress: Installing org.eclipse.emf.databinding.edit.feature.group
[INFO] progress: Installing org.polarsys.kitalpha.vp.componentsamplequalityassessment.feature.source.feature.group
[INFO] progress: Installing org.eclipse.rcptt.tesla.runtime.feature.group
[INFO] progress: Installing org.eclipse.rcptt.tesla.jdt
[INFO] progress: Installing org.eclipse.rcptt.ctx.parameters.impl
[INFO] progress: Installing org.eclipse.rcptt.tesla.recording.canvas
[INFO] progress: Installing org.polarsys.kitalpha.vp.componentsampleframework.rules.feature.feature.group
[INFO] progress: Installing org.polarsys.kitalpha.vp.componentsample.design.source
[INFO] progress: Installing org.eclipse.rcptt.ecl.parser
[INFO] progress: Installing org.eclipse.rcptt.reporting
[INFO] progress: Installing a.jre.javase
[INFO] progress: Installing org.antlr.runtime
[INFO] progress: Installing org.polarsys.kitalpha.vp.componentsampleframework.rules.validation
[INFO] progress: Installing org.polarsys.kitalpha.vp.componentsamplesafety.vpdsl
[INFO] progress: Installing org.polarsys.kitalpha.vp.componentsamplesafetypattern.model
[INFO] progress: Installing org.polarsys.kitalpha.vp.componentsamplesafetypattern.feature.source.feature.jar
[INFO] progress: Installing org.eclipse.rcptt.watson.core
[INFO] progress: Installing org.eclipse.rcptt.watson.runtime.feature.jar
[INFO] progress: Installing org.eclipse.emf.edit.ui.feature.group
[INFO] progress: Installing org.eclipse.rcptt.module.nebula.runtime.feature.jar
[INFO] progress: Installing org.eclipse.rcptt.tesla.recording.aspects.swt
[INFO] progress: Installing org.eclipse.emf
[INFO] progress: Installing org.polarsys.kitalpha.vp.componentsamplesafety.model.source
[INFO] progress: Installing org.eclipse.rcptt.runtime.feature.jar
[INFO] progress: Installing org.polarsys.kitalpha.vp.componentsample.example.feature.feature.jar
[INFO] progress: Installing org.polarsys.kitalpha.vp.componentsample.rules.feature.source.feature.jar
[INFO] progress: Installing org.eclipse.emf.validation.ui
[INFO] progress: Installing org.polarsys.kitalpha.vp.componentsamplesafety.rules.generation.source
[INFO] progress: Installing org.eclipse.rcptt.util.resources
[INFO] progress: Installing org.polarsys.kitalpha.vp.componentsamplequalityassessment.model
[INFO] progress: Installing org.polarsys.kitalpha.vp.componentsampleperformance.model.source
[INFO] progress: Installing org.polarsys.kitalpha.vp.componentsample.feature.source.feature.jar
[INFO] progress: Installing org.polarsys.kitalpha.vp.componentsampleperformance.af.feature.feature.group
[INFO] progress: Installing org.polarsys.kitalpha.vp.componentsample.design
[INFO] progress: Installing org.eclipse.emf.edit.ui.feature.jar
[INFO] progress: Installing org.eclipse.rcptt.tesla.nebula.ecl.impl
[INFO] progress: Installing org.polarsys.kitalpha.vp.componentsample.wizard.project
[INFO] progress: Installing org.eclipse.emf.mapping.ui
[INFO] progress: Installing org.polarsys.kitalpha.vp.componentsampleperformance.representation.feature.feature.jar
[INFO] progress: Installing org.eclipse.rcptt.tesla.recording.aspects.gmf
[INFO] progress: Installing org.eclipse.rcptt.ecl.server.tcp
[INFO] progress: Installing org.polarsys.kitalpha.vp.componentsampleperformance.model.edit.source
[INFO] progress: Installing org.eclipse.emf.importer.java
[INFO] progress: Installing org.eclipse.emf.codegen.feature.jar
[INFO] progress: Installing org.eclipse.emf.common
[INFO] progress: Installing org.eclipse.rcptt.ecl.dispatch
[INFO] progress: Installing org.polarsys.kitalpha.vp.componentsample.contextual.explorer.source
[INFO] progress: Installing org.eclipse.emf.mapping.ecore.editor.feature.jar
[INFO] progress: Installing org.eclipse.emf.common.feature.jar
[INFO] progress: Installing org.eclipse.rcptt.verifications.tree.impl
[INFO] progress: Installing org.polarsys.kitalpha.vp.componentsampleperformance.rules.transformation.source
[INFO] progress: Installing org.eclipse.emf.mapping.ecore2ecore
[INFO] progress: Installing org.eclipse.rcptt.forms.impl
[INFO] progress: Installing org.polarsys.kitalpha.vp.componentsamplequalityassessment.af
[INFO] progress: Installing org.eclipse.emf.validation_root
[INFO] progress: Installing org.eclipse.emf.feature.jar
[INFO] progress: Installing org.polarsys.kitalpha.transposer.componentsample.installer.feature.feature.group
[INFO] progress: Installing org.polarsys.kitalpha.vp.componentsamplesafety.af.feature.source.feature.group
[INFO] progress: Installing org.polarsys.kitalpha.vp.componentsampleperformance.activity.explorer
[INFO] progress: Installing org.eclipse.rcptt.tesla.gmf.aspects
[INFO] progress: Installing org.polarsys.kitalpha.vp.componentsamplesafetypattern.representation.feature.feature.group
[INFO] progress: Installing org.polarsys.kitalpha.vp.componentsamplequalityassessment.af.feature.source.feature.group
[INFO] progress: Installing org.polarsys.kitalpha.vp.componentsamplesafetypattern.feature.source.feature.group
[INFO] progress: Installing file:/jobs/genie.rcptt/rcptt-all/workspace/modules/nebula/runtime-site/target/site/site.xml.rcptt
[INFO] progress: Installing org.eclipse.rcptt.ctx.workbench.impl
[INFO] progress: Installing org.eclipse.rcptt.tesla.core
[INFO] progress: Installing org.polarsys.kitalpha.vp.componentsample.ui
[INFO] progress: Installing org.eclipse.rcptt.tesla.workbench.aspects.e4x
[INFO] progress: Installing org.eclipse.rcptt.ctx.resources
[INFO] progress: Installing org.eclipse.rcptt.tesla.swt.fragment
[INFO] progress: Installing org.polarsys.kitalpha.vp.componentsampleframework.feature.source.feature.jar
[INFO] progress: Installing org.eclipse.emf.feature.group
[INFO] progress: Installing org.polarsys.kitalpha.vp.componentsamplesafety.source
[INFO] progress: Installing org.eclipse.rcptt.resources
[INFO] progress: Installing org.eclipse.emf.mapping.ecore2xml
[INFO] progress: Installing org.polarsys.kitalpha.vp.componentsamplesafetypattern.design.source
[INFO] progress: Installing org.polarsys.kitalpha.vp.componentsamplesafety.af
[INFO] progress: Installing org.polarsys.kitalpha.vp.componentsamplesafetypattern.rules.computation
[INFO] progress: Installing org.polarsys.kitalpha.vp.componentsample.af.feature.feature.jar
[INFO] progress: Installing org.eclipse.rcptt.module.testrail.runtime.feature.group
[INFO] progress: Installing org.eclipse.rcptt.tesla.core.context
[INFO] progress: Installing org.eclipse.rcptt.tesla.jface.text.aspects
[INFO] progress: Installing org.polarsys.kitalpha.vp.componentsamplesafetypattern.feature.feature.group
[INFO] progress: Installing org.polarsys.kitalpha.vp.componentsamplequalityassessment.af.feature.feature.jar
[INFO] progress: Installing org.polarsys.kitalpha.vp.componentsampleperformance.design
[INFO] progress: Installing org.eclipse.emf.exporter
[INFO] progress: Installing org.eclipse.emf.converter.feature.jar
[INFO] progress: Installing org.polarsys.kitalpha.vp.componentsample.af.feature.source.feature.jar
[INFO] progress: Installing org.eclipse.rcptt.ecl.platform.ui.feature.group
[INFO] progress: Installing org.eclipse.emf.transaction_root
[INFO] progress: Installing org.eclipse.rcptt.ecl.data
[INFO] progress: Installing org.eclipse.rcptt.ecl.client.tcp
[INFO] progress: Installing org.eclipse.emf.databinding.edit.feature.jar
[INFO] progress: Installing org.eclipse.rcptt.ctx.workbench
[INFO] progress: Installing org.polarsys.kitalpha.vp.componentsample.rules.generation
[INFO] progress: Installing org.polarsys.kitalpha.vp.componentsamplesafety.design
[INFO] progress: Installing org.eclipse.rcptt.verifications.log
[INFO] progress: Installing org.polarsys.kitalpha.vp.componentsampleperformance.activity.explorer.source
[INFO] progress: Installing org.eclipse.emf.ant
[INFO] progress: Installing org.aspectj.runtime
[INFO] progress: Installing org.eclipse.emf.codegen.ecore.ui
[INFO] progress: Installing org.eclipse.rcptt.ecl.platform.ui.feature.jar
[INFO] progress: Installing org.eclipse.emf.transaction.feature.group
[INFO] progress: Installing org.eclipse.emf.codegen
[INFO] progress: Installing org.polarsys.kitalpha.vp.componentsamplequalityassessment.contextual.explorer.source
[INFO] progress: Installing config.a.jre.javase
[INFO] progress: Installing org.eclipse.rcptt.expandbar.runtime
[INFO] progress: Installing org.eclipse.rcptt.tesla.core.am
[INFO] progress: Installing org.polarsys.kitalpha.af.componentsamplearchitectureframework.feature.feature.jar
[INFO] progress: Installing org.eclipse.emf.query_root
[INFO] progress: Installing org.eclipse.emf.codegen.ui
[INFO] progress: Installing org.polarsys.kitalpha.vp.componentsampleframework.model.edit.source
[INFO] progress: Installing org.eclipse.emf.converter
[INFO] progress: Installing org.polarsys.kitalpha.vp.componentsampleperformance.rules.feature.source.feature.jar
[INFO] progress: Installing org.eclipse.rcptt.tesla.nebula.impl
[INFO] progress: Installing org.eclipse.emf.mapping.ecore.feature.group
[INFO] progress: Installing org.eclipse.emf.mapping.ui.feature.group
[INFO] progress: Installing org.eclipse.rcptt.ctx.group.impl
[INFO] progress: Installing org.polarsys.kitalpha.vp.componentsamplesafetypattern.rules.generation.source
[INFO] progress: Installing org.eclipse.rcptt.tesla.gmf
[INFO] progress: Installing org.polarsys.kitalpha.vp.componentsampleperformance.feature.source.feature.group
[INFO] progress: Installing org.eclipse.emf.codegen.ui.feature.jar
[INFO] progress: Installing org.polarsys.kitalpha.vp.componentsamplequalityassessment.activity.explorer
[INFO] progress: Installing org.eclipse.emf.ecore.editor.feature.group
[INFO] progress: Installing 201906250706.Default
[INFO] progress: Installing org.polarsys.kitalpha.vp.componentsample.af.source
[INFO] progress: Installing org.polarsys.kitalpha.vp.componentsampleperformance.rules.analysis.source
[INFO] progress: Installing org.polarsys.kitalpha.vp.componentsampleframework.model.edit
[INFO] progress: Installing org.eclipse.emf.common.feature.group
[INFO] progress: Installing org.polarsys.kitalpha.vp.componentsamplesafety.activity.explorer.source
[INFO] progress: Installing org.eclipse.rcptt.tesla.jface.databinding.observable.aspects
[INFO] progress: Installing org.polarsys.kitalpha.vp.componentsample.rules.computation
[INFO] progress: Installing org.eclipse.rcptt.ctx.script
[INFO] progress: Installing org.polarsys.kitalpha.vp.componentsamplequalityassessment.representation.feature.feature.jar
[INFO] progress: Installing org.polarsys.kitalpha.vp.componentsample.rules.generation.source
[INFO] progress: Installing org.polarsys.kitalpha.vp.componentsample
[INFO] progress: Installing org.eclipse.emf.query.feature.jar
[INFO] progress: Installing org.eclipse.emf.ecore.editor.feature.jar
[INFO] progress: Installing org.polarsys.kitalpha.vp.componentsamplesafetypattern.af.feature.source.feature.group
[INFO] progress: Installing org.polarsys.kitalpha.vp.componentsamplequalityassessment.rules.analysis
[INFO] progress: Installing org.polarsys.kitalpha.vp.componentsample.af
[INFO] progress: Installing org.polarsys.kitalpha.vp.componentsample.representation.feature.feature.group
[INFO] progress: Installing org.eclipse.rcptt.ctx.preferences
[INFO] progress: Installing org.eclipse.emf.ecore.feature.jar
[INFO] progress: Installing org.aspectj.weaver
[INFO] progress: Installing org.polarsys.kitalpha.vp.componentsamplequalityassessment.rules.transformation
[INFO] progress: Installing org.polarsys.kitalpha.vp.componentsamplesafetypattern.rules.generation
[INFO] progress: Installing org.polarsys.kitalpha.vp.componentsampleframework.rules.computation
[INFO] progress: Installing org.polarsys.kitalpha.vp.componentsamplequalityassessment.feature.feature.group
[INFO] progress: Installing org.eclipse.emf.codegen.ui.feature.group
[INFO] progress: Installing org.polarsys.kitalpha.vp.componentsamplesafety.feature.source.feature.group
[INFO] progress: Installing org.eclipse.rcptt.tesla.recording.aspects.draw2d
[INFO] progress: Installing org.polarsys.kitalpha.vp.componentsamplesafety.rules.transformation.source
[INFO] progress: Installing org.polarsys.kitalpha.vp.componentsamplesafety.activity.explorer
[INFO] progress: Installing org.eclipse.rcptt.module.testrail.runtime.feature.jar
[INFO] progress: Installing org.polarsys.kitalpha.vp.componentsamplesafety.rules.computation.source
[INFO] progress: Installing org.eclipse.rcptt.ecl.platform
[INFO] progress: Installing org.polarsys.kitalpha.vp.componentsamplesafety.representation.feature.source.feature.jar
[INFO] progress: Installing org.eclipse.rcptt.verifications.log.impl
[INFO] progress: Installing org.polarsys.kitalpha.vp.componentsampleperformance.rules.feature.source.feature.group
[INFO] progress: Installing org.polarsys.kitalpha.vp.componentsamplesafety.rules.analysis
[INFO] progress: Installing org.eclipse.emf.common.ui
[INFO] progress: Installing org.eclipse.rcptt.ecl.doc
[INFO] progress: Installing org.eclipse.rcptt.watson.jobs
[INFO] progress: Installing org.polarsys.kitalpha.vp.componentsamplequalityassessment.af.source
[INFO] progress: Installing org.polarsys.kitalpha.vp.componentsampleperformance.feature.source.feature.jar
[INFO] progress: Installing org.polarsys.kitalpha.vp.componentsamplequalityassessment.rules.feature.source.feature.jar
[INFO] progress: Installing org.polarsys.kitalpha.vp.componentsampleframework.rules.feature.source.feature.group
[INFO] progress: Installing org.polarsys.kitalpha.vp.componentsamplesafety.rules.generation
[INFO] progress: Installing org.polarsys.kitalpha.vp.componentsample.model.edit.source
[INFO] progress: Installing org.polarsys.kitalpha.vp.componentsamplequalityassessment.rules.transformation.source
[INFO] progress: Installing org.eclipse.rcptt.tesla.ui.ide
[INFO] progress: Installing org.polarsys.kitalpha.vp.componentsamplequalityassessment
[INFO] progress: Installing org.polarsys.kitalpha.vp.componentsamplesafetypattern.rules.computation.source
[INFO] progress: Installing org.polarsys.kitalpha.vp.componentsamplesafety.af.feature.source.feature.jar
[INFO] progress: Installing org.polarsys.kitalpha.vp.componentsamplesafety.feature.feature.jar
[INFO] progress: Installing org.eclipse.rcptt.tesla.recording.aspects.jface.text
[INFO] progress: Installing org.polarsys.kitalpha.vp.componentsamplesafetypattern.model.edit.source
[INFO] progress: Installing org.polarsys.kitalpha.vp.componentsamplesafety.model.edit.source
[INFO] progress: Installing org.polarsys.kitalpha.vp.componentsample.representation.feature.source.feature.jar
[INFO] progress: Installing org.polarsys.kitalpha.vp.componentsamplequalityassessment.rules.computation
[INFO] progress: Installing org.polarsys.kitalpha.vp.componentsamplesafetypattern.representation.feature.source.feature.group
[INFO] progress: Installing org.eclipse.rcptt.tesla.jface.databinding.aspects
[INFO] progress: Installing org.eclipse.emf.ecore.xmi
[INFO] progress: Installing org.polarsys.kitalpha.vp.componentsamplesafetypattern.rules.transformation
[INFO] progress: Installing org.eclipse.rcptt.tesla.swt
[INFO] progress: Installing org.eclipse.emf.mapping.feature.jar
[INFO] progress: Installing org.polarsys.kitalpha.vp.componentsample.rules.transformation.source
[INFO] progress: Installing org.polarsys.kitalpha.vp.componentsampleframework.af.feature.source.feature.jar
[INFO] progress: Installing org.polarsys.kitalpha.vp.componentsampleperformance.contextual.explorer.source
[INFO] progress: Installing org.polarsys.kitalpha.vp.componentsampleframework.feature.source.feature.group
[INFO] progress: Installing org.polarsys.kitalpha.vp.componentsampleframework
[INFO] progress: Installing 201907030400.SampleComponentSource
[INFO] progress: Installing org.eclipse.emf.importer
[INFO] progress: Installing org.eclipse.emf.mapping.ecore2xml.ui
[INFO] progress: Installing org.eclipse.rcptt.testrail.ecl
[INFO] progress: Installing org.polarsys.kitalpha.vp.componentsamplequalityassessment.rules.generation
[INFO] progress: Installing org.polarsys.kitalpha.vp.componentsamplesafety.contextual.explorer
[INFO] progress: Installing org.eclipse.rcptt.tesla.properties.view
[INFO] progress: Installing org.eclipse.emf.edit.feature.group
[INFO] progress: Installing org.polarsys.kitalpha.vp.componentsampleperformance.rules.feature.feature.group
[INFO] progress: Installing org.eclipse.rcptt.ecl.data.apache.poi.impl
[INFO] progress: Installing org.eclipse.emf.mapping.ecore.editor.feature.group
[INFO] progress: Installing org.eclipse.emf.common.ui.feature.jar
[INFO] progress: Installing org.polarsys.kitalpha.vp.componentsampleframework.rules.transformation
[INFO] progress: Installing org.polarsys.kitalpha.vp.componentsampleperformance.rules.generation
[INFO] progress: Installing org.eclipse.emf.ecore.edit.feature.group
[INFO] progress: Installing org.polarsys.kitalpha.vp.componentsampleframework.rules.analysis.source
[INFO] progress: Installing org.polarsys.kitalpha.vp.componentsamplesafety.rules.feature.feature.jar
[INFO] progress: Installing org.polarsys.kitalpha.vp.componentsamplesafetypattern.rules.validation
[INFO] progress: Installing org.polarsys.kitalpha.vp.componentsampleperformance.rules.analysis
[INFO] progress: Installing org.polarsys.kitalpha.vp.componentsampleperformance.vpdsl
[INFO] progress: Installing org.eclipse.rcptt.runtime.feature.group
[INFO] progress: Installing org.eclipse.rcptt.ecl.server.feature.jar
[INFO] progress: Installing org.polarsys.kitalpha.vp.componentsample.rules.analysis.source
[INFO] progress: Installing org.polarsys.kitalpha.vp.componentsamplesafety.model.edit
[INFO] progress: Installing org.eclipse.emf.ecore.edit.feature.jar
[INFO] progress: Installing org.polarsys.kitalpha.vp.componentsampleperformance.af.feature.feature.jar
[INFO] progress: Installing org.polarsys.kitalpha.vp.componentsampleframework.rules.validation.source
[INFO] progress: Installing org.polarsys.kitalpha.vp.componentsample.model
[INFO] progress: Installing org.eclipse.rcptt.tesla.recording.workbench.texteditor
[INFO] progress: Installing org.eclipse.emf.edit.ui
[INFO] progress: Installing org.polarsys.kitalpha.af.componentsamplearchitectureframework
[INFO] progress: Installing org.polarsys.kitalpha.vp.componentsamplequalityassessment.rules.computation.source
[INFO] progress: Installing org.eclipse.rcptt.module.nebula.runtime.feature.group
[INFO] progress: Installing org.polarsys.kitalpha.vp.componentsamplesafety.representation.feature.feature.group
[INFO] progress: Installing org.eclipse.equinox.weaving.aspectj
[INFO] progress: Installing org.eclipse.rcptt.tesla.gef.aspects
[INFO] progress: Installing org.polarsys.kitalpha.vp.componentsample.activity.explorer.source
[INFO] progress: Installing org.polarsys.kitalpha.vp.componentsampleperformance.af
[INFO] progress: Installing org.eclipse.emf.validation.ui.ide
[INFO] progress: Installing org.eclipse.rcptt.tesla.variables
[INFO] progress: Installing org.polarsys.kitalpha.vp.componentsampleperformance.rules.computation.source
[INFO] progress: Installing org.polarsys.kitalpha.vp.componentsamplesafety.rules.feature.source.feature.jar
[INFO] progress: Installing org.polarsys.kitalpha.vp.componentsamplequalityassessment.af.feature.feature.group
[INFO] progress: Installing org.eclipse.emf.converter.feature.group
[INFO] progress: Installing org.eclipse.emf.codegen.ecore
[INFO] progress: Installing org.polarsys.kitalpha.vp.componentsamplequalityassessment.source
[INFO] progress: Installing org.eclipse.rcptt.tesla.recording.gmf
[INFO] progress: Installing org.polarsys.kitalpha.transposer.componentsample.installer.feature.feature.jar
[INFO] progress: Installing org.polarsys.kitalpha.vp.componentsample.example.feature.feature.group
[INFO] progress: Installing org.eclipse.emf.common.ui.feature.group
[INFO] progress: Installing org.apache.poi.ooxml.schemas
[INFO] progress: Installing org.eclipse.emf.ecore.change.edit
[INFO] progress: Installing org.eclipse.emf.mapping.ecore2ecore.editor
[INFO] progress: Installing org.eclipse.rcptt.ecl.platform.feature.jar
[INFO] progress: Installing org.polarsys.kitalpha.af.componentsamplearchitectureframework.feature.source.feature.jar
[INFO] progress: Installing org.eclipse.rcptt.ecl.interop
[INFO] progress: Installing org.polarsys.kitalpha.vp.componentsample.rules.analysis
[INFO] progress: Installing org.eclipse.rcptt.ctx.preferences.aspects
[INFO] progress: Installing org.eclipse.rcptt.ctx.script.impl
[INFO] progress: Installing org.eclipse.emf.databinding.edit
[INFO] progress: Installing org.polarsys.kitalpha.vp.componentsamplesafetypattern.af.feature.feature.group
[INFO] progress: Installing org.polarsys.kitalpha.vp.componentsamplesafetypattern.contextual.explorer
[INFO] progress: Installing org.eclipse.rcptt.verifications.text
[INFO] progress: Installing org.polarsys.kitalpha.vp.componentsamplequalityassessment.feature.source.feature.jar
[INFO] progress: Installing org.polarsys.kitalpha.vp.componentsamplesafety.rules.validation.source
[INFO] progress: Installing org.eclipse.rcptt.tesla.recording.core.ecl
[INFO] progress: Installing org.polarsys.kitalpha.vp.componentsamplesafetypattern.representation.feature.source.feature.jar
[INFO] progress: Installing org.polarsys.kitalpha.vp.componentsamplesafetypattern.rules.feature.feature.jar
[INFO] progress: Installing org.polarsys.kitalpha.vp.componentsample.af.feature.source.feature.group
[INFO] progress: Installing org.polarsys.kitalpha.vp.componentsampleperformance.representation.feature.source.feature.jar
[INFO] progress: Installing org.eclipse.rcptt.core.scenario
[INFO] progress: Installing org.polarsys.kitalpha.vp.componentsamplesafetypattern.design
[INFO] progress: Installing org.eclipse.rcptt.ctx.preferences.impl
[INFO] progress: Installing org.eclipse.emf.codegen.ecore.feature.group
[INFO] progress: Installing org.apache.xmlbeans
[INFO] progress: Installing org.eclipse.rcptt.runtime.ui
[INFO] progress: Installing org.polarsys.kitalpha.vp.componentsampleperformance.rules.computation
[INFO] progress: Installing org.polarsys.kitalpha.vp.componentsampleframework.feature.feature.group
[INFO] progress: Installing org.eclipse.emf.mapping.ecore.feature.jar
[INFO] progress: Installing org.polarsys.kitalpha.vp.componentsampleframework.af.feature.feature.jar
[INFO] progress: Installing org.eclipse.rcptt.verifications.resources
[INFO] progress: Installing org.polarsys.kitalpha.vp.componentsampleframework.rules.analysis
[INFO] progress: Installing org.eclipse.rcptt.logging
[INFO] progress: Installing org.eclipse.emf.mapping.feature.group
[INFO] progress: Installing org.polarsys.kitalpha.vp.componentsample.source
[INFO] progress: Installing org.eclipse.equinox.weaving.hook
[INFO] progress: Installing org.polarsys.kitalpha.vp.componentsamplesafetypattern.rules.validation.source
[INFO] progress: Installing org.polarsys.kitalpha.vp.componentsamplesafety.design.source
[INFO] progress: Installing org.eclipse.rcptt.tesla.ecl.feature.group
[INFO] progress: Installing org.eclipse.rcptt.ecl.core.feature.jar
[INFO] progress: Installing org.eclipse.rcptt.tesla.recording.aspects.gef
[INFO] progress: Installing org.polarsys.kitalpha.vp.componentsamplesafetypattern.feature.feature.jar
[INFO] progress: Installing org.polarsys.kitalpha.vp.componentsamplequalityassessment.rules.generation.source
[INFO] progress: Installing org.polarsys.kitalpha.af.componentsamplearchitectureframework.feature.feature.group
[INFO] progress: Installing org.eclipse.rcptt.ctx.filesystem.impl
[INFO] progress: Installing org.polarsys.kitalpha.vp.componentsample.feature.feature.group
[INFO] progress: Installing org.polarsys.kitalpha.vp.componentsamplesafetypattern.af.feature.feature.jar
[INFO] progress: Installing org.polarsys.kitalpha.vp.componentsampleperformance.model.edit
[INFO] progress: Installing org.eclipse.rcptt.verifications.text.impl
[INFO] progress: Installing org.polarsys.kitalpha.composer.componentsample.installer.feature.feature.group
[INFO] progress: Installing org.eclipse.rcptt.tesla.feature.group
[INFO] progress: Installing org.eclipse.rcptt.tesla.feature.jar
[INFO] progress: Installing org.eclipse.rcptt.tesla.recording.swt
[INFO] progress: Installing org.eclipse.rcptt.watson.feature.jar
[INFO] progress: Installing org.polarsys.kitalpha.vp.componentsampleframework.rules.feature.feature.jar
[INFO] progress: Installing org.eclipse.emf.mapping.ecore
[INFO] progress: Installing org.polarsys.kitalpha.vp.componentsamplesafety.rules.analysis.source
[INFO] progress: Installing org.eclipse.rcptt.verifications.tree
[INFO] progress: Installing org.polarsys.kitalpha.vp.componentsamplesafetypattern.representation.feature.feature.jar
[INFO] progress: Installing org.polarsys.kitalpha.vp.componentsampleframework.af
[INFO] progress: Installing org.polarsys.kitalpha.vp.componentsamplequalityassessment.rules.feature.feature.group
[INFO] progress: Installing org.polarsys.kitalpha.vp.componentsamplesafety.rules.feature.source.feature.group
[INFO] progress: Installing org.polarsys.kitalpha.vp.componentsampleperformance.rules.generation.source
[INFO] progress: Installing 201907030400.SampleComponent
[INFO] progress: Installing org.polarsys.kitalpha.vp.componentsample.rules.validation
[INFO] progress: Installing org.eclipse.rcptt.ctx.debug
[INFO] progress: Installing org.eclipse.emf.mapping.ecore.editor
[INFO] progress: Installing org.polarsys.kitalpha.vp.componentsample.rules.transformation
[INFO] progress: Installing org.polarsys.kitalpha.vp.componentsample.rules.feature.source.feature.group
[INFO] progress: Installing file:/jobs/genie.rcptt/rcptt-all/workspace/modules/testrail/runtime-site/target/site/site.xml.rcptt
[INFO] progress: Installing org.eclipse.rcptt.core
[INFO] progress: Installing org.polarsys.kitalpha.vp.componentsample.af.feature.feature.group
[INFO] progress: Installing org.eclipse.rcptt.tesla.ecl
[INFO] progress: Installing org.eclipse.rcptt.watson.aspects.swt
[INFO] progress: Installing org.eclipse.emf.importer.ecore
[INFO] progress: Installing org.polarsys.kitalpha.vp.componentsample.representation.feature.source.feature.group
[INFO] progress: Installing org.polarsys.kitalpha.vp.componentsamplesafetypattern.rules.feature.feature.group
[INFO] progress: Installing org.polarsys.kitalpha.vp.componentsamplequalityassessment.feature.feature.jar
[INFO] progress: Installing org.polarsys.kitalpha.vp.componentsamplesafetypattern.rules.feature.source.feature.group
[INFO] progress: Installing org.polarsys.kitalpha.vp.componentsamplesafetypattern.source
[INFO] progress: Installing org.polarsys.kitalpha.vp.componentsample.rules.feature.feature.group
[INFO] progress: Installing org.eclipse.rcptt.tesla.recording.aspects.workbench.texteditor
[INFO] progress: Installing org.eclipse.emf.codegen.ecore.ui.feature.group
[INFO] progress: Installing org.polarsys.kitalpha.vp.componentsamplesafety
[INFO] progress: Installing org.polarsys.kitalpha.vp.componentsamplesafetypattern.model.edit
[INFO] progress: Installing org.eclipse.rcptt.core.swt.win64
[INFO] progress: Installing org.eclipse.emf.codegen.ecore.ui.feature.jar
[INFO] progress: Installing org.polarsys.kitalpha.vp.componentsamplequalityassessment.rules.analysis.source
[INFO] progress: Installing org.polarsys.kitalpha.vp.componentsamplesafetypattern.af.feature.source.feature.jar
[INFO] progress: Installing org.polarsys.kitalpha.vp.componentsampleframework.af.source
[INFO] progress: Installing org.eclipse.rcptt.tesla.recording.aspects.forms
[INFO] progress: Installing org.polarsys.kitalpha.vp.componentsample.rules.validation.source
[INFO] progress: Installing org.eclipse.rcptt.tesla.jface.text.reconciler.aspects
[INFO] progress: Installing org.eclipse.rcptt.ctx.debug.impl
[INFO] progress: Installing org.polarsys.kitalpha.vp.componentsamplequalityassessment.representation.feature.source.feature.group
[INFO] progress: Installing org.polarsys.kitalpha.vp.componentsample.feature.source.feature.group
[INFO] progress: Installing org.eclipse.rcptt.tesla.jface.fragment
[INFO] progress: Installing org.polarsys.kitalpha.vp.componentsamplesafetypattern.vpdsl
[INFO] progress: Installing org.polarsys.kitalpha.vp.componentsamplesafetypattern.rules.feature.source.feature.jar
[INFO] progress: Installing org.polarsys.kitalpha.vp.componentsampleframework.vpdsl
[INFO] progress: Installing org.polarsys.kitalpha.vp.componentsamplesafetypattern.model.source
[INFO] progress: Installing org.eclipse.rcptt.watson.jface
[INFO] progress: Installing org.polarsys.kitalpha.vp.componentsamplesafety.rules.feature.feature.group
[INFO] progress: Installing org.eclipse.rcptt.ecl.perf
[INFO] progress: Installing org.polarsys.kitalpha.vp.componentsamplequalityassessment.design.source
[INFO] progress: Installing org.eclipse.rcptt.tesla.jdt.aspects
[INFO] progress: Installing org.eclipse.rcptt.tesla.nebula.ecl
[INFO] progress: Installing org.polarsys.kitalpha.vp.componentsample.ui.source
[INFO] progress: Installing org.eclipse.rcptt.verifications.resources.impl
[INFO] progress: Installing org.eclipse.rcptt.core.launching
[INFO] progress: Installing org.eclipse.emf.mapping
[INFO] progress: Installing org.polarsys.kitalpha.vp.componentsampleperformance.rules.validation.source
[INFO] progress: Installing org.eclipse.rcptt.tesla.jface.aspects
[INFO] progress: Installing org.polarsys.kitalpha.vp.componentsamplesafetypattern.activity.explorer
[INFO] progress: Installing org.eclipse.rcptt.tesla.workbench.texteditor
[INFO] progress: Installing org.polarsys.kitalpha.vp.componentsamplesafetypattern.rules.analysis
[INFO] progress: Installing org.eclipse.rcptt.tesla.runtime.feature.jar
[INFO] progress: Installing org.polarsys.kitalpha.vp.componentsamplesafety.rules.computation
[INFO] progress: Installing org.polarsys.kitalpha.vp.componentsample.model.source
[INFO] progress: Installing org.eclipse.rcptt.tesla.nebula
[INFO] progress: Installing org.eclipse.rcptt.tesla.swt.aspects
[INFO] progress: Installing org.polarsys.kitalpha.vp.componentsample.feature.feature.jar
[INFO] progress: Installing org.eclipse.rcptt.tesla.ecl.runtime.feature.group
[INFO] progress: Installing org.eclipse.rcptt.tesla.recording.draw2d
[INFO] progress: Installing org.polarsys.kitalpha.vp.componentsampleperformance.af.feature.source.feature.group
[INFO] progress: Installing org.polarsys.kitalpha.vp.componentsample.example.installer.feature.feature.jar
[INFO] progress: Installing org.polarsys.kitalpha.af.componentsamplearchitectureframework.feature.source.feature.group
[INFO] progress: Installing org.polarsys.kitalpha.vp.componentsamplesafety.feature.feature.group
[INFO] progress: Installing org.polarsys.kitalpha.vp.componentsampleperformance.rules.transformation
[INFO] progress: Installing org.eclipse.rcptt.ecl.operations
[INFO] progress: Installing org.eclipse.rcptt.ecl.server.feature.group
[INFO] progress: Installing org.polarsys.kitalpha.vp.componentsamplesafety.feature.source.feature.jar
[INFO] progress: Installing org.polarsys.kitalpha.vp.componentsample.contextual.explorer
[INFO] progress: Installing org.polarsys.kitalpha.vp.componentsampleframework.af.feature.source.feature.group
[INFO] progress: Installing org.apache.poi
[INFO] progress: Installing org.eclipse.rcptt.util.swt
[INFO] progress: Installing org.polarsys.kitalpha.vp.componentsamplequalityassessment.contextual.explorer
[INFO] progress: Installing org.polarsys.kitalpha.vp.componentsamplesafetypattern.contextual.explorer.source
[INFO] progress: Installing org.eclipse.rcptt.ctx.filesystem
[INFO] progress: Installing org.eclipse.emf.query.feature.group
[INFO] progress: Installing org.eclipse.emf.ecore.feature.group
[INFO] progress: Installing org.polarsys.kitalpha.vp.componentsamplequalityassessment.vpdsl
[INFO] progress: Installing org.eclipse.rcptt.verifications.time.impl
[INFO] progress: Installing org.polarsys.kitalpha.vp.componentsample.importer
[INFO] progress: Installing org.eclipse.emf.codegen.feature.group
[INFO] progress: Installing a.jre.javase
[INFO] progress: Installing org.eclipse.rcptt.ecl.data.apache.poi
[INFO] progress: Installing org.polarsys.kitalpha.vp.componentsampleframework.rules.generation
[INFO] progress: Installing org.polarsys.kitalpha.vp.componentsampleframework.source
[INFO] progress: Installing org.eclipse.rcptt.tesla.gef
[INFO] progress: Installing org.eclipse.emf.mapping.ui.feature.jar
[INFO] progress: Installing org.polarsys.kitalpha.composer.componentsample.installer.feature.feature.jar
[INFO] progress: Installing org.apache.poi.ooxml
[INFO] progress: Installing org.polarsys.kitalpha.vp.componentsampleperformance.representation.feature.source.feature.group
[INFO] progress: Installing org.polarsys.kitalpha.vp.componentsamplequalityassessment.representation.feature.feature.group
[INFO] progress: Installing org.eclipse.rcptt.tesla.ecl.impl
[INFO] progress: Installing org.polarsys.kitalpha.vp.componentsampleframework.af.feature.feature.group
[INFO] progress: Installing org.eclipse.emf.ecore
[INFO] progress: Installing org.polarsys.kitalpha.vp.componentsamplesafety.model
[INFO] progress: Installing org.eclipse.rcptt.core.ecl.debug
[INFO] progress: Installing org.eclipse.rcptt.tesla.ecl.runtime.feature.jar
[INFO] progress: Installing org.polarsys.kitalpha.vp.componentsampleframework.rules.transformation.source
[INFO] progress: Installing org.eclipse.rcptt.watson.runtime.feature.group
[INFO] progress: Installing org.eclipse.emf.databinding
[INFO] progress: Installing org.polarsys.kitalpha.vp.componentsampleframework.model
[INFO] progress: Installing org.eclipse.emf.databinding.feature.group
[INFO] progress: Installing org.eclipse.rcptt.tesla.ui.ide.aspects
[INFO] progress: Installing org.eclipse.rcptt.ecl.filesystem
[INFO] progress: Installing org.eclipse.emf.databinding.feature.jar
[INFO] progress: Installing org.eclipse.rcptt.ctx.group
[INFO] progress: Installing org.polarsys.kitalpha.vp.componentsamplesafety.contextual.explorer.source
[INFO] progress: Installing org.polarsys.kitalpha.vp.componentsampleframework.rules.generation.source
[INFO] progress: Installing org.eclipse.rcptt.verifications
[INFO] progress: Installing org.eclipse.rcptt.expandbar
[INFO] progress: Installing org.polarsys.kitalpha.vp.componentsamplequalityassessment.model.edit.source
[INFO] progress: Installing org.polarsys.kitalpha.vp.componentsample.model.edit
[INFO] progress: Installing org.polarsys.kitalpha.vp.componentsample.model.editor.source
[INFO] progress: Installing org.polarsys.kitalpha.vp.componentsample.activity.explorer
[INFO] progress: Installing org.polarsys.kitalpha.vp.componentsamplequalityassessment.representation.feature.source.feature.jar
[INFO] progress: Installing org.eclipse.emf.query
[INFO] progress: Installing org.polarsys.kitalpha.vp.componentsamplesafetypattern.rules.analysis.source
[INFO] progress: Installing org.eclipse.rcptt.ctx.workbench.aspect
[INFO] progress: Installing org.polarsys.kitalpha.vp.componentsamplesafety.representation.feature.feature.jar
[INFO] progress: Installing org.eclipse.rcptt.core.ecl.core
[INFO] progress: Installing org.eclipse.rcptt.tesla.recording.aspects.workbench
[INFO] progress: Installing org.eclipse.emf.validation.feature.group
[INFO] progress: Installing org.polarsys.kitalpha.vp.componentsamplesafety.af.feature.feature.jar
[INFO] progress: Installing org.eclipse.emf.importer.rose
[INFO] progress: Installing org.eclipse.rcptt.tesla.recording.nebula
[INFO] progress: Installing org.polarsys.kitalpha.vp.componentsample.example.feature.source.feature.group
[INFO] progress: Installing org.polarsys.kitalpha.vp.componentsamplequalityassessment.rules.feature.feature.jar
[INFO] progress: Installing org.polarsys.kitalpha.vp.componentsample.example.installer.feature.feature.group
[INFO] progress: Installing org.eclipse.rcptt.watson.feature.group
[INFO] progress: Installing org.polarsys.kitalpha.vp.componentsampleperformance.rules.validation
[INFO] progress: Installing org.eclipse.emf.ecore.editor
[INFO] progress: Installing org.polarsys.kitalpha.vp.componentsamplesafety.representation.feature.source.feature.group
[INFO] progress: Installing org.polarsys.kitalpha.vp.componentsampleperformance.rules.feature.feature.jar
[INFO] progress: Installing org.eclipse.rcptt.tesla.recording.aspects.jface
[INFO] progress: Downloading org.eclipse.emf.validation_root
[INFO] progress: Downloading org.eclipse.emf.transaction_root
[INFO] progress: Downloading org.eclipse.emf.query_root
[INFO] progress: Preparing to commit the provisioning operation.
[INFO] progress: Committing the provisioning operation.
[INFO] progress: Reading plug-ins
[INFO] Target platform is valid.
[INFO] Looking for tests...
[INFO] Existing projects in workspace:
[INFO]     <none>
[INFO] Importing projects to workspace:
[INFO] Refreshing projects:
[INFO]     /jobs/genie.capella/capella-studio-master/workspace/vpdsl/tests/org.polarsys.capella.studio.ad.viewpoint.rcptt/target/projects/org.polarsys.capella.studio.ad.viewpoint.rcptt... OK
[INFO] Refreshing projects:
[INFO]     org.polarsys.capella.studio.ad.viewpoint.rcptt... OK
[INFO] Searching for tests in projects:
[INFO]     org.polarsys.capella.studio.ad.viewpoint.rcptt... 
[INFO] Complete OK
[INFO] Testcase Artifacts:6
[INFO] AUT-0:Launching
[INFO] AUT-0:Product: org.polarsys.capella.studio.product.CapellaStudio
[INFO] AUT-0:Application: org.polarsys.capella.studio.product.application
[INFO] AUT-0:Architecture: x86_64
[INFO] 64bit arch is selected because AUT uses launcher library
[INFO] 	"plugins/org.eclipse.equinox.launcher.gtk.linux.x86_64_1.1.1000.v20190125-2016" specified in config file: eclipse.ini
[INFO] /jobs/genie.capella/capella-studio-master/workspace/vpdsl/tests/org.polarsys.capella.studio.ad.viewpoint.rcptt/target/aut-ws-0: AUT arguments: -os ${target.os} -arch ${target.arch} -consoleLog
[INFO] /jobs/genie.capella/capella-studio-master/workspace/vpdsl/tests/org.polarsys.capella.studio.ad.viewpoint.rcptt/target/aut-ws-0: AUT VM arguments: -Dosgi.requiredJavaVersion=1.8 -Xms512m -Xmx2048m -XX:PermSize=256M -XX:-UseGCOverheadLimit -javaagent:/opt/public/hipp/homes/genie.capella/.m2/repository/org/jacoco/org.jacoco.agent/0.7.9/org.jacoco.agent-0.7.9-runtime.jar=destfile=/jobs/genie.capella/capella-studio-master/workspace/vpdsl/tests/org.polarsys.capella.studio.ad.viewpoint.rcptt/target/jacoco.exec -XX:MaxPermSize=128m
[INFO] Pass 1 (6) processed. 0 failed. spent: 1:03, 1:24 mins remaining. AF For Capella Security. time: 63184ms 
[INFO] Pass 2 (6) processed. 0 failed. spent: 1:26, 1:04 mins remaining. AF For EMF Security. time: 22596ms 
[INFO] Pass 3 (6) processed. 0 failed. spent: 2:47, 1:06 mins remaining. Capella Scurity Viewpoint. time: 79667ms 
[INFO] Pass 4 (6) processed. 0 failed. spent: 3:10, 0:31 mins remaining. EMF Security Viewpoint. time: 23329ms 
[INFO] Pass 5 (6) processed. 0 failed. spent: 3:36, 0:00 mins remaining. Many Activity Explorer Pages. time: 24418ms 
[INFO] Pass 6 (6) processed. 0 failed. spent: 4:11, 0:00 mins remaining. generation Vpdesc to Vptext. time: 35138ms 
[INFO] Process terminated. Shut down AUTs
[INFO] Finished at Wed Jul 03 05:37:07 EDT 2019
[INFO] Runner exit code is: 0
[INFO] 
[INFO] --- rcptt-maven-plugin:2.5.0-SNAPSHOT:package (default-package) @ org.polarsys.capella.studio.ad.viewpoint.rcptt ---
[INFO] Building zip: /jobs/genie.capella/capella-studio-master/workspace/vpdsl/tests/org.polarsys.capella.studio.ad.viewpoint.rcptt/target/projects/org.polarsys.capella.studio.ad.viewpoint.rcptt-1.4.0-SNAPSHOT.zip
[INFO] Building zip: /jobs/genie.capella/capella-studio-master/workspace/vpdsl/tests/org.polarsys.capella.studio.ad.viewpoint.rcptt/target/org.polarsys.capella-org.polarsys.capella.studio.ad.viewpoint.rcptt-1.4.0-SNAPSHOT-result.zip
[INFO] aut1/out.txt already added, skipping
[INFO] 
[INFO] --- tycho-source-plugin:1.1.0:plugin-source (plugin-source) @ org.polarsys.capella.studio.ad.viewpoint.rcptt ---
[INFO] 
[INFO] --- tycho-source-feature-plugin:1.1.0:source-feature (source-feature) @ org.polarsys.capella.studio.ad.viewpoint.rcptt ---
[INFO] 
[INFO] --< org.polarsys.capella:capellastudio.vpdsl.qualityassessment.reverse.tests >--
[INFO] Building capellastudio.vpdsl.qualityassessment.reverse.tests 1.4.0-SNAPSHOT [29/33]
[INFO] -----------------------------[ rcpttTest ]------------------------------
[INFO] 
[INFO] --- maven-clean-plugin:2.5:clean (default-clean) @ capellastudio.vpdsl.qualityassessment.reverse.tests ---
[INFO] 
[INFO] --- jacoco-maven-plugin:0.7.9:prepare-agent (default) @ capellastudio.vpdsl.qualityassessment.reverse.tests ---
[INFO] failsafeArgline set to -javaagent:/opt/public/hipp/homes/genie.capella/.m2/repository/org/jacoco/org.jacoco.agent/0.7.9/org.jacoco.agent-0.7.9-runtime.jar=destfile=/jobs/genie.capella/capella-studio-master/workspace/vpdsl/tests/capellastudio.vpdsl.qualityassessment.reverse.tests/target/jacoco.exec
[INFO] 
[INFO] --- rcptt-maven-plugin:2.5.0-SNAPSHOT:resources (default-resources) @ capellastudio.vpdsl.qualityassessment.reverse.tests ---
[INFO] Resolving artifact org.eclipse.rcptt.runner:rcptt.runner:zip:2.5.0-SNAPSHOT, this may take a while ...
[INFO] Artifact org.eclipse.rcptt.runner:rcptt.runner:zip:2.5.0-SNAPSHOT is resolved to /opt/public/hipp/homes/genie.capella/.m2/repository/org/eclipse/rcptt/runner/rcptt.runner/2.5.0-SNAPSHOT/rcptt.runner-2.5.0-SNAPSHOT.zip
[INFO] Using AUT from /jobs/genie.capella/capella-studio-master/workspace/vpdsl/tests/capellastudio.vpdsl.qualityassessment.reverse.tests/../../../releng/plugins/org.polarsys.capella.studio.releng.product/target/products/org.polarsys.capella.studio.releng.product/linux/gtk/x86_64
[INFO] Extracting RCPTT runner to /jobs/genie.capella/capella-studio-master/workspace/vpdsl/tests/capellastudio.vpdsl.qualityassessment.reverse.tests/target/runner
[INFO] Copying project contents to target directory...
[INFO] 
[INFO] --- rcptt-maven-plugin:2.5.0-SNAPSHOT:execute (default-execute) @ capellastudio.vpdsl.qualityassessment.reverse.tests ---
[INFO] Runner command line is /bin/sh -c cd /jobs/genie.capella/capella-studio-master/workspace/vpdsl/tests/capellastudio.vpdsl.qualityassessment.reverse.tests/target/runner/eclipse && /opt/public/common/java/oracle/jdk1.8.0_192_x64/jre/bin/java -Xms128m -Xmx256m -Dorg.eclipse.rcptt.runner.returnTestFailure=true -jar /jobs/genie.capella/capella-studio-master/workspace/vpdsl/tests/capellastudio.vpdsl.qualityassessment.reverse.tests/target/runner/eclipse/plugins/org.eclipse.equinox.launcher_1.5.300.v20190213-1655.jar -application org.eclipse.rcptt.runner.headless -runnerPlatform swt -data /jobs/genie.capella/capella-studio-master/workspace/vpdsl/tests/capellastudio.vpdsl.qualityassessment.reverse.tests/target/runner-workspace -aut /jobs/genie.capella/capella-studio-master/workspace/vpdsl/tests/capellastudio.vpdsl.qualityassessment.reverse.tests/../../../releng/plugins/org.polarsys.capella.studio.releng.product/target/products/org.polarsys.capella.studio.releng.product/linux/gtk/x86_64 -autWsPrefix /jobs/genie.capella/capella-studio-master/workspace/vpdsl/tests/capellastudio.vpdsl.qualityassessment.reverse.tests/target/aut-ws- -autConsolePrefix /jobs/genie.capella/capella-studio-master/workspace/vpdsl/tests/capellastudio.vpdsl.qualityassessment.reverse.tests/target/results/aut-console- -autVMArgs -javaagent:/opt/public/hipp/homes/genie.capella/.m2/repository/org/jacoco/org.jacoco.agent/0.7.9/org.jacoco.agent-0.7.9-runtime.jar=destfile=/jobs/genie.capella/capella-studio-master/workspace/vpdsl/tests/capellastudio.vpdsl.qualityassessment.reverse.tests/target/jacoco.exec -q7report /jobs/genie.capella/capella-studio-master/workspace/vpdsl/tests/capellastudio.vpdsl.qualityassessment.reverse.tests/target/results/capellastudio.vpdsl.qualityassessment.reverse.tests.report -htmlReport /jobs/genie.capella/capella-studio-master/workspace/vpdsl/tests/capellastudio.vpdsl.qualityassessment.reverse.tests/target/results/capellastudio.vpdsl.qualityassessment.reverse.tests.html -junitReport /jobs/genie.capella/capella-studio-master/workspace/vpdsl/tests/capellastudio.vpdsl.qualityassessment.reverse.tests/target/surefire-reports/TEST-capellastudio.vpdsl.qualityassessment.reverse.tests.xml -import /jobs/genie.capella/capella-studio-master/workspace/vpdsl/tests/capellastudio.vpdsl.qualityassessment.reverse.tests/target/projects/capellastudio.vpdsl.qualityassessment.reverse.tests -testOptions 'testExecTimeout=300;execTimeout=3600' -timeout 3600 -shutdownListenerPort 8805
[INFO] The execution timeout is set to 3600 seconds
[ERROR] Picked up JAVA_TOOL_OPTIONS: -Xmx2G -Djava.io.tmpdir=/tmp/genie.capella
[INFO] Started at Wed Jul 03 05:37:17 EDT 2019
[INFO] RCPTT Runner version: 2.5.0
[INFO] Initializing target platform...
[INFO] Begin task: Create AUT configuration
[INFO] progress: Resolving Target Contents...
[INFO] progress: Reading plug-ins
[INFO] progress: Fetching p2.index from platform:/plugin/org.eclipse.rcptt.updates.runtime.e4x/q7/
[INFO] progress: Adding repository platform:///plugin/org.eclipse.rcptt.updates.runtime.e4x/q7/
[INFO] progress: Fetching content.jar from platform:/plugin/org.eclipse.rcptt.updates.runtime.e4x/q7/
[INFO] progress: Fetching p2.index from platform:/plugin/org.eclipse.rcptt.updates.runtime.e4x/q7/
[INFO] progress: Fetching content.jar from platform:/plugin/org.eclipse.rcptt.updates.runtime.e4x/q7/
[INFO] progress: Fetching p2.index from platform:/plugin/org.eclipse.rcptt.updates.runtime.e4x/q7/
[INFO] progress: Fetching artifacts.jar from platform:/plugin/org.eclipse.rcptt.updates.runtime.e4x/q7/
[INFO] progress: The user operation is waiting for background work to complete.
[INFO] progress: Downloading org.antlr.runtime
[INFO] progress: The user operation is waiting for background work to complete.
[INFO] progress: Adding repository platform:///plugin/org.eclipse.rcptt.updates.aspectj.e44x/dependencies/
[INFO] progress: Fetching content.jar from platform:/plugin/org.eclipse.rcptt.updates.aspectj.e44x/dependencies/
[INFO] progress: Fetching artifacts.jar from platform:/plugin/org.eclipse.rcptt.updates.aspectj.e44x/dependencies/
[INFO] progress: Downloading org.aspectj.runtime
[INFO] progress: Downloading org.eclipse.equinox.weaving.aspectj
[INFO] progress: Downloading org.eclipse.equinox.weaving.hook
[INFO] progress: Downloading org.aspectj.weaver
[INFO] progress: The user operation is waiting for background work to complete.
[INFO] progress: Adding repository platform:///plugin/org.eclipse.rcptt.updates.kepler/dependencies/
[INFO] progress: Fetching content.jar from platform:/plugin/org.eclipse.rcptt.updates.kepler/dependencies/
[INFO] progress: Fetching artifacts.jar from platform:/plugin/org.eclipse.rcptt.updates.kepler/dependencies/
[INFO] progress: Downloading org.eclipse.emf.converter
[INFO] progress: Downloading org.eclipse.emf.mapping.ecore2ecore
[INFO] progress: Downloading org.eclipse.emf.ecore.change
[INFO] progress: Downloading org.eclipse.emf.codegen.ecore
[INFO] progress: The user operation is waiting for background work to complete.
[INFO] progress: Downloading org.eclipse.emf.validation
[INFO] progress: The user operation is waiting for background work to complete.
[INFO] progress: Downloading org.eclipse.emf.transaction.ui
[INFO] progress: Downloading org.eclipse.emf.mapping.ecore.editor
[INFO] progress: The user operation is waiting for background work to complete.
[INFO] progress: Downloading org.eclipse.emf.validation_root
[INFO] progress: The user operation is waiting for background work to complete.
[INFO] progress: Downloading org.eclipse.emf
[INFO] progress: Downloading org.eclipse.emf.ecore.change.edit
[INFO] progress: The user operation is waiting for background work to complete.
[INFO] progress: Downloading org.eclipse.emf.importer.ecore
[INFO] progress: Downloading org.eclipse.emf.codegen.ui
[INFO] progress: The user operation is waiting for background work to complete.
[INFO] progress: Downloading org.eclipse.emf.mapping.ecore2ecore.editor
[INFO] progress: Downloading org.eclipse.emf.ecore.xmi
[INFO] progress: Downloading org.eclipse.emf.mapping.ui
[INFO] progress: Downloading org.eclipse.emf.databinding.edit
[INFO] progress: The user operation is waiting for background work to complete.
[INFO] progress: Downloading org.eclipse.emf.mapping
[INFO] progress: Downloading org.eclipse.emf.ecore
[INFO] progress: Downloading org.eclipse.emf.codegen.ecore.ui
[INFO] progress: The user operation is waiting for background work to complete.
[INFO] progress: Downloading org.eclipse.emf.importer
[INFO] progress: The user operation is waiting for background work to complete.
[INFO] progress: Downloading org.eclipse.emf.mapping.ecore2xml.ui
[INFO] progress: Downloading org.eclipse.emf.databinding
[INFO] progress: Downloading org.eclipse.emf
[INFO] progress: The user operation is waiting for background work to complete.
[INFO] progress: Downloading org.eclipse.emf.ecore.edit
[INFO] progress: The user operation is waiting for background work to complete.
[INFO] progress: Downloading org.eclipse.emf.databinding
[INFO] progress: The user operation is waiting for background work to complete.
[INFO] progress: Downloading org.eclipse.emf.validation.ui
[INFO] progress: Downloading org.eclipse.emf.query
[INFO] progress: The user operation is waiting for background work to complete.
[INFO] progress: Downloading org.eclipse.emf.transaction
[INFO] progress: The user operation is waiting for background work to complete.
[INFO] progress: Downloading org.eclipse.emf.ecore.editor
[INFO] progress: The user operation is waiting for background work to complete.
[INFO] progress: Downloading org.eclipse.emf.codegen.ecore
[INFO] progress: Downloading org.eclipse.emf.common.ui
[INFO] progress: The user operation is waiting for background work to complete.
[INFO] progress: Downloading org.eclipse.emf.mapping.ecore2xml
[INFO] progress: The user operation is waiting for background work to complete.
[INFO] progress: Downloading org.eclipse.emf.mapping.ecore
[INFO] progress: The user operation is waiting for background work to complete.
[INFO] progress: Downloading org.eclipse.emf.ecore
[INFO] progress: The user operation is waiting for background work to complete.
[INFO] progress: Downloading org.eclipse.emf.query
[INFO] progress: The user operation is waiting for background work to complete.
[INFO] progress: Downloading org.eclipse.emf.mapping
[INFO] progress: The user operation is waiting for background work to complete.
[INFO] progress: Downloading org.eclipse.emf.edit.ui
[INFO] progress: Downloading org.eclipse.emf.exporter
[INFO] progress: The user operation is waiting for background work to complete.
[INFO] progress: Downloading org.eclipse.emf.mapping.ui
[INFO] progress: The user operation is waiting for background work to complete.
[INFO] progress: Downloading org.eclipse.emf.converter
[INFO] progress: The user operation is waiting for background work to complete.
[INFO] progress: Downloading org.eclipse.emf.transaction
[INFO] progress: Downloading org.eclipse.emf.transaction_root
[INFO] progress: The user operation is waiting for background work to complete.
[INFO] progress: Downloading org.eclipse.emf.databinding.edit
[INFO] progress: The user operation is waiting for background work to complete.
[INFO] progress: Downloading org.eclipse.emf.ecore.edit
[INFO] progress: The user operation is waiting for background work to complete.
[INFO] progress: Downloading org.eclipse.emf.validation
[INFO] progress: The user operation is waiting for background work to complete.
[INFO] progress: Downloading org.eclipse.emf.importer.rose
[INFO] progress: The user operation is waiting for background work to complete.
[INFO] progress: Downloading org.eclipse.emf.edit.ui
[INFO] progress: The user operation is waiting for background work to complete.
[INFO] progress: Downloading org.eclipse.emf.ant
[INFO] progress: The user operation is waiting for background work to complete.
[INFO] progress: Downloading org.eclipse.emf.importer.java
[INFO] progress: The user operation is waiting for background work to complete.
[INFO] progress: Downloading org.eclipse.emf.codegen.ecore.ui
[INFO] progress: Downloading org.eclipse.emf.edit
[INFO] progress: The user operation is waiting for background work to complete.
[INFO] progress: Downloading org.eclipse.emf.codegen
[INFO] progress: The user operation is waiting for background work to complete.
[INFO] progress: Downloading org.eclipse.emf.common.ui
[INFO] progress: The user operation is waiting for background work to complete.
[INFO] progress: Downloading org.eclipse.emf.common
[INFO] progress: The user operation is waiting for background work to complete.
[INFO] progress: Downloading org.eclipse.emf.ecore.editor
[INFO] progress: The user operation is waiting for background work to complete.
[INFO] progress: Downloading org.eclipse.emf.mapping.ecore
[INFO] progress: The user operation is waiting for background work to complete.
[INFO] progress: Downloading org.eclipse.emf.mapping.ecore.editor
[INFO] progress: The user operation is waiting for background work to complete.
[INFO] progress: Downloading org.eclipse.emf.validation.ui.ide
[INFO] progress: The user operation is waiting for background work to complete.
[INFO] progress: Downloading org.eclipse.emf.edit
[INFO] progress: The user operation is waiting for background work to complete.
[INFO] progress: Downloading org.eclipse.emf.common
[INFO] progress: The user operation is waiting for background work to complete.
[INFO] progress: Downloading org.eclipse.emf.codegen
[INFO] progress: The user operation is waiting for background work to complete.
[INFO] progress: Downloading org.eclipse.emf.query_root
[INFO] progress: The user operation is waiting for background work to complete.
[INFO] progress: Downloading org.eclipse.emf.codegen.ui
[INFO] progress: The user operation is waiting for background work to complete.
[INFO] progress: Adding repository platform:///plugin/org.eclipse.rcptt.module.nebula.updates/runtime/
[INFO] progress: Fetching content.jar from platform:/plugin/org.eclipse.rcptt.module.nebula.updates/runtime/
[INFO] progress: Fetching artifacts.jar from platform:/plugin/org.eclipse.rcptt.module.nebula.updates/runtime/
[INFO] progress: The user operation is waiting for background work to complete.
[INFO] progress: Adding repository platform:///plugin/org.eclipse.rcptt.module.testrail.updates/runtime/
[INFO] progress: Fetching content.jar from platform:/plugin/org.eclipse.rcptt.module.testrail.updates/runtime/
[INFO] progress: Fetching artifacts.jar from platform:/plugin/org.eclipse.rcptt.module.testrail.updates/runtime/
[INFO] progress: The user operation is waiting for background work to complete.
[INFO] progress: Adding repository platform:///plugin/org.eclipse.rcptt.updates.extra/dependencies/
[INFO] progress: Fetching content.jar from platform:/plugin/org.eclipse.rcptt.updates.extra/dependencies/
[INFO] progress: Fetching artifacts.jar from platform:/plugin/org.eclipse.rcptt.updates.extra/dependencies/
[INFO] progress: Downloading org.apache.poi.ooxml
[INFO] progress: Downloading org.apache.xmlbeans
[INFO] progress: Downloading org.apache.poi.ooxml.schemas
[INFO] progress: Downloading org.dom4j
[INFO] progress: The user operation is waiting for background work to complete.
[INFO] progress: Downloading org.apache.poi
[INFO] progress: The user operation is waiting for background work to complete.
[INFO] progress: Resolving Target Contents...
[INFO] progress: Reading plug-ins
[INFO] progress: Fetching p2.index from platform:/plugin/org.eclipse.rcptt.updates.runtime.e4x/q7/
[INFO] progress: Fetching content.jar from platform:/plugin/org.eclipse.rcptt.updates.runtime.e4x/q7/
[INFO] progress: Fetching content.jar from platform:/plugin/org.eclipse.rcptt.updates.aspectj.e44x/dependencies/
[INFO] progress: Fetching content.jar from platform:/plugin/org.eclipse.rcptt.updates.kepler/dependencies/
[INFO] progress: Fetching content.jar from platform:/plugin/org.eclipse.rcptt.module.nebula.updates/runtime/
[INFO] progress: Fetching content.jar from platform:/plugin/org.eclipse.rcptt.module.testrail.updates/runtime/
[INFO] progress: Fetching content.jar from platform:/plugin/org.eclipse.rcptt.updates.extra/dependencies/
[INFO] progress: Fetching p2.index from platform:/plugin/org.eclipse.rcptt.updates.runtime.e4x/q7/
[INFO] progress: Fetching artifacts.jar from platform:/plugin/org.eclipse.rcptt.updates.runtime.e4x/q7/
[INFO] progress: Fetching artifacts.jar from platform:/plugin/org.eclipse.rcptt.module.testrail.updates/runtime/
[INFO] progress: Fetching artifacts.jar from platform:/plugin/org.eclipse.rcptt.updates.kepler/dependencies/
[INFO] progress: Fetching artifacts.jar from platform:/plugin/org.eclipse.rcptt.module.nebula.updates/runtime/
[INFO] progress: Fetching artifacts.jar from platform:/plugin/org.eclipse.rcptt.updates.aspectj.e44x/dependencies/
[INFO] progress: Fetching artifacts.jar from platform:/plugin/org.eclipse.rcptt.updates.extra/dependencies/
[INFO] progress: Downloading org.eclipse.emf.validation_root
[INFO] progress: Downloading org.eclipse.emf.transaction_root
[INFO] progress: Downloading org.eclipse.emf.query_root
[INFO] progress: Installing org.eclipse.emf.ecore.change
[INFO] progress: Installing org.eclipse.rcptt.tesla.ui.ide
[INFO] progress: Installing org.eclipse.rcptt.core.swt
[INFO] progress: Installing org.eclipse.rcptt.ecl.debug.runtime
[INFO] progress: Installing org.eclipse.rcptt.ctx.parameters
[INFO] progress: Installing org.eclipse.rcptt.ecl.core
[INFO] progress: Installing org.eclipse.rcptt.tesla.recording.aspects.jface.text
[INFO] progress: Installing org.eclipse.rcptt.util
[INFO] progress: Installing org.eclipse.rcptt.ctx.resources.impl
[INFO] progress: Installing org.eclipse.rcptt.tesla.jface.databinding.aspects
[INFO] progress: Installing org.eclipse.emf.ecore.xmi
[INFO] progress: Installing org.eclipse.rcptt.tesla.swt
[INFO] progress: Installing org.eclipse.emf.mapping.feature.jar
[INFO] progress: Installing org.dom4j
[INFO] progress: Installing org.eclipse.emf.importer
[INFO] progress: Installing org.eclipse.emf.mapping.ecore2xml.ui
[INFO] progress: Installing org.eclipse.rcptt.testrail.ecl
[INFO] progress: Installing org.eclipse.rcptt.ecl.core.feature.group
[INFO] progress: Installing org.eclipse.emf.ecore.edit
[INFO] progress: Installing org.eclipse.rcptt.tesla.properties.view
[INFO] progress: Installing org.eclipse.emf.edit.feature.group
[INFO] progress: Installing org.eclipse.rcptt.ecl.data.apache.poi.impl
[INFO] progress: Installing org.eclipse.emf.transaction
[INFO] progress: Installing org.eclipse.rcptt.verifications.time
[INFO] progress: Installing org.eclipse.rcptt.tesla.canvas
[INFO] progress: Installing org.eclipse.emf.codegen.ecore.feature.jar
[INFO] progress: Installing org.eclipse.emf.mapping.ecore.editor.feature.group
[INFO] progress: Installing org.eclipse.emf.common.ui.feature.jar
[INFO] progress: Installing org.eclipse.rcptt.tesla.swt.e4x
[INFO] progress: Installing org.eclipse.rcptt.tesla.recording.core
[INFO] progress: Installing org.eclipse.emf.ecore.edit.feature.group
[INFO] progress: Installing org.eclipse.rcptt.runtime.feature.group
[INFO] progress: Installing org.eclipse.rcptt.ecl.server.feature.jar
[INFO] progress: Installing org.eclipse.rcptt.tesla.workbench.texteditor.aspects
[INFO] progress: Installing org.eclipse.emf.transaction.feature.jar
[INFO] progress: Installing org.eclipse.rcptt.tesla.jface.text
[INFO] progress: Installing org.eclipse.emf.ecore.edit.feature.jar
[INFO] progress: Installing org.eclipse.emf.validation
[INFO] progress: Installing org.eclipse.rcptt.tesla.recording.jface.text
[INFO] progress: Installing org.eclipse.rcptt.tesla.recording.workbench.texteditor
[INFO] progress: Installing org.eclipse.emf.edit.ui
[INFO] progress: Installing org.eclipse.rcptt.ecl.platform.feature.group
[INFO] progress: Installing org.eclipse.rcptt.tesla.ecl.feature.jar
[INFO] progress: Installing org.eclipse.emf.edit.feature.jar
[INFO] progress: Installing org.eclipse.rcptt.tesla.jobs.aspects
[INFO] progress: Installing org.eclipse.rcptt.module.nebula.runtime.feature.group
[INFO] progress: Installing org.eclipse.rcptt.tesla.jface.databinding
[INFO] progress: Installing org.eclipse.equinox.weaving.aspectj
[INFO] progress: Installing org.eclipse.rcptt.tesla.gef.aspects
[INFO] progress: Installing org.eclipse.emf.validation.ui.ide
[INFO] progress: Installing org.eclipse.emf.edit
[INFO] progress: Installing org.eclipse.rcptt.tesla.variables
[INFO] progress: Installing org.eclipse.rcptt.ecl.platform.ui
[INFO] progress: Installing org.eclipse.rcptt.testrail.ecl.impl
[INFO] progress: Installing org.eclipse.rcptt.watson.aspects.jobs
[INFO] progress: Installing org.eclipse.rcptt.tesla.recording.gef
[INFO] progress: Installing org.eclipse.rcptt.resources.impl
[INFO] progress: Installing org.eclipse.emf.converter.feature.group
[INFO] progress: Installing org.eclipse.emf.codegen.ecore
[INFO] progress: Installing org.eclipse.emf.validation.feature.jar
[INFO] progress: Installing org.eclipse.emf.transaction.ui
[INFO] progress: Installing org.eclipse.emf.databinding.edit.feature.group
[INFO] progress: Installing org.eclipse.rcptt.tesla.recording.gmf
[INFO] progress: Installing org.eclipse.rcptt.tesla.runtime.feature.group
[INFO] progress: Installing org.eclipse.rcptt.tesla.jdt
[INFO] progress: Installing org.eclipse.rcptt.ctx.parameters.impl
[INFO] progress: Installing org.eclipse.rcptt.tesla.recording.canvas
[INFO] progress: Installing org.eclipse.emf.common.ui.feature.group
[INFO] progress: Installing org.eclipse.rcptt.ecl.parser
[INFO] progress: Installing org.apache.poi.ooxml.schemas
[INFO] progress: Installing org.eclipse.rcptt.reporting
[INFO] progress: Installing org.eclipse.emf.ecore.change.edit
[INFO] progress: Installing org.eclipse.emf.mapping.ecore2ecore.editor
[INFO] progress: Installing org.antlr.runtime
[INFO] progress: Installing org.eclipse.rcptt.ecl.platform.feature.jar
[INFO] progress: Installing org.eclipse.rcptt.ecl.interop
[INFO] progress: Installing org.eclipse.rcptt.ctx.preferences.aspects
[INFO] progress: Installing org.eclipse.rcptt.ctx.script.impl
[INFO] progress: Installing org.eclipse.emf.databinding.edit
[INFO] progress: Installing org.eclipse.rcptt.verifications.text
[INFO] progress: Installing org.eclipse.rcptt.tesla.recording.core.ecl
[INFO] progress: Installing org.eclipse.rcptt.watson.core
[INFO] progress: Installing org.eclipse.rcptt.watson.runtime.feature.jar
[INFO] progress: Installing org.eclipse.emf.edit.ui.feature.group
[INFO] progress: Installing org.eclipse.rcptt.module.nebula.runtime.feature.jar
[INFO] progress: Installing org.eclipse.rcptt.tesla.recording.aspects.swt
[INFO] progress: Installing org.eclipse.emf
[INFO] progress: Installing org.eclipse.rcptt.runtime.feature.jar
[INFO] progress: Installing org.eclipse.rcptt.core.scenario
[INFO] progress: Installing org.eclipse.rcptt.ctx.preferences.impl
[INFO] progress: Installing org.eclipse.emf.validation.ui
[INFO] progress: Installing org.eclipse.rcptt.util.resources
[INFO] progress: Installing org.eclipse.emf.codegen.ecore.feature.group
[INFO] progress: Installing org.apache.xmlbeans
[INFO] progress: Installing org.eclipse.rcptt.runtime.ui
[INFO] progress: Installing org.eclipse.emf.mapping.ecore.feature.jar
[INFO] progress: Installing org.eclipse.rcptt.verifications.resources
[INFO] progress: Installing org.eclipse.rcptt.logging
[INFO] progress: Installing org.eclipse.emf.mapping.feature.group
[INFO] progress: Installing org.eclipse.equinox.weaving.hook
[INFO] progress: Installing org.eclipse.emf.edit.ui.feature.jar
[INFO] progress: Installing org.eclipse.rcptt.tesla.ecl.feature.group
[INFO] progress: Installing org.eclipse.rcptt.tesla.nebula.ecl.impl
[INFO] progress: Installing org.eclipse.rcptt.ecl.core.feature.jar
[INFO] progress: Installing org.eclipse.emf.mapping.ui
[INFO] progress: Installing org.eclipse.rcptt.tesla.recording.aspects.gef
[INFO] progress: Installing org.eclipse.rcptt.ctx.filesystem.impl
[INFO] progress: Installing org.eclipse.rcptt.tesla.recording.aspects.gmf
[INFO] progress: Installing org.eclipse.rcptt.ecl.server.tcp
[INFO] progress: Installing org.eclipse.rcptt.verifications.text.impl
[INFO] progress: Installing org.eclipse.rcptt.tesla.feature.group
[INFO] progress: Installing org.eclipse.emf.importer.java
[INFO] progress: Installing org.eclipse.rcptt.tesla.feature.jar
[INFO] progress: Installing org.eclipse.rcptt.tesla.recording.swt
[INFO] progress: Installing org.eclipse.emf.codegen.feature.jar
[INFO] progress: Installing org.eclipse.emf.common
[INFO] progress: Installing org.eclipse.rcptt.ecl.dispatch
[INFO] progress: Installing org.eclipse.rcptt.watson.feature.jar
[INFO] progress: Installing org.eclipse.emf.mapping.ecore
[INFO] progress: Installing org.eclipse.emf.mapping.ecore.editor.feature.jar
[INFO] progress: Installing org.eclipse.emf.common.feature.jar
[INFO] progress: Installing org.eclipse.rcptt.verifications.tree
[INFO] progress: Installing org.eclipse.rcptt.verifications.tree.impl
[INFO] progress: Installing org.eclipse.emf.mapping.ecore2ecore
[INFO] progress: Installing org.eclipse.rcptt.forms.impl
[INFO] progress: Installing org.eclipse.rcptt.ctx.debug
[INFO] progress: Installing org.eclipse.emf.mapping.ecore.editor
[INFO] progress: Installing org.eclipse.emf.validation_root
[INFO] progress: Installing org.eclipse.emf.feature.jar
[INFO] progress: Installing file:/jobs/genie.rcptt/rcptt-all/workspace/modules/testrail/runtime-site/target/site/site.xml.rcptt
[INFO] progress: Installing org.eclipse.rcptt.core
[INFO] progress: Installing org.eclipse.rcptt.tesla.ecl
[INFO] progress: Installing org.eclipse.rcptt.watson.aspects.swt
[INFO] progress: Installing org.eclipse.emf.importer.ecore
[INFO] progress: Installing org.eclipse.rcptt.tesla.recording.aspects.workbench.texteditor
[INFO] progress: Installing org.eclipse.emf.codegen.ecore.ui.feature.group
[INFO] progress: Installing org.eclipse.rcptt.tesla.gmf.aspects
[INFO] progress: Installing org.eclipse.rcptt.core.swt.win64
[INFO] progress: Installing org.eclipse.emf.codegen.ecore.ui.feature.jar
[INFO] progress: Installing org.eclipse.rcptt.tesla.recording.aspects.forms
[INFO] progress: Installing org.eclipse.rcptt.tesla.jface.text.reconciler.aspects
[INFO] progress: Installing org.eclipse.rcptt.ctx.debug.impl
[INFO] progress: Installing file:/jobs/genie.rcptt/rcptt-all/workspace/modules/nebula/runtime-site/target/site/site.xml.rcptt
[INFO] progress: Installing org.eclipse.rcptt.tesla.jface.fragment
[INFO] progress: Installing org.eclipse.rcptt.ctx.workbench.impl
[INFO] progress: Installing org.eclipse.rcptt.tesla.core
[INFO] progress: Installing org.eclipse.rcptt.watson.jface
[INFO] progress: Installing org.eclipse.rcptt.tesla.workbench.aspects.e4x
[INFO] progress: Installing org.eclipse.rcptt.ecl.perf
[INFO] progress: Installing org.eclipse.rcptt.ctx.resources
[INFO] progress: Installing org.eclipse.rcptt.tesla.jdt.aspects
[INFO] progress: Installing org.eclipse.rcptt.tesla.swt.fragment
[INFO] progress: Installing org.eclipse.emf.feature.group
[INFO] progress: Installing org.eclipse.rcptt.tesla.nebula.ecl
[INFO] progress: Installing org.eclipse.rcptt.resources
[INFO] progress: Installing org.eclipse.emf.mapping.ecore2xml
[INFO] progress: Installing org.eclipse.rcptt.module.testrail.runtime.feature.group
[INFO] progress: Installing org.eclipse.rcptt.tesla.core.context
[INFO] progress: Installing org.eclipse.rcptt.tesla.jface.text.aspects
[INFO] progress: Installing org.eclipse.rcptt.verifications.resources.impl
[INFO] progress: Installing org.eclipse.rcptt.core.launching
[INFO] progress: Installing org.eclipse.emf.mapping
[INFO] progress: Installing org.eclipse.rcptt.tesla.jface.aspects
[INFO] progress: Installing org.eclipse.rcptt.tesla.workbench.texteditor
[INFO] progress: Installing org.eclipse.rcptt.tesla.runtime.feature.jar
[INFO] progress: Installing org.eclipse.rcptt.tesla.nebula
[INFO] progress: Installing org.eclipse.rcptt.tesla.swt.aspects
[INFO] progress: Installing org.eclipse.emf.exporter
[INFO] progress: Installing org.eclipse.emf.converter.feature.jar
[INFO] progress: Installing org.eclipse.rcptt.ecl.platform.ui.feature.group
[INFO] progress: Installing org.eclipse.rcptt.tesla.ecl.runtime.feature.group
[INFO] progress: Installing org.eclipse.rcptt.tesla.recording.draw2d
[INFO] progress: Installing org.eclipse.emf.transaction_root
[INFO] progress: Installing org.eclipse.rcptt.ecl.data
[INFO] progress: Installing org.eclipse.rcptt.ecl.client.tcp
[INFO] progress: Installing org.eclipse.emf.databinding.edit.feature.jar
[INFO] progress: Installing org.eclipse.rcptt.ctx.workbench
[INFO] progress: Installing org.eclipse.rcptt.ecl.operations
[INFO] progress: Installing org.eclipse.rcptt.ecl.server.feature.group
[INFO] progress: Installing org.eclipse.rcptt.verifications.log
[INFO] progress: Installing org.eclipse.emf.ant
[INFO] progress: Installing org.aspectj.runtime
[INFO] progress: Installing org.eclipse.emf.codegen.ecore.ui
[INFO] progress: Installing org.apache.poi
[INFO] progress: Installing org.eclipse.rcptt.ecl.platform.ui.feature.jar
[INFO] progress: Installing org.eclipse.rcptt.util.swt
[INFO] progress: Installing org.eclipse.emf.transaction.feature.group
[INFO] progress: Installing org.eclipse.emf.codegen
[INFO] progress: Installing org.eclipse.rcptt.expandbar.runtime
[INFO] progress: Installing org.eclipse.rcptt.tesla.core.am
[INFO] progress: Installing org.eclipse.rcptt.ctx.filesystem
[INFO] progress: Installing org.eclipse.emf.query_root
[INFO] progress: Installing org.eclipse.emf.codegen.ui
[INFO] progress: Installing org.eclipse.emf.query.feature.group
[INFO] progress: Installing org.eclipse.emf.converter
[INFO] progress: Installing org.eclipse.emf.ecore.feature.group
[INFO] progress: Installing org.eclipse.rcptt.verifications.time.impl
[INFO] progress: Installing org.eclipse.rcptt.tesla.nebula.impl
[INFO] progress: Installing org.eclipse.emf.mapping.ecore.feature.group
[INFO] progress: Installing org.eclipse.emf.mapping.ui.feature.group
[INFO] progress: Installing org.eclipse.rcptt.ctx.group.impl
[INFO] progress: Installing org.eclipse.rcptt.tesla.gmf
[INFO] progress: Installing org.eclipse.emf.codegen.feature.group
[INFO] progress: Installing org.eclipse.rcptt.ecl.data.apache.poi
[INFO] progress: Installing org.eclipse.emf.codegen.ui.feature.jar
[INFO] progress: Installing org.eclipse.rcptt.tesla.gef
[INFO] progress: Installing org.eclipse.emf.ecore.editor.feature.group
[INFO] progress: Installing 201906250706.Default
[INFO] progress: Installing org.eclipse.emf.mapping.ui.feature.jar
[INFO] progress: Installing org.apache.poi.ooxml
[INFO] progress: Installing org.eclipse.rcptt.tesla.ecl.impl
[INFO] progress: Installing org.eclipse.emf.ecore
[INFO] progress: Installing org.eclipse.emf.common.feature.group
[INFO] progress: Installing org.eclipse.rcptt.core.ecl.debug
[INFO] progress: Installing org.eclipse.rcptt.tesla.ecl.runtime.feature.jar
[INFO] progress: Installing org.eclipse.rcptt.watson.runtime.feature.group
[INFO] progress: Installing org.eclipse.rcptt.tesla.jface.databinding.observable.aspects
[INFO] progress: Installing org.eclipse.emf.databinding
[INFO] progress: Installing org.eclipse.emf.databinding.feature.group
[INFO] progress: Installing org.eclipse.rcptt.ctx.script
[INFO] progress: Installing org.eclipse.rcptt.tesla.ui.ide.aspects
[INFO] progress: Installing org.eclipse.rcptt.ecl.filesystem
[INFO] progress: Installing org.eclipse.emf.databinding.feature.jar
[INFO] progress: Installing org.eclipse.rcptt.ctx.group
[INFO] progress: Installing org.eclipse.emf.query.feature.jar
[INFO] progress: Installing org.eclipse.rcptt.verifications
[INFO] progress: Installing org.eclipse.rcptt.expandbar
[INFO] progress: Installing org.eclipse.emf.ecore.editor.feature.jar
[INFO] progress: Installing org.eclipse.rcptt.ctx.preferences
[INFO] progress: Installing org.eclipse.emf.ecore.feature.jar
[INFO] progress: Installing org.aspectj.weaver
[INFO] progress: Installing org.eclipse.emf.query
[INFO] progress: Installing org.eclipse.emf.codegen.ui.feature.group
[INFO] progress: Installing org.eclipse.rcptt.ctx.workbench.aspect
[INFO] progress: Installing org.eclipse.rcptt.core.ecl.core
[INFO] progress: Installing org.eclipse.rcptt.tesla.recording.aspects.workbench
[INFO] progress: Installing org.eclipse.emf.validation.feature.group
[INFO] progress: Installing org.eclipse.rcptt.tesla.recording.aspects.draw2d
[INFO] progress: Installing org.eclipse.rcptt.module.testrail.runtime.feature.jar
[INFO] progress: Installing org.eclipse.rcptt.ecl.platform
[INFO] progress: Installing org.eclipse.rcptt.verifications.log.impl
[INFO] progress: Installing org.eclipse.emf.importer.rose
[INFO] progress: Installing org.eclipse.rcptt.tesla.recording.nebula
[INFO] progress: Installing org.eclipse.rcptt.watson.feature.group
[INFO] progress: Installing org.eclipse.emf.common.ui
[INFO] progress: Installing org.eclipse.rcptt.ecl.doc
[INFO] progress: Installing org.eclipse.emf.ecore.editor
[INFO] progress: Installing org.eclipse.rcptt.watson.jobs
[INFO] progress: Installing org.eclipse.rcptt.tesla.recording.aspects.jface
[INFO] progress: Downloading org.eclipse.emf.validation_root
[INFO] progress: Downloading org.eclipse.emf.transaction_root
[INFO] progress: Downloading org.eclipse.emf.query_root
[INFO] progress: Preparing to commit the provisioning operation.
[INFO] progress: Committing the provisioning operation.
[INFO] progress: Reading plug-ins
[INFO] Target platform is valid.
[INFO] Looking for tests...
[INFO] Existing projects in workspace:
[INFO]     <none>
[INFO] Importing projects to workspace:
[INFO] Refreshing projects:
[INFO]     /jobs/genie.capella/capella-studio-master/workspace/vpdsl/tests/capellastudio.vpdsl.qualityassessment.reverse.tests/target/projects/capellastudio.vpdsl.qualityassessment.reverse.tests... OK
[INFO] Refreshing projects:
[INFO]     capellastudio.vpdsl.qualityassessment.reverse.tests... OK
[INFO] Searching for tests in projects:
[INFO]     capellastudio.vpdsl.qualityassessment.reverse.tests... 
[INFO] Complete OK
[INFO] Testcase Artifacts:1
[INFO] AUT-0:Launching
[INFO] AUT-0:Product: org.polarsys.capella.studio.product.CapellaStudio
[INFO] AUT-0:Application: org.polarsys.capella.studio.product.application
[INFO] AUT-0:Architecture: x86_64
[INFO] 64bit arch is selected because AUT uses launcher library
[INFO] 	"plugins/org.eclipse.equinox.launcher.gtk.linux.x86_64_1.1.1000.v20190125-2016" specified in config file: eclipse.ini
[INFO] /jobs/genie.capella/capella-studio-master/workspace/vpdsl/tests/capellastudio.vpdsl.qualityassessment.reverse.tests/target/aut-ws-0: AUT arguments: -os ${target.os} -arch ${target.arch} -consoleLog
[INFO] /jobs/genie.capella/capella-studio-master/workspace/vpdsl/tests/capellastudio.vpdsl.qualityassessment.reverse.tests/target/aut-ws-0: AUT VM arguments: -Dosgi.requiredJavaVersion=1.8 -Xms512m -Xmx2048m -XX:PermSize=256M -XX:-UseGCOverheadLimit -javaagent:/opt/public/hipp/homes/genie.capella/.m2/repository/org/jacoco/org.jacoco.agent/0.7.9/org.jacoco.agent-0.7.9-runtime.jar=destfile=/jobs/genie.capella/capella-studio-master/workspace/vpdsl/tests/capellastudio.vpdsl.qualityassessment.reverse.tests/target/jacoco.exec -XX:MaxPermSize=128m
[INFO] Fail 1 (1) processed. 1 failed. spent: 0:00, 0:00 mins remaining. Reverse from Ecore. time: 0ms  Cause: org.eclipse.core.runtime.CoreException: Failed to process Reverse from Ecore.test
[INFO] 	at org.eclipse.rcptt.internal.launching.Q7LaunchManager$ExecutableFactory.map(Q7LaunchManager.java:676)
[INFO] 	at org.eclipse.rcptt.internal.launching.Q7LaunchManager.execute(Q7LaunchManager.java:272)
[INFO] 	at org.eclipse.rcptt.internal.launching.Q7LaunchConfigurationDelegate.launch(Q7LaunchConfigurationDelegate.java:221)
[INFO] 	at org.eclipse.rcptt.internal.launching.Q7LaunchConfigurationDelegate.launch(Q7LaunchConfigurationDelegate.java:172)
[INFO] 	at org.eclipse.debug.internal.core.LaunchConfiguration.launch(LaunchConfiguration.java:862)
[INFO] 	at org.eclipse.debug.internal.core.LaunchConfiguration.launch(LaunchConfiguration.java:720)
[INFO] 	at org.eclipse.debug.internal.core.LaunchConfiguration.launch(LaunchConfiguration.java:715)
[INFO] 	at org.eclipse.rcptt.launching.Q7Launcher.execute(Q7Launcher.java:102)
[INFO] 	at org.eclipse.rcptt.launching.Q7Launcher.execute(Q7Launcher.java:90)
[INFO] 	at org.eclipse.rcptt.runner.ScenarioRunnable.run(ScenarioRunnable.java:65)
[INFO] 	at org.eclipse.rcptt.runner.util.AutThread.run(AutThread.java:141)
[INFO] Caused by: java.lang.NullPointerException
[INFO] 	at com.google.common.base.Preconditions.checkNotNull(Preconditions.java:770)
[INFO] 	at org.eclipse.rcptt.internal.launching.DataExecutable.<init>(DataExecutable.java:44)
[INFO] 	at org.eclipse.rcptt.internal.launching.VerificationExecutable.<init>(VerificationExecutable.java:21)
[INFO] 	at org.eclipse.rcptt.internal.launching.UnresolvedVerificationExecutable.<init>(UnresolvedVerificationExecutable.java:36)
[INFO] 	at org.eclipse.rcptt.internal.launching.Q7LaunchManager$ExecutableFactory.makeVerificationExecutable(Q7LaunchManager.java:522)
[INFO] 	at org.eclipse.rcptt.internal.launching.Q7LaunchManager$ExecutableFactory.addVerificationExecutables(Q7LaunchManager.java:534)
[INFO] 	at org.eclipse.rcptt.internal.launching.Q7LaunchManager$ExecutableFactory.makeExecutionPlans(Q7LaunchManager.java:604)
[INFO] 	at org.eclipse.rcptt.internal.launching.Q7LaunchManager$ExecutableFactory.map(Q7LaunchManager.java:640)
[INFO] 	... 10 more
[INFO] 
[INFO] Failed Tests:
[INFO] Reverse from Ecore
[INFO] Process terminated. Shut down AUTs
[INFO] Runner exit code is: 56
[ERROR] There are test failures
[INFO] 
[INFO] --- rcptt-maven-plugin:2.5.0-SNAPSHOT:package (default-package) @ capellastudio.vpdsl.qualityassessment.reverse.tests ---
[INFO] Building zip: /jobs/genie.capella/capella-studio-master/workspace/vpdsl/tests/capellastudio.vpdsl.qualityassessment.reverse.tests/target/projects/capellastudio.vpdsl.qualityassessment.reverse.tests-1.4.0-SNAPSHOT.zip
[INFO] Building zip: /jobs/genie.capella/capella-studio-master/workspace/vpdsl/tests/capellastudio.vpdsl.qualityassessment.reverse.tests/target/org.polarsys.capella-capellastudio.vpdsl.qualityassessment.reverse.tests-1.4.0-SNAPSHOT-result.zip
[INFO] aut1/out.txt already added, skipping
[INFO] 
[INFO] --- tycho-source-plugin:1.1.0:plugin-source (plugin-source) @ capellastudio.vpdsl.qualityassessment.reverse.tests ---
[INFO] 
[INFO] --- tycho-source-feature-plugin:1.1.0:source-feature (source-feature) @ capellastudio.vpdsl.qualityassessment.reverse.tests ---
[INFO] 
[INFO] --< org.polarsys.capella:capellastudio.vpdsl.qualityassessment.tests >--
[INFO] Building capellastudio.vpdsl.qualityassessment.tests 1.4.0-SNAPSHOT [30/33]
[INFO] -----------------------------[ rcpttTest ]------------------------------
[INFO] 
[INFO] --- maven-clean-plugin:2.5:clean (default-clean) @ capellastudio.vpdsl.qualityassessment.tests ---
[INFO] 
[INFO] --- jacoco-maven-plugin:0.7.9:prepare-agent (default) @ capellastudio.vpdsl.qualityassessment.tests ---
[INFO] failsafeArgline set to -javaagent:/opt/public/hipp/homes/genie.capella/.m2/repository/org/jacoco/org.jacoco.agent/0.7.9/org.jacoco.agent-0.7.9-runtime.jar=destfile=/jobs/genie.capella/capella-studio-master/workspace/vpdsl/tests/capellastudio.vpdsl.qualityassessment.tests/target/jacoco.exec
[INFO] 
[INFO] --- rcptt-maven-plugin:2.5.0-SNAPSHOT:resources (default-resources) @ capellastudio.vpdsl.qualityassessment.tests ---
[INFO] Resolving artifact org.eclipse.rcptt.runner:rcptt.runner:zip:2.5.0-SNAPSHOT, this may take a while ...
[INFO] Artifact org.eclipse.rcptt.runner:rcptt.runner:zip:2.5.0-SNAPSHOT is resolved to /opt/public/hipp/homes/genie.capella/.m2/repository/org/eclipse/rcptt/runner/rcptt.runner/2.5.0-SNAPSHOT/rcptt.runner-2.5.0-SNAPSHOT.zip
[INFO] Using AUT from /jobs/genie.capella/capella-studio-master/workspace/vpdsl/tests/capellastudio.vpdsl.qualityassessment.tests/../../../releng/plugins/org.polarsys.capella.studio.releng.product/target/products/org.polarsys.capella.studio.releng.product/linux/gtk/x86_64
[INFO] Extracting RCPTT runner to /jobs/genie.capella/capella-studio-master/workspace/vpdsl/tests/capellastudio.vpdsl.qualityassessment.tests/target/runner
[INFO] Copying project contents to target directory...
[INFO] 
[INFO] --- rcptt-maven-plugin:2.5.0-SNAPSHOT:execute (default-execute) @ capellastudio.vpdsl.qualityassessment.tests ---
[INFO] Runner command line is /bin/sh -c cd /jobs/genie.capella/capella-studio-master/workspace/vpdsl/tests/capellastudio.vpdsl.qualityassessment.tests/target/runner/eclipse && /opt/public/common/java/oracle/jdk1.8.0_192_x64/jre/bin/java -Xms128m -Xmx256m -Dorg.eclipse.rcptt.runner.returnTestFailure=true -jar /jobs/genie.capella/capella-studio-master/workspace/vpdsl/tests/capellastudio.vpdsl.qualityassessment.tests/target/runner/eclipse/plugins/org.eclipse.equinox.launcher_1.5.300.v20190213-1655.jar -application org.eclipse.rcptt.runner.headless -runnerPlatform swt -data /jobs/genie.capella/capella-studio-master/workspace/vpdsl/tests/capellastudio.vpdsl.qualityassessment.tests/target/runner-workspace -aut /jobs/genie.capella/capella-studio-master/workspace/vpdsl/tests/capellastudio.vpdsl.qualityassessment.tests/../../../releng/plugins/org.polarsys.capella.studio.releng.product/target/products/org.polarsys.capella.studio.releng.product/linux/gtk/x86_64 -autWsPrefix /jobs/genie.capella/capella-studio-master/workspace/vpdsl/tests/capellastudio.vpdsl.qualityassessment.tests/target/aut-ws- -autConsolePrefix /jobs/genie.capella/capella-studio-master/workspace/vpdsl/tests/capellastudio.vpdsl.qualityassessment.tests/target/results/aut-console- -autVMArgs -javaagent:/opt/public/hipp/homes/genie.capella/.m2/repository/org/jacoco/org.jacoco.agent/0.7.9/org.jacoco.agent-0.7.9-runtime.jar=destfile=/jobs/genie.capella/capella-studio-master/workspace/vpdsl/tests/capellastudio.vpdsl.qualityassessment.tests/target/jacoco.exec -q7report /jobs/genie.capella/capella-studio-master/workspace/vpdsl/tests/capellastudio.vpdsl.qualityassessment.tests/target/results/capellastudio.vpdsl.qualityassessment.tests.report -htmlReport /jobs/genie.capella/capella-studio-master/workspace/vpdsl/tests/capellastudio.vpdsl.qualityassessment.tests/target/results/capellastudio.vpdsl.qualityassessment.tests.html -junitReport /jobs/genie.capella/capella-studio-master/workspace/vpdsl/tests/capellastudio.vpdsl.qualityassessment.tests/target/surefire-reports/TEST-capellastudio.vpdsl.qualityassessment.tests.xml -import /jobs/genie.capella/capella-studio-master/workspace/vpdsl/tests/capellastudio.vpdsl.qualityassessment.tests/target/projects/capellastudio.vpdsl.qualityassessment.tests -testOptions 'testExecTimeout=300;execTimeout=3600' -timeout 3600 -shutdownListenerPort 8424
[INFO] The execution timeout is set to 3600 seconds
[ERROR] Picked up JAVA_TOOL_OPTIONS: -Xmx2G -Djava.io.tmpdir=/tmp/genie.capella
[INFO] Started at Wed Jul 03 05:40:10 EDT 2019
[INFO] RCPTT Runner version: 2.5.0
[INFO] Initializing target platform...
[INFO] Begin task: Create AUT configuration
[INFO] progress: Resolving Target Contents...
[INFO] progress: Reading plug-ins
[INFO] progress: Fetching p2.index from platform:/plugin/org.eclipse.rcptt.updates.runtime.e4x/q7/
[INFO] progress: Adding repository platform:///plugin/org.eclipse.rcptt.updates.runtime.e4x/q7/
[INFO] progress: Fetching content.jar from platform:/plugin/org.eclipse.rcptt.updates.runtime.e4x/q7/
[INFO] progress: Fetching p2.index from platform:/plugin/org.eclipse.rcptt.updates.runtime.e4x/q7/
[INFO] progress: Fetching content.jar from platform:/plugin/org.eclipse.rcptt.updates.runtime.e4x/q7/
[INFO] progress: Fetching p2.index from platform:/plugin/org.eclipse.rcptt.updates.runtime.e4x/q7/
[INFO] progress: Fetching artifacts.jar from platform:/plugin/org.eclipse.rcptt.updates.runtime.e4x/q7/
[INFO] progress: The user operation is waiting for background work to complete.
[INFO] progress: Downloading org.antlr.runtime
[INFO] progress: The user operation is waiting for background work to complete.
[INFO] progress: Adding repository platform:///plugin/org.eclipse.rcptt.updates.aspectj.e44x/dependencies/
[INFO] progress: Fetching content.jar from platform:/plugin/org.eclipse.rcptt.updates.aspectj.e44x/dependencies/
[INFO] progress: Fetching artifacts.jar from platform:/plugin/org.eclipse.rcptt.updates.aspectj.e44x/dependencies/
[INFO] progress: Downloading org.aspectj.runtime
[INFO] progress: Downloading org.eclipse.equinox.weaving.hook
[INFO] progress: Downloading org.eclipse.equinox.weaving.aspectj
[INFO] progress: Downloading org.aspectj.weaver
[INFO] progress: The user operation is waiting for background work to complete.
[INFO] progress: Adding repository platform:///plugin/org.eclipse.rcptt.updates.kepler/dependencies/
[INFO] progress: Fetching content.jar from platform:/plugin/org.eclipse.rcptt.updates.kepler/dependencies/
[INFO] progress: Fetching artifacts.jar from platform:/plugin/org.eclipse.rcptt.updates.kepler/dependencies/
[INFO] progress: Downloading org.eclipse.emf.converter
[INFO] progress: Downloading org.eclipse.emf.codegen.ecore
[INFO] progress: Downloading org.eclipse.emf.mapping.ecore2ecore
[INFO] progress: Downloading org.eclipse.emf.ecore.change
[INFO] progress: The user operation is waiting for background work to complete.
[INFO] progress: Downloading org.eclipse.emf.validation
[INFO] progress: The user operation is waiting for background work to complete.
[INFO] progress: Downloading org.eclipse.emf.transaction.ui
[INFO] progress: The user operation is waiting for background work to complete.
[INFO] progress: Downloading org.eclipse.emf.mapping.ecore.editor
[INFO] progress: The user operation is waiting for background work to complete.
[INFO] progress: Downloading org.eclipse.emf.validation_root
[INFO] progress: The user operation is waiting for background work to complete.
[INFO] progress: Downloading org.eclipse.emf
[INFO] progress: Downloading org.eclipse.emf.ecore.change.edit
[INFO] progress: Downloading org.eclipse.emf.importer.ecore
[INFO] progress: The user operation is waiting for background work to complete.
[INFO] progress: Downloading org.eclipse.emf.codegen.ui
[INFO] progress: The user operation is waiting for background work to complete.
[INFO] progress: Downloading org.eclipse.emf.mapping.ecore2ecore.editor
[INFO] progress: The user operation is waiting for background work to complete.
[INFO] progress: Downloading org.eclipse.emf.ecore.xmi
[INFO] progress: Downloading org.eclipse.emf.mapping.ui
[INFO] progress: The user operation is waiting for background work to complete.
[INFO] progress: Downloading org.eclipse.emf.databinding.edit
[INFO] progress: The user operation is waiting for background work to complete.
[INFO] progress: Downloading org.eclipse.emf.mapping
[INFO] progress: The user operation is waiting for background work to complete.
[INFO] progress: Downloading org.eclipse.emf.ecore
[INFO] progress: The user operation is waiting for background work to complete.
[INFO] progress: Downloading org.eclipse.emf.codegen.ecore.ui
[INFO] progress: The user operation is waiting for background work to complete.
[INFO] progress: Downloading org.eclipse.emf.importer
[INFO] progress: The user operation is waiting for background work to complete.
[INFO] progress: Downloading org.eclipse.emf.mapping.ecore2xml.ui
[INFO] progress: The user operation is waiting for background work to complete.
[INFO] progress: Downloading org.eclipse.emf.databinding
[INFO] progress: The user operation is waiting for background work to complete.
[INFO] progress: Downloading org.eclipse.emf
[INFO] progress: The user operation is waiting for background work to complete.
[INFO] progress: Downloading org.eclipse.emf.ecore.edit
[INFO] progress: The user operation is waiting for background work to complete.
[INFO] progress: Downloading org.eclipse.emf.databinding
[INFO] progress: The user operation is waiting for background work to complete.
[INFO] progress: Downloading org.eclipse.emf.validation.ui
[INFO] progress: The user operation is waiting for background work to complete.
[INFO] progress: Downloading org.eclipse.emf.query
[INFO] progress: The user operation is waiting for background work to complete.
[INFO] progress: Downloading org.eclipse.emf.transaction
[INFO] progress: The user operation is waiting for background work to complete.
[INFO] progress: Downloading org.eclipse.emf.ecore.editor
[INFO] progress: The user operation is waiting for background work to complete.
[INFO] progress: Downloading org.eclipse.emf.codegen.ecore
[INFO] progress: The user operation is waiting for background work to complete.
[INFO] progress: Downloading org.eclipse.emf.common.ui
[INFO] progress: The user operation is waiting for background work to complete.
[INFO] progress: Downloading org.eclipse.emf.mapping.ecore2xml
[INFO] progress: The user operation is waiting for background work to complete.
[INFO] progress: Downloading org.eclipse.emf.mapping.ecore
[INFO] progress: The user operation is waiting for background work to complete.
[INFO] progress: Downloading org.eclipse.emf.ecore
[INFO] progress: The user operation is waiting for background work to complete.
[INFO] progress: Downloading org.eclipse.emf.query
[INFO] progress: The user operation is waiting for background work to complete.
[INFO] progress: Downloading org.eclipse.emf.mapping
[INFO] progress: The user operation is waiting for background work to complete.
[INFO] progress: Downloading org.eclipse.emf.edit.ui
[INFO] progress: The user operation is waiting for background work to complete.
[INFO] progress: Downloading org.eclipse.emf.exporter
[INFO] progress: The user operation is waiting for background work to complete.
[INFO] progress: Downloading org.eclipse.emf.mapping.ui
[INFO] progress: The user operation is waiting for background work to complete.
[INFO] progress: Downloading org.eclipse.emf.converter
[INFO] progress: The user operation is waiting for background work to complete.
[INFO] progress: Downloading org.eclipse.emf.transaction
[INFO] progress: The user operation is waiting for background work to complete.
[INFO] progress: Downloading org.eclipse.emf.transaction_root
[INFO] progress: The user operation is waiting for background work to complete.
[INFO] progress: Downloading org.eclipse.emf.databinding.edit
[INFO] progress: The user operation is waiting for background work to complete.
[INFO] progress: Downloading org.eclipse.emf.ecore.edit
[INFO] progress: The user operation is waiting for background work to complete.
[INFO] progress: Downloading org.eclipse.emf.validation
[INFO] progress: The user operation is waiting for background work to complete.
[INFO] progress: Downloading org.eclipse.emf.importer.rose
[INFO] progress: The user operation is waiting for background work to complete.
[INFO] progress: Downloading org.eclipse.emf.edit.ui
[INFO] progress: The user operation is waiting for background work to complete.
[INFO] progress: Downloading org.eclipse.emf.ant
[INFO] progress: The user operation is waiting for background work to complete.
[INFO] progress: Downloading org.eclipse.emf.importer.java
[INFO] progress: The user operation is waiting for background work to complete.
[INFO] progress: Downloading org.eclipse.emf.codegen.ecore.ui
[INFO] progress: The user operation is waiting for background work to complete.
[INFO] progress: Downloading org.eclipse.emf.edit
[INFO] progress: The user operation is waiting for background work to complete.
[INFO] progress: Downloading org.eclipse.emf.codegen
[INFO] progress: The user operation is waiting for background work to complete.
[INFO] progress: Downloading org.eclipse.emf.common.ui
[INFO] progress: The user operation is waiting for background work to complete.
[INFO] progress: Downloading org.eclipse.emf.common
[INFO] progress: Downloading org.eclipse.emf.ecore.editor
[INFO] progress: Downloading org.eclipse.emf.mapping.ecore
[INFO] progress: The user operation is waiting for background work to complete.
[INFO] progress: Downloading org.eclipse.emf.mapping.ecore.editor
[INFO] progress: The user operation is waiting for background work to complete.
[INFO] progress: Downloading org.eclipse.emf.validation.ui.ide
[INFO] progress: The user operation is waiting for background work to complete.
[INFO] progress: Downloading org.eclipse.emf.edit
[INFO] progress: The user operation is waiting for background work to complete.
[INFO] progress: Downloading org.eclipse.emf.common
[INFO] progress: The user operation is waiting for background work to complete.
[INFO] progress: Downloading org.eclipse.emf.codegen
[INFO] progress: The user operation is waiting for background work to complete.
[INFO] progress: Downloading org.eclipse.emf.query_root
[INFO] progress: The user operation is waiting for background work to complete.
[INFO] progress: Downloading org.eclipse.emf.codegen.ui
[INFO] progress: The user operation is waiting for background work to complete.
[INFO] progress: Adding repository platform:///plugin/org.eclipse.rcptt.module.nebula.updates/runtime/
[INFO] progress: Fetching content.jar from platform:/plugin/org.eclipse.rcptt.module.nebula.updates/runtime/
[INFO] progress: Fetching artifacts.jar from platform:/plugin/org.eclipse.rcptt.module.nebula.updates/runtime/
[INFO] progress: The user operation is waiting for background work to complete.
[INFO] progress: Adding repository platform:///plugin/org.eclipse.rcptt.module.testrail.updates/runtime/
[INFO] progress: Fetching content.jar from platform:/plugin/org.eclipse.rcptt.module.testrail.updates/runtime/
[INFO] progress: Fetching artifacts.jar from platform:/plugin/org.eclipse.rcptt.module.testrail.updates/runtime/
[INFO] progress: The user operation is waiting for background work to complete.
[INFO] progress: Adding repository platform:///plugin/org.eclipse.rcptt.updates.extra/dependencies/
[INFO] progress: Fetching content.jar from platform:/plugin/org.eclipse.rcptt.updates.extra/dependencies/
[INFO] progress: Fetching artifacts.jar from platform:/plugin/org.eclipse.rcptt.updates.extra/dependencies/
[INFO] progress: Downloading org.apache.poi.ooxml
[INFO] progress: Downloading org.apache.xmlbeans
[INFO] progress: Downloading org.apache.poi.ooxml.schemas
[INFO] progress: Downloading org.dom4j
[INFO] progress: The user operation is waiting for background work to complete.
[INFO] progress: Downloading org.apache.poi
[INFO] progress: The user operation is waiting for background work to complete.
[INFO] progress: Resolving Target Contents...
[INFO] progress: Reading plug-ins
[INFO] progress: Fetching p2.index from platform:/plugin/org.eclipse.rcptt.updates.runtime.e4x/q7/
[INFO] progress: Fetching content.jar from platform:/plugin/org.eclipse.rcptt.updates.runtime.e4x/q7/
[INFO] progress: Fetching content.jar from platform:/plugin/org.eclipse.rcptt.updates.aspectj.e44x/dependencies/
[INFO] progress: Fetching content.jar from platform:/plugin/org.eclipse.rcptt.updates.kepler/dependencies/
[INFO] progress: Fetching content.jar from platform:/plugin/org.eclipse.rcptt.module.nebula.updates/runtime/
[INFO] progress: Fetching content.jar from platform:/plugin/org.eclipse.rcptt.module.testrail.updates/runtime/
[INFO] progress: Fetching content.jar from platform:/plugin/org.eclipse.rcptt.updates.extra/dependencies/
[INFO] progress: Fetching p2.index from platform:/plugin/org.eclipse.rcptt.updates.runtime.e4x/q7/
[INFO] progress: Fetching artifacts.jar from platform:/plugin/org.eclipse.rcptt.updates.runtime.e4x/q7/
[INFO] progress: Fetching artifacts.jar from platform:/plugin/org.eclipse.rcptt.module.testrail.updates/runtime/
[INFO] progress: Fetching artifacts.jar from platform:/plugin/org.eclipse.rcptt.updates.kepler/dependencies/
[INFO] progress: Fetching artifacts.jar from platform:/plugin/org.eclipse.rcptt.module.nebula.updates/runtime/
[INFO] progress: Fetching artifacts.jar from platform:/plugin/org.eclipse.rcptt.updates.aspectj.e44x/dependencies/
[INFO] progress: Fetching artifacts.jar from platform:/plugin/org.eclipse.rcptt.updates.extra/dependencies/
[INFO] progress: Downloading org.eclipse.emf.validation_root
[INFO] progress: Downloading org.eclipse.emf.transaction_root
[INFO] progress: Downloading org.eclipse.emf.query_root
[INFO] progress: Installing org.eclipse.emf.ecore.change
[INFO] progress: Installing org.eclipse.rcptt.tesla.ui.ide
[INFO] progress: Installing org.eclipse.rcptt.core.swt
[INFO] progress: Installing org.eclipse.rcptt.ecl.debug.runtime
[INFO] progress: Installing org.eclipse.rcptt.ctx.parameters
[INFO] progress: Installing org.eclipse.rcptt.ecl.core
[INFO] progress: Installing org.eclipse.rcptt.tesla.recording.aspects.jface.text
[INFO] progress: Installing org.eclipse.rcptt.util
[INFO] progress: Installing org.eclipse.rcptt.ctx.resources.impl
[INFO] progress: Installing org.eclipse.rcptt.tesla.jface.databinding.aspects
[INFO] progress: Installing org.eclipse.emf.ecore.xmi
[INFO] progress: Installing org.eclipse.rcptt.tesla.swt
[INFO] progress: Installing org.eclipse.emf.mapping.feature.jar
[INFO] progress: Installing org.dom4j
[INFO] progress: Installing org.eclipse.emf.importer
[INFO] progress: Installing org.eclipse.emf.mapping.ecore2xml.ui
[INFO] progress: Installing org.eclipse.rcptt.testrail.ecl
[INFO] progress: Installing org.eclipse.rcptt.ecl.core.feature.group
[INFO] progress: Installing org.eclipse.emf.ecore.edit
[INFO] progress: Installing org.eclipse.rcptt.tesla.properties.view
[INFO] progress: Installing org.eclipse.emf.edit.feature.group
[INFO] progress: Installing org.eclipse.rcptt.ecl.data.apache.poi.impl
[INFO] progress: Installing org.eclipse.emf.transaction
[INFO] progress: Installing org.eclipse.rcptt.verifications.time
[INFO] progress: Installing org.eclipse.rcptt.tesla.canvas
[INFO] progress: Installing org.eclipse.emf.codegen.ecore.feature.jar
[INFO] progress: Installing org.eclipse.emf.mapping.ecore.editor.feature.group
[INFO] progress: Installing org.eclipse.emf.common.ui.feature.jar
[INFO] progress: Installing org.eclipse.rcptt.tesla.swt.e4x
[INFO] progress: Installing org.eclipse.rcptt.tesla.recording.core
[INFO] progress: Installing org.eclipse.emf.ecore.edit.feature.group
[INFO] progress: Installing org.eclipse.rcptt.runtime.feature.group
[INFO] progress: Installing org.eclipse.rcptt.ecl.server.feature.jar
[INFO] progress: Installing org.eclipse.rcptt.tesla.workbench.texteditor.aspects
[INFO] progress: Installing org.eclipse.emf.transaction.feature.jar
[INFO] progress: Installing org.eclipse.rcptt.tesla.jface.text
[INFO] progress: Installing org.eclipse.emf.ecore.edit.feature.jar
[INFO] progress: Installing org.eclipse.emf.validation
[INFO] progress: Installing org.eclipse.rcptt.tesla.recording.jface.text
[INFO] progress: Installing org.eclipse.rcptt.tesla.recording.workbench.texteditor
[INFO] progress: Installing org.eclipse.emf.edit.ui
[INFO] progress: Installing org.eclipse.rcptt.ecl.platform.feature.group
[INFO] progress: Installing org.eclipse.rcptt.tesla.ecl.feature.jar
[INFO] progress: Installing org.eclipse.emf.edit.feature.jar
[INFO] progress: Installing org.eclipse.rcptt.tesla.jobs.aspects
[INFO] progress: Installing org.eclipse.rcptt.module.nebula.runtime.feature.group
[INFO] progress: Installing org.eclipse.rcptt.tesla.jface.databinding
[INFO] progress: Installing org.eclipse.equinox.weaving.aspectj
[INFO] progress: Installing org.eclipse.rcptt.tesla.gef.aspects
[INFO] progress: Installing org.eclipse.emf.validation.ui.ide
[INFO] progress: Installing org.eclipse.emf.edit
[INFO] progress: Installing org.eclipse.rcptt.tesla.variables
[INFO] progress: Installing org.eclipse.rcptt.ecl.platform.ui
[INFO] progress: Installing org.eclipse.rcptt.testrail.ecl.impl
[INFO] progress: Installing org.eclipse.rcptt.watson.aspects.jobs
[INFO] progress: Installing org.eclipse.rcptt.tesla.recording.gef
[INFO] progress: Installing org.eclipse.rcptt.resources.impl
[INFO] progress: Installing org.eclipse.emf.converter.feature.group
[INFO] progress: Installing org.eclipse.emf.codegen.ecore
[INFO] progress: Installing org.eclipse.emf.validation.feature.jar
[INFO] progress: Installing org.eclipse.emf.transaction.ui
[INFO] progress: Installing org.eclipse.emf.databinding.edit.feature.group
[INFO] progress: Installing org.eclipse.rcptt.tesla.recording.gmf
[INFO] progress: Installing org.eclipse.rcptt.tesla.runtime.feature.group
[INFO] progress: Installing org.eclipse.rcptt.tesla.jdt
[INFO] progress: Installing org.eclipse.rcptt.ctx.parameters.impl
[INFO] progress: Installing org.eclipse.rcptt.tesla.recording.canvas
[INFO] progress: Installing org.eclipse.emf.common.ui.feature.group
[INFO] progress: Installing org.eclipse.rcptt.ecl.parser
[INFO] progress: Installing org.apache.poi.ooxml.schemas
[INFO] progress: Installing org.eclipse.rcptt.reporting
[INFO] progress: Installing org.eclipse.emf.ecore.change.edit
[INFO] progress: Installing org.eclipse.emf.mapping.ecore2ecore.editor
[INFO] progress: Installing org.antlr.runtime
[INFO] progress: Installing org.eclipse.rcptt.ecl.platform.feature.jar
[INFO] progress: Installing org.eclipse.rcptt.ecl.interop
[INFO] progress: Installing org.eclipse.rcptt.ctx.preferences.aspects
[INFO] progress: Installing org.eclipse.rcptt.ctx.script.impl
[INFO] progress: Installing org.eclipse.emf.databinding.edit
[INFO] progress: Installing org.eclipse.rcptt.verifications.text
[INFO] progress: Installing org.eclipse.rcptt.tesla.recording.core.ecl
[INFO] progress: Installing org.eclipse.rcptt.watson.core
[INFO] progress: Installing org.eclipse.rcptt.watson.runtime.feature.jar
[INFO] progress: Installing org.eclipse.emf.edit.ui.feature.group
[INFO] progress: Installing org.eclipse.rcptt.module.nebula.runtime.feature.jar
[INFO] progress: Installing org.eclipse.rcptt.tesla.recording.aspects.swt
[INFO] progress: Installing org.eclipse.emf
[INFO] progress: Installing org.eclipse.rcptt.runtime.feature.jar
[INFO] progress: Installing org.eclipse.rcptt.core.scenario
[INFO] progress: Installing org.eclipse.rcptt.ctx.preferences.impl
[INFO] progress: Installing org.eclipse.emf.validation.ui
[INFO] progress: Installing org.eclipse.rcptt.util.resources
[INFO] progress: Installing org.eclipse.emf.codegen.ecore.feature.group
[INFO] progress: Installing org.apache.xmlbeans
[INFO] progress: Installing org.eclipse.rcptt.runtime.ui
[INFO] progress: Installing org.eclipse.emf.mapping.ecore.feature.jar
[INFO] progress: Installing org.eclipse.rcptt.verifications.resources
[INFO] progress: Installing org.eclipse.rcptt.logging
[INFO] progress: Installing org.eclipse.emf.mapping.feature.group
[INFO] progress: Installing org.eclipse.equinox.weaving.hook
[INFO] progress: Installing org.eclipse.emf.edit.ui.feature.jar
[INFO] progress: Installing org.eclipse.rcptt.tesla.ecl.feature.group
[INFO] progress: Installing org.eclipse.rcptt.tesla.nebula.ecl.impl
[INFO] progress: Installing org.eclipse.rcptt.ecl.core.feature.jar
[INFO] progress: Installing org.eclipse.emf.mapping.ui
[INFO] progress: Installing org.eclipse.rcptt.tesla.recording.aspects.gef
[INFO] progress: Installing org.eclipse.rcptt.ctx.filesystem.impl
[INFO] progress: Installing org.eclipse.rcptt.tesla.recording.aspects.gmf
[INFO] progress: Installing org.eclipse.rcptt.ecl.server.tcp
[INFO] progress: Installing org.eclipse.rcptt.verifications.text.impl
[INFO] progress: Installing org.eclipse.rcptt.tesla.feature.group
[INFO] progress: Installing org.eclipse.emf.importer.java
[INFO] progress: Installing org.eclipse.rcptt.tesla.feature.jar
[INFO] progress: Installing org.eclipse.rcptt.tesla.recording.swt
[INFO] progress: Installing org.eclipse.emf.codegen.feature.jar
[INFO] progress: Installing org.eclipse.emf.common
[INFO] progress: Installing org.eclipse.rcptt.ecl.dispatch
[INFO] progress: Installing org.eclipse.rcptt.watson.feature.jar
[INFO] progress: Installing org.eclipse.emf.mapping.ecore
[INFO] progress: Installing org.eclipse.emf.mapping.ecore.editor.feature.jar
[INFO] progress: Installing org.eclipse.emf.common.feature.jar
[INFO] progress: Installing org.eclipse.rcptt.verifications.tree
[INFO] progress: Installing org.eclipse.rcptt.verifications.tree.impl
[INFO] progress: Installing org.eclipse.emf.mapping.ecore2ecore
[INFO] progress: Installing org.eclipse.rcptt.forms.impl
[INFO] progress: Installing org.eclipse.rcptt.ctx.debug
[INFO] progress: Installing org.eclipse.emf.mapping.ecore.editor
[INFO] progress: Installing org.eclipse.emf.validation_root
[INFO] progress: Installing org.eclipse.emf.feature.jar
[INFO] progress: Installing file:/jobs/genie.rcptt/rcptt-all/workspace/modules/testrail/runtime-site/target/site/site.xml.rcptt
[INFO] progress: Installing org.eclipse.rcptt.core
[INFO] progress: Installing org.eclipse.rcptt.tesla.ecl
[INFO] progress: Installing org.eclipse.rcptt.watson.aspects.swt
[INFO] progress: Installing org.eclipse.emf.importer.ecore
[INFO] progress: Installing org.eclipse.rcptt.tesla.recording.aspects.workbench.texteditor
[INFO] progress: Installing org.eclipse.emf.codegen.ecore.ui.feature.group
[INFO] progress: Installing org.eclipse.rcptt.tesla.gmf.aspects
[INFO] progress: Installing org.eclipse.rcptt.core.swt.win64
[INFO] progress: Installing org.eclipse.emf.codegen.ecore.ui.feature.jar
[INFO] progress: Installing org.eclipse.rcptt.tesla.recording.aspects.forms
[INFO] progress: Installing org.eclipse.rcptt.tesla.jface.text.reconciler.aspects
[INFO] progress: Installing org.eclipse.rcptt.ctx.debug.impl
[INFO] progress: Installing file:/jobs/genie.rcptt/rcptt-all/workspace/modules/nebula/runtime-site/target/site/site.xml.rcptt
[INFO] progress: Installing org.eclipse.rcptt.tesla.jface.fragment
[INFO] progress: Installing org.eclipse.rcptt.ctx.workbench.impl
[INFO] progress: Installing org.eclipse.rcptt.tesla.core
[INFO] progress: Installing org.eclipse.rcptt.watson.jface
[INFO] progress: Installing org.eclipse.rcptt.tesla.workbench.aspects.e4x
[INFO] progress: Installing org.eclipse.rcptt.ecl.perf
[INFO] progress: Installing org.eclipse.rcptt.ctx.resources
[INFO] progress: Installing org.eclipse.rcptt.tesla.jdt.aspects
[INFO] progress: Installing org.eclipse.rcptt.tesla.swt.fragment
[INFO] progress: Installing org.eclipse.emf.feature.group
[INFO] progress: Installing org.eclipse.rcptt.tesla.nebula.ecl
[INFO] progress: Installing org.eclipse.rcptt.resources
[INFO] progress: Installing org.eclipse.emf.mapping.ecore2xml
[INFO] progress: Installing org.eclipse.rcptt.module.testrail.runtime.feature.group
[INFO] progress: Installing org.eclipse.rcptt.tesla.core.context
[INFO] progress: Installing org.eclipse.rcptt.tesla.jface.text.aspects
[INFO] progress: Installing org.eclipse.rcptt.verifications.resources.impl
[INFO] progress: Installing org.eclipse.rcptt.core.launching
[INFO] progress: Installing org.eclipse.emf.mapping
[INFO] progress: Installing org.eclipse.rcptt.tesla.jface.aspects
[INFO] progress: Installing org.eclipse.rcptt.tesla.workbench.texteditor
[INFO] progress: Installing org.eclipse.rcptt.tesla.runtime.feature.jar
[INFO] progress: Installing org.eclipse.rcptt.tesla.nebula
[INFO] progress: Installing org.eclipse.rcptt.tesla.swt.aspects
[INFO] progress: Installing org.eclipse.emf.exporter
[INFO] progress: Installing org.eclipse.emf.converter.feature.jar
[INFO] progress: Installing org.eclipse.rcptt.ecl.platform.ui.feature.group
[INFO] progress: Installing org.eclipse.rcptt.tesla.ecl.runtime.feature.group
[INFO] progress: Installing org.eclipse.rcptt.tesla.recording.draw2d
[INFO] progress: Installing org.eclipse.emf.transaction_root
[INFO] progress: Installing org.eclipse.rcptt.ecl.data
[INFO] progress: Installing org.eclipse.rcptt.ecl.client.tcp
[INFO] progress: Installing org.eclipse.emf.databinding.edit.feature.jar
[INFO] progress: Installing org.eclipse.rcptt.ctx.workbench
[INFO] progress: Installing org.eclipse.rcptt.ecl.operations
[INFO] progress: Installing org.eclipse.rcptt.ecl.server.feature.group
[INFO] progress: Installing org.eclipse.rcptt.verifications.log
[INFO] progress: Installing org.eclipse.emf.ant
[INFO] progress: Installing org.aspectj.runtime
[INFO] progress: Installing org.eclipse.emf.codegen.ecore.ui
[INFO] progress: Installing org.apache.poi
[INFO] progress: Installing org.eclipse.rcptt.ecl.platform.ui.feature.jar
[INFO] progress: Installing org.eclipse.rcptt.util.swt
[INFO] progress: Installing org.eclipse.emf.transaction.feature.group
[INFO] progress: Installing org.eclipse.emf.codegen
[INFO] progress: Installing org.eclipse.rcptt.expandbar.runtime
[INFO] progress: Installing org.eclipse.rcptt.tesla.core.am
[INFO] progress: Installing org.eclipse.rcptt.ctx.filesystem
[INFO] progress: Installing org.eclipse.emf.query_root
[INFO] progress: Installing org.eclipse.emf.codegen.ui
[INFO] progress: Installing org.eclipse.emf.query.feature.group
[INFO] progress: Installing org.eclipse.emf.converter
[INFO] progress: Installing org.eclipse.emf.ecore.feature.group
[INFO] progress: Installing org.eclipse.rcptt.verifications.time.impl
[INFO] progress: Installing org.eclipse.rcptt.tesla.nebula.impl
[INFO] progress: Installing org.eclipse.emf.mapping.ecore.feature.group
[INFO] progress: Installing org.eclipse.emf.mapping.ui.feature.group
[INFO] progress: Installing org.eclipse.rcptt.ctx.group.impl
[INFO] progress: Installing org.eclipse.rcptt.tesla.gmf
[INFO] progress: Installing org.eclipse.emf.codegen.feature.group
[INFO] progress: Installing org.eclipse.rcptt.ecl.data.apache.poi
[INFO] progress: Installing org.eclipse.emf.codegen.ui.feature.jar
[INFO] progress: Installing org.eclipse.rcptt.tesla.gef
[INFO] progress: Installing org.eclipse.emf.ecore.editor.feature.group
[INFO] progress: Installing 201906250706.Default
[INFO] progress: Installing org.eclipse.emf.mapping.ui.feature.jar
[INFO] progress: Installing org.apache.poi.ooxml
[INFO] progress: Installing org.eclipse.rcptt.tesla.ecl.impl
[INFO] progress: Installing org.eclipse.emf.ecore
[INFO] progress: Installing org.eclipse.emf.common.feature.group
[INFO] progress: Installing org.eclipse.rcptt.core.ecl.debug
[INFO] progress: Installing org.eclipse.rcptt.tesla.ecl.runtime.feature.jar
[INFO] progress: Installing org.eclipse.rcptt.watson.runtime.feature.group
[INFO] progress: Installing org.eclipse.rcptt.tesla.jface.databinding.observable.aspects
[INFO] progress: Installing org.eclipse.emf.databinding
[INFO] progress: Installing org.eclipse.emf.databinding.feature.group
[INFO] progress: Installing org.eclipse.rcptt.ctx.script
[INFO] progress: Installing org.eclipse.rcptt.tesla.ui.ide.aspects
[INFO] progress: Installing org.eclipse.rcptt.ecl.filesystem
[INFO] progress: Installing org.eclipse.emf.databinding.feature.jar
[INFO] progress: Installing org.eclipse.rcptt.ctx.group
[INFO] progress: Installing org.eclipse.emf.query.feature.jar
[INFO] progress: Installing org.eclipse.rcptt.verifications
[INFO] progress: Installing org.eclipse.rcptt.expandbar
[INFO] progress: Installing org.eclipse.emf.ecore.editor.feature.jar
[INFO] progress: Installing org.eclipse.rcptt.ctx.preferences
[INFO] progress: Installing org.eclipse.emf.ecore.feature.jar
[INFO] progress: Installing org.aspectj.weaver
[INFO] progress: Installing org.eclipse.emf.query
[INFO] progress: Installing org.eclipse.emf.codegen.ui.feature.group
[INFO] progress: Installing org.eclipse.rcptt.ctx.workbench.aspect
[INFO] progress: Installing org.eclipse.rcptt.core.ecl.core
[INFO] progress: Installing org.eclipse.rcptt.tesla.recording.aspects.workbench
[INFO] progress: Installing org.eclipse.emf.validation.feature.group
[INFO] progress: Installing org.eclipse.rcptt.tesla.recording.aspects.draw2d
[INFO] progress: Installing org.eclipse.rcptt.module.testrail.runtime.feature.jar
[INFO] progress: Installing org.eclipse.rcptt.ecl.platform
[INFO] progress: Installing org.eclipse.rcptt.verifications.log.impl
[INFO] progress: Installing org.eclipse.emf.importer.rose
[INFO] progress: Installing org.eclipse.rcptt.tesla.recording.nebula
[INFO] progress: Installing org.eclipse.rcptt.watson.feature.group
[INFO] progress: Installing org.eclipse.emf.common.ui
[INFO] progress: Installing org.eclipse.rcptt.ecl.doc
[INFO] progress: Installing org.eclipse.emf.ecore.editor
[INFO] progress: Installing org.eclipse.rcptt.watson.jobs
[INFO] progress: Installing org.eclipse.rcptt.tesla.recording.aspects.jface
[INFO] progress: Downloading org.eclipse.emf.validation_root
[INFO] progress: Downloading org.eclipse.emf.transaction_root
[INFO] progress: Downloading org.eclipse.emf.query_root
[INFO] progress: Preparing to commit the provisioning operation.
[INFO] progress: Committing the provisioning operation.
[INFO] progress: Reading plug-ins
[INFO] Target platform is valid.
[INFO] Looking for tests...
[INFO] Existing projects in workspace:
[INFO]     <none>
[INFO] Importing projects to workspace:
[INFO] Refreshing projects:
[INFO]     /jobs/genie.capella/capella-studio-master/workspace/vpdsl/tests/capellastudio.vpdsl.qualityassessment.tests/target/projects/capellastudio.vpdsl.qualityassessment.tests... OK
[INFO] Refreshing projects:
[INFO]     capellastudio.vpdsl.qualityassessment.tests... OK
[INFO] Searching for tests in projects:
[INFO]     capellastudio.vpdsl.qualityassessment.tests... 
[INFO] Complete OK
[INFO] Testcase Artifacts:10
[INFO] AUT-0:Launching
[INFO] AUT-0:Product: org.polarsys.capella.studio.product.CapellaStudio
[INFO] AUT-0:Application: org.polarsys.capella.studio.product.application
[INFO] AUT-0:Architecture: x86_64
[INFO] 64bit arch is selected because AUT uses launcher library
[INFO] 	"plugins/org.eclipse.equinox.launcher.gtk.linux.x86_64_1.1.1000.v20190125-2016" specified in config file: eclipse.ini
[INFO] /jobs/genie.capella/capella-studio-master/workspace/vpdsl/tests/capellastudio.vpdsl.qualityassessment.tests/target/aut-ws-0: AUT arguments: -os ${target.os} -arch ${target.arch} -consoleLog
[INFO] /jobs/genie.capella/capella-studio-master/workspace/vpdsl/tests/capellastudio.vpdsl.qualityassessment.tests/target/aut-ws-0: AUT VM arguments: -Dosgi.requiredJavaVersion=1.8 -Xms512m -Xmx2048m -XX:PermSize=256M -XX:-UseGCOverheadLimit -javaagent:/opt/public/hipp/homes/genie.capella/.m2/repository/org/jacoco/org.jacoco.agent/0.7.9/org.jacoco.agent-0.7.9-runtime.jar=destfile=/jobs/genie.capella/capella-studio-master/workspace/vpdsl/tests/capellastudio.vpdsl.qualityassessment.tests/target/jacoco.exec -XX:MaxPermSize=128m
[INFO] Pass 1 (10) processed. 0 failed. spent: 0:37, 1:38 mins remaining. Aspect - Data. time: 36932ms 
[INFO] Fail 2 (10) processed. 1 failed. spent: 1:03, 1:50 mins remaining. Aspect - Diagram. time: 25007ms  Cause: The Item "[platform:/resource/org.polarsys.capella.vp.qualityassessment.vpdsl/model/QualityAssessment.vpdesc, Viewpoint QualityAssessment, Diagram Set QualityAssessment.diagram, Diagram Extension QualityAssessment_PAB]" could not be found.
[INFO] Pass 3 (10) processed. 1 failed. spent: 1:20, 1:36 mins remaining. Aspect - Releng. time: 16819ms 
[INFO] Pass 4 (10) processed. 1 failed. spent: 1:39, 1:22 mins remaining. Aspect - Service. time: 17703ms 
[INFO] Pass 5 (10) processed. 1 failed. spent: 2:00, 1:08 mins remaining. Aspect - UI. time: 20652ms 
[INFO] Pass 6 (10) processed. 1 failed. spent: 2:40, 1:00 mins remaining. Bug - vpui-1275. time: 39638ms 
[INFO] Pass 7 (10) processed. 1 failed. spent: 2:52, 0:38 mins remaining. New Project creation. time: 11212ms 
[INFO] Pass 8 (10) processed. 1 failed. spent: 3:13, 0:19 mins remaining. Reverse from Ecore. time: 20913ms 
[INFO] Fail 9 (10) processed. 2 failed. spent: 5:29, 0:00 mins remaining. Viewpoint Generation and Packaging. time: 134536ms  Cause: Dropins is not generated by the "Generate and Package Viewpoint" action
[INFO] Pass 10 (10) processed. 2 failed. spent: 6:52, 0:00 mins remaining. Viewpoint Generation. time: 81854ms 
[INFO] Failed Tests:
[INFO] Aspect - Diagram
[INFO] Viewpoint Generation and Packaging
[INFO] Process terminated. Shut down AUTs
[INFO] Runner exit code is: 56
[ERROR] There are test failures
[INFO] 
[INFO] --- rcptt-maven-plugin:2.5.0-SNAPSHOT:package (default-package) @ capellastudio.vpdsl.qualityassessment.tests ---
[INFO] Building zip: /jobs/genie.capella/capella-studio-master/workspace/vpdsl/tests/capellastudio.vpdsl.qualityassessment.tests/target/projects/capellastudio.vpdsl.qualityassessment.tests-1.4.0-SNAPSHOT.zip
[INFO] Building zip: /jobs/genie.capella/capella-studio-master/workspace/vpdsl/tests/capellastudio.vpdsl.qualityassessment.tests/target/org.polarsys.capella-capellastudio.vpdsl.qualityassessment.tests-1.4.0-SNAPSHOT-result.zip
[INFO] aut1/out.txt already added, skipping
[INFO] 
[INFO] --- tycho-source-plugin:1.1.0:plugin-source (plugin-source) @ capellastudio.vpdsl.qualityassessment.tests ---
[INFO] 
[INFO] --- tycho-source-feature-plugin:1.1.0:source-feature (source-feature) @ capellastudio.vpdsl.qualityassessment.tests ---
[INFO] 
[INFO] ---< org.polarsys.capella:org.polarsys.capella.studio.test.feature >----
[INFO] Building org.polarsys.capella.studio.test.feature 1.4.0-SNAPSHOT [31/33]
[INFO] --------------------------[ eclipse-feature ]---------------------------
[INFO] 
[INFO] --- maven-clean-plugin:2.5:clean (default-clean) @ org.polarsys.capella.studio.test.feature ---
[INFO] Deleting /jobs/genie.capella/capella-studio-master/workspace/tests/features/org.polarsys.capella.studio.test.feature/target
[INFO] 
[INFO] --- tycho-packaging-plugin:1.1.0:build-qualifier-aggregator (default-build-qualifier-aggregator) @ org.polarsys.capella.studio.test.feature ---
[INFO] The project's OSGi version is 1.4.0.201907030848
[INFO] 
[INFO] --- tycho-packaging-plugin:1.1.0:validate-id (default-validate-id) @ org.polarsys.capella.studio.test.feature ---
[INFO] 
[INFO] --- tycho-packaging-plugin:1.1.0:validate-version (default-validate-version) @ org.polarsys.capella.studio.test.feature ---
[INFO] 
[INFO] --- jacoco-maven-plugin:0.7.9:prepare-agent (default) @ org.polarsys.capella.studio.test.feature ---
[INFO] failsafeArgline set to -javaagent:/opt/public/hipp/homes/genie.capella/.m2/repository/org/jacoco/org.jacoco.agent/0.7.9/org.jacoco.agent-0.7.9-runtime.jar=destfile=/jobs/genie.capella/capella-studio-master/workspace/tests/features/org.polarsys.capella.studio.test.feature/target/jacoco.exec
[INFO] 
[INFO] --- target-platform-configuration:1.1.0:target-platform (default-target-platform) @ org.polarsys.capella.studio.test.feature ---
[INFO] 
[INFO] --- tycho-packaging-plugin:1.1.0:package-feature (default-package-feature) @ org.polarsys.capella.studio.test.feature ---
[INFO] Building jar: /jobs/genie.capella/capella-studio-master/workspace/tests/features/org.polarsys.capella.studio.test.feature/target/org.polarsys.capella.studio.test.feature-1.4.0-SNAPSHOT.jar
[INFO] 
[INFO] --- tycho-p2-plugin:1.1.0:p2-metadata-default (default-p2-metadata-default) @ org.polarsys.capella.studio.test.feature ---
[INFO] 
[INFO] --- tycho-p2-plugin:1.1.0:feature-p2-metadata (default-feature-p2-metadata) @ org.polarsys.capella.studio.test.feature ---
[INFO] 
[INFO] --- tycho-source-plugin:1.1.0:plugin-source (plugin-source) @ org.polarsys.capella.studio.test.feature ---
[INFO] 
[INFO] --- tycho-source-feature-plugin:1.1.0:source-feature (source-feature) @ org.polarsys.capella.studio.test.feature ---
[INFO] Building jar: /jobs/genie.capella/capella-studio-master/workspace/tests/features/org.polarsys.capella.studio.test.feature/target/org.polarsys.capella.studio.test.feature-1.4.0-SNAPSHOT-sources-feature.jar
[INFO] 
[INFO] --- tycho-p2-plugin:1.1.0:p2-metadata (p2-metadata) @ org.polarsys.capella.studio.test.feature ---
[INFO] 
[INFO] --< org.polarsys.capella:org.polarsys.capella.studio.releng.aggregator.tests >--
[INFO] Building Capella Sudio tests Aggregator Module 1.4.0-SNAPSHOT    [32/33]
[INFO] --------------------------------[ pom ]---------------------------------
[INFO] 
[INFO] --- maven-clean-plugin:2.5:clean (default-clean) @ org.polarsys.capella.studio.releng.aggregator.tests ---
[INFO] 
[INFO] --- jacoco-maven-plugin:0.7.9:prepare-agent (default) @ org.polarsys.capella.studio.releng.aggregator.tests ---
[INFO] failsafeArgline set to -javaagent:/opt/public/hipp/homes/genie.capella/.m2/repository/org/jacoco/org.jacoco.agent/0.7.9/org.jacoco.agent-0.7.9-runtime.jar=destfile=/jobs/genie.capella/capella-studio-master/workspace/releng/plugins/org.polarsys.capella.studio.releng.aggregator.tests/target/jacoco.exec
[INFO] 
[INFO] --- tycho-source-plugin:1.1.0:plugin-source (plugin-source) @ org.polarsys.capella.studio.releng.aggregator.tests ---
[INFO] 
[INFO] --- tycho-source-feature-plugin:1.1.0:source-feature (source-feature) @ org.polarsys.capella.studio.releng.aggregator.tests ---
[INFO] 
[INFO] ----< org.polarsys.capella:org.polarsys.capella.studio.releng.root >----
[INFO] Building Capella Studio Root 1.4.0-SNAPSHOT                      [33/33]
[INFO] --------------------------------[ pom ]---------------------------------
[INFO] 
[INFO] --- maven-clean-plugin:2.5:clean (default-clean) @ org.polarsys.capella.studio.releng.root ---
[INFO] 
[INFO] --- jacoco-maven-plugin:0.7.9:prepare-agent (default) @ org.polarsys.capella.studio.releng.root ---
[INFO] failsafeArgline set to -javaagent:/opt/public/hipp/homes/genie.capella/.m2/repository/org/jacoco/org.jacoco.agent/0.7.9/org.jacoco.agent-0.7.9-runtime.jar=destfile=/jobs/genie.capella/capella-studio-master/workspace/target/jacoco.exec
[INFO] 
[INFO] --- tycho-source-plugin:1.1.0:plugin-source (plugin-source) @ org.polarsys.capella.studio.releng.root ---
[INFO] 
[INFO] --- tycho-source-feature-plugin:1.1.0:source-feature (source-feature) @ org.polarsys.capella.studio.releng.root ---
[INFO] ------------------------------------------------------------------------
[INFO] Reactor Summary for Capella Studio Root 1.4.0-SNAPSHOT:
[INFO] 
[INFO] Capella Studio ..................................... SUCCESS [  1.919 s]
[INFO] capellastudio ...................................... SUCCESS [  0.797 s]
[INFO] org.polarsys.capella.extension.genchain.model ...... SUCCESS [  2.997 s]
[INFO] org.polarsys.capella.extension.genchain ............ SUCCESS [  0.768 s]
[INFO] org.polarsys.capella.extension.genchain.model.edit . SUCCESS [  0.288 s]
[INFO] org.polarsys.capella.extension.tools ............... SUCCESS [  1.277 s]
[INFO] org.polarsys.capella.extension.tools.ui ............ SUCCESS [  0.833 s]
[INFO] org.polarsys.capella.studio.product ................ SUCCESS [  0.448 s]
[INFO] org.polarsys.capella.ad.viewpoint.dsl.generation.ui  SUCCESS [  0.961 s]
[INFO] org.polarsys.capella.ta ............................ SUCCESS [  0.512 s]
[INFO] org.polarsys.capella.ta.viewpoint.dsl.extension .... SUCCESS [  0.169 s]
[INFO] org.polarsys.capella.cdo.ta.definition ............. SUCCESS [  0.615 s]
[INFO] org.polarsys.capella.cdo.ta.ext .................... SUCCESS [  0.455 s]
[INFO] org.polarsys.capella.extension.sdk.feature ......... SUCCESS [  2.552 s]
[INFO] org.polarsys.capella.studio.product.feature ........ SUCCESS [  0.715 s]
[INFO] org.polarsys.capella.ta.viewpoint.dsl.feature ...... SUCCESS [  1.275 s]
[INFO] org.polarsys.capella.cdo.ta.definition.feature ..... SUCCESS [  0.897 s]
[INFO] org.polarsys.capella.studio.releng.eclipse.feature . SUCCESS [  0.985 s]
[INFO] org.polarsys.capella.studio.releng.capella.feature . SUCCESS [  0.774 s]
[INFO] org.polarsys.capella.studio.releng.kitalpha.feature  SUCCESS [  0.589 s]
[INFO] org.polarsys.capella.studio.releng.updatesite ...... SUCCESS [02:09 min]
[INFO] Capella studio Product ............................. SUCCESS [15:21 min]
[INFO] Capella Sudio Aggregator Module .................... SUCCESS [  0.010 s]
[INFO] org.polarsys.capella.studio.test ................... SUCCESS [  0.394 s]
[INFO] org.polarsys.capella.extension.rcptt ............... SUCCESS [04:07 min]
[INFO] org.polarsys.capella.ad.viewpoint.dsl.tests ........ SUCCESS [04:00 min]
[INFO] org.polarsys.capella.gen.doc.tests ................. SUCCESS [02:05 min]
[INFO] org.polarsys.capella.studio.ad.viewpoint.rcptt ..... SUCCESS [06:18 min]
[INFO] capellastudio.vpdsl.qualityassessment.reverse.tests  SUCCESS [02:45 min]
[INFO] capellastudio.vpdsl.qualityassessment.tests ........ SUCCESS [08:41 min]
[INFO] org.polarsys.capella.studio.test.feature ........... SUCCESS [  0.518 s]
[INFO] Capella Sudio tests Aggregator Module .............. SUCCESS [  0.005 s]
[INFO] Capella Studio Root ................................ SUCCESS [  0.004 s]
[INFO] ------------------------------------------------------------------------
[INFO] BUILD SUCCESS
[INFO] ------------------------------------------------------------------------
[INFO] Total time:  59:44 min
[INFO] Finished at: 2019-07-03T05:48:39-04:00
[INFO] ------------------------------------------------------------------------
[workspace] $ /bin/sh -xe /tmp/genie.capella/jenkins183552739233421512.sh
+ echo 'Cleaning old nightly'
Cleaning old nightly
+ /bin/sh /home/hudson/genie.capella/.jenkins/jobs/capella-studio-master/workspace/releng/plugins/org.polarsys.capella.studio.releng.publish/scripts/cleaner-UpdateProductsNightly.sh
List of file and folder in /home/data/httpd/download.polarsys.org/capella/capellastudio/updates/nightly/sdk before delete
total 12
drwxrwsr-x 1 genie.capella polarsys.polarsys.capella  236 Jul  3 04:48 .
drwxr-sr-x 1 genie.capella polarsys.polarsys.capella  234 Jul  3 04:48 ..
drwxrwsr-x 1 genie.capella polarsys.polarsys.capella   40 Jul  3 04:48 extension
drwxrwsr-x 1 genie.capella polarsys.polarsys.capella   10 Jul  3 04:48 gendoc
drwxrwsr-x 1 genie.capella polarsys.polarsys.capella  136 Jul  3 05:41 .git
-rw-rw-r-- 1 genie.capella polarsys.polarsys.capella  928 Jul  3 04:48 .gitignore
drwxrwsr-x 1 genie.capella polarsys.polarsys.capella   28 Jul  3 04:48 .mvn
-rw-rw-r-- 1 genie.capella polarsys.polarsys.capella 1562 Jul  3 04:48 pom.xml
drwxrwsr-x 1 genie.capella polarsys.polarsys.capella   30 Jul  3 04:48 product
drwxrwsr-x 1 genie.capella polarsys.polarsys.capella   30 Jul  3 04:48 releng
-rw-rw-r-- 1 genie.capella polarsys.polarsys.capella 1940 Jul  3 04:48 sonar-project.properties
drwxrwsr-x 1 genie.capella polarsys.polarsys.capella   30 Jul  3 04:48 tests
drwxrwsr-x 1 genie.capella polarsys.polarsys.capella   40 Jul  3 04:48 vpdsl
-rw-rw-r-- 1 genie.capella polarsys.polarsys.capella    0 Jul  3 04:48 .Xauthority-2455149172481139101
List of file and folder in /home/data/httpd/download.polarsys.org/capella/capellastudio/updates/nightly/sdk after delete
total 20
drwxrwsr-x 1 genie.capella polarsys.polarsys.capella  306 Jul  3 05:48 .
drwxr-sr-x 1 genie.capella polarsys.polarsys.capella  234 Jul  3 04:48 ..
-rw-rw-r-- 1 genie.capella polarsys.polarsys.capella 1006 Jul  3 05:48 allsdk.txt
drwxrwsr-x 1 genie.capella polarsys.polarsys.capella   40 Jul  3 04:48 extension
drwxrwsr-x 1 genie.capella polarsys.polarsys.capella   10 Jul  3 04:48 gendoc
drwxrwsr-x 1 genie.capella polarsys.polarsys.capella  136 Jul  3 05:41 .git
-rw-rw-r-- 1 genie.capella polarsys.polarsys.capella  928 Jul  3 04:48 .gitignore
-rw-rw-r-- 1 genie.capella polarsys.polarsys.capella 1006 Jul  3 05:48 keptsdk.txt
drwxrwsr-x 1 genie.capella polarsys.polarsys.capella   28 Jul  3 04:48 .mvn
-rw-rw-r-- 1 genie.capella polarsys.polarsys.capella 1562 Jul  3 04:48 pom.xml
drwxrwsr-x 1 genie.capella polarsys.polarsys.capella   30 Jul  3 04:48 product
drwxrwsr-x 1 genie.capella polarsys.polarsys.capella   30 Jul  3 04:48 releng
-rw-rw-r-- 1 genie.capella polarsys.polarsys.capella    0 Jul  3 05:48 removedsdk.txt
-rw-rw-r-- 1 genie.capella polarsys.polarsys.capella 1940 Jul  3 04:48 sonar-project.properties
drwxrwsr-x 1 genie.capella polarsys.polarsys.capella   30 Jul  3 04:48 tests
drwxrwsr-x 1 genie.capella polarsys.polarsys.capella   40 Jul  3 04:48 vpdsl
-rw-rw-r-- 1 genie.capella polarsys.polarsys.capella    0 Jul  3 04:48 .Xauthority-2455149172481139101
List of file and folder in /home/data/httpd/download.polarsys.org/capella/capellastudio/products/nightly before delete
total 20
drwxrwsr-x 1 genie.capella polarsys.polarsys.capella  306 Jul  3 05:48 .
drwxr-sr-x 1 genie.capella polarsys.polarsys.capella  234 Jul  3 04:48 ..
-rw-rw-r-- 1 genie.capella polarsys.polarsys.capella 1006 Jul  3 05:48 allsdk.txt
drwxrwsr-x 1 genie.capella polarsys.polarsys.capella   40 Jul  3 04:48 extension
drwxrwsr-x 1 genie.capella polarsys.polarsys.capella   10 Jul  3 04:48 gendoc
drwxrwsr-x 1 genie.capella polarsys.polarsys.capella  136 Jul  3 05:41 .git
-rw-rw-r-- 1 genie.capella polarsys.polarsys.capella  928 Jul  3 04:48 .gitignore
-rw-rw-r-- 1 genie.capella polarsys.polarsys.capella 1006 Jul  3 05:48 keptsdk.txt
drwxrwsr-x 1 genie.capella polarsys.polarsys.capella   28 Jul  3 04:48 .mvn
-rw-rw-r-- 1 genie.capella polarsys.polarsys.capella 1562 Jul  3 04:48 pom.xml
drwxrwsr-x 1 genie.capella polarsys.polarsys.capella   30 Jul  3 04:48 product
drwxrwsr-x 1 genie.capella polarsys.polarsys.capella   30 Jul  3 04:48 releng
-rw-rw-r-- 1 genie.capella polarsys.polarsys.capella    0 Jul  3 05:48 removedsdk.txt
-rw-rw-r-- 1 genie.capella polarsys.polarsys.capella 1940 Jul  3 04:48 sonar-project.properties
drwxrwsr-x 1 genie.capella polarsys.polarsys.capella   30 Jul  3 04:48 tests
drwxrwsr-x 1 genie.capella polarsys.polarsys.capella   40 Jul  3 04:48 vpdsl
-rw-rw-r-- 1 genie.capella polarsys.polarsys.capella    0 Jul  3 04:48 .Xauthority-2455149172481139101
List of file and folder in /home/data/httpd/download.polarsys.org/capella/capellastudio/products/nightly after delete
total 28
drwxrwsr-x 1 genie.capella polarsys.polarsys.capella  406 Jul  3 05:48 .
drwxr-sr-x 1 genie.capella polarsys.polarsys.capella  234 Jul  3 04:48 ..
-rw-rw-r-- 1 genie.capella polarsys.polarsys.capella  707 Jul  3 05:48 allproducts.txt
-rw-rw-r-- 1 genie.capella polarsys.polarsys.capella 1006 Jul  3 05:48 allsdk.txt
drwxrwsr-x 1 genie.capella polarsys.polarsys.capella   40 Jul  3 04:48 extension
drwxrwsr-x 1 genie.capella polarsys.polarsys.capella   10 Jul  3 04:48 gendoc
drwxrwsr-x 1 genie.capella polarsys.polarsys.capella  136 Jul  3 05:41 .git
-rw-rw-r-- 1 genie.capella polarsys.polarsys.capella  928 Jul  3 04:48 .gitignore
-rw-rw-r-- 1 genie.capella polarsys.polarsys.capella  707 Jul  3 05:48 keptproducts.txt
-rw-rw-r-- 1 genie.capella polarsys.polarsys.capella 1006 Jul  3 05:48 keptsdk.txt
drwxrwsr-x 1 genie.capella polarsys.polarsys.capella   28 Jul  3 04:48 .mvn
-rw-rw-r-- 1 genie.capella polarsys.polarsys.capella 1562 Jul  3 04:48 pom.xml
drwxrwsr-x 1 genie.capella polarsys.polarsys.capella   30 Jul  3 04:48 product
drwxrwsr-x 1 genie.capella polarsys.polarsys.capella   30 Jul  3 04:48 releng
-rw-rw-r-- 1 genie.capella polarsys.polarsys.capella    0 Jul  3 05:48 removedproducts.txt
-rw-rw-r-- 1 genie.capella polarsys.polarsys.capella    0 Jul  3 05:48 removedsdk.txt
-rw-rw-r-- 1 genie.capella polarsys.polarsys.capella 1940 Jul  3 04:48 sonar-project.properties
drwxrwsr-x 1 genie.capella polarsys.polarsys.capella   30 Jul  3 04:48 tests
drwxrwsr-x 1 genie.capella polarsys.polarsys.capella   40 Jul  3 04:48 vpdsl
-rw-rw-r-- 1 genie.capella polarsys.polarsys.capella    0 Jul  3 04:48 .Xauthority-2455149172481139101
+ echo 'Launch the publish of Capella Studio'
Launch the publish of Capella Studio
+ /bin/sh /home/hudson/genie.capella/.jenkins/jobs/capella-studio-master/workspace/releng/plugins/org.polarsys.capella.studio.releng.publish/scripts/publish-sdk-nightly.sh
mkdir: cannot create directory ‘/home/data/httpd/download.polarsys.org/capella/capellastudio/updates/nightly/sdk/1.4.0-N487’: Permission denied
Build step 'Execute shell' marked build as failure
Terminating xvnc.
Archiving artifacts
Skipping sonar analysis due to bad build status FAILURE
Recording test results
Started calculate disk usage of build
Finished Calculation of disk usage of build in 0 seconds
Started calculate disk usage of workspace
Finished Calculation of disk usage of workspace in  1 second
[WS-CLEANUP] Deleting project workspace...
[WS-CLEANUP] Deferred wipeout is used...
[WS-CLEANUP] done
Finished: FAILURE