UnstableConsole Output

Skipping 3,235 KB.. Full Log
] progress: Installing org.polarsys.kitalpha.vp.componentsampleperformance.model
[INFO] progress: Installing org.eclipse.emf.edit.feature.group
[INFO] progress: Installing org.polarsys.kitalpha.vp.componentsampleframework.rules.feature.source.feature.jar
[INFO] progress: Installing org.eclipse.rcptt.tesla.jface.text.reconciler.aspects
[INFO] progress: Installing org.eclipse.emf.mapping.ecore.editor.feature.group
[INFO] progress: Installing org.eclipse.emf.common.ui.feature.jar
[INFO] progress: Installing org.eclipse.emf.ecore.edit.feature.group
[INFO] progress: Installing org.eclipse.rcptt.ctx.debug
[INFO] progress: Installing org.eclipse.rcptt.tesla.nebula
[INFO] progress: Installing org.eclipse.rcptt.tesla.recording.aspects.workbench
[INFO] progress: Installing org.polarsys.kitalpha.vp.componentsamplesafetypattern
[INFO] progress: Installing org.polarsys.kitalpha.vp.componentsampleframework.rules.computation.source
[INFO] progress: Installing org.eclipse.rcptt.tesla.recording.workbench.texteditor
[INFO] progress: Installing org.polarsys.kitalpha.vp.componentsamplesafetypattern.rules.analysis.source
[INFO] progress: Installing org.polarsys.kitalpha.vp.componentsampleperformance.rules.validation
[INFO] progress: Installing org.eclipse.rcptt.tesla.core
[INFO] progress: Installing org.eclipse.rcptt.ctx.group
[INFO] progress: Installing org.eclipse.emf.ecore.edit.feature.jar
[INFO] progress: Installing org.polarsys.kitalpha.vp.componentsamplesafety.representation.feature.source.feature.group
[INFO] progress: Installing org.polarsys.kitalpha.vp.componentsample.wizard.project
[INFO] progress: Installing org.eclipse.emf.edit.ui
[INFO] progress: Installing org.eclipse.rcptt.tesla.workbench.texteditor
[INFO] progress: Installing org.polarsys.kitalpha.vp.componentsampleperformance.representation.feature.feature.group
[INFO] progress: Installing org.eclipse.equinox.weaving.aspectj
[INFO] progress: Installing org.polarsys.kitalpha.vp.componentsamplequalityassessment.rules.transformation
[INFO] progress: Installing org.eclipse.emf.validation.ui.ide
[INFO] progress: Installing org.polarsys.kitalpha.vp.componentsampleperformance.model.edit.source
[INFO] progress: Installing org.polarsys.kitalpha.vp.componentsamplequalityassessment.model.source
[INFO] progress: Installing org.eclipse.rcptt.tesla.gef
[INFO] progress: Installing org.eclipse.rcptt.tesla.ecl.runtime.feature.jar
[INFO] progress: Installing org.eclipse.rcptt.ctx.workbench
[INFO] progress: Installing org.eclipse.emf.converter.feature.group
[INFO] progress: Installing org.eclipse.emf.codegen.ecore
[INFO] progress: Installing org.eclipse.rcptt.logging
[INFO] progress: Installing org.polarsys.kitalpha.vp.componentsamplequalityassessment.model.edit.source
[INFO] progress: Installing org.eclipse.rcptt.module.testrail.runtime.feature.group
[INFO] progress: Installing org.eclipse.rcptt.tesla.recording.core.ecl
[INFO] progress: Installing org.polarsys.kitalpha.vp.componentsamplesafety.rules.computation.source
[INFO] progress: Installing org.eclipse.rcptt.tesla.recording.aspects.jface
[INFO] progress: Installing org.polarsys.kitalpha.vp.componentsamplesafety.vpdsl
[INFO] progress: Installing org.eclipse.emf.common.ui.feature.group
[INFO] progress: Installing org.apache.poi.ooxml.schemas
[INFO] progress: Installing org.eclipse.emf.ecore.change.edit
[INFO] progress: Installing org.polarsys.kitalpha.vp.componentsample.representation.feature.feature.group
[INFO] progress: Installing org.eclipse.rcptt.core.scenario
[INFO] progress: Installing org.eclipse.emf.mapping.ecore2ecore.editor
[INFO] progress: Installing org.polarsys.kitalpha.vp.componentsampleperformance.model.source
[INFO] progress: Installing org.polarsys.kitalpha.vp.componentsamplesafety.representation.feature.feature.jar
[INFO] progress: Installing org.eclipse.rcptt.ecl.platform.ui
[INFO] progress: Installing org.eclipse.emf.databinding.edit
[INFO] progress: Installing org.polarsys.kitalpha.vp.componentsampleframework.rules.computation
[INFO] progress: Installing org.polarsys.kitalpha.vp.componentsampleframework.model
[INFO] progress: Installing org.polarsys.kitalpha.vp.componentsamplesafetypattern.representation.feature.feature.group
[INFO] progress: Installing org.polarsys.kitalpha.vp.componentsample.design.source
[INFO] progress: Installing org.polarsys.kitalpha.vp.componentsample.rules.generation.source
[INFO] progress: Installing org.eclipse.rcptt.ecl.filesystem
[INFO] progress: Installing org.eclipse.rcptt.tesla.ecl.feature.jar
[INFO] progress: Installing org.polarsys.kitalpha.vp.componentsamplesafety.contextual.explorer.source
[INFO] progress: Installing org.polarsys.kitalpha.vp.componentsampleframework.rules.validation
[INFO] progress: Installing org.eclipse.rcptt.tesla.recording.canvas
[INFO] progress: Installing org.polarsys.kitalpha.vp.componentsamplequalityassessment.rules.analysis.source
[INFO] progress: Installing org.eclipse.rcptt.tesla.swt.aspects
[INFO] progress: Installing org.polarsys.kitalpha.vp.componentsamplesafetypattern.feature.source.feature.jar
[INFO] progress: Installing org.polarsys.kitalpha.vp.componentsamplequalityassessment.af.feature.source.feature.group
[INFO] progress: Installing org.eclipse.rcptt.tesla.runtime.feature.group
[INFO] progress: Installing org.eclipse.rcptt.ctx.preferences.aspects
[INFO] progress: Installing org.polarsys.kitalpha.vp.componentsamplequalityassessment.rules.validation.source
[INFO] progress: Installing org.eclipse.emf.codegen.ecore.feature.group
[INFO] progress: Installing org.apache.xmlbeans
[INFO] progress: Installing org.polarsys.kitalpha.vp.componentsamplequalityassessment.rules.feature.source.feature.group
[INFO] progress: Installing org.eclipse.emf.mapping.ecore.feature.jar
[INFO] progress: Installing org.polarsys.kitalpha.vp.componentsampleframework.source
[INFO] progress: Installing org.polarsys.kitalpha.vp.componentsample.example.feature.source.feature.jar
[INFO] progress: Installing org.eclipse.rcptt.watson.feature.group
[INFO] progress: Installing org.polarsys.kitalpha.vp.componentsampleperformance.rules.analysis.source
[INFO] progress: Installing org.eclipse.emf.mapping.feature.group
[INFO] progress: Installing org.eclipse.rcptt.tesla.recording.aspects.gmf
[INFO] progress: Installing org.eclipse.equinox.weaving.hook
[INFO] progress: Installing org.polarsys.kitalpha.vp.componentsamplequalityassessment.af.feature.source.feature.jar
[INFO] progress: Installing org.eclipse.rcptt.tesla.jdt
[INFO] progress: Installing org.eclipse.rcptt.ctx.preferences.impl
[INFO] progress: Installing org.polarsys.kitalpha.vp.componentsample.wizard.project.source
[INFO] progress: Installing org.polarsys.kitalpha.vp.componentsamplesafety.rules.computation
[INFO] progress: Installing org.polarsys.kitalpha.vp.componentsampleperformance.af.feature.source.feature.jar
[INFO] progress: Installing org.eclipse.rcptt.util.resources
[INFO] progress: Installing org.eclipse.rcptt.tesla.recording.gef
[INFO] progress: Installing org.polarsys.kitalpha.vp.componentsamplesafety.af.feature.source.feature.group
[INFO] progress: Installing org.polarsys.kitalpha.transposer.componentsample.importer
[INFO] progress: Installing org.eclipse.rcptt.core.ecl.core
[INFO] progress: Installing org.polarsys.kitalpha.vp.componentsamplesafety.feature.feature.group
[INFO] progress: Installing org.polarsys.kitalpha.vp.componentsampleperformance.rules.transformation
[INFO] progress: Installing org.polarsys.kitalpha.vp.componentsampleperformance.source
[INFO] progress: Installing org.eclipse.emf.mapping.ecore
[INFO] progress: Installing org.eclipse.rcptt.tesla.recording.swt
[INFO] progress: Installing org.polarsys.kitalpha.vp.componentsamplequalityassessment.model.edit
[INFO] progress: Installing org.polarsys.kitalpha.vp.componentsamplequalityassessment.representation.feature.source.feature.group
[INFO] progress: Installing org.eclipse.rcptt.tesla.properties.view
[INFO] progress: Installing org.polarsys.kitalpha.vp.componentsampleperformance.af.feature.feature.group
[INFO] progress: Installing org.polarsys.kitalpha.vp.componentsamplesafetypattern.af.feature.feature.jar
[INFO] progress: Installing org.polarsys.kitalpha.vp.componentsamplesafetypattern.contextual.explorer.source
[INFO] progress: Installing org.polarsys.kitalpha.vp.componentsample.af.feature.source.feature.jar
[INFO] progress: Installing org.polarsys.kitalpha.vp.componentsample.model.source
[INFO] progress: Installing org.eclipse.emf.mapping.ecore.editor
[INFO] progress: Installing org.eclipse.rcptt.verifications.log.impl
[INFO] progress: Installing org.polarsys.kitalpha.vp.componentsampleframework.feature.source.feature.jar
[INFO] progress: Installing org.polarsys.kitalpha.vp.componentsamplequalityassessment.rules.analysis
[INFO] progress: Installing org.polarsys.kitalpha.vp.componentsamplesafety.rules.analysis
[INFO] progress: Installing org.eclipse.emf.importer.ecore
[INFO] progress: Installing org.eclipse.rcptt.tesla.ui.ide
[INFO] progress: Installing org.polarsys.kitalpha.vp.componentsampleperformance.rules.validation.source
[INFO] progress: Installing org.eclipse.emf.codegen.ecore.ui.feature.group
[INFO] progress: Installing org.eclipse.rcptt.tesla.gef.aspects
[INFO] progress: Installing org.eclipse.rcptt.core.swt
[INFO] progress: Installing org.eclipse.emf.codegen.ecore.ui.feature.jar
[INFO] progress: Installing org.eclipse.rcptt.ctx.parameters
[INFO] progress: Installing org.polarsys.kitalpha.vp.componentsamplequalityassessment.feature.feature.jar
[INFO] progress: Installing org.eclipse.rcptt.verifications.log
[INFO] progress: Installing org.polarsys.kitalpha.vp.componentsampleperformance.rules.transformation.source
[INFO] progress: Installing org.eclipse.rcptt.tesla.recording.aspects.jface.text
[INFO] progress: Installing org.polarsys.kitalpha.vp.componentsample.rules.computation
[INFO] progress: Installing org.polarsys.kitalpha.vp.componentsamplequalityassessment.activity.explorer
[INFO] progress: Installing org.polarsys.kitalpha.vp.componentsample.af.feature.feature.group
[INFO] progress: Installing org.eclipse.rcptt.ecl.debug.runtime
[INFO] progress: Installing org.polarsys.kitalpha.vp.componentsamplesafetypattern.source
[INFO] progress: Installing org.eclipse.rcptt.tesla.swt
[INFO] progress: Installing org.eclipse.emf.mapping
[INFO] progress: Installing org.eclipse.rcptt.tesla.jface.databinding
[INFO] progress: Installing org.eclipse.rcptt.watson.core
[INFO] progress: Installing org.polarsys.kitalpha.vp.componentsamplesafety.representation.feature.source.feature.jar
[INFO] progress: Installing org.polarsys.kitalpha.vp.componentsampleperformance.rules.feature.source.feature.jar
[INFO] progress: Installing org.eclipse.rcptt.tesla.jface.databinding.aspects
[INFO] progress: Installing org.polarsys.kitalpha.vp.componentsampleperformance.feature.source.feature.jar
[INFO] progress: Installing org.polarsys.kitalpha.vp.componentsampleframework.rules.feature.feature.group
[INFO] progress: Installing org.polarsys.kitalpha.vp.componentsamplequalityassessment.af.source
[INFO] progress: Installing org.polarsys.kitalpha.vp.componentsamplesafety.feature.source.feature.group
[INFO] progress: Installing org.eclipse.rcptt.tesla.jface.databinding.observable.aspects
[INFO] progress: Installing 201706090642.Default
[INFO] progress: Installing org.polarsys.kitalpha.vp.componentsample.feature.feature.group
[INFO] progress: Installing org.apache.poi
[INFO] progress: Installing org.eclipse.emf.query.feature.group
[INFO] progress: Installing org.eclipse.rcptt.testrail.ecl.impl
[INFO] progress: Installing org.eclipse.rcptt.ecl.platform
[INFO] progress: Installing org.eclipse.emf.ecore.feature.group
[INFO] progress: Installing org.polarsys.kitalpha.vp.componentsamplequalityassessment.af.feature.feature.jar
[INFO] progress: Installing org.eclipse.rcptt.ecl.data.apache.poi
[INFO] progress: Installing org.polarsys.kitalpha.vp.componentsamplequalityassessment.representation.feature.feature.jar
[INFO] progress: Installing org.eclipse.rcptt.tesla.recording.aspects.draw2d
[INFO] progress: Installing org.eclipse.rcptt.ecl.data.apache.poi.impl
[INFO] progress: Installing org.polarsys.kitalpha.vp.componentsamplequalityassessment.rules.generation.source
[INFO] progress: Installing org.polarsys.kitalpha.vp.componentsamplesafetypattern.design.source
[INFO] progress: Installing org.polarsys.kitalpha.vp.componentsamplesafetypattern.af
[INFO] progress: Installing org.polarsys.kitalpha.vp.componentsamplesafetypattern.model
[INFO] progress: Installing org.polarsys.kitalpha.vp.componentsamplesafety.af
[INFO] progress: Installing org.eclipse.rcptt.ecl.core.feature.group
[INFO] progress: Installing org.eclipse.emf.codegen.feature.group
[INFO] progress: Installing a.jre.javase
[INFO] progress: Installing org.eclipse.rcptt.ctx.preferences
[INFO] progress: Installing org.eclipse.emf.mapping.ui.feature.jar
[INFO] progress: Installing org.apache.poi.ooxml
[INFO] progress: Installing org.polarsys.kitalpha.transposer.componentsample.installer.feature.feature.jar
[INFO] progress: Installing org.eclipse.emf.ecore
[INFO] progress: Installing org.eclipse.rcptt.ecl.server.feature.jar
[INFO] progress: Installing org.eclipse.emf.databinding
[INFO] progress: Installing org.polarsys.kitalpha.vp.componentsample.rules.analysis
[INFO] progress: Installing org.eclipse.emf.databinding.feature.group
[INFO] progress: Installing org.polarsys.kitalpha.vp.componentsampleframework.model.edit
[INFO] progress: Installing org.polarsys.kitalpha.vp.componentsample.representation.feature.feature.jar
[INFO] progress: Installing org.eclipse.rcptt.ctx.filesystem
[INFO] progress: Installing org.eclipse.emf.databinding.feature.jar
[INFO] progress: Installing org.eclipse.rcptt.tesla.ecl
[INFO] progress: Installing org.eclipse.rcptt.tesla.ecl.runtime.feature.group
[INFO] progress: Installing org.eclipse.rcptt.tesla.nebula.ecl.impl
[INFO] progress: Installing org.polarsys.kitalpha.vp.componentsamplesafety.model.source
[INFO] progress: Installing org.eclipse.rcptt.tesla.recording.core
[INFO] progress: Installing org.polarsys.kitalpha.vp.componentsamplesafetypattern.activity.explorer.source
[INFO] progress: Installing org.eclipse.emf.query
[INFO] progress: Installing org.polarsys.kitalpha.vp.componentsampleperformance.rules.computation.source
[INFO] progress: Installing org.polarsys.kitalpha.vp.componentsamplesafetypattern.rules.generation.source
[INFO] progress: Installing org.eclipse.emf.validation.feature.group
[INFO] progress: Installing org.polarsys.kitalpha.vp.componentsamplequalityassessment
[INFO] progress: Installing org.polarsys.kitalpha.vp.componentsamplequalityassessment.feature.source.feature.group
[INFO] progress: Installing org.polarsys.kitalpha.vp.componentsampleframework.rules.analysis.source
[INFO] progress: Installing org.polarsys.kitalpha.vp.componentsampleperformance.activity.explorer.source
[INFO] progress: Installing org.polarsys.kitalpha.vp.componentsamplesafetypattern.feature.feature.group
[INFO] progress: Installing org.eclipse.rcptt.ecl.data
[INFO] progress: Installing org.eclipse.rcptt.tesla.gmf
[INFO] progress: Installing org.polarsys.kitalpha.vp.componentsample.activity.explorer.source
[INFO] progress: Installing org.eclipse.rcptt.tesla.feature.jar
[INFO] progress: Installing org.eclipse.rcptt.core.swt.win64
[INFO] progress: Installing org.eclipse.emf.importer.rose
[INFO] progress: Installing org.eclipse.rcptt.ctx.script
[INFO] progress: Installing org.eclipse.emf.ecore.editor
[INFO] progress: Installing org.polarsys.kitalpha.vp.componentsampleframework.rules.transformation
[INFO] progress: Installing org.polarsys.kitalpha.vp.componentsample.af.feature.feature.jar
[INFO] progress: Installing org.polarsys.kitalpha.vp.componentsampleframework.rules.validation.source
[INFO] progress: Downloading org.eclipse.emf.validation_root
[INFO] progress: Downloading org.eclipse.emf.transaction_root
[INFO] progress: Downloading org.eclipse.emf.query_root
[INFO] progress: Preparing to commit the provisioning operation.
[INFO] progress: Committing the provisioning operation.
[INFO] progress: Reading plug-ins
[INFO] Target platform is valid.
[INFO] Looking for tests...
[INFO] Existing projects in workspace:
[INFO]     <none>
[INFO] Importing projects to workspace:
[INFO] Refreshing projects:
[INFO]     /jobs/genie.capella/capella-studio-gerrit/workspace/vpdsl/tests/org.polarsys.capella.studio.ad.viewpoint.rcptt/target/projects/org.polarsys.capella.studio.ad.viewpoint.rcptt... OK
[INFO] Refreshing projects:
[INFO]     org.polarsys.capella.studio.ad.viewpoint.rcptt... OK
[INFO] Searching for tests in projects:
[INFO]     org.polarsys.capella.studio.ad.viewpoint.rcptt... 
[INFO] Complete OK
[INFO] Testcase Artifacts:6
[INFO] AUT-0:Launching
[INFO] AUT-0:Product: org.polarsys.capella.studio.product.CapellaStudio
[INFO] AUT-0:Application: org.polarsys.capella.studio.product.application
[INFO] AUT-0:Architecture: x86_64
[INFO] 64bit arch is selected because AUT uses launcher library
[INFO] 	"plugins/org.eclipse.equinox.launcher.gtk.linux.x86_64_1.1.551.v20171108-1834" specified in config file: eclipse.ini
[INFO] /jobs/genie.capella/capella-studio-gerrit/workspace/vpdsl/tests/org.polarsys.capella.studio.ad.viewpoint.rcptt/target/aut-ws-0: AUT arguments: -os ${target.os} -arch ${target.arch} -consoleLog
[INFO] /jobs/genie.capella/capella-studio-gerrit/workspace/vpdsl/tests/org.polarsys.capella.studio.ad.viewpoint.rcptt/target/aut-ws-0: AUT VM arguments: -Dosgi.requiredJavaVersion=1.8 -Xms512m -Xmx2048m -XX:PermSize=256M -javaagent:/home/hudson/genie.capella/.jenkins/jobs/capella-studio-gerrit/workspace/.repository/org/jacoco/org.jacoco.agent/0.7.9/org.jacoco.agent-0.7.9-runtime.jar=destfile=/jobs/genie.capella/capella-studio-gerrit/workspace/vpdsl/tests/org.polarsys.capella.studio.ad.viewpoint.rcptt/target/jacoco.exec -XX:MaxPermSize=128m
[INFO] Pass 1 (6) processed. 0 failed. spent: 1:27, 1:56 mins remaining. AF For Capella Security. time: 87269ms 
[INFO] Pass 2 (6) processed. 0 failed. spent: 1:50, 1:22 mins remaining. AF For EMF Security. time: 22845ms 
[INFO] Pass 3 (6) processed. 0 failed. spent: 3:37, 1:26 mins remaining. Capella Scurity Viewpoint. time: 106082ms 
[INFO] Pass 4 (6) processed. 0 failed. spent: 4:00, 0:40 mins remaining. EMF Security Viewpoint. time: 22985ms 
[INFO] Pass 5 (6) processed. 0 failed. spent: 4:23, 0:00 mins remaining. Many Activity Explorer Pages. time: 22530ms 
[INFO] Pass 6 (6) processed. 0 failed. spent: 5:02, 0:00 mins remaining. generation Vpdesc to Vptext. time: 37912ms 
[INFO] Process terminated. Shut down AUTs
[INFO] Finished at Mon Jul 15 03:50:25 EDT 2019
[INFO] Runner exit code is: 0
[INFO] 
[INFO] --- rcptt-maven-plugin:2.2.0:package (default-package) @ org.polarsys.capella.studio.ad.viewpoint.rcptt ---
[INFO] Building zip: /jobs/genie.capella/capella-studio-gerrit/workspace/vpdsl/tests/org.polarsys.capella.studio.ad.viewpoint.rcptt/target/projects/org.polarsys.capella.studio.ad.viewpoint.rcptt-1.3.1-SNAPSHOT.zip
[INFO] Building zip: /jobs/genie.capella/capella-studio-gerrit/workspace/vpdsl/tests/org.polarsys.capella.studio.ad.viewpoint.rcptt/target/org.polarsys.capella-org.polarsys.capella.studio.ad.viewpoint.rcptt-1.3.1-SNAPSHOT-result.zip
[INFO] aut1/out.txt already added, skipping
[INFO] 
[INFO] --- tycho-source-plugin:1.1.0:plugin-source (plugin-source) @ org.polarsys.capella.studio.ad.viewpoint.rcptt ---
[INFO] 
[INFO] --- tycho-source-feature-plugin:1.1.0:source-feature (source-feature) @ org.polarsys.capella.studio.ad.viewpoint.rcptt ---
[INFO] 
[INFO] --< org.polarsys.capella:capellastudio.vpdsl.qualityassessment.reverse.tests >--
[INFO] Building capellastudio.vpdsl.qualityassessment.reverse.tests 1.3.1-SNAPSHOT [26/30]
[INFO] -----------------------------[ rcpttTest ]------------------------------
[INFO] 
[INFO] --- maven-clean-plugin:2.5:clean (default-clean) @ capellastudio.vpdsl.qualityassessment.reverse.tests ---
[INFO] 
[INFO] --- jacoco-maven-plugin:0.7.9:prepare-agent (default) @ capellastudio.vpdsl.qualityassessment.reverse.tests ---
[INFO] failsafeArgline set to -javaagent:/home/hudson/genie.capella/.jenkins/jobs/capella-studio-gerrit/workspace/.repository/org/jacoco/org.jacoco.agent/0.7.9/org.jacoco.agent-0.7.9-runtime.jar=destfile=/jobs/genie.capella/capella-studio-gerrit/workspace/vpdsl/tests/capellastudio.vpdsl.qualityassessment.reverse.tests/target/jacoco.exec
[INFO] 
[INFO] --- rcptt-maven-plugin:2.2.0:resources (default-resources) @ capellastudio.vpdsl.qualityassessment.reverse.tests ---
[INFO] Resolving artifact org.eclipse.rcptt.runner:rcptt.runner:zip:2.2.0, this may take a while ...
[INFO] Artifact org.eclipse.rcptt.runner:rcptt.runner:zip:2.2.0 is resolved to /home/hudson/genie.capella/.jenkins/jobs/capella-studio-gerrit/workspace/.repository/org/eclipse/rcptt/runner/rcptt.runner/2.2.0/rcptt.runner-2.2.0.zip
[INFO] Using AUT from /jobs/genie.capella/capella-studio-gerrit/workspace/vpdsl/tests/capellastudio.vpdsl.qualityassessment.reverse.tests/../../../releng/plugins/org.polarsys.capella.studio.releng.product/target/products/org.polarsys.capella.studio.releng.product/linux/gtk/x86_64
[INFO] Extracting RCPTT runner to /jobs/genie.capella/capella-studio-gerrit/workspace/vpdsl/tests/capellastudio.vpdsl.qualityassessment.reverse.tests/target/runner
[INFO] Copying project contents to target directory...
[INFO] 
[INFO] --- rcptt-maven-plugin:2.2.0:execute (default-execute) @ capellastudio.vpdsl.qualityassessment.reverse.tests ---
[INFO] Runner command line is /bin/sh -c cd /jobs/genie.capella/capella-studio-gerrit/workspace/vpdsl/tests/capellastudio.vpdsl.qualityassessment.reverse.tests/target/runner/eclipse && /opt/public/common/java/oracle/jdk1.8.0_192_x64/jre/bin/java -Xms128m -Xmx256m -Dorg.eclipse.rcptt.runner.returnTestFailure=true -jar /jobs/genie.capella/capella-studio-gerrit/workspace/vpdsl/tests/capellastudio.vpdsl.qualityassessment.reverse.tests/target/runner/eclipse/plugins/org.eclipse.equinox.launcher_1.4.0.v20161219-1356.jar -application org.eclipse.rcptt.runner.headless -runnerPlatform swt -data /jobs/genie.capella/capella-studio-gerrit/workspace/vpdsl/tests/capellastudio.vpdsl.qualityassessment.reverse.tests/target/runner-workspace -aut /jobs/genie.capella/capella-studio-gerrit/workspace/vpdsl/tests/capellastudio.vpdsl.qualityassessment.reverse.tests/../../../releng/plugins/org.polarsys.capella.studio.releng.product/target/products/org.polarsys.capella.studio.releng.product/linux/gtk/x86_64 -autWsPrefix /jobs/genie.capella/capella-studio-gerrit/workspace/vpdsl/tests/capellastudio.vpdsl.qualityassessment.reverse.tests/target/aut-ws- -autConsolePrefix /jobs/genie.capella/capella-studio-gerrit/workspace/vpdsl/tests/capellastudio.vpdsl.qualityassessment.reverse.tests/target/results/aut-console- -autVMArgs -javaagent:/home/hudson/genie.capella/.jenkins/jobs/capella-studio-gerrit/workspace/.repository/org/jacoco/org.jacoco.agent/0.7.9/org.jacoco.agent-0.7.9-runtime.jar=destfile=/jobs/genie.capella/capella-studio-gerrit/workspace/vpdsl/tests/capellastudio.vpdsl.qualityassessment.reverse.tests/target/jacoco.exec -q7report /jobs/genie.capella/capella-studio-gerrit/workspace/vpdsl/tests/capellastudio.vpdsl.qualityassessment.reverse.tests/target/results/capellastudio.vpdsl.qualityassessment.reverse.tests.report -htmlReport /jobs/genie.capella/capella-studio-gerrit/workspace/vpdsl/tests/capellastudio.vpdsl.qualityassessment.reverse.tests/target/results/capellastudio.vpdsl.qualityassessment.reverse.tests.html -junitReport /jobs/genie.capella/capella-studio-gerrit/workspace/vpdsl/tests/capellastudio.vpdsl.qualityassessment.reverse.tests/target/surefire-reports/TEST-capellastudio.vpdsl.qualityassessment.reverse.tests.xml -import /jobs/genie.capella/capella-studio-gerrit/workspace/vpdsl/tests/capellastudio.vpdsl.qualityassessment.reverse.tests/target/projects/capellastudio.vpdsl.qualityassessment.reverse.tests -testOptions 'testExecTimeout=300;execTimeout=3600' -timeout 3600 -shutdownListenerPort 8302
[INFO] The execution timeout is set to 3600 seconds
[ERROR] Picked up JAVA_TOOL_OPTIONS: -Xmx2G -Djava.io.tmpdir=/tmp/genie.capella
[INFO] Started at Mon Jul 15 03:50:42 EDT 2019
[INFO] RCPTT Runner version: 2.2.0
[INFO] Initializing target platform...
[INFO] Begin task: Create AUT configuration
[INFO] progress: Resolving Target Contents...
[INFO] progress: Reading plug-ins
[INFO] progress: Fetching p2.index from platform:/plugin/org.eclipse.rcptt.updates.runtime.e4x/q7/
[INFO] progress: Adding repository platform:///plugin/org.eclipse.rcptt.updates.runtime.e4x/q7/
[INFO] progress: Fetching content.jar from platform:/plugin/org.eclipse.rcptt.updates.runtime.e4x/q7/
[INFO] progress: Fetching p2.index from platform:/plugin/org.eclipse.rcptt.updates.runtime.e4x/q7/
[INFO] progress: Adding repository platform:///plugin/org.eclipse.rcptt.updates.runtime.e4x/q7/
[INFO] progress: Fetching content.jar from platform:/plugin/org.eclipse.rcptt.updates.runtime.e4x/q7/
[INFO] progress: Fetching p2.index from platform:/plugin/org.eclipse.rcptt.updates.runtime.e4x/q7/
[INFO] progress: Adding repository platform:///plugin/org.eclipse.rcptt.updates.runtime.e4x/q7/
[INFO] progress: Fetching artifacts.jar from platform:/plugin/org.eclipse.rcptt.updates.runtime.e4x/q7/
[INFO] progress: Downloading org.antlr.runtime
[INFO] progress: Adding repository platform:///plugin/org.eclipse.rcptt.updates.aspectj.e44x/dependencies/
[INFO] progress: Fetching content.jar from platform:/plugin/org.eclipse.rcptt.updates.aspectj.e44x/dependencies/
[INFO] progress: Adding repository platform:///plugin/org.eclipse.rcptt.updates.aspectj.e44x/dependencies/
[INFO] progress: Fetching artifacts.jar from platform:/plugin/org.eclipse.rcptt.updates.aspectj.e44x/dependencies/
[INFO] progress: Downloading org.eclipse.equinox.weaving.hook
[INFO] progress: Downloading org.aspectj.runtime
[INFO] progress: Downloading org.eclipse.equinox.weaving.aspectj
[INFO] progress: Downloading org.aspectj.weaver
[INFO] progress: Adding repository platform:///plugin/org.eclipse.rcptt.updates.kepler/dependencies/
[INFO] progress: Fetching content.jar from platform:/plugin/org.eclipse.rcptt.updates.kepler/dependencies/
[INFO] progress: Adding repository platform:///plugin/org.eclipse.rcptt.updates.kepler/dependencies/
[INFO] progress: Fetching artifacts.jar from platform:/plugin/org.eclipse.rcptt.updates.kepler/dependencies/
[INFO] progress: Downloading org.eclipse.emf.converter
[INFO] progress: Downloading org.eclipse.emf.ecore.change
[INFO] progress: Downloading org.eclipse.emf.mapping.ecore2ecore
[INFO] progress: Downloading org.eclipse.emf.codegen.ecore
[INFO] progress: Downloading org.eclipse.emf.validation
[INFO] progress: Downloading org.eclipse.emf.transaction.ui
[INFO] progress: Downloading org.eclipse.emf.mapping.ecore.editor
[INFO] progress: Downloading org.eclipse.emf.validation_root
[INFO] progress: Downloading org.eclipse.emf
[INFO] progress: Downloading org.eclipse.emf.ecore.change.edit
[INFO] progress: Downloading org.eclipse.emf.importer.ecore
[INFO] progress: Downloading org.eclipse.emf.codegen.ui
[INFO] progress: Downloading org.eclipse.emf.mapping.ecore2ecore.editor
[INFO] progress: Downloading org.eclipse.emf.ecore.xmi
[INFO] progress: Downloading org.eclipse.emf.mapping.ui
[INFO] progress: Downloading org.eclipse.emf.databinding.edit
[INFO] progress: Downloading org.eclipse.emf.mapping
[INFO] progress: Downloading org.eclipse.emf.ecore
[INFO] progress: Downloading org.eclipse.emf.codegen.ecore.ui
[INFO] progress: Downloading org.eclipse.emf.importer
[INFO] progress: Downloading org.eclipse.emf.mapping.ecore2xml.ui
[INFO] progress: Downloading org.eclipse.emf.databinding
[INFO] progress: Downloading org.eclipse.emf
[INFO] progress: Downloading org.eclipse.emf.ecore.edit
[INFO] progress: Downloading org.eclipse.emf.databinding
[INFO] progress: Downloading org.eclipse.emf.validation.ui
[INFO] progress: Downloading org.eclipse.emf.query
[INFO] progress: Downloading org.eclipse.emf.transaction
[INFO] progress: Downloading org.eclipse.emf.ecore.editor
[INFO] progress: Downloading org.eclipse.emf.codegen.ecore
[INFO] progress: Downloading org.eclipse.emf.common.ui
[INFO] progress: Downloading org.eclipse.emf.mapping.ecore2xml
[INFO] progress: Downloading org.eclipse.emf.mapping.ecore
[INFO] progress: Downloading org.eclipse.emf.ecore
[INFO] progress: Downloading org.eclipse.emf.query
[INFO] progress: Downloading org.eclipse.emf.mapping
[INFO] progress: Downloading org.eclipse.emf.edit.ui
[INFO] progress: Downloading org.eclipse.emf.exporter
[INFO] progress: Downloading org.eclipse.emf.mapping.ui
[INFO] progress: Downloading org.eclipse.emf.converter
[INFO] progress: Downloading org.eclipse.emf.transaction
[INFO] progress: Downloading org.eclipse.emf.transaction_root
[INFO] progress: Downloading org.eclipse.emf.databinding.edit
[INFO] progress: Downloading org.eclipse.emf.ecore.edit
[INFO] progress: Downloading org.eclipse.emf.validation
[INFO] progress: Downloading org.eclipse.emf.importer.rose
[INFO] progress: Downloading org.eclipse.emf.edit.ui
[INFO] progress: Downloading org.eclipse.emf.ant
[INFO] progress: Downloading org.eclipse.emf.importer.java
[INFO] progress: Downloading org.eclipse.emf.codegen.ecore.ui
[INFO] progress: Downloading org.eclipse.emf.edit
[INFO] progress: Downloading org.eclipse.emf.codegen
[INFO] progress: Downloading org.eclipse.emf.common.ui
[INFO] progress: Downloading org.eclipse.emf.common
[INFO] progress: Downloading org.eclipse.emf.ecore.editor
[INFO] progress: Downloading org.eclipse.emf.mapping.ecore
[INFO] progress: Downloading org.eclipse.emf.mapping.ecore.editor
[INFO] progress: Downloading org.eclipse.emf.validation.ui.ide
[INFO] progress: Downloading org.eclipse.emf.edit
[INFO] progress: Downloading org.eclipse.emf.common
[INFO] progress: Downloading org.eclipse.emf.codegen
[INFO] progress: Downloading org.eclipse.emf.query_root
[INFO] progress: Downloading org.eclipse.emf.codegen.ui
[INFO] progress: Adding repository platform:///plugin/org.eclipse.rcptt.module.nebula.updates/runtime/
[INFO] progress: Fetching content.jar from platform:/plugin/org.eclipse.rcptt.module.nebula.updates/runtime/
[INFO] progress: Adding repository platform:///plugin/org.eclipse.rcptt.module.nebula.updates/runtime/
[INFO] progress: Fetching artifacts.jar from platform:/plugin/org.eclipse.rcptt.module.nebula.updates/runtime/
[INFO] progress: Adding repository platform:///plugin/org.eclipse.rcptt.module.testrail.updates/runtime/
[INFO] progress: Fetching content.jar from platform:/plugin/org.eclipse.rcptt.module.testrail.updates/runtime/
[INFO] progress: Adding repository platform:///plugin/org.eclipse.rcptt.module.testrail.updates/runtime/
[INFO] progress: Fetching artifacts.jar from platform:/plugin/org.eclipse.rcptt.module.testrail.updates/runtime/
[INFO] progress: Adding repository platform:///plugin/org.eclipse.rcptt.updates.extra/dependencies/
[INFO] progress: Fetching content.jar from platform:/plugin/org.eclipse.rcptt.updates.extra/dependencies/
[INFO] progress: Adding repository platform:///plugin/org.eclipse.rcptt.updates.extra/dependencies/
[INFO] progress: Fetching artifacts.jar from platform:/plugin/org.eclipse.rcptt.updates.extra/dependencies/
[INFO] progress: Downloading org.apache.poi.ooxml
[INFO] progress: Downloading org.apache.poi.ooxml.schemas
[INFO] progress: Downloading org.apache.xmlbeans
[INFO] progress: Downloading org.dom4j
[INFO] progress: Downloading org.apache.poi
[INFO] progress: Resolving Target Contents...
[INFO] progress: Reading plug-ins
[INFO] progress: Fetching p2.index from platform:/plugin/org.eclipse.rcptt.updates.runtime.e4x/q7/
[INFO] progress: Fetching content.jar from platform:/plugin/org.eclipse.rcptt.updates.runtime.e4x/q7/
[INFO] progress: Fetching content.jar from platform:/plugin/org.eclipse.rcptt.updates.aspectj.e44x/dependencies/
[INFO] progress: Fetching content.jar from platform:/plugin/org.eclipse.rcptt.updates.kepler/dependencies/
[INFO] progress: Fetching content.jar from platform:/plugin/org.eclipse.rcptt.module.nebula.updates/runtime/
[INFO] progress: Fetching content.jar from platform:/plugin/org.eclipse.rcptt.module.testrail.updates/runtime/
[INFO] progress: Fetching content.jar from platform:/plugin/org.eclipse.rcptt.updates.extra/dependencies/
[INFO] progress: Fetching p2.index from platform:/plugin/org.eclipse.rcptt.updates.runtime.e4x/q7/
[INFO] progress: Fetching artifacts.jar from platform:/plugin/org.eclipse.rcptt.updates.runtime.e4x/q7/
[INFO] progress: Fetching artifacts.jar from platform:/plugin/org.eclipse.rcptt.module.testrail.updates/runtime/
[INFO] progress: Fetching artifacts.jar from platform:/plugin/org.eclipse.rcptt.updates.kepler/dependencies/
[INFO] progress: Fetching artifacts.jar from platform:/plugin/org.eclipse.rcptt.module.nebula.updates/runtime/
[INFO] progress: Fetching artifacts.jar from platform:/plugin/org.eclipse.rcptt.updates.aspectj.e44x/dependencies/
[INFO] progress: Fetching artifacts.jar from platform:/plugin/org.eclipse.rcptt.updates.extra/dependencies/
[INFO] progress: Downloading org.eclipse.emf.validation_root
[INFO] progress: Downloading org.eclipse.emf.transaction_root
[INFO] progress: Downloading org.eclipse.emf.query_root
[INFO] progress: Installing org.eclipse.emf.ecore.change
[INFO] progress: Installing org.eclipse.rcptt.tesla.workbench.aspects.e4x
[INFO] progress: Installing org.eclipse.rcptt.tesla.core.am
[INFO] progress: Installing org.eclipse.rcptt.tesla.gmf.aspects
[INFO] progress: Installing org.eclipse.rcptt.watson.aspects.swt
[INFO] progress: Installing org.eclipse.rcptt.ecl.client.tcp
[INFO] progress: Installing org.eclipse.rcptt.tesla.jdt.aspects
[INFO] progress: Installing org.eclipse.rcptt.tesla.ecl.feature.group
[INFO] progress: Installing org.eclipse.rcptt.tesla.recording.aspects.forms
[INFO] progress: Installing org.eclipse.rcptt.watson.jface
[INFO] progress: Installing org.eclipse.emf.ecore.xmi
[INFO] progress: Installing org.eclipse.rcptt.verifications
[INFO] progress: Installing org.eclipse.emf.mapping.feature.jar
[INFO] progress: Installing org.eclipse.rcptt.tesla.jface.fragment
[INFO] progress: Installing org.dom4j
[INFO] progress: Installing org.eclipse.rcptt.testrail.ecl
[INFO] progress: Installing org.eclipse.rcptt.ecl.dispatch
[INFO] progress: Installing org.eclipse.emf.importer
[INFO] progress: Installing org.eclipse.emf.mapping.ecore2xml.ui
[INFO] progress: Installing org.eclipse.rcptt.watson.jobs
[INFO] progress: Installing org.eclipse.rcptt.tesla.runtime.feature.jar
[INFO] progress: Installing org.eclipse.rcptt.verifications.tree
[INFO] progress: Installing org.eclipse.rcptt.reporting
[INFO] progress: Installing org.eclipse.emf.ecore.edit
[INFO] progress: Installing org.eclipse.rcptt.forms.impl
[INFO] progress: Installing org.eclipse.emf.edit.feature.group
[INFO] progress: Installing org.eclipse.emf.transaction
[INFO] progress: Installing org.eclipse.rcptt.tesla.jface.text.reconciler.aspects
[INFO] progress: Installing org.eclipse.rcptt.ecl.perf
[INFO] progress: Installing org.eclipse.emf.codegen.ecore.feature.jar
[INFO] progress: Installing org.eclipse.rcptt.expandbar.runtime
[INFO] progress: Installing org.eclipse.rcptt.tesla.recording.draw2d
[INFO] progress: Installing org.eclipse.emf.mapping.ecore.editor.feature.group
[INFO] progress: Installing org.eclipse.emf.common.ui.feature.jar
[INFO] progress: Installing org.eclipse.rcptt.ecl.platform.ui.feature.jar
[INFO] progress: Installing org.eclipse.emf.ecore.edit.feature.group
[INFO] progress: Installing org.eclipse.rcptt.ctx.debug
[INFO] progress: Installing org.eclipse.rcptt.module.nebula.runtime.feature.group
[INFO] progress: Installing org.eclipse.rcptt.tesla.nebula
[INFO] progress: Installing org.eclipse.rcptt.tesla.recording.aspects.workbench
[INFO] progress: Installing org.eclipse.rcptt.tesla.core.context
[INFO] progress: Installing org.eclipse.emf.transaction.feature.jar
[INFO] progress: Installing org.eclipse.rcptt.tesla.recording.workbench.texteditor
[INFO] progress: Installing org.eclipse.rcptt.tesla.core
[INFO] progress: Installing org.eclipse.rcptt.tesla.nebula.impl
[INFO] progress: Installing org.eclipse.rcptt.ctx.group
[INFO] progress: Installing org.eclipse.emf.ecore.edit.feature.jar
[INFO] progress: Installing org.eclipse.rcptt.runtime.feature.jar
[INFO] progress: Installing org.eclipse.emf.validation
[INFO] progress: Installing org.eclipse.rcptt.ecl.platform.ui.feature.group
[INFO] progress: Installing org.eclipse.emf.edit.ui
[INFO] progress: Installing org.eclipse.rcptt.tesla.workbench.texteditor
[INFO] progress: Installing org.eclipse.emf.edit.feature.jar
[INFO] progress: Installing org.eclipse.equinox.weaving.aspectj
[INFO] progress: Installing org.eclipse.emf.validation.ui.ide
[INFO] progress: Installing org.eclipse.emf.edit
[INFO] progress: Installing org.eclipse.rcptt.ctx.workbench.impl
[INFO] progress: Installing org.eclipse.rcptt.tesla.ecl.impl
[INFO] progress: Installing org.eclipse.rcptt.tesla.gef
[INFO] progress: Installing org.eclipse.rcptt.ecl.interop
[INFO] progress: Installing org.eclipse.rcptt.tesla.ecl.runtime.feature.jar
[INFO] progress: Installing org.eclipse.rcptt.ctx.workbench
[INFO] progress: Installing org.eclipse.rcptt.verifications.text
[INFO] progress: Installing org.eclipse.emf.converter.feature.group
[INFO] progress: Installing org.eclipse.emf.codegen.ecore
[INFO] progress: Installing org.eclipse.emf.validation.feature.jar
[INFO] progress: Installing org.eclipse.emf.transaction.ui
[INFO] progress: Installing org.eclipse.emf.databinding.edit.feature.group
[INFO] progress: Installing org.eclipse.rcptt.logging
[INFO] progress: Installing org.eclipse.rcptt.ctx.resources
[INFO] progress: Installing org.eclipse.rcptt.module.testrail.runtime.feature.group
[INFO] progress: Installing org.eclipse.rcptt.tesla.recording.core.ecl
[INFO] progress: Installing org.eclipse.rcptt.ctx.group.impl
[INFO] progress: Installing org.eclipse.rcptt.tesla.recording.aspects.jface
[INFO] progress: Installing org.eclipse.emf.common.ui.feature.group
[INFO] progress: Installing org.apache.poi.ooxml.schemas
[INFO] progress: Installing org.eclipse.emf.ecore.change.edit
[INFO] progress: Installing org.eclipse.rcptt.core.scenario
[INFO] progress: Installing org.eclipse.emf.mapping.ecore2ecore.editor
[INFO] progress: Installing org.antlr.runtime
[INFO] progress: Installing org.eclipse.rcptt.module.testrail.runtime.feature.jar
[INFO] progress: Installing org.eclipse.rcptt.watson.aspects.jobs
[INFO] progress: Installing org.eclipse.rcptt.ecl.platform.ui
[INFO] progress: Installing org.eclipse.emf.databinding.edit
[INFO] progress: Installing org.eclipse.rcptt.tesla.swt.e4x
[INFO] progress: Installing org.eclipse.rcptt.ecl.filesystem
[INFO] progress: Installing org.eclipse.rcptt.tesla.jobs.aspects
[INFO] progress: Installing org.eclipse.rcptt.tesla.ecl.feature.jar
[INFO] progress: Installing org.eclipse.emf.edit.ui.feature.group
[INFO] progress: Installing org.eclipse.rcptt.verifications.tree.impl
[INFO] progress: Installing org.eclipse.rcptt.watson.runtime.feature.jar
[INFO] progress: Installing org.eclipse.emf
[INFO] progress: Installing org.eclipse.rcptt.ecl.parser
[INFO] progress: Installing org.eclipse.rcptt.tesla.recording.canvas
[INFO] progress: Installing org.eclipse.rcptt.tesla.jface.text
[INFO] progress: Installing org.eclipse.rcptt.ecl.doc
[INFO] progress: Installing org.eclipse.rcptt.tesla.swt.aspects
[INFO] progress: Installing org.eclipse.emf.validation.ui
[INFO] progress: Installing org.eclipse.rcptt.tesla.runtime.feature.group
[INFO] progress: Installing org.eclipse.rcptt.ctx.preferences.aspects
[INFO] progress: Installing org.eclipse.emf.codegen.ecore.feature.group
[INFO] progress: Installing org.apache.xmlbeans
[INFO] progress: Installing org.eclipse.rcptt.ctx.script.impl
[INFO] progress: Installing org.eclipse.rcptt.tesla.recording.aspects.swt
[INFO] progress: Installing org.eclipse.emf.mapping.ecore.feature.jar
[INFO] progress: Installing org.eclipse.rcptt.watson.feature.group
[INFO] progress: Installing org.eclipse.rcptt.tesla.recording.gmf
[INFO] progress: Installing org.eclipse.emf.mapping.feature.group
[INFO] progress: Installing org.eclipse.rcptt.tesla.recording.aspects.gmf
[INFO] progress: Installing org.eclipse.equinox.weaving.hook
[INFO] progress: Installing org.eclipse.emf.edit.ui.feature.jar
[INFO] progress: Installing org.eclipse.rcptt.tesla.recording.aspects.gef
[INFO] progress: Installing org.eclipse.rcptt.util
[INFO] progress: Installing org.eclipse.rcptt.tesla.jface.text.aspects
[INFO] progress: Installing org.eclipse.emf.mapping.ui
[INFO] progress: Installing org.eclipse.rcptt.tesla.jdt
[INFO] progress: Installing org.eclipse.rcptt.ctx.preferences.impl
[INFO] progress: Installing org.eclipse.rcptt.util.resources
[INFO] progress: Installing org.eclipse.rcptt.tesla.recording.gef
[INFO] progress: Installing org.eclipse.rcptt.ecl.server.tcp
[INFO] progress: Installing org.eclipse.rcptt.core.ecl.core
[INFO] progress: Installing org.eclipse.emf.importer.java
[INFO] progress: Installing org.eclipse.rcptt.ctx.parameters.impl
[INFO] progress: Installing org.eclipse.emf.codegen.feature.jar
[INFO] progress: Installing org.eclipse.emf.common
[INFO] progress: Installing org.eclipse.emf.mapping.ecore
[INFO] progress: Installing org.eclipse.emf.mapping.ecore.editor.feature.jar
[INFO] progress: Installing org.eclipse.emf.common.feature.jar
[INFO] progress: Installing org.eclipse.rcptt.tesla.recording.swt
[INFO] progress: Installing org.eclipse.rcptt.tesla.properties.view
[INFO] progress: Installing org.eclipse.emf.mapping.ecore2ecore
[INFO] progress: Installing org.eclipse.emf.mapping.ecore.editor
[INFO] progress: Installing org.eclipse.rcptt.verifications.log.impl
[INFO] progress: Installing org.eclipse.emf.validation_root
[INFO] progress: Installing org.eclipse.emf.feature.jar
[INFO] progress: Installing file:/jobs/genie.rcptt/rcptt-all/workspace/modules/nebula/runtime-site/target/site/site.xml.rcptt
[INFO] progress: Installing org.eclipse.rcptt.tesla.feature.group
[INFO] progress: Installing org.eclipse.rcptt.runtime.ui
[INFO] progress: Installing org.eclipse.emf.importer.ecore
[INFO] progress: Installing org.eclipse.rcptt.runtime.feature.group
[INFO] progress: Installing org.eclipse.rcptt.tesla.ui.ide
[INFO] progress: Installing org.eclipse.emf.codegen.ecore.ui.feature.group
[INFO] progress: Installing org.eclipse.rcptt.tesla.gef.aspects
[INFO] progress: Installing org.eclipse.rcptt.core.swt
[INFO] progress: Installing org.eclipse.rcptt.ctx.resources.impl
[INFO] progress: Installing org.eclipse.emf.codegen.ecore.ui.feature.jar
[INFO] progress: Installing org.eclipse.rcptt.ctx.parameters
[INFO] progress: Installing org.eclipse.rcptt.verifications.log
[INFO] progress: Installing org.eclipse.rcptt.tesla.variables
[INFO] progress: Installing org.eclipse.rcptt.tesla.recording.aspects.jface.text
[INFO] progress: Installing org.eclipse.rcptt.tesla.workbench.texteditor.aspects
[INFO] progress: Installing org.eclipse.rcptt.verifications.text.impl
[INFO] progress: Installing org.eclipse.rcptt.tesla.recording.jface.text
[INFO] progress: Installing org.eclipse.rcptt.ecl.operations
[INFO] progress: Installing org.eclipse.emf.feature.group
[INFO] progress: Installing org.eclipse.rcptt.util.swt
[INFO] progress: Installing org.eclipse.emf.mapping.ecore2xml
[INFO] progress: Installing org.eclipse.rcptt.ecl.debug.runtime
[INFO] progress: Installing org.eclipse.rcptt.tesla.swt
[INFO] progress: Installing org.eclipse.emf.mapping
[INFO] progress: Installing org.eclipse.rcptt.tesla.jface.databinding
[INFO] progress: Installing org.eclipse.rcptt.watson.core
[INFO] progress: Installing org.eclipse.emf.exporter
[INFO] progress: Installing org.eclipse.rcptt.core
[INFO] progress: Installing org.eclipse.rcptt.core.ecl.debug
[INFO] progress: Installing org.eclipse.emf.converter.feature.jar
[INFO] progress: Installing org.eclipse.rcptt.verifications.time.impl
[INFO] progress: Installing file:/jobs/genie.rcptt/rcptt-all/workspace/modules/testrail/runtime-site/target/site/site.xml.rcptt
[INFO] progress: Installing org.eclipse.rcptt.tesla.canvas
[INFO] progress: Installing org.eclipse.rcptt.tesla.jface.databinding.aspects
[INFO] progress: Installing org.eclipse.emf.transaction_root
[INFO] progress: Installing org.eclipse.rcptt.verifications.time
[INFO] progress: Installing org.eclipse.emf.databinding.edit.feature.jar
[INFO] progress: Installing org.eclipse.rcptt.ecl.platform.feature.jar
[INFO] progress: Installing org.eclipse.rcptt.tesla.jface.databinding.observable.aspects
[INFO] progress: Installing 201706090642.Default
[INFO] progress: Installing org.eclipse.emf.ant
[INFO] progress: Installing org.eclipse.rcptt.tesla.jface.aspects
[INFO] progress: Installing org.aspectj.runtime
[INFO] progress: Installing org.eclipse.emf.codegen.ecore.ui
[INFO] progress: Installing org.apache.poi
[INFO] progress: Installing org.eclipse.emf.transaction.feature.group
[INFO] progress: Installing org.eclipse.emf.codegen
[INFO] progress: Installing org.eclipse.emf.query_root
[INFO] progress: Installing org.eclipse.emf.codegen.ui
[INFO] progress: Installing org.eclipse.rcptt.core.swt.win32
[INFO] progress: Installing org.eclipse.emf.query.feature.group
[INFO] progress: Installing org.eclipse.rcptt.testrail.ecl.impl
[INFO] progress: Installing org.eclipse.rcptt.ecl.platform
[INFO] progress: Installing org.eclipse.emf.converter
[INFO] progress: Installing org.eclipse.emf.ecore.feature.group
[INFO] progress: Installing org.eclipse.rcptt.ecl.data.apache.poi
[INFO] progress: Installing org.eclipse.rcptt.ecl.platform.feature.group
[INFO] progress: Installing org.eclipse.rcptt.tesla.recording.aspects.draw2d
[INFO] progress: Installing org.eclipse.rcptt.ecl.data.apache.poi.impl
[INFO] progress: Installing org.eclipse.emf.mapping.ecore.feature.group
[INFO] progress: Installing org.eclipse.emf.mapping.ui.feature.group
[INFO] progress: Installing org.eclipse.rcptt.core.launching
[INFO] progress: Installing org.eclipse.rcptt.watson.feature.jar
[INFO] progress: Installing org.eclipse.rcptt.ecl.core.feature.group
[INFO] progress: Installing org.eclipse.emf.codegen.feature.group
[INFO] progress: Installing org.eclipse.emf.codegen.ui.feature.jar
[INFO] progress: Installing org.eclipse.emf.ecore.editor.feature.group
[INFO] progress: Installing org.eclipse.rcptt.ctx.preferences
[INFO] progress: Installing org.eclipse.rcptt.ctx.filesystem.impl
[INFO] progress: Installing org.eclipse.rcptt.ctx.debug.impl
[INFO] progress: Installing org.eclipse.emf.mapping.ui.feature.jar
[INFO] progress: Installing org.apache.poi.ooxml
[INFO] progress: Installing org.eclipse.emf.ecore
[INFO] progress: Installing org.eclipse.emf.common.feature.group
[INFO] progress: Installing org.eclipse.rcptt.ecl.server.feature.jar
[INFO] progress: Installing org.eclipse.emf.databinding
[INFO] progress: Installing org.eclipse.rcptt.ecl.server.feature.group
[INFO] progress: Installing org.eclipse.emf.databinding.feature.group
[INFO] progress: Installing org.eclipse.rcptt.ctx.workbench.aspect
[INFO] progress: Installing org.eclipse.rcptt.watson.runtime.feature.group
[INFO] progress: Installing org.eclipse.rcptt.ctx.filesystem
[INFO] progress: Installing org.eclipse.emf.databinding.feature.jar
[INFO] progress: Installing org.eclipse.emf.query.feature.jar
[INFO] progress: Installing org.eclipse.rcptt.tesla.recording.nebula
[INFO] progress: Installing org.eclipse.rcptt.tesla.ecl
[INFO] progress: Installing org.eclipse.rcptt.tesla.ecl.runtime.feature.group
[INFO] progress: Installing org.eclipse.emf.ecore.editor.feature.jar
[INFO] progress: Installing org.eclipse.rcptt.tesla.nebula.ecl.impl
[INFO] progress: Installing org.eclipse.rcptt.ecl.core.feature.jar
[INFO] progress: Installing org.eclipse.rcptt.tesla.recording.core
[INFO] progress: Installing org.eclipse.emf.ecore.feature.jar
[INFO] progress: Installing org.aspectj.weaver
[INFO] progress: Installing org.eclipse.emf.query
[INFO] progress: Installing org.eclipse.emf.codegen.ui.feature.group
[INFO] progress: Installing org.eclipse.rcptt.tesla.swt.fragment
[INFO] progress: Installing org.eclipse.emf.validation.feature.group
[INFO] progress: Installing org.eclipse.rcptt.module.nebula.runtime.feature.jar
[INFO] progress: Installing org.eclipse.rcptt.tesla.nebula.ecl
[INFO] progress: Installing org.eclipse.rcptt.ecl.data
[INFO] progress: Installing org.eclipse.rcptt.tesla.gmf
[INFO] progress: Installing org.eclipse.rcptt.tesla.ui.ide.aspects
[INFO] progress: Installing org.eclipse.rcptt.expandbar
[INFO] progress: Installing org.eclipse.rcptt.tesla.feature.jar
[INFO] progress: Installing org.eclipse.rcptt.core.swt.win64
[INFO] progress: Installing org.eclipse.emf.importer.rose
[INFO] progress: Installing org.eclipse.rcptt.ecl.core
[INFO] progress: Installing org.eclipse.emf.common.ui
[INFO] progress: Installing org.eclipse.rcptt.ctx.script
[INFO] progress: Installing org.eclipse.emf.ecore.editor
[INFO] progress: Installing org.eclipse.rcptt.tesla.recording.aspects.workbench.texteditor
[INFO] progress: Downloading org.eclipse.emf.validation_root
[INFO] progress: Downloading org.eclipse.emf.transaction_root
[INFO] progress: Downloading org.eclipse.emf.query_root
[INFO] progress: Preparing to commit the provisioning operation.
[INFO] progress: Committing the provisioning operation.
[INFO] progress: Reading plug-ins
[INFO] Target platform is valid.
[INFO] Looking for tests...
[INFO] Existing projects in workspace:
[INFO]     <none>
[INFO] Importing projects to workspace:
[INFO] Refreshing projects:
[INFO]     /jobs/genie.capella/capella-studio-gerrit/workspace/vpdsl/tests/capellastudio.vpdsl.qualityassessment.reverse.tests/target/projects/capellastudio.vpdsl.qualityassessment.reverse.tests... OK
[INFO] Refreshing projects:
[INFO]     capellastudio.vpdsl.qualityassessment.reverse.tests... OK
[INFO] Searching for tests in projects:
[INFO]     capellastudio.vpdsl.qualityassessment.reverse.tests... 
[INFO] Complete OK
[INFO] Testcase Artifacts:1
[INFO] AUT-0:Launching
[INFO] AUT-0:Product: org.polarsys.capella.studio.product.CapellaStudio
[INFO] AUT-0:Application: org.polarsys.capella.studio.product.application
[INFO] AUT-0:Architecture: x86_64
[INFO] 64bit arch is selected because AUT uses launcher library
[INFO] 	"plugins/org.eclipse.equinox.launcher.gtk.linux.x86_64_1.1.551.v20171108-1834" specified in config file: eclipse.ini
[INFO] /jobs/genie.capella/capella-studio-gerrit/workspace/vpdsl/tests/capellastudio.vpdsl.qualityassessment.reverse.tests/target/aut-ws-0: AUT arguments: -os ${target.os} -arch ${target.arch} -consoleLog
[INFO] /jobs/genie.capella/capella-studio-gerrit/workspace/vpdsl/tests/capellastudio.vpdsl.qualityassessment.reverse.tests/target/aut-ws-0: AUT VM arguments: -Dosgi.requiredJavaVersion=1.8 -Xms512m -Xmx2048m -XX:PermSize=256M -javaagent:/home/hudson/genie.capella/.jenkins/jobs/capella-studio-gerrit/workspace/.repository/org/jacoco/org.jacoco.agent/0.7.9/org.jacoco.agent-0.7.9-runtime.jar=destfile=/jobs/genie.capella/capella-studio-gerrit/workspace/vpdsl/tests/capellastudio.vpdsl.qualityassessment.reverse.tests/target/jacoco.exec -XX:MaxPermSize=128m
[INFO] Fail 1 (1) processed. 1 failed. spent: 0:00, 0:00 mins remaining. Reverse from Ecore. time: 153ms  Cause: Id can't be empty
[INFO] Failed Tests:
[INFO] Reverse from Ecore
[INFO] Process terminated. Shut down AUTs
[INFO] Runner exit code is: 56
[ERROR] There are test failures
[INFO] 
[INFO] --- rcptt-maven-plugin:2.2.0:package (default-package) @ capellastudio.vpdsl.qualityassessment.reverse.tests ---
[INFO] Building zip: /jobs/genie.capella/capella-studio-gerrit/workspace/vpdsl/tests/capellastudio.vpdsl.qualityassessment.reverse.tests/target/projects/capellastudio.vpdsl.qualityassessment.reverse.tests-1.3.1-SNAPSHOT.zip
[INFO] Building zip: /jobs/genie.capella/capella-studio-gerrit/workspace/vpdsl/tests/capellastudio.vpdsl.qualityassessment.reverse.tests/target/org.polarsys.capella-capellastudio.vpdsl.qualityassessment.reverse.tests-1.3.1-SNAPSHOT-result.zip
[INFO] aut1/out.txt already added, skipping
[INFO] 
[INFO] --- tycho-source-plugin:1.1.0:plugin-source (plugin-source) @ capellastudio.vpdsl.qualityassessment.reverse.tests ---
[INFO] 
[INFO] --- tycho-source-feature-plugin:1.1.0:source-feature (source-feature) @ capellastudio.vpdsl.qualityassessment.reverse.tests ---
[INFO] 
[INFO] --< org.polarsys.capella:capellastudio.vpdsl.qualityassessment.tests >--
[INFO] Building capellastudio.vpdsl.qualityassessment.tests 1.3.1-SNAPSHOT [27/30]
[INFO] -----------------------------[ rcpttTest ]------------------------------
[INFO] 
[INFO] --- maven-clean-plugin:2.5:clean (default-clean) @ capellastudio.vpdsl.qualityassessment.tests ---
[INFO] 
[INFO] --- jacoco-maven-plugin:0.7.9:prepare-agent (default) @ capellastudio.vpdsl.qualityassessment.tests ---
[INFO] failsafeArgline set to -javaagent:/home/hudson/genie.capella/.jenkins/jobs/capella-studio-gerrit/workspace/.repository/org/jacoco/org.jacoco.agent/0.7.9/org.jacoco.agent-0.7.9-runtime.jar=destfile=/jobs/genie.capella/capella-studio-gerrit/workspace/vpdsl/tests/capellastudio.vpdsl.qualityassessment.tests/target/jacoco.exec
[INFO] 
[INFO] --- rcptt-maven-plugin:2.2.0:resources (default-resources) @ capellastudio.vpdsl.qualityassessment.tests ---
[INFO] Resolving artifact org.eclipse.rcptt.runner:rcptt.runner:zip:2.2.0, this may take a while ...
[INFO] Artifact org.eclipse.rcptt.runner:rcptt.runner:zip:2.2.0 is resolved to /home/hudson/genie.capella/.jenkins/jobs/capella-studio-gerrit/workspace/.repository/org/eclipse/rcptt/runner/rcptt.runner/2.2.0/rcptt.runner-2.2.0.zip
[INFO] Using AUT from /jobs/genie.capella/capella-studio-gerrit/workspace/vpdsl/tests/capellastudio.vpdsl.qualityassessment.tests/../../../releng/plugins/org.polarsys.capella.studio.releng.product/target/products/org.polarsys.capella.studio.releng.product/linux/gtk/x86_64
[INFO] Extracting RCPTT runner to /jobs/genie.capella/capella-studio-gerrit/workspace/vpdsl/tests/capellastudio.vpdsl.qualityassessment.tests/target/runner
[INFO] Copying project contents to target directory...
[INFO] 
[INFO] --- rcptt-maven-plugin:2.2.0:execute (default-execute) @ capellastudio.vpdsl.qualityassessment.tests ---
[INFO] Runner command line is /bin/sh -c cd /jobs/genie.capella/capella-studio-gerrit/workspace/vpdsl/tests/capellastudio.vpdsl.qualityassessment.tests/target/runner/eclipse && /opt/public/common/java/oracle/jdk1.8.0_192_x64/jre/bin/java -Xms128m -Xmx256m -Dorg.eclipse.rcptt.runner.returnTestFailure=true -jar /jobs/genie.capella/capella-studio-gerrit/workspace/vpdsl/tests/capellastudio.vpdsl.qualityassessment.tests/target/runner/eclipse/plugins/org.eclipse.equinox.launcher_1.4.0.v20161219-1356.jar -application org.eclipse.rcptt.runner.headless -runnerPlatform swt -data /jobs/genie.capella/capella-studio-gerrit/workspace/vpdsl/tests/capellastudio.vpdsl.qualityassessment.tests/target/runner-workspace -aut /jobs/genie.capella/capella-studio-gerrit/workspace/vpdsl/tests/capellastudio.vpdsl.qualityassessment.tests/../../../releng/plugins/org.polarsys.capella.studio.releng.product/target/products/org.polarsys.capella.studio.releng.product/linux/gtk/x86_64 -autWsPrefix /jobs/genie.capella/capella-studio-gerrit/workspace/vpdsl/tests/capellastudio.vpdsl.qualityassessment.tests/target/aut-ws- -autConsolePrefix /jobs/genie.capella/capella-studio-gerrit/workspace/vpdsl/tests/capellastudio.vpdsl.qualityassessment.tests/target/results/aut-console- -autVMArgs -javaagent:/home/hudson/genie.capella/.jenkins/jobs/capella-studio-gerrit/workspace/.repository/org/jacoco/org.jacoco.agent/0.7.9/org.jacoco.agent-0.7.9-runtime.jar=destfile=/jobs/genie.capella/capella-studio-gerrit/workspace/vpdsl/tests/capellastudio.vpdsl.qualityassessment.tests/target/jacoco.exec -q7report /jobs/genie.capella/capella-studio-gerrit/workspace/vpdsl/tests/capellastudio.vpdsl.qualityassessment.tests/target/results/capellastudio.vpdsl.qualityassessment.tests.report -htmlReport /jobs/genie.capella/capella-studio-gerrit/workspace/vpdsl/tests/capellastudio.vpdsl.qualityassessment.tests/target/results/capellastudio.vpdsl.qualityassessment.tests.html -junitReport /jobs/genie.capella/capella-studio-gerrit/workspace/vpdsl/tests/capellastudio.vpdsl.qualityassessment.tests/target/surefire-reports/TEST-capellastudio.vpdsl.qualityassessment.tests.xml -import /jobs/genie.capella/capella-studio-gerrit/workspace/vpdsl/tests/capellastudio.vpdsl.qualityassessment.tests/target/projects/capellastudio.vpdsl.qualityassessment.tests -testOptions 'testExecTimeout=300;execTimeout=3600' -timeout 3600 -shutdownListenerPort 8788
[INFO] The execution timeout is set to 3600 seconds
[ERROR] Picked up JAVA_TOOL_OPTIONS: -Xmx2G -Djava.io.tmpdir=/tmp/genie.capella
[INFO] Started at Mon Jul 15 03:52:13 EDT 2019
[INFO] RCPTT Runner version: 2.2.0
[INFO] Initializing target platform...
[INFO] Begin task: Create AUT configuration
[INFO] progress: Resolving Target Contents...
[INFO] progress: Reading plug-ins
[INFO] progress: Fetching p2.index from platform:/plugin/org.eclipse.rcptt.updates.runtime.e4x/q7/
[INFO] progress: Adding repository platform:///plugin/org.eclipse.rcptt.updates.runtime.e4x/q7/
[INFO] progress: Fetching content.jar from platform:/plugin/org.eclipse.rcptt.updates.runtime.e4x/q7/
[INFO] progress: Fetching p2.index from platform:/plugin/org.eclipse.rcptt.updates.runtime.e4x/q7/
[INFO] progress: Adding repository platform:///plugin/org.eclipse.rcptt.updates.runtime.e4x/q7/
[INFO] progress: Fetching content.jar from platform:/plugin/org.eclipse.rcptt.updates.runtime.e4x/q7/
[INFO] progress: Fetching p2.index from platform:/plugin/org.eclipse.rcptt.updates.runtime.e4x/q7/
[INFO] progress: Adding repository platform:///plugin/org.eclipse.rcptt.updates.runtime.e4x/q7/
[INFO] progress: Fetching artifacts.jar from platform:/plugin/org.eclipse.rcptt.updates.runtime.e4x/q7/
[INFO] progress: Downloading org.antlr.runtime
[INFO] progress: Adding repository platform:///plugin/org.eclipse.rcptt.updates.aspectj.e44x/dependencies/
[INFO] progress: Fetching content.jar from platform:/plugin/org.eclipse.rcptt.updates.aspectj.e44x/dependencies/
[INFO] progress: Adding repository platform:///plugin/org.eclipse.rcptt.updates.aspectj.e44x/dependencies/
[INFO] progress: Fetching artifacts.jar from platform:/plugin/org.eclipse.rcptt.updates.aspectj.e44x/dependencies/
[INFO] progress: Downloading org.aspectj.runtime
[INFO] progress: Downloading org.aspectj.weaver
[INFO] progress: Downloading org.eclipse.equinox.weaving.hook
[INFO] progress: Downloading org.eclipse.equinox.weaving.aspectj
[INFO] progress: Adding repository platform:///plugin/org.eclipse.rcptt.updates.kepler/dependencies/
[INFO] progress: Fetching content.jar from platform:/plugin/org.eclipse.rcptt.updates.kepler/dependencies/
[INFO] progress: Adding repository platform:///plugin/org.eclipse.rcptt.updates.kepler/dependencies/
[INFO] progress: Fetching artifacts.jar from platform:/plugin/org.eclipse.rcptt.updates.kepler/dependencies/
[INFO] progress: Downloading org.eclipse.emf.converter
[INFO] progress: Downloading org.eclipse.emf.mapping.ecore2ecore
[INFO] progress: Downloading org.eclipse.emf.codegen.ecore
[INFO] progress: Downloading org.eclipse.emf.ecore.change
[INFO] progress: Downloading org.eclipse.emf.validation
[INFO] progress: Downloading org.eclipse.emf.transaction.ui
[INFO] progress: Downloading org.eclipse.emf.mapping.ecore.editor
[INFO] progress: Downloading org.eclipse.emf.validation_root
[INFO] progress: Downloading org.eclipse.emf
[INFO] progress: Downloading org.eclipse.emf.ecore.change.edit
[INFO] progress: Downloading org.eclipse.emf.importer.ecore
[INFO] progress: Downloading org.eclipse.emf.codegen.ui
[INFO] progress: Downloading org.eclipse.emf.mapping.ecore2ecore.editor
[INFO] progress: Downloading org.eclipse.emf.ecore.xmi
[INFO] progress: Downloading org.eclipse.emf.mapping.ui
[INFO] progress: Downloading org.eclipse.emf.databinding.edit
[INFO] progress: Downloading org.eclipse.emf.mapping
[INFO] progress: Downloading org.eclipse.emf.ecore
[INFO] progress: Downloading org.eclipse.emf.codegen.ecore.ui
[INFO] progress: Downloading org.eclipse.emf.importer
[INFO] progress: Downloading org.eclipse.emf.mapping.ecore2xml.ui
[INFO] progress: Downloading org.eclipse.emf.databinding
[INFO] progress: Downloading org.eclipse.emf
[INFO] progress: Downloading org.eclipse.emf.ecore.edit
[INFO] progress: Downloading org.eclipse.emf.databinding
[INFO] progress: Downloading org.eclipse.emf.validation.ui
[INFO] progress: Downloading org.eclipse.emf.query
[INFO] progress: Downloading org.eclipse.emf.transaction
[INFO] progress: Downloading org.eclipse.emf.ecore.editor
[INFO] progress: Downloading org.eclipse.emf.codegen.ecore
[INFO] progress: Downloading org.eclipse.emf.common.ui
[INFO] progress: Downloading org.eclipse.emf.mapping.ecore2xml
[INFO] progress: Downloading org.eclipse.emf.mapping.ecore
[INFO] progress: Downloading org.eclipse.emf.ecore
[INFO] progress: Downloading org.eclipse.emf.query
[INFO] progress: Downloading org.eclipse.emf.mapping
[INFO] progress: Downloading org.eclipse.emf.edit.ui
[INFO] progress: Downloading org.eclipse.emf.exporter
[INFO] progress: Downloading org.eclipse.emf.mapping.ui
[INFO] progress: Downloading org.eclipse.emf.converter
[INFO] progress: Downloading org.eclipse.emf.transaction
[INFO] progress: Downloading org.eclipse.emf.transaction_root
[INFO] progress: Downloading org.eclipse.emf.databinding.edit
[INFO] progress: Downloading org.eclipse.emf.ecore.edit
[INFO] progress: Downloading org.eclipse.emf.validation
[INFO] progress: Downloading org.eclipse.emf.importer.rose
[INFO] progress: Downloading org.eclipse.emf.edit.ui
[INFO] progress: Downloading org.eclipse.emf.ant
[INFO] progress: Downloading org.eclipse.emf.importer.java
[INFO] progress: Downloading org.eclipse.emf.codegen.ecore.ui
[INFO] progress: Downloading org.eclipse.emf.edit
[INFO] progress: Downloading org.eclipse.emf.codegen
[INFO] progress: Downloading org.eclipse.emf.common.ui
[INFO] progress: Downloading org.eclipse.emf.common
[INFO] progress: Downloading org.eclipse.emf.ecore.editor
[INFO] progress: Downloading org.eclipse.emf.mapping.ecore
[INFO] progress: Downloading org.eclipse.emf.mapping.ecore.editor
[INFO] progress: Downloading org.eclipse.emf.validation.ui.ide
[INFO] progress: Downloading org.eclipse.emf.edit
[INFO] progress: Downloading org.eclipse.emf.common
[INFO] progress: Downloading org.eclipse.emf.codegen
[INFO] progress: Downloading org.eclipse.emf.query_root
[INFO] progress: Downloading org.eclipse.emf.codegen.ui
[INFO] progress: Adding repository platform:///plugin/org.eclipse.rcptt.module.nebula.updates/runtime/
[INFO] progress: Fetching content.jar from platform:/plugin/org.eclipse.rcptt.module.nebula.updates/runtime/
[INFO] progress: Adding repository platform:///plugin/org.eclipse.rcptt.module.nebula.updates/runtime/
[INFO] progress: Fetching artifacts.jar from platform:/plugin/org.eclipse.rcptt.module.nebula.updates/runtime/
[INFO] progress: Adding repository platform:///plugin/org.eclipse.rcptt.module.testrail.updates/runtime/
[INFO] progress: Fetching content.jar from platform:/plugin/org.eclipse.rcptt.module.testrail.updates/runtime/
[INFO] progress: Adding repository platform:///plugin/org.eclipse.rcptt.module.testrail.updates/runtime/
[INFO] progress: Fetching artifacts.jar from platform:/plugin/org.eclipse.rcptt.module.testrail.updates/runtime/
[INFO] progress: Adding repository platform:///plugin/org.eclipse.rcptt.updates.extra/dependencies/
[INFO] progress: Fetching content.jar from platform:/plugin/org.eclipse.rcptt.updates.extra/dependencies/
[INFO] progress: Adding repository platform:///plugin/org.eclipse.rcptt.updates.extra/dependencies/
[INFO] progress: Fetching artifacts.jar from platform:/plugin/org.eclipse.rcptt.updates.extra/dependencies/
[INFO] progress: Downloading org.apache.poi.ooxml
[INFO] progress: Downloading org.apache.xmlbeans
[INFO] progress: Downloading org.apache.poi.ooxml.schemas
[INFO] progress: Downloading org.dom4j
[INFO] progress: Downloading org.apache.poi
[INFO] progress: Resolving Target Contents...
[INFO] progress: Reading plug-ins
[INFO] progress: Fetching p2.index from platform:/plugin/org.eclipse.rcptt.updates.runtime.e4x/q7/
[INFO] progress: Fetching content.jar from platform:/plugin/org.eclipse.rcptt.updates.runtime.e4x/q7/
[INFO] progress: Fetching content.jar from platform:/plugin/org.eclipse.rcptt.updates.aspectj.e44x/dependencies/
[INFO] progress: Fetching content.jar from platform:/plugin/org.eclipse.rcptt.updates.kepler/dependencies/
[INFO] progress: Fetching content.jar from platform:/plugin/org.eclipse.rcptt.module.nebula.updates/runtime/
[INFO] progress: Fetching content.jar from platform:/plugin/org.eclipse.rcptt.module.testrail.updates/runtime/
[INFO] progress: Fetching content.jar from platform:/plugin/org.eclipse.rcptt.updates.extra/dependencies/
[INFO] progress: Fetching p2.index from platform:/plugin/org.eclipse.rcptt.updates.runtime.e4x/q7/
[INFO] progress: Fetching artifacts.jar from platform:/plugin/org.eclipse.rcptt.updates.runtime.e4x/q7/
[INFO] progress: Fetching artifacts.jar from platform:/plugin/org.eclipse.rcptt.module.testrail.updates/runtime/
[INFO] progress: Fetching artifacts.jar from platform:/plugin/org.eclipse.rcptt.updates.kepler/dependencies/
[INFO] progress: Fetching artifacts.jar from platform:/plugin/org.eclipse.rcptt.module.nebula.updates/runtime/
[INFO] progress: Fetching artifacts.jar from platform:/plugin/org.eclipse.rcptt.updates.aspectj.e44x/dependencies/
[INFO] progress: Fetching artifacts.jar from platform:/plugin/org.eclipse.rcptt.updates.extra/dependencies/
[INFO] progress: Downloading org.eclipse.emf.validation_root
[INFO] progress: Downloading org.eclipse.emf.transaction_root
[INFO] progress: Downloading org.eclipse.emf.query_root
[INFO] progress: Installing org.eclipse.emf.ecore.change
[INFO] progress: Installing org.eclipse.rcptt.tesla.workbench.aspects.e4x
[INFO] progress: Installing org.eclipse.rcptt.tesla.core.am
[INFO] progress: Installing org.eclipse.rcptt.tesla.gmf.aspects
[INFO] progress: Installing org.eclipse.rcptt.watson.aspects.swt
[INFO] progress: Installing org.eclipse.rcptt.ecl.client.tcp
[INFO] progress: Installing org.eclipse.rcptt.tesla.jdt.aspects
[INFO] progress: Installing org.eclipse.rcptt.tesla.ecl.feature.group
[INFO] progress: Installing org.eclipse.rcptt.tesla.recording.aspects.forms
[INFO] progress: Installing org.eclipse.rcptt.watson.jface
[INFO] progress: Installing org.eclipse.emf.ecore.xmi
[INFO] progress: Installing org.eclipse.rcptt.verifications
[INFO] progress: Installing org.eclipse.emf.mapping.feature.jar
[INFO] progress: Installing org.eclipse.rcptt.tesla.jface.fragment
[INFO] progress: Installing org.dom4j
[INFO] progress: Installing org.eclipse.rcptt.testrail.ecl
[INFO] progress: Installing org.eclipse.rcptt.ecl.dispatch
[INFO] progress: Installing org.eclipse.emf.importer
[INFO] progress: Installing org.eclipse.emf.mapping.ecore2xml.ui
[INFO] progress: Installing org.eclipse.rcptt.watson.jobs
[INFO] progress: Installing org.eclipse.rcptt.tesla.runtime.feature.jar
[INFO] progress: Installing org.eclipse.rcptt.verifications.tree
[INFO] progress: Installing org.eclipse.rcptt.reporting
[INFO] progress: Installing org.eclipse.emf.ecore.edit
[INFO] progress: Installing org.eclipse.rcptt.forms.impl
[INFO] progress: Installing org.eclipse.emf.edit.feature.group
[INFO] progress: Installing org.eclipse.emf.transaction
[INFO] progress: Installing org.eclipse.rcptt.tesla.jface.text.reconciler.aspects
[INFO] progress: Installing org.eclipse.rcptt.ecl.perf
[INFO] progress: Installing org.eclipse.emf.codegen.ecore.feature.jar
[INFO] progress: Installing org.eclipse.rcptt.expandbar.runtime
[INFO] progress: Installing org.eclipse.rcptt.tesla.recording.draw2d
[INFO] progress: Installing org.eclipse.emf.mapping.ecore.editor.feature.group
[INFO] progress: Installing org.eclipse.emf.common.ui.feature.jar
[INFO] progress: Installing org.eclipse.rcptt.ecl.platform.ui.feature.jar
[INFO] progress: Installing org.eclipse.emf.ecore.edit.feature.group
[INFO] progress: Installing org.eclipse.rcptt.ctx.debug
[INFO] progress: Installing org.eclipse.rcptt.module.nebula.runtime.feature.group
[INFO] progress: Installing org.eclipse.rcptt.tesla.nebula
[INFO] progress: Installing org.eclipse.rcptt.tesla.recording.aspects.workbench
[INFO] progress: Installing org.eclipse.rcptt.tesla.core.context
[INFO] progress: Installing org.eclipse.emf.transaction.feature.jar
[INFO] progress: Installing org.eclipse.rcptt.tesla.recording.workbench.texteditor
[INFO] progress: Installing org.eclipse.rcptt.tesla.core
[INFO] progress: Installing org.eclipse.rcptt.tesla.nebula.impl
[INFO] progress: Installing org.eclipse.rcptt.ctx.group
[INFO] progress: Installing org.eclipse.emf.ecore.edit.feature.jar
[INFO] progress: Installing org.eclipse.rcptt.runtime.feature.jar
[INFO] progress: Installing org.eclipse.emf.validation
[INFO] progress: Installing org.eclipse.rcptt.ecl.platform.ui.feature.group
[INFO] progress: Installing org.eclipse.emf.edit.ui
[INFO] progress: Installing org.eclipse.rcptt.tesla.workbench.texteditor
[INFO] progress: Installing org.eclipse.emf.edit.feature.jar
[INFO] progress: Installing org.eclipse.equinox.weaving.aspectj
[INFO] progress: Installing org.eclipse.emf.validation.ui.ide
[INFO] progress: Installing org.eclipse.emf.edit
[INFO] progress: Installing org.eclipse.rcptt.ctx.workbench.impl
[INFO] progress: Installing org.eclipse.rcptt.tesla.ecl.impl
[INFO] progress: Installing org.eclipse.rcptt.tesla.gef
[INFO] progress: Installing org.eclipse.rcptt.ecl.interop
[INFO] progress: Installing org.eclipse.rcptt.tesla.ecl.runtime.feature.jar
[INFO] progress: Installing org.eclipse.rcptt.ctx.workbench
[INFO] progress: Installing org.eclipse.rcptt.verifications.text
[INFO] progress: Installing org.eclipse.emf.converter.feature.group
[INFO] progress: Installing org.eclipse.emf.codegen.ecore
[INFO] progress: Installing org.eclipse.emf.validation.feature.jar
[INFO] progress: Installing org.eclipse.emf.transaction.ui
[INFO] progress: Installing org.eclipse.emf.databinding.edit.feature.group
[INFO] progress: Installing org.eclipse.rcptt.logging
[INFO] progress: Installing org.eclipse.rcptt.ctx.resources
[INFO] progress: Installing org.eclipse.rcptt.module.testrail.runtime.feature.group
[INFO] progress: Installing org.eclipse.rcptt.tesla.recording.core.ecl
[INFO] progress: Installing org.eclipse.rcptt.ctx.group.impl
[INFO] progress: Installing org.eclipse.rcptt.tesla.recording.aspects.jface
[INFO] progress: Installing org.eclipse.emf.common.ui.feature.group
[INFO] progress: Installing org.apache.poi.ooxml.schemas
[INFO] progress: Installing org.eclipse.emf.ecore.change.edit
[INFO] progress: Installing org.eclipse.rcptt.core.scenario
[INFO] progress: Installing org.eclipse.emf.mapping.ecore2ecore.editor
[INFO] progress: Installing org.antlr.runtime
[INFO] progress: Installing org.eclipse.rcptt.module.testrail.runtime.feature.jar
[INFO] progress: Installing org.eclipse.rcptt.watson.aspects.jobs
[INFO] progress: Installing org.eclipse.rcptt.ecl.platform.ui
[INFO] progress: Installing org.eclipse.emf.databinding.edit
[INFO] progress: Installing org.eclipse.rcptt.tesla.swt.e4x
[INFO] progress: Installing org.eclipse.rcptt.ecl.filesystem
[INFO] progress: Installing org.eclipse.rcptt.tesla.jobs.aspects
[INFO] progress: Installing org.eclipse.rcptt.tesla.ecl.feature.jar
[INFO] progress: Installing org.eclipse.emf.edit.ui.feature.group
[INFO] progress: Installing org.eclipse.rcptt.verifications.tree.impl
[INFO] progress: Installing org.eclipse.rcptt.watson.runtime.feature.jar
[INFO] progress: Installing org.eclipse.emf
[INFO] progress: Installing org.eclipse.rcptt.ecl.parser
[INFO] progress: Installing org.eclipse.rcptt.tesla.recording.canvas
[INFO] progress: Installing org.eclipse.rcptt.tesla.jface.text
[INFO] progress: Installing org.eclipse.rcptt.ecl.doc
[INFO] progress: Installing org.eclipse.rcptt.tesla.swt.aspects
[INFO] progress: Installing org.eclipse.emf.validation.ui
[INFO] progress: Installing org.eclipse.rcptt.tesla.runtime.feature.group
[INFO] progress: Installing org.eclipse.rcptt.ctx.preferences.aspects
[INFO] progress: Installing org.eclipse.emf.codegen.ecore.feature.group
[INFO] progress: Installing org.apache.xmlbeans
[INFO] progress: Installing org.eclipse.rcptt.ctx.script.impl
[INFO] progress: Installing org.eclipse.rcptt.tesla.recording.aspects.swt
[INFO] progress: Installing org.eclipse.emf.mapping.ecore.feature.jar
[INFO] progress: Installing org.eclipse.rcptt.watson.feature.group
[INFO] progress: Installing org.eclipse.rcptt.tesla.recording.gmf
[INFO] progress: Installing org.eclipse.emf.mapping.feature.group
[INFO] progress: Installing org.eclipse.rcptt.tesla.recording.aspects.gmf
[INFO] progress: Installing org.eclipse.equinox.weaving.hook
[INFO] progress: Installing org.eclipse.emf.edit.ui.feature.jar
[INFO] progress: Installing org.eclipse.rcptt.tesla.recording.aspects.gef
[INFO] progress: Installing org.eclipse.rcptt.util
[INFO] progress: Installing org.eclipse.rcptt.tesla.jface.text.aspects
[INFO] progress: Installing org.eclipse.emf.mapping.ui
[INFO] progress: Installing org.eclipse.rcptt.tesla.jdt
[INFO] progress: Installing org.eclipse.rcptt.ctx.preferences.impl
[INFO] progress: Installing org.eclipse.rcptt.util.resources
[INFO] progress: Installing org.eclipse.rcptt.tesla.recording.gef
[INFO] progress: Installing org.eclipse.rcptt.ecl.server.tcp
[INFO] progress: Installing org.eclipse.rcptt.core.ecl.core
[INFO] progress: Installing org.eclipse.emf.importer.java
[INFO] progress: Installing org.eclipse.rcptt.ctx.parameters.impl
[INFO] progress: Installing org.eclipse.emf.codegen.feature.jar
[INFO] progress: Installing org.eclipse.emf.common
[INFO] progress: Installing org.eclipse.emf.mapping.ecore
[INFO] progress: Installing org.eclipse.emf.mapping.ecore.editor.feature.jar
[INFO] progress: Installing org.eclipse.emf.common.feature.jar
[INFO] progress: Installing org.eclipse.rcptt.tesla.recording.swt
[INFO] progress: Installing org.eclipse.rcptt.tesla.properties.view
[INFO] progress: Installing org.eclipse.emf.mapping.ecore2ecore
[INFO] progress: Installing org.eclipse.emf.mapping.ecore.editor
[INFO] progress: Installing org.eclipse.rcptt.verifications.log.impl
[INFO] progress: Installing org.eclipse.emf.validation_root
[INFO] progress: Installing org.eclipse.emf.feature.jar
[INFO] progress: Installing file:/jobs/genie.rcptt/rcptt-all/workspace/modules/nebula/runtime-site/target/site/site.xml.rcptt
[INFO] progress: Installing org.eclipse.rcptt.tesla.feature.group
[INFO] progress: Installing org.eclipse.rcptt.runtime.ui
[INFO] progress: Installing org.eclipse.emf.importer.ecore
[INFO] progress: Installing org.eclipse.rcptt.runtime.feature.group
[INFO] progress: Installing org.eclipse.rcptt.tesla.ui.ide
[INFO] progress: Installing org.eclipse.emf.codegen.ecore.ui.feature.group
[INFO] progress: Installing org.eclipse.rcptt.tesla.gef.aspects
[INFO] progress: Installing org.eclipse.rcptt.core.swt
[INFO] progress: Installing org.eclipse.rcptt.ctx.resources.impl
[INFO] progress: Installing org.eclipse.emf.codegen.ecore.ui.feature.jar
[INFO] progress: Installing org.eclipse.rcptt.ctx.parameters
[INFO] progress: Installing org.eclipse.rcptt.verifications.log
[INFO] progress: Installing org.eclipse.rcptt.tesla.variables
[INFO] progress: Installing org.eclipse.rcptt.tesla.recording.aspects.jface.text
[INFO] progress: Installing org.eclipse.rcptt.tesla.workbench.texteditor.aspects
[INFO] progress: Installing org.eclipse.rcptt.verifications.text.impl
[INFO] progress: Installing org.eclipse.rcptt.tesla.recording.jface.text
[INFO] progress: Installing org.eclipse.rcptt.ecl.operations
[INFO] progress: Installing org.eclipse.emf.feature.group
[INFO] progress: Installing org.eclipse.rcptt.util.swt
[INFO] progress: Installing org.eclipse.emf.mapping.ecore2xml
[INFO] progress: Installing org.eclipse.rcptt.ecl.debug.runtime
[INFO] progress: Installing org.eclipse.rcptt.tesla.swt
[INFO] progress: Installing org.eclipse.emf.mapping
[INFO] progress: Installing org.eclipse.rcptt.tesla.jface.databinding
[INFO] progress: Installing org.eclipse.rcptt.watson.core
[INFO] progress: Installing org.eclipse.emf.exporter
[INFO] progress: Installing org.eclipse.rcptt.core
[INFO] progress: Installing org.eclipse.rcptt.core.ecl.debug
[INFO] progress: Installing org.eclipse.emf.converter.feature.jar
[INFO] progress: Installing org.eclipse.rcptt.verifications.time.impl
[INFO] progress: Installing file:/jobs/genie.rcptt/rcptt-all/workspace/modules/testrail/runtime-site/target/site/site.xml.rcptt
[INFO] progress: Installing org.eclipse.rcptt.tesla.canvas
[INFO] progress: Installing org.eclipse.rcptt.tesla.jface.databinding.aspects
[INFO] progress: Installing org.eclipse.emf.transaction_root
[INFO] progress: Installing org.eclipse.rcptt.verifications.time
[INFO] progress: Installing org.eclipse.emf.databinding.edit.feature.jar
[INFO] progress: Installing org.eclipse.rcptt.ecl.platform.feature.jar
[INFO] progress: Installing org.eclipse.rcptt.tesla.jface.databinding.observable.aspects
[INFO] progress: Installing 201706090642.Default
[INFO] progress: Installing org.eclipse.emf.ant
[INFO] progress: Installing org.eclipse.rcptt.tesla.jface.aspects
[INFO] progress: Installing org.aspectj.runtime
[INFO] progress: Installing org.eclipse.emf.codegen.ecore.ui
[INFO] progress: Installing org.apache.poi
[INFO] progress: Installing org.eclipse.emf.transaction.feature.group
[INFO] progress: Installing org.eclipse.emf.codegen
[INFO] progress: Installing org.eclipse.emf.query_root
[INFO] progress: Installing org.eclipse.emf.codegen.ui
[INFO] progress: Installing org.eclipse.rcptt.core.swt.win32
[INFO] progress: Installing org.eclipse.emf.query.feature.group
[INFO] progress: Installing org.eclipse.rcptt.testrail.ecl.impl
[INFO] progress: Installing org.eclipse.rcptt.ecl.platform
[INFO] progress: Installing org.eclipse.emf.converter
[INFO] progress: Installing org.eclipse.emf.ecore.feature.group
[INFO] progress: Installing org.eclipse.rcptt.ecl.data.apache.poi
[INFO] progress: Installing org.eclipse.rcptt.ecl.platform.feature.group
[INFO] progress: Installing org.eclipse.rcptt.tesla.recording.aspects.draw2d
[INFO] progress: Installing org.eclipse.rcptt.ecl.data.apache.poi.impl
[INFO] progress: Installing org.eclipse.emf.mapping.ecore.feature.group
[INFO] progress: Installing org.eclipse.emf.mapping.ui.feature.group
[INFO] progress: Installing org.eclipse.rcptt.core.launching
[INFO] progress: Installing org.eclipse.rcptt.watson.feature.jar
[INFO] progress: Installing org.eclipse.rcptt.ecl.core.feature.group
[INFO] progress: Installing org.eclipse.emf.codegen.feature.group
[INFO] progress: Installing org.eclipse.emf.codegen.ui.feature.jar
[INFO] progress: Installing org.eclipse.emf.ecore.editor.feature.group
[INFO] progress: Installing org.eclipse.rcptt.ctx.preferences
[INFO] progress: Installing org.eclipse.rcptt.ctx.filesystem.impl
[INFO] progress: Installing org.eclipse.rcptt.ctx.debug.impl
[INFO] progress: Installing org.eclipse.emf.mapping.ui.feature.jar
[INFO] progress: Installing org.apache.poi.ooxml
[INFO] progress: Installing org.eclipse.emf.ecore
[INFO] progress: Installing org.eclipse.emf.common.feature.group
[INFO] progress: Installing org.eclipse.rcptt.ecl.server.feature.jar
[INFO] progress: Installing org.eclipse.emf.databinding
[INFO] progress: Installing org.eclipse.rcptt.ecl.server.feature.group
[INFO] progress: Installing org.eclipse.emf.databinding.feature.group
[INFO] progress: Installing org.eclipse.rcptt.ctx.workbench.aspect
[INFO] progress: Installing org.eclipse.rcptt.watson.runtime.feature.group
[INFO] progress: Installing org.eclipse.rcptt.ctx.filesystem
[INFO] progress: Installing org.eclipse.emf.databinding.feature.jar
[INFO] progress: Installing org.eclipse.emf.query.feature.jar
[INFO] progress: Installing org.eclipse.rcptt.tesla.recording.nebula
[INFO] progress: Installing org.eclipse.rcptt.tesla.ecl
[INFO] progress: Installing org.eclipse.rcptt.tesla.ecl.runtime.feature.group
[INFO] progress: Installing org.eclipse.emf.ecore.editor.feature.jar
[INFO] progress: Installing org.eclipse.rcptt.tesla.nebula.ecl.impl
[INFO] progress: Installing org.eclipse.rcptt.ecl.core.feature.jar
[INFO] progress: Installing org.eclipse.rcptt.tesla.recording.core
[INFO] progress: Installing org.eclipse.emf.ecore.feature.jar
[INFO] progress: Installing org.aspectj.weaver
[INFO] progress: Installing org.eclipse.emf.query
[INFO] progress: Installing org.eclipse.emf.codegen.ui.feature.group
[INFO] progress: Installing org.eclipse.rcptt.tesla.swt.fragment
[INFO] progress: Installing org.eclipse.emf.validation.feature.group
[INFO] progress: Installing org.eclipse.rcptt.module.nebula.runtime.feature.jar
[INFO] progress: Installing org.eclipse.rcptt.tesla.nebula.ecl
[INFO] progress: Installing org.eclipse.rcptt.ecl.data
[INFO] progress: Installing org.eclipse.rcptt.tesla.gmf
[INFO] progress: Installing org.eclipse.rcptt.tesla.ui.ide.aspects
[INFO] progress: Installing org.eclipse.rcptt.expandbar
[INFO] progress: Installing org.eclipse.rcptt.tesla.feature.jar
[INFO] progress: Installing org.eclipse.rcptt.core.swt.win64
[INFO] progress: Installing org.eclipse.emf.importer.rose
[INFO] progress: Installing org.eclipse.rcptt.ecl.core
[INFO] progress: Installing org.eclipse.emf.common.ui
[INFO] progress: Installing org.eclipse.rcptt.ctx.script
[INFO] progress: Installing org.eclipse.emf.ecore.editor
[INFO] progress: Installing org.eclipse.rcptt.tesla.recording.aspects.workbench.texteditor
[INFO] progress: Downloading org.eclipse.emf.validation_root
[INFO] progress: Downloading org.eclipse.emf.transaction_root
[INFO] progress: Downloading org.eclipse.emf.query_root
[INFO] progress: Preparing to commit the provisioning operation.
[INFO] progress: Committing the provisioning operation.
[INFO] progress: Reading plug-ins
[INFO] Target platform is valid.
[INFO] Looking for tests...
[INFO] Existing projects in workspace:
[INFO]     <none>
[INFO] Importing projects to workspace:
[INFO] Refreshing projects:
[INFO]     /jobs/genie.capella/capella-studio-gerrit/workspace/vpdsl/tests/capellastudio.vpdsl.qualityassessment.tests/target/projects/capellastudio.vpdsl.qualityassessment.tests... OK
[INFO] Refreshing projects:
[INFO]     capellastudio.vpdsl.qualityassessment.tests... OK
[INFO] Searching for tests in projects:
[INFO]     capellastudio.vpdsl.qualityassessment.tests... 
[INFO] Complete OK
[INFO] Testcase Artifacts:10
[INFO] AUT-0:Launching
[INFO] AUT-0:Product: org.polarsys.capella.studio.product.CapellaStudio
[INFO] AUT-0:Application: org.polarsys.capella.studio.product.application
[INFO] AUT-0:Architecture: x86_64
[INFO] 64bit arch is selected because AUT uses launcher library
[INFO] 	"plugins/org.eclipse.equinox.launcher.gtk.linux.x86_64_1.1.551.v20171108-1834" specified in config file: eclipse.ini
[INFO] /jobs/genie.capella/capella-studio-gerrit/workspace/vpdsl/tests/capellastudio.vpdsl.qualityassessment.tests/target/aut-ws-0: AUT arguments: -os ${target.os} -arch ${target.arch} -consoleLog
[INFO] /jobs/genie.capella/capella-studio-gerrit/workspace/vpdsl/tests/capellastudio.vpdsl.qualityassessment.tests/target/aut-ws-0: AUT VM arguments: -Dosgi.requiredJavaVersion=1.8 -Xms512m -Xmx2048m -XX:PermSize=256M -javaagent:/home/hudson/genie.capella/.jenkins/jobs/capella-studio-gerrit/workspace/.repository/org/jacoco/org.jacoco.agent/0.7.9/org.jacoco.agent-0.7.9-runtime.jar=destfile=/jobs/genie.capella/capella-studio-gerrit/workspace/vpdsl/tests/capellastudio.vpdsl.qualityassessment.tests/target/jacoco.exec -XX:MaxPermSize=128m
[INFO] Pass 1 (10) processed. 0 failed. spent: 0:50, 2:13 mins remaining. Aspect - Data. time: 50212ms 
[INFO] Fail 2 (10) processed. 1 failed. spent: 1:21, 2:21 mins remaining. Aspect - Diagram. time: 30057ms  Cause: The Item "[platform:/resource/org.polarsys.capella.vp.qualityassessment.vpdsl/model/QualityAssessment.vpdesc, Viewpoint QualityAssessment, Diagram Set QualityAssessment.diagram, Diagram Extension QualityAssessment_PAB]" could not be found.
[INFO] Pass 3 (10) processed. 1 failed. spent: 1:56, 2:19 mins remaining. Aspect - Releng. time: 34637ms 
[INFO] Pass 4 (10) processed. 1 failed. spent: 2:21, 2:49 mins remaining. Aspect - Service. time: 24571ms 
[INFO] Pass 5 (10) processed. 1 failed. spent: 2:52, 1:38 mins remaining. Aspect - UI. time: 30377ms 
[INFO] Pass 6 (10) processed. 1 failed. spent: 4:06, 1:32 mins remaining. Bug - vpui-1275. time: 73308ms 
[INFO] Pass 7 (10) processed. 1 failed. spent: 4:17, 0:57 mins remaining. New Project creation. time: 10426ms 
[INFO] Pass 8 (10) processed. 1 failed. spent: 4:39, 0:27 mins remaining. Reverse from Ecore. time: 22233ms 
[INFO] Fail 9 (10) processed. 2 failed. spent: 7:00, 0:00 mins remaining. Viewpoint Generation and Packaging. time: 140575ms  Cause: Dropins is not generated by the "Generate and Package Viewpoint" action
[INFO] Pass 10 (10) processed. 2 failed. spent: 8:28, 0:00 mins remaining. Viewpoint Generation. time: 86877ms 
[INFO] Failed Tests:
[INFO] Aspect - Diagram
[INFO] Viewpoint Generation and Packaging
[INFO] Process terminated. Shut down AUTs
[INFO] Runner exit code is: 56
[ERROR] There are test failures
[INFO] 
[INFO] --- rcptt-maven-plugin:2.2.0:package (default-package) @ capellastudio.vpdsl.qualityassessment.tests ---
[INFO] Building zip: /jobs/genie.capella/capella-studio-gerrit/workspace/vpdsl/tests/capellastudio.vpdsl.qualityassessment.tests/target/projects/capellastudio.vpdsl.qualityassessment.tests-1.3.1-SNAPSHOT.zip
[INFO] Building zip: /jobs/genie.capella/capella-studio-gerrit/workspace/vpdsl/tests/capellastudio.vpdsl.qualityassessment.tests/target/org.polarsys.capella-capellastudio.vpdsl.qualityassessment.tests-1.3.1-SNAPSHOT-result.zip
[INFO] aut1/out.txt already added, skipping
[INFO] 
[INFO] --- tycho-source-plugin:1.1.0:plugin-source (plugin-source) @ capellastudio.vpdsl.qualityassessment.tests ---
[INFO] 
[INFO] --- tycho-source-feature-plugin:1.1.0:source-feature (source-feature) @ capellastudio.vpdsl.qualityassessment.tests ---
[INFO] 
[INFO] ---< org.polarsys.capella:org.polarsys.capella.studio.test.feature >----
[INFO] Building org.polarsys.capella.studio.test.feature 1.3.1-SNAPSHOT [28/30]
[INFO] --------------------------[ eclipse-feature ]---------------------------
[INFO] 
[INFO] --- maven-clean-plugin:2.5:clean (default-clean) @ org.polarsys.capella.studio.test.feature ---
[INFO] Deleting /jobs/genie.capella/capella-studio-gerrit/workspace/tests/features/org.polarsys.capella.studio.test.feature/target
[INFO] 
[INFO] --- tycho-packaging-plugin:1.1.0:build-qualifier-aggregator (default-build-qualifier-aggregator) @ org.polarsys.capella.studio.test.feature ---
[INFO] The project's OSGi version is 1.3.1.201907150715
[INFO] 
[INFO] --- tycho-packaging-plugin:1.1.0:validate-id (default-validate-id) @ org.polarsys.capella.studio.test.feature ---
[INFO] 
[INFO] --- tycho-packaging-plugin:1.1.0:validate-version (default-validate-version) @ org.polarsys.capella.studio.test.feature ---
[INFO] 
[INFO] --- jacoco-maven-plugin:0.7.9:prepare-agent (default) @ org.polarsys.capella.studio.test.feature ---
[INFO] failsafeArgline set to -javaagent:/home/hudson/genie.capella/.jenkins/jobs/capella-studio-gerrit/workspace/.repository/org/jacoco/org.jacoco.agent/0.7.9/org.jacoco.agent-0.7.9-runtime.jar=destfile=/jobs/genie.capella/capella-studio-gerrit/workspace/tests/features/org.polarsys.capella.studio.test.feature/target/jacoco.exec
[INFO] 
[INFO] --- target-platform-configuration:1.1.0:target-platform (default-target-platform) @ org.polarsys.capella.studio.test.feature ---
[INFO] 
[INFO] --- tycho-packaging-plugin:1.1.0:package-feature (default-package-feature) @ org.polarsys.capella.studio.test.feature ---
[INFO] Building jar: /jobs/genie.capella/capella-studio-gerrit/workspace/tests/features/org.polarsys.capella.studio.test.feature/target/org.polarsys.capella.studio.test.feature-1.3.1-SNAPSHOT.jar
[INFO] 
[INFO] --- tycho-p2-plugin:1.1.0:p2-metadata-default (default-p2-metadata-default) @ org.polarsys.capella.studio.test.feature ---
[INFO] 
[INFO] --- tycho-p2-plugin:1.1.0:feature-p2-metadata (default-feature-p2-metadata) @ org.polarsys.capella.studio.test.feature ---
[INFO] 
[INFO] --- tycho-source-plugin:1.1.0:plugin-source (plugin-source) @ org.polarsys.capella.studio.test.feature ---
[INFO] 
[INFO] --- tycho-source-feature-plugin:1.1.0:source-feature (source-feature) @ org.polarsys.capella.studio.test.feature ---
[INFO] Building jar: /jobs/genie.capella/capella-studio-gerrit/workspace/tests/features/org.polarsys.capella.studio.test.feature/target/org.polarsys.capella.studio.test.feature-1.3.1-SNAPSHOT-sources-feature.jar
[INFO] 
[INFO] --- tycho-p2-plugin:1.1.0:p2-metadata (p2-metadata) @ org.polarsys.capella.studio.test.feature ---
[INFO] 
[INFO] --< org.polarsys.capella:org.polarsys.capella.studio.releng.aggregator.tests >--
[INFO] Building Capella Sudio tests Aggregator Module 1.3.1-SNAPSHOT    [29/30]
[INFO] --------------------------------[ pom ]---------------------------------
[INFO] 
[INFO] --- maven-clean-plugin:2.5:clean (default-clean) @ org.polarsys.capella.studio.releng.aggregator.tests ---
[INFO] 
[INFO] --- jacoco-maven-plugin:0.7.9:prepare-agent (default) @ org.polarsys.capella.studio.releng.aggregator.tests ---
[INFO] failsafeArgline set to -javaagent:/home/hudson/genie.capella/.jenkins/jobs/capella-studio-gerrit/workspace/.repository/org/jacoco/org.jacoco.agent/0.7.9/org.jacoco.agent-0.7.9-runtime.jar=destfile=/jobs/genie.capella/capella-studio-gerrit/workspace/releng/plugins/org.polarsys.capella.studio.releng.aggregator.tests/target/jacoco.exec
[INFO] 
[INFO] --- tycho-source-plugin:1.1.0:plugin-source (plugin-source) @ org.polarsys.capella.studio.releng.aggregator.tests ---
[INFO] 
[INFO] --- tycho-source-feature-plugin:1.1.0:source-feature (source-feature) @ org.polarsys.capella.studio.releng.aggregator.tests ---
[INFO] 
[INFO] ----< org.polarsys.capella:org.polarsys.capella.studio.releng.root >----
[INFO] Building Capella Studio Root 1.3.1-SNAPSHOT                      [30/30]
[INFO] --------------------------------[ pom ]---------------------------------
[INFO] 
[INFO] --- maven-clean-plugin:2.5:clean (default-clean) @ org.polarsys.capella.studio.releng.root ---
[INFO] 
[INFO] --- jacoco-maven-plugin:0.7.9:prepare-agent (default) @ org.polarsys.capella.studio.releng.root ---
[INFO] failsafeArgline set to -javaagent:/home/hudson/genie.capella/.jenkins/jobs/capella-studio-gerrit/workspace/.repository/org/jacoco/org.jacoco.agent/0.7.9/org.jacoco.agent-0.7.9-runtime.jar=destfile=/jobs/genie.capella/capella-studio-gerrit/workspace/target/jacoco.exec
[INFO] 
[INFO] --- tycho-source-plugin:1.1.0:plugin-source (plugin-source) @ org.polarsys.capella.studio.releng.root ---
[INFO] 
[INFO] --- tycho-source-feature-plugin:1.1.0:source-feature (source-feature) @ org.polarsys.capella.studio.releng.root ---
[INFO] ------------------------------------------------------------------------
[INFO] Reactor Summary for Capella Studio Root 1.3.1-SNAPSHOT:
[INFO] 
[INFO] Capella Studio ..................................... SUCCESS [ 20.273 s]
[INFO] capellastudio ...................................... SUCCESS [  3.772 s]
[INFO] org.polarsys.capella.extension.genchain.model ...... SUCCESS [  5.809 s]
[INFO] org.polarsys.capella.extension.genchain ............ SUCCESS [  0.877 s]
[INFO] org.polarsys.capella.extension.genchain.model.edit . SUCCESS [  0.320 s]
[INFO] org.polarsys.capella.extension.tools ............... SUCCESS [  1.345 s]
[INFO] org.polarsys.capella.extension.tools.ui ............ SUCCESS [  0.963 s]
[INFO] org.polarsys.capella.studio.product ................ SUCCESS [  0.621 s]
[INFO] org.polarsys.capella.ad.viewpoint.dsl.generation.ui  SUCCESS [  1.842 s]
[INFO] org.polarsys.capella.ta ............................ SUCCESS [  0.454 s]
[INFO] org.polarsys.capella.ta.viewpoint.dsl.extension .... SUCCESS [  0.183 s]
[INFO] org.polarsys.capella.extension.sdk.feature ......... SUCCESS [  0.775 s]
[INFO] org.polarsys.capella.studio.product.feature ........ SUCCESS [  0.492 s]
[INFO] org.polarsys.capella.ta.viewpoint.dsl.feature ...... SUCCESS [  0.171 s]
[INFO] org.polarsys.capella.studio.releng.eclipse.feature . SUCCESS [  0.744 s]
[INFO] org.polarsys.capella.studio.releng.capella.feature . SUCCESS [  0.802 s]
[INFO] org.polarsys.capella.studio.releng.kitalpha.feature  SUCCESS [  0.516 s]
[INFO] org.polarsys.capella.studio.releng.updatesite ...... SUCCESS [  4.094 s]
[INFO] Capella studio Product ............................. SUCCESS [06:40 min]
[INFO] Capella Sudio Aggregator Module .................... SUCCESS [  0.009 s]
[INFO] org.polarsys.capella.studio.test ................... SUCCESS [  0.231 s]
[INFO] org.polarsys.capella.extension.rcptt ............... SUCCESS [03:39 min]
[INFO] org.polarsys.capella.ad.viewpoint.dsl.tests ........ SUCCESS [ 38.079 s]
[INFO] org.polarsys.capella.gen.doc.tests ................. SUCCESS [02:29 min]
[INFO] org.polarsys.capella.studio.ad.viewpoint.rcptt ..... SUCCESS [06:49 min]
[INFO] capellastudio.vpdsl.qualityassessment.reverse.tests  SUCCESS [01:37 min]
[INFO] capellastudio.vpdsl.qualityassessment.tests ........ SUCCESS [10:31 min]
[INFO] org.polarsys.capella.studio.test.feature ........... SUCCESS [  0.097 s]
[INFO] Capella Sudio tests Aggregator Module .............. SUCCESS [  0.012 s]
[INFO] Capella Studio Root ................................ SUCCESS [  0.009 s]
[INFO] ------------------------------------------------------------------------
[INFO] BUILD SUCCESS
[INFO] ------------------------------------------------------------------------
[INFO] Total time:  47:27 min
[INFO] Finished at: 2019-07-15T04:02:38-04:00
[INFO] ------------------------------------------------------------------------
Terminating xvnc.
Archiving artifacts
Recording test results
Build step 'Publish JUnit test result report' changed build result to UNSTABLE
[JaCoCo plugin] Collecting JaCoCo coverage data...
[JaCoCo plugin] **/target/jacoco.exec;**/target/classes;**/src/; locations are configured
[JaCoCo plugin] Number of found exec files for pattern **/target/jacoco.exec: 5
[JaCoCo plugin] Saving matched execfiles:  /home/hudson/genie.capella/.jenkins/jobs/capella-studio-gerrit/workspace/extension/tests/org.polarsys.capella.extension.rcptt/target/jacoco.exec /home/hudson/genie.capella/.jenkins/jobs/capella-studio-gerrit/workspace/gendoc/tests/org.polarsys.capella.gen.doc.tests/target/jacoco.exec /home/hudson/genie.capella/.jenkins/jobs/capella-studio-gerrit/workspace/vpdsl/tests/capellastudio.vpdsl.qualityassessment.reverse.tests/target/jacoco.exec /home/hudson/genie.capella/.jenkins/jobs/capella-studio-gerrit/workspace/vpdsl/tests/capellastudio.vpdsl.qualityassessment.tests/target/jacoco.exec /home/hudson/genie.capella/.jenkins/jobs/capella-studio-gerrit/workspace/vpdsl/tests/org.polarsys.capella.studio.ad.viewpoint.rcptt/target/jacoco.exec
[JaCoCo plugin] Saving matched class directories for class-pattern: **/target/classes: 
[JaCoCo plugin]  - /home/hudson/genie.capella/.jenkins/jobs/capella-studio-gerrit/workspace/extension/plugins/org.polarsys.capella.extension.genchain.model.edit/target/classes 5 files
[JaCoCo plugin]  - /home/hudson/genie.capella/.jenkins/jobs/capella-studio-gerrit/workspace/extension/plugins/org.polarsys.capella.extension.genchain.model/target/classes 12 files
[JaCoCo plugin]  - /home/hudson/genie.capella/.jenkins/jobs/capella-studio-gerrit/workspace/extension/plugins/org.polarsys.capella.extension.genchain/target/classes 6 files
[JaCoCo plugin]  - /home/hudson/genie.capella/.jenkins/jobs/capella-studio-gerrit/workspace/extension/plugins/org.polarsys.capella.extension.tools.ui/target/classes 15 files
[JaCoCo plugin]  - /home/hudson/genie.capella/.jenkins/jobs/capella-studio-gerrit/workspace/extension/plugins/org.polarsys.capella.extension.tools/target/classes 19 files
[JaCoCo plugin]  - /home/hudson/genie.capella/.jenkins/jobs/capella-studio-gerrit/workspace/product/plugins/org.polarsys.capella.studio.product/target/classes 7 files
[JaCoCo plugin]  - /home/hudson/genie.capella/.jenkins/jobs/capella-studio-gerrit/workspace/tests/plugins/org.polarsys.capella.studio.test/target/classes 3 files
[JaCoCo plugin]  - /home/hudson/genie.capella/.jenkins/jobs/capella-studio-gerrit/workspace/vpdsl/plugins/org.polarsys.capella.ad.viewpoint.dsl.generation.ui/target/classes 42 files
[JaCoCo plugin]  - /home/hudson/genie.capella/.jenkins/jobs/capella-studio-gerrit/workspace/vpdsl/plugins/org.polarsys.capella.ta.viewpoint.dsl.extension/target/classes 1 files
[JaCoCo plugin]  - /home/hudson/genie.capella/.jenkins/jobs/capella-studio-gerrit/workspace/vpdsl/plugins/org.polarsys.capella.ta/target/classes 2 files
[JaCoCo plugin]  - /home/hudson/genie.capella/.jenkins/jobs/capella-studio-gerrit/workspace/vpdsl/tests/org.polarsys.capella.ad.viewpoint.dsl.tests/target/classes 3 files
[JaCoCo plugin] Saving matched source directories for source-pattern: **/src/: 
[JaCoCo plugin] Source Inclusions: **/*.java
[JaCoCo plugin] Source Exclusions: 
[JaCoCo plugin] WARNING: You are using directory patterns with trailing /, /* or /** . This will most likely multiply the copied files in your build directory. Check the list below and ignore this warning if you know what you are doing.
[JaCoCo plugin] - /home/hudson/genie.capella/.jenkins/jobs/capella-studio-gerrit/workspace/extension/plugins/org.polarsys.capella.extension.genchain/src 3 files
[JaCoCo plugin] - /home/hudson/genie.capella/.jenkins/jobs/capella-studio-gerrit/workspace/extension/plugins/org.polarsys.capella.extension.genchain/src/org 3 files
[JaCoCo plugin] - /home/hudson/genie.capella/.jenkins/jobs/capella-studio-gerrit/workspace/extension/plugins/org.polarsys.capella.extension.genchain/src/org/polarsys 3 files
[JaCoCo plugin] - /home/hudson/genie.capella/.jenkins/jobs/capella-studio-gerrit/workspace/extension/plugins/org.polarsys.capella.extension.genchain/src/org/polarsys/capella 3 files
[JaCoCo plugin] - /home/hudson/genie.capella/.jenkins/jobs/capella-studio-gerrit/workspace/extension/plugins/org.polarsys.capella.extension.genchain/src/org/polarsys/capella/extension 3 files
[JaCoCo plugin] - /home/hudson/genie.capella/.jenkins/jobs/capella-studio-gerrit/workspace/extension/plugins/org.polarsys.capella.extension.genchain/src/org/polarsys/capella/extension/genchain 3 files
[JaCoCo plugin] - /home/hudson/genie.capella/.jenkins/jobs/capella-studio-gerrit/workspace/extension/plugins/org.polarsys.capella.extension.tools.ui/src 6 files
[JaCoCo plugin] - /home/hudson/genie.capella/.jenkins/jobs/capella-studio-gerrit/workspace/extension/plugins/org.polarsys.capella.extension.tools.ui/src/org 6 files
[JaCoCo plugin] - /home/hudson/genie.capella/.jenkins/jobs/capella-studio-gerrit/workspace/extension/plugins/org.polarsys.capella.extension.tools.ui/src/org/polarsys 6 files
[JaCoCo plugin] - /home/hudson/genie.capella/.jenkins/jobs/capella-studio-gerrit/workspace/extension/plugins/org.polarsys.capella.extension.tools.ui/src/org/polarsys/capella 6 files
[JaCoCo plugin] - /home/hudson/genie.capella/.jenkins/jobs/capella-studio-gerrit/workspace/extension/plugins/org.polarsys.capella.extension.tools.ui/src/org/polarsys/capella/extension 6 files
[JaCoCo plugin] - /home/hudson/genie.capella/.jenkins/jobs/capella-studio-gerrit/workspace/extension/plugins/org.polarsys.capella.extension.tools.ui/src/org/polarsys/capella/extension/tools 6 files
[JaCoCo plugin] - /home/hudson/genie.capella/.jenkins/jobs/capella-studio-gerrit/workspace/extension/plugins/org.polarsys.capella.extension.tools.ui/src/org/polarsys/capella/extension/tools/ui 6 files
[JaCoCo plugin] - /home/hudson/genie.capella/.jenkins/jobs/capella-studio-gerrit/workspace/extension/plugins/org.polarsys.capella.extension.tools/src 5 files
[JaCoCo plugin] - /home/hudson/genie.capella/.jenkins/jobs/capella-studio-gerrit/workspace/extension/plugins/org.polarsys.capella.extension.tools/src/org 5 files
[JaCoCo plugin] - /home/hudson/genie.capella/.jenkins/jobs/capella-studio-gerrit/workspace/extension/plugins/org.polarsys.capella.extension.tools/src/org/polarsys 5 files
[JaCoCo plugin] - /home/hudson/genie.capella/.jenkins/jobs/capella-studio-gerrit/workspace/extension/plugins/org.polarsys.capella.extension.tools/src/org/polarsys/capella 5 files
[JaCoCo plugin] - /home/hudson/genie.capella/.jenkins/jobs/capella-studio-gerrit/workspace/extension/plugins/org.polarsys.capella.extension.tools/src/org/polarsys/capella/extension 5 files
[JaCoCo plugin] - /home/hudson/genie.capella/.jenkins/jobs/capella-studio-gerrit/workspace/extension/plugins/org.polarsys.capella.extension.tools/src/org/polarsys/capella/extension/tools 5 files
[JaCoCo plugin] - /home/hudson/genie.capella/.jenkins/jobs/capella-studio-gerrit/workspace/extension/tests/org.polarsys.capella.extension.rcptt/target/aut-ws-0/org.eclipse.emf.examples.library.extlibrary.cdo/src 13 files
[JaCoCo plugin] - /home/hudson/genie.capella/.jenkins/jobs/capella-studio-gerrit/workspace/extension/tests/org.polarsys.capella.extension.rcptt/target/aut-ws-0/org.eclipse.emf.examples.library.extlibrary.cdo/src/org 13 files
[JaCoCo plugin] - /home/hudson/genie.capella/.jenkins/jobs/capella-studio-gerrit/workspace/extension/tests/org.polarsys.capella.extension.rcptt/target/aut-ws-0/org.eclipse.emf.examples.library.extlibrary.cdo/src/org/eclipse 13 files
[JaCoCo plugin] - /home/hudson/genie.capella/.jenkins/jobs/capella-studio-gerrit/workspace/extension/tests/org.polarsys.capella.extension.rcptt/target/aut-ws-0/org.eclipse.emf.examples.library.extlibrary.cdo/src/org/eclipse/emf 13 files
[JaCoCo plugin] - /home/hudson/genie.capella/.jenkins/jobs/capella-studio-gerrit/workspace/extension/tests/org.polarsys.capella.extension.rcptt/target/aut-ws-0/org.eclipse.emf.examples.library.extlibrary.cdo/src/org/eclipse/emf/examples 13 files
[JaCoCo plugin] - /home/hudson/genie.capella/.jenkins/jobs/capella-studio-gerrit/workspace/extension/tests/org.polarsys.capella.extension.rcptt/target/aut-ws-0/org.eclipse.emf.examples.library.extlibrary.cdo/src/org/eclipse/emf/examples/library 13 files
[JaCoCo plugin] - /home/hudson/genie.capella/.jenkins/jobs/capella-studio-gerrit/workspace/extension/tests/org.polarsys.capella.extension.rcptt/target/aut-ws-0/org.eclipse.emf.examples.library.extlibrary.cdo/src/org/eclipse/emf/examples/library/extlibrary 13 files
[JaCoCo plugin] - /home/hudson/genie.capella/.jenkins/jobs/capella-studio-gerrit/workspace/extension/tests/org.polarsys.capella.extension.rcptt/target/aut-ws-0/org.eclipse.emf.examples.library.extlibrary.cdo/src/org/eclipse/emf/examples/library/extlibrary/impl 13 files
[JaCoCo plugin] - /home/hudson/genie.capella/.jenkins/jobs/capella-studio-gerrit/workspace/extension/tests/org.polarsys.capella.extension.rcptt/target/aut-ws-0/org.eclipse.emf.examples.library.extlibrary.edit/src 26 files
[JaCoCo plugin] - /home/hudson/genie.capella/.jenkins/jobs/capella-studio-gerrit/workspace/extension/tests/org.polarsys.capella.extension.rcptt/target/aut-ws-0/org.eclipse.emf.examples.library.extlibrary.edit/src/org 26 files
[JaCoCo plugin] - /home/hudson/genie.capella/.jenkins/jobs/capella-studio-gerrit/workspace/extension/tests/org.polarsys.capella.extension.rcptt/target/aut-ws-0/org.eclipse.emf.examples.library.extlibrary.edit/src/org/eclipse 26 files
[JaCoCo plugin] - /home/hudson/genie.capella/.jenkins/jobs/capella-studio-gerrit/workspace/extension/tests/org.polarsys.capella.extension.rcptt/target/aut-ws-0/org.eclipse.emf.examples.library.extlibrary.edit/src/org/eclipse/emf 26 files
[JaCoCo plugin] - /home/hudson/genie.capella/.jenkins/jobs/capella-studio-gerrit/workspace/extension/tests/org.polarsys.capella.extension.rcptt/target/aut-ws-0/org.eclipse.emf.examples.library.extlibrary.edit/src/org/eclipse/emf/examples 26 files
[JaCoCo plugin] - /home/hudson/genie.capella/.jenkins/jobs/capella-studio-gerrit/workspace/extension/tests/org.polarsys.capella.extension.rcptt/target/aut-ws-0/org.eclipse.emf.examples.library.extlibrary.edit/src/org/eclipse/emf/examples/library 26 files
[JaCoCo plugin] - /home/hudson/genie.capella/.jenkins/jobs/capella-studio-gerrit/workspace/extension/tests/org.polarsys.capella.extension.rcptt/target/aut-ws-0/org.eclipse.emf.examples.library.extlibrary.edit/src/org/eclipse/emf/examples/library/extlibrary 26 files
[JaCoCo plugin] - /home/hudson/genie.capella/.jenkins/jobs/capella-studio-gerrit/workspace/extension/tests/org.polarsys.capella.extension.rcptt/target/aut-ws-0/org.eclipse.emf.examples.library.extlibrary.edit/src/org/eclipse/emf/examples/library/extlibrary/provider 26 files
[JaCoCo plugin] - /home/hudson/genie.capella/.jenkins/jobs/capella-studio-gerrit/workspace/extension/tests/org.polarsys.capella.extension.rcptt/target/aut-ws-0/org.eclipse.emf.examples.library.extlibrary.edit/src/org/eclipse/emf/examples/library/extlibrary/provider/sections 12 files
[JaCoCo plugin] - /home/hudson/genie.capella/.jenkins/jobs/capella-studio-gerrit/workspace/extension/tests/org.polarsys.capella.extension.rcptt/target/aut-ws-0/org.eclipse.emf.examples.library.extlibrary/src 35 files
[JaCoCo plugin] - /home/hudson/genie.capella/.jenkins/jobs/capella-studio-gerrit/workspace/extension/tests/org.polarsys.capella.extension.rcptt/target/aut-ws-0/org.eclipse.emf.examples.library.extlibrary/src/org 35 files
[JaCoCo plugin] - /home/hudson/genie.capella/.jenkins/jobs/capella-studio-gerrit/workspace/extension/tests/org.polarsys.capella.extension.rcptt/target/aut-ws-0/org.eclipse.emf.examples.library.extlibrary/src/org/eclipse 35 files
[JaCoCo plugin] - /home/hudson/genie.capella/.jenkins/jobs/capella-studio-gerrit/workspace/extension/tests/org.polarsys.capella.extension.rcptt/target/aut-ws-0/org.eclipse.emf.examples.library.extlibrary/src/org/eclipse/emf 35 files
[JaCoCo plugin] - /home/hudson/genie.capella/.jenkins/jobs/capella-studio-gerrit/workspace/extension/tests/org.polarsys.capella.extension.rcptt/target/aut-ws-0/org.eclipse.emf.examples.library.extlibrary/src/org/eclipse/emf/examples 35 files
[JaCoCo plugin] - /home/hudson/genie.capella/.jenkins/jobs/capella-studio-gerrit/workspace/extension/tests/org.polarsys.capella.extension.rcptt/target/aut-ws-0/org.eclipse.emf.examples.library.extlibrary/src/org/eclipse/emf/examples/library 35 files
[JaCoCo plugin] - /home/hudson/genie.capella/.jenkins/jobs/capella-studio-gerrit/workspace/extension/tests/org.polarsys.capella.extension.rcptt/target/aut-ws-0/org.eclipse.emf.examples.library.extlibrary/src/org/eclipse/emf/examples/library/extlibrary 35 files
[JaCoCo plugin] - /home/hudson/genie.capella/.jenkins/jobs/capella-studio-gerrit/workspace/extension/tests/org.polarsys.capella.extension.rcptt/target/aut-ws-0/org.eclipse.emf.examples.library.extlibrary/src/org/eclipse/emf/examples/library/extlibrary/impl 14 files
[JaCoCo plugin] - /home/hudson/genie.capella/.jenkins/jobs/capella-studio-gerrit/workspace/extension/tests/org.polarsys.capella.extension.rcptt/target/aut-ws-0/org.eclipse.emf.examples.library.extlibrary/src/org/eclipse/emf/examples/library/extlibrary/util 4 files
[JaCoCo plugin] - /home/hudson/genie.capella/.jenkins/jobs/capella-studio-gerrit/workspace/extension/tests/org.polarsys.capella.extension.rcptt/target/aut-ws-0/org.eclipse.emf.examples.library/src 0 files
[JaCoCo plugin] - /home/hudson/genie.capella/.jenkins/jobs/capella-studio-gerrit/workspace/product/plugins/org.polarsys.capella.studio.product/src 4 files
[JaCoCo plugin] - /home/hudson/genie.capella/.jenkins/jobs/capella-studio-gerrit/workspace/product/plugins/org.polarsys.capella.studio.product/src/org 4 files
[JaCoCo plugin] - /home/hudson/genie.capella/.jenkins/jobs/capella-studio-gerrit/workspace/product/plugins/org.polarsys.capella.studio.product/src/org/polarsys 4 files
[JaCoCo plugin] - /home/hudson/genie.capella/.jenkins/jobs/capella-studio-gerrit/workspace/product/plugins/org.polarsys.capella.studio.product/src/org/polarsys/capella 4 files
[JaCoCo plugin] - /home/hudson/genie.capella/.jenkins/jobs/capella-studio-gerrit/workspace/product/plugins/org.polarsys.capella.studio.product/src/org/polarsys/capella/studio 4 files
[JaCoCo plugin] - /home/hudson/genie.capella/.jenkins/jobs/capella-studio-gerrit/workspace/product/plugins/org.polarsys.capella.studio.product/src/org/polarsys/capella/studio/product 4 files
[JaCoCo plugin] - /home/hudson/genie.capella/.jenkins/jobs/capella-studio-gerrit/workspace/releng/plugins/org.polarsys.capella.studio.releng/src 1 files
[JaCoCo plugin] - /home/hudson/genie.capella/.jenkins/jobs/capella-studio-gerrit/workspace/releng/plugins/org.polarsys.capella.studio.releng/src/org 1 files
[JaCoCo plugin] - /home/hudson/genie.capella/.jenkins/jobs/capella-studio-gerrit/workspace/releng/plugins/org.polarsys.capella.studio.releng/src/org/polarsys 1 files
[JaCoCo plugin] - /home/hudson/genie.capella/.jenkins/jobs/capella-studio-gerrit/workspace/releng/plugins/org.polarsys.capella.studio.releng/src/org/polarsys/capella 1 files
[JaCoCo plugin] - /home/hudson/genie.capella/.jenkins/jobs/capella-studio-gerrit/workspace/releng/plugins/org.polarsys.capella.studio.releng/src/org/polarsys/capella/studio 1 files
[JaCoCo plugin] - /home/hudson/genie.capella/.jenkins/jobs/capella-studio-gerrit/workspace/releng/plugins/org.polarsys.capella.studio.releng/src/org/polarsys/capella/studio/releng 1 files
[JaCoCo plugin] - /home/hudson/genie.capella/.jenkins/jobs/capella-studio-gerrit/workspace/tests/plugins/org.polarsys.capella.studio.test/src 3 files
[JaCoCo plugin] - /home/hudson/genie.capella/.jenkins/jobs/capella-studio-gerrit/workspace/tests/plugins/org.polarsys.capella.studio.test/src/org 3 files
[JaCoCo plugin] - /home/hudson/genie.capella/.jenkins/jobs/capella-studio-gerrit/workspace/tests/plugins/org.polarsys.capella.studio.test/src/org/polarsys 3 files
[JaCoCo plugin] - /home/hudson/genie.capella/.jenkins/jobs/capella-studio-gerrit/workspace/tests/plugins/org.polarsys.capella.studio.test/src/org/polarsys/capella 3 files
[JaCoCo plugin] - /home/hudson/genie.capella/.jenkins/jobs/capella-studio-gerrit/workspace/tests/plugins/org.polarsys.capella.studio.test/src/org/polarsys/capella/studio 3 files
[JaCoCo plugin] - /home/hudson/genie.capella/.jenkins/jobs/capella-studio-gerrit/workspace/tests/plugins/org.polarsys.capella.studio.test/src/org/polarsys/capella/studio/test 3 files
[JaCoCo plugin] - /home/hudson/genie.capella/.jenkins/jobs/capella-studio-gerrit/workspace/tests/plugins/org.polarsys.capella.studio.test/src/org/polarsys/capella/studio/test/suite 1 files
[JaCoCo plugin] - /home/hudson/genie.capella/.jenkins/jobs/capella-studio-gerrit/workspace/tests/plugins/org.polarsys.capella.studio.test/src/org/polarsys/capella/studio/test/viewpoint 1 files
[JaCoCo plugin] - /home/hudson/genie.capella/.jenkins/jobs/capella-studio-gerrit/workspace/vpdsl/plugins/org.polarsys.capella.ad.viewpoint.dsl.generation.ui/src 21 files
[JaCoCo plugin] - /home/hudson/genie.capella/.jenkins/jobs/capella-studio-gerrit/workspace/vpdsl/plugins/org.polarsys.capella.ad.viewpoint.dsl.generation.ui/src/org 21 files
[JaCoCo plugin] - /home/hudson/genie.capella/.jenkins/jobs/capella-studio-gerrit/workspace/vpdsl/plugins/org.polarsys.capella.ad.viewpoint.dsl.generation.ui/src/org/polarsys 21 files
[JaCoCo plugin] - /home/hudson/genie.capella/.jenkins/jobs/capella-studio-gerrit/workspace/vpdsl/plugins/org.polarsys.capella.ad.viewpoint.dsl.generation.ui/src/org/polarsys/capella 21 files
[JaCoCo plugin] - /home/hudson/genie.capella/.jenkins/jobs/capella-studio-gerrit/workspace/vpdsl/plugins/org.polarsys.capella.ad.viewpoint.dsl.generation.ui/src/org/polarsys/capella/ad 21 files
[JaCoCo plugin] - /home/hudson/genie.capella/.jenkins/jobs/capella-studio-gerrit/workspace/vpdsl/plugins/org.polarsys.capella.ad.viewpoint.dsl.generation.ui/src/org/polarsys/capella/ad/viewpoint 21 files
[JaCoCo plugin] - /home/hudson/genie.capella/.jenkins/jobs/capella-studio-gerrit/workspace/vpdsl/plugins/org.polarsys.capella.ad.viewpoint.dsl.generation.ui/src/org/polarsys/capella/ad/viewpoint/dsl 21 files
[JaCoCo plugin] - /home/hudson/genie.capella/.jenkins/jobs/capella-studio-gerrit/workspace/vpdsl/plugins/org.polarsys.capella.ad.viewpoint.dsl.generation.ui/src/org/polarsys/capella/ad/viewpoint/dsl/generation 21 files
[JaCoCo plugin] - /home/hudson/genie.capella/.jenkins/jobs/capella-studio-gerrit/workspace/vpdsl/plugins/org.polarsys.capella.ad.viewpoint.dsl.generation.ui/src/org/polarsys/capella/ad/viewpoint/dsl/generation/ui 21 files
[JaCoCo plugin] - /home/hudson/genie.capella/.jenkins/jobs/capella-studio-gerrit/workspace/vpdsl/plugins/org.polarsys.capella.ad.viewpoint.dsl.generation.ui/src/org/polarsys/capella/ad/viewpoint/dsl/generation/ui/constant 1 files
[JaCoCo plugin] - /home/hudson/genie.capella/.jenkins/jobs/capella-studio-gerrit/workspace/vpdsl/plugins/org.polarsys.capella.ad.viewpoint.dsl.generation.ui/src/org/polarsys/capella/ad/viewpoint/dsl/generation/ui/extensions 3 files
[JaCoCo plugin] - /home/hudson/genie.capella/.jenkins/jobs/capella-studio-gerrit/workspace/vpdsl/plugins/org.polarsys.capella.ad.viewpoint.dsl.generation.ui/src/org/polarsys/capella/ad/viewpoint/dsl/generation/ui/reporters 1 files
[JaCoCo plugin] - /home/hudson/genie.capella/.jenkins/jobs/capella-studio-gerrit/workspace/vpdsl/plugins/org.polarsys.capella.ad.viewpoint.dsl.generation.ui/src/org/polarsys/capella/ad/viewpoint/dsl/generation/ui/tasks 3 files
[JaCoCo plugin] - /home/hudson/genie.capella/.jenkins/jobs/capella-studio-gerrit/workspace/vpdsl/plugins/org.polarsys.capella.ad.viewpoint.dsl.generation.ui/src/org/polarsys/capella/ad/viewpoint/dsl/generation/ui/util 12 files
[JaCoCo plugin] - /home/hudson/genie.capella/.jenkins/jobs/capella-studio-gerrit/workspace/vpdsl/plugins/org.polarsys.capella.ta.viewpoint.dsl.extension/src 1 files
[JaCoCo plugin] - /home/hudson/genie.capella/.jenkins/jobs/capella-studio-gerrit/workspace/vpdsl/plugins/org.polarsys.capella.ta.viewpoint.dsl.extension/src/org 1 files
[JaCoCo plugin] - /home/hudson/genie.capella/.jenkins/jobs/capella-studio-gerrit/workspace/vpdsl/plugins/org.polarsys.capella.ta.viewpoint.dsl.extension/src/org/polarsys 1 files
[JaCoCo plugin] - /home/hudson/genie.capella/.jenkins/jobs/capella-studio-gerrit/workspace/vpdsl/plugins/org.polarsys.capella.ta.viewpoint.dsl.extension/src/org/polarsys/capella 1 files
[JaCoCo plugin] - /home/hudson/genie.capella/.jenkins/jobs/capella-studio-gerrit/workspace/vpdsl/plugins/org.polarsys.capella.ta.viewpoint.dsl.extension/src/org/polarsys/capella/ta 1 files
[JaCoCo plugin] - /home/hudson/genie.capella/.jenkins/jobs/capella-studio-gerrit/workspace/vpdsl/plugins/org.polarsys.capella.ta.viewpoint.dsl.extension/src/org/polarsys/capella/ta/viewpoint 1 files
[JaCoCo plugin] - /home/hudson/genie.capella/.jenkins/jobs/capella-studio-gerrit/workspace/vpdsl/plugins/org.polarsys.capella.ta.viewpoint.dsl.extension/src/org/polarsys/capella/ta/viewpoint/dsl 1 files
[JaCoCo plugin] - /home/hudson/genie.capella/.jenkins/jobs/capella-studio-gerrit/workspace/vpdsl/plugins/org.polarsys.capella.ta.viewpoint.dsl.extension/src/org/polarsys/capella/ta/viewpoint/dsl/extension 1 files
[JaCoCo plugin] - /home/hudson/genie.capella/.jenkins/jobs/capella-studio-gerrit/workspace/vpdsl/plugins/org.polarsys.capella.ta/src 2 files
[JaCoCo plugin] - /home/hudson/genie.capella/.jenkins/jobs/capella-studio-gerrit/workspace/vpdsl/plugins/org.polarsys.capella.ta/src/org 2 files
[JaCoCo plugin] - /home/hudson/genie.capella/.jenkins/jobs/capella-studio-gerrit/workspace/vpdsl/plugins/org.polarsys.capella.ta/src/org/polarsys 2 files
[JaCoCo plugin] - /home/hudson/genie.capella/.jenkins/jobs/capella-studio-gerrit/workspace/vpdsl/plugins/org.polarsys.capella.ta/src/org/polarsys/capella 2 files
[JaCoCo plugin] - /home/hudson/genie.capella/.jenkins/jobs/capella-studio-gerrit/workspace/vpdsl/plugins/org.polarsys.capella.ta/src/org/polarsys/capella/ta 2 files
[JaCoCo plugin] - /home/hudson/genie.capella/.jenkins/jobs/capella-studio-gerrit/workspace/vpdsl/plugins/org.polarsys.capella.ta/src/org/polarsys/capella/ta/definition 1 files
[JaCoCo plugin] - /home/hudson/genie.capella/.jenkins/jobs/capella-studio-gerrit/workspace/vpdsl/tests/capellastudio.vpdsl.qualityassessment.tests/target/aut-ws-0/org.polarsys.capella.vp.qualityassessment.af/src 2 files
[JaCoCo plugin] - /home/hudson/genie.capella/.jenkins/jobs/capella-studio-gerrit/workspace/vpdsl/tests/capellastudio.vpdsl.qualityassessment.tests/target/aut-ws-0/org.polarsys.capella.vp.qualityassessment.af/src/org 2 files
[JaCoCo plugin] - /home/hudson/genie.capella/.jenkins/jobs/capella-studio-gerrit/workspace/vpdsl/tests/capellastudio.vpdsl.qualityassessment.tests/target/aut-ws-0/org.polarsys.capella.vp.qualityassessment.af/src/org/polarsys 2 files
[JaCoCo plugin] - /home/hudson/genie.capella/.jenkins/jobs/capella-studio-gerrit/workspace/vpdsl/tests/capellastudio.vpdsl.qualityassessment.tests/target/aut-ws-0/org.polarsys.capella.vp.qualityassessment.af/src/org/polarsys/capella 2 files
[JaCoCo plugin] - /home/hudson/genie.capella/.jenkins/jobs/capella-studio-gerrit/workspace/vpdsl/tests/capellastudio.vpdsl.qualityassessment.tests/target/aut-ws-0/org.polarsys.capella.vp.qualityassessment.af/src/org/polarsys/capella/vp 2 files
[JaCoCo plugin] - /home/hudson/genie.capella/.jenkins/jobs/capella-studio-gerrit/workspace/vpdsl/tests/capellastudio.vpdsl.qualityassessment.tests/target/aut-ws-0/org.polarsys.capella.vp.qualityassessment.af/src/org/polarsys/capella/vp/qualityassessment 2 files
[JaCoCo plugin] - /home/hudson/genie.capella/.jenkins/jobs/capella-studio-gerrit/workspace/vpdsl/tests/capellastudio.vpdsl.qualityassessment.tests/target/aut-ws-0/org.polarsys.capella.vp.qualityassessment.af/src/org/polarsys/capella/vp/qualityassessment/af 2 files
[JaCoCo plugin] - /home/hudson/genie.capella/.jenkins/jobs/capella-studio-gerrit/workspace/vpdsl/tests/capellastudio.vpdsl.qualityassessment.tests/target/aut-ws-0/org.polarsys.capella.vp.qualityassessment.af/src/org/polarsys/capella/vp/qualityassessment/af/businessrules 2 files
[JaCoCo plugin] - /home/hudson/genie.capella/.jenkins/jobs/capella-studio-gerrit/workspace/vpdsl/tests/capellastudio.vpdsl.qualityassessment.tests/target/aut-ws-0/org.polarsys.capella.vp.qualityassessment.contextual.explorer/src 6 files
[JaCoCo plugin] - /home/hudson/genie.capella/.jenkins/jobs/capella-studio-gerrit/workspace/vpdsl/tests/capellastudio.vpdsl.qualityassessment.tests/target/aut-ws-0/org.polarsys.capella.vp.qualityassessment.contextual.explorer/src/org 6 files
[JaCoCo plugin] - /home/hudson/genie.capella/.jenkins/jobs/capella-studio-gerrit/workspace/vpdsl/tests/capellastudio.vpdsl.qualityassessment.tests/target/aut-ws-0/org.polarsys.capella.vp.qualityassessment.contextual.explorer/src/org/polarsys 6 files
[JaCoCo plugin] - /home/hudson/genie.capella/.jenkins/jobs/capella-studio-gerrit/workspace/vpdsl/tests/capellastudio.vpdsl.qualityassessment.tests/target/aut-ws-0/org.polarsys.capella.vp.qualityassessment.contextual.explorer/src/org/polarsys/capella 6 files
[JaCoCo plugin] - /home/hudson/genie.capella/.jenkins/jobs/capella-studio-gerrit/workspace/vpdsl/tests/capellastudio.vpdsl.qualityassessment.tests/target/aut-ws-0/org.polarsys.capella.vp.qualityassessment.contextual.explorer/src/org/polarsys/capella/vp 6 files
[JaCoCo plugin] - /home/hudson/genie.capella/.jenkins/jobs/capella-studio-gerrit/workspace/vpdsl/tests/capellastudio.vpdsl.qualityassessment.tests/target/aut-ws-0/org.polarsys.capella.vp.qualityassessment.contextual.explorer/src/org/polarsys/capella/vp/qualityassessment 6 files
[JaCoCo plugin] - /home/hudson/genie.capella/.jenkins/jobs/capella-studio-gerrit/workspace/vpdsl/tests/capellastudio.vpdsl.qualityassessment.tests/target/aut-ws-0/org.polarsys.capella.vp.qualityassessment.contextual.explorer/src/org/polarsys/capella/vp/qualityassessment/contextual 6 files
[JaCoCo plugin] - /home/hudson/genie.capella/.jenkins/jobs/capella-studio-gerrit/workspace/vpdsl/tests/capellastudio.vpdsl.qualityassessment.tests/target/aut-ws-0/org.polarsys.capella.vp.qualityassessment.contextual.explorer/src/org/polarsys/capella/vp/qualityassessment/contextual/explorer 6 files
[JaCoCo plugin] - /home/hudson/genie.capella/.jenkins/jobs/capella-studio-gerrit/workspace/vpdsl/tests/capellastudio.vpdsl.qualityassessment.tests/target/aut-ws-0/org.polarsys.capella.vp.qualityassessment.contextual.explorer/src/org/polarsys/capella/vp/qualityassessment/contextual/explorer/queries 6 files
[JaCoCo plugin] - /home/hudson/genie.capella/.jenkins/jobs/capella-studio-gerrit/workspace/vpdsl/tests/capellastudio.vpdsl.qualityassessment.tests/target/aut-ws-0/org.polarsys.capella.vp.qualityassessment.contextual.explorer/src/org/polarsys/capella/vp/qualityassessment/contextual/explorer/queries/qualityassessment 5 files
[JaCoCo plugin] - /home/hudson/genie.capella/.jenkins/jobs/capella-studio-gerrit/workspace/vpdsl/tests/capellastudio.vpdsl.qualityassessment.tests/target/aut-ws-0/org.polarsys.capella.vp.qualityassessment.contextual.explorer/src/org/polarsys/capella/vp/qualityassessment/contextual/explorer/queries/qualitymeasure 1 files
[JaCoCo plugin] - /home/hudson/genie.capella/.jenkins/jobs/capella-studio-gerrit/workspace/vpdsl/tests/capellastudio.vpdsl.qualityassessment.tests/target/aut-ws-0/org.polarsys.capella.vp.qualityassessment.design/src 2 files
[JaCoCo plugin] - /home/hudson/genie.capella/.jenkins/jobs/capella-studio-gerrit/workspace/vpdsl/tests/capellastudio.vpdsl.qualityassessment.tests/target/aut-ws-0/org.polarsys.capella.vp.qualityassessment.design/src/org 2 files
[JaCoCo plugin] - /home/hudson/genie.capella/.jenkins/jobs/capella-studio-gerrit/workspace/vpdsl/tests/capellastudio.vpdsl.qualityassessment.tests/target/aut-ws-0/org.polarsys.capella.vp.qualityassessment.design/src/org/polarsys 2 files
[JaCoCo plugin] - /home/hudson/genie.capella/.jenkins/jobs/capella-studio-gerrit/workspace/vpdsl/tests/capellastudio.vpdsl.qualityassessment.tests/target/aut-ws-0/org.polarsys.capella.vp.qualityassessment.design/src/org/polarsys/capella 2 files
[JaCoCo plugin] - /home/hudson/genie.capella/.jenkins/jobs/capella-studio-gerrit/workspace/vpdsl/tests/capellastudio.vpdsl.qualityassessment.tests/target/aut-ws-0/org.polarsys.capella.vp.qualityassessment.design/src/org/polarsys/capella/vp 2 files
[JaCoCo plugin] - /home/hudson/genie.capella/.jenkins/jobs/capella-studio-gerrit/workspace/vpdsl/tests/capellastudio.vpdsl.qualityassessment.tests/target/aut-ws-0/org.polarsys.capella.vp.qualityassessment.design/src/org/polarsys/capella/vp/qualityassessment 2 files
[JaCoCo plugin] - /home/hudson/genie.capella/.jenkins/jobs/capella-studio-gerrit/workspace/vpdsl/tests/capellastudio.vpdsl.qualityassessment.tests/target/aut-ws-0/org.polarsys.capella.vp.qualityassessment.design/src/org/polarsys/capella/vp/qualityassessment/design 2 files
[JaCoCo plugin] - /home/hudson/genie.capella/.jenkins/jobs/capella-studio-gerrit/workspace/vpdsl/tests/capellastudio.vpdsl.qualityassessment.tests/target/aut-ws-0/org.polarsys.capella.vp.qualityassessment.design/src/org/polarsys/capella/vp/qualityassessment/design/service 1 files
[JaCoCo plugin] - /home/hudson/genie.capella/.jenkins/jobs/capella-studio-gerrit/workspace/vpdsl/tests/capellastudio.vpdsl.qualityassessment.tests/target/aut-ws-0/org.polarsys.capella.vp.qualityassessment.model.edit/src 6 files
[JaCoCo plugin] - /home/hudson/genie.capella/.jenkins/jobs/capella-studio-gerrit/workspace/vpdsl/tests/capellastudio.vpdsl.qualityassessment.tests/target/aut-ws-0/org.polarsys.capella.vp.qualityassessment.model.edit/src/org 6 files
[JaCoCo plugin] - /home/hudson/genie.capella/.jenkins/jobs/capella-studio-gerrit/workspace/vpdsl/tests/capellastudio.vpdsl.qualityassessment.tests/target/aut-ws-0/org.polarsys.capella.vp.qualityassessment.model.edit/src/org/polarsys 6 files
[JaCoCo plugin] - /home/hudson/genie.capella/.jenkins/jobs/capella-studio-gerrit/workspace/vpdsl/tests/capellastudio.vpdsl.qualityassessment.tests/target/aut-ws-0/org.polarsys.capella.vp.qualityassessment.model.edit/src/org/polarsys/capella 6 files
[JaCoCo plugin] - /home/hudson/genie.capella/.jenkins/jobs/capella-studio-gerrit/workspace/vpdsl/tests/capellastudio.vpdsl.qualityassessment.tests/target/aut-ws-0/org.polarsys.capella.vp.qualityassessment.model.edit/src/org/polarsys/capella/vp 6 files
[JaCoCo plugin] - /home/hudson/genie.capella/.jenkins/jobs/capella-studio-gerrit/workspace/vpdsl/tests/capellastudio.vpdsl.qualityassessment.tests/target/aut-ws-0/org.polarsys.capella.vp.qualityassessment.model.edit/src/org/polarsys/capella/vp/qualityassessment 6 files
[JaCoCo plugin] - /home/hudson/genie.capella/.jenkins/jobs/capella-studio-gerrit/workspace/vpdsl/tests/capellastudio.vpdsl.qualityassessment.tests/target/aut-ws-0/org.polarsys.capella.vp.qualityassessment.model.edit/src/org/polarsys/capella/vp/qualityassessment/QualityAssessment 6 files
[JaCoCo plugin] - /home/hudson/genie.capella/.jenkins/jobs/capella-studio-gerrit/workspace/vpdsl/tests/capellastudio.vpdsl.qualityassessment.tests/target/aut-ws-0/org.polarsys.capella.vp.qualityassessment.model.edit/src/org/polarsys/capella/vp/qualityassessment/QualityAssessment/provider 6 files
[JaCoCo plugin] - /home/hudson/genie.capella/.jenkins/jobs/capella-studio-gerrit/workspace/vpdsl/tests/capellastudio.vpdsl.qualityassessment.tests/target/aut-ws-0/org.polarsys.capella.vp.qualityassessment.model.edit/src/org/polarsys/capella/vp/qualityassessment/QualityAssessment/provider/sections 2 files
[JaCoCo plugin] - /home/hudson/genie.capella/.jenkins/jobs/capella-studio-gerrit/workspace/vpdsl/tests/capellastudio.vpdsl.qualityassessment.tests/target/aut-ws-0/org.polarsys.capella.vp.qualityassessment.model/src 16 files
[JaCoCo plugin] - /home/hudson/genie.capella/.jenkins/jobs/capella-studio-gerrit/workspace/vpdsl/tests/capellastudio.vpdsl.qualityassessment.tests/target/aut-ws-0/org.polarsys.capella.vp.qualityassessment.model/src/org 16 files
[JaCoCo plugin] - /home/hudson/genie.capella/.jenkins/jobs/capella-studio-gerrit/workspace/vpdsl/tests/capellastudio.vpdsl.qualityassessment.tests/target/aut-ws-0/org.polarsys.capella.vp.qualityassessment.model/src/org/polarsys 16 files
[JaCoCo plugin] - /home/hudson/genie.capella/.jenkins/jobs/capella-studio-gerrit/workspace/vpdsl/tests/capellastudio.vpdsl.qualityassessment.tests/target/aut-ws-0/org.polarsys.capella.vp.qualityassessment.model/src/org/polarsys/capella 16 files
[JaCoCo plugin] - /home/hudson/genie.capella/.jenkins/jobs/capella-studio-gerrit/workspace/vpdsl/tests/capellastudio.vpdsl.qualityassessment.tests/target/aut-ws-0/org.polarsys.capella.vp.qualityassessment.model/src/org/polarsys/capella/vp 16 files
[JaCoCo plugin] - /home/hudson/genie.capella/.jenkins/jobs/capella-studio-gerrit/workspace/vpdsl/tests/capellastudio.vpdsl.qualityassessment.tests/target/aut-ws-0/org.polarsys.capella.vp.qualityassessment.model/src/org/polarsys/capella/vp/qualityassessment 16 files
[JaCoCo plugin] - /home/hudson/genie.capella/.jenkins/jobs/capella-studio-gerrit/workspace/vpdsl/tests/capellastudio.vpdsl.qualityassessment.tests/target/aut-ws-0/org.polarsys.capella.vp.qualityassessment.model/src/org/polarsys/capella/vp/qualityassessment/QualityAssessment 13 files
[JaCoCo plugin] - /home/hudson/genie.capella/.jenkins/jobs/capella-studio-gerrit/workspace/vpdsl/tests/capellastudio.vpdsl.qualityassessment.tests/target/aut-ws-0/org.polarsys.capella.vp.qualityassessment.model/src/org/polarsys/capella/vp/qualityassessment/QualityAssessment/impl 4 files
[JaCoCo plugin] - /home/hudson/genie.capella/.jenkins/jobs/capella-studio-gerrit/workspace/vpdsl/tests/capellastudio.vpdsl.qualityassessment.tests/target/aut-ws-0/org.polarsys.capella.vp.qualityassessment.model/src/org/polarsys/capella/vp/qualityassessment/QualityAssessment/util 4 files
[JaCoCo plugin] - /home/hudson/genie.capella/.jenkins/jobs/capella-studio-gerrit/workspace/vpdsl/tests/capellastudio.vpdsl.qualityassessment.tests/target/aut-ws-0/org.polarsys.capella.vp.qualityassessment.model/src/org/polarsys/capella/vp/qualityassessment/model 3 files
[JaCoCo plugin] - /home/hudson/genie.capella/.jenkins/jobs/capella-studio-gerrit/workspace/vpdsl/tests/capellastudio.vpdsl.qualityassessment.tests/target/aut-ws-0/org.polarsys.capella.vp.qualityassessment.model/src/org/polarsys/capella/vp/qualityassessment/model/helpers 3 files
[JaCoCo plugin] - /home/hudson/genie.capella/.jenkins/jobs/capella-studio-gerrit/workspace/vpdsl/tests/capellastudio.vpdsl.qualityassessment.tests/target/aut-ws-0/org.polarsys.capella.vp.qualityassessment.releng/src 0 files
[JaCoCo plugin] - /home/hudson/genie.capella/.jenkins/jobs/capella-studio-gerrit/workspace/vpdsl/tests/capellastudio.vpdsl.qualityassessment.tests/target/aut-ws-0/org.polarsys.capella.vp.qualityassessment.rules.analysis/src 0 files
[JaCoCo plugin] - /home/hudson/genie.capella/.jenkins/jobs/capella-studio-gerrit/workspace/vpdsl/tests/capellastudio.vpdsl.qualityassessment.tests/target/aut-ws-0/org.polarsys.capella.vp.qualityassessment.rules.computation/src 0 files
[JaCoCo plugin] - /home/hudson/genie.capella/.jenkins/jobs/capella-studio-gerrit/workspace/vpdsl/tests/capellastudio.vpdsl.qualityassessment.tests/target/aut-ws-0/org.polarsys.capella.vp.qualityassessment.rules.generation/src 0 files
[JaCoCo plugin] - /home/hudson/genie.capella/.jenkins/jobs/capella-studio-gerrit/workspace/vpdsl/tests/capellastudio.vpdsl.qualityassessment.tests/target/aut-ws-0/org.polarsys.capella.vp.qualityassessment.rules.transformation/src 0 files
[JaCoCo plugin] - /home/hudson/genie.capella/.jenkins/jobs/capella-studio-gerrit/workspace/vpdsl/tests/capellastudio.vpdsl.qualityassessment.tests/target/aut-ws-0/org.polarsys.capella.vp.qualityassessment.rules.validation/src 0 files
[JaCoCo plugin] - /home/hudson/genie.capella/.jenkins/jobs/capella-studio-gerrit/workspace/vpdsl/tests/capellastudio.vpdsl.qualityassessment.tests/target/aut-ws-0/org.polarsys.capella.vp.qualityassessment.ui/src 10 files
[JaCoCo plugin] - /home/hudson/genie.capella/.jenkins/jobs/capella-studio-gerrit/workspace/vpdsl/tests/capellastudio.vpdsl.qualityassessment.tests/target/aut-ws-0/org.polarsys.capella.vp.qualityassessment.ui/src/org 10 files
[JaCoCo plugin] - /home/hudson/genie.capella/.jenkins/jobs/capella-studio-gerrit/workspace/vpdsl/tests/capellastudio.vpdsl.qualityassessment.tests/target/aut-ws-0/org.polarsys.capella.vp.qualityassessment.ui/src/org/polarsys 10 files
[JaCoCo plugin] - /home/hudson/genie.capella/.jenkins/jobs/capella-studio-gerrit/workspace/vpdsl/tests/capellastudio.vpdsl.qualityassessment.tests/target/aut-ws-0/org.polarsys.capella.vp.qualityassessment.ui/src/org/polarsys/capella 10 files
[JaCoCo plugin] - /home/hudson/genie.capella/.jenkins/jobs/capella-studio-gerrit/workspace/vpdsl/tests/capellastudio.vpdsl.qualityassessment.tests/target/aut-ws-0/org.polarsys.capella.vp.qualityassessment.ui/src/org/polarsys/capella/vp 10 files
[JaCoCo plugin] - /home/hudson/genie.capella/.jenkins/jobs/capella-studio-gerrit/workspace/vpdsl/tests/capellastudio.vpdsl.qualityassessment.tests/target/aut-ws-0/org.polarsys.capella.vp.qualityassessment.ui/src/org/polarsys/capella/vp/qualityassessment 10 files
[JaCoCo plugin] - /home/hudson/genie.capella/.jenkins/jobs/capella-studio-gerrit/workspace/vpdsl/tests/capellastudio.vpdsl.qualityassessment.tests/target/aut-ws-0/org.polarsys.capella.vp.qualityassessment.ui/src/org/polarsys/capella/vp/qualityassessment/ui 10 files
[JaCoCo plugin] - /home/hudson/genie.capella/.jenkins/jobs/capella-studio-gerrit/workspace/vpdsl/tests/capellastudio.vpdsl.qualityassessment.tests/target/aut-ws-0/org.polarsys.capella.vp.qualityassessment.ui/src/org/polarsys/capella/vp/qualityassessment/ui/controllers 3 files
[JaCoCo plugin] - /home/hudson/genie.capella/.jenkins/jobs/capella-studio-gerrit/workspace/vpdsl/tests/capellastudio.vpdsl.qualityassessment.tests/target/aut-ws-0/org.polarsys.capella.vp.qualityassessment.ui/src/org/polarsys/capella/vp/qualityassessment/ui/fields 2 files
[JaCoCo plugin] - /home/hudson/genie.capella/.jenkins/jobs/capella-studio-gerrit/workspace/vpdsl/tests/capellastudio.vpdsl.qualityassessment.tests/target/aut-ws-0/org.polarsys.capella.vp.qualityassessment.ui/src/org/polarsys/capella/vp/qualityassessment/ui/queries 3 files
[JaCoCo plugin] - /home/hudson/genie.capella/.jenkins/jobs/capella-studio-gerrit/workspace/vpdsl/tests/capellastudio.vpdsl.qualityassessment.tests/target/aut-ws-0/org.polarsys.capella.vp.qualityassessment.ui/src/org/polarsys/capella/vp/qualityassessment/ui/sections 2 files
[JaCoCo plugin] - /home/hudson/genie.capella/.jenkins/jobs/capella-studio-gerrit/workspace/vpdsl/tests/capellastudio.vpdsl.qualityassessment.tests/target/aut-ws-0/org.polarsys.capella.vp.qualityassessment.vpdsl/src 0 files
[JaCoCo plugin] - /home/hudson/genie.capella/.jenkins/jobs/capella-studio-gerrit/workspace/vpdsl/tests/capellastudio.vpdsl.qualityassessment.tests/target/aut-ws-0/org.polarsys.capella.vp.qualityassessment/src 0 files
[JaCoCo plugin] - /home/hudson/genie.capella/.jenkins/jobs/capella-studio-gerrit/workspace/vpdsl/tests/org.polarsys.capella.ad.viewpoint.dsl.tests/src 3 files
[JaCoCo plugin] - /home/hudson/genie.capella/.jenkins/jobs/capella-studio-gerrit/workspace/vpdsl/tests/org.polarsys.capella.ad.viewpoint.dsl.tests/src/org 3 files
[JaCoCo plugin] - /home/hudson/genie.capella/.jenkins/jobs/capella-studio-gerrit/workspace/vpdsl/tests/org.polarsys.capella.ad.viewpoint.dsl.tests/src/org/polarsys 3 files
[JaCoCo plugin] - /home/hudson/genie.capella/.jenkins/jobs/capella-studio-gerrit/workspace/vpdsl/tests/org.polarsys.capella.ad.viewpoint.dsl.tests/src/org/polarsys/capella 3 files
[JaCoCo plugin] - /home/hudson/genie.capella/.jenkins/jobs/capella-studio-gerrit/workspace/vpdsl/tests/org.polarsys.capella.ad.viewpoint.dsl.tests/src/org/polarsys/capella/ad 3 files
[JaCoCo plugin] - /home/hudson/genie.capella/.jenkins/jobs/capella-studio-gerrit/workspace/vpdsl/tests/org.polarsys.capella.ad.viewpoint.dsl.tests/src/org/polarsys/capella/ad/viewpoint 3 files
[JaCoCo plugin] - /home/hudson/genie.capella/.jenkins/jobs/capella-studio-gerrit/workspace/vpdsl/tests/org.polarsys.capella.ad.viewpoint.dsl.tests/src/org/polarsys/capella/ad/viewpoint/dsl 3 files
[JaCoCo plugin] - /home/hudson/genie.capella/.jenkins/jobs/capella-studio-gerrit/workspace/vpdsl/tests/org.polarsys.capella.ad.viewpoint.dsl.tests/src/org/polarsys/capella/ad/viewpoint/dsl/tests 3 files
[JaCoCo plugin] - /home/hudson/genie.capella/.jenkins/jobs/capella-studio-gerrit/workspace/vpdsl/tests/org.polarsys.capella.ad.viewpoint.dsl.tests/src/org/polarsys/capella/ad/viewpoint/dsl/tests/suite 1 files
[JaCoCo plugin] - /home/hudson/genie.capella/.jenkins/jobs/capella-studio-gerrit/workspace/vpdsl/tests/org.polarsys.capella.ad.viewpoint.dsl.tests/src/org/polarsys/capella/ad/viewpoint/dsl/tests/ta 1 files
[JaCoCo plugin] - /home/hudson/genie.capella/.jenkins/jobs/capella-studio-gerrit/workspace/vpdsl/tests/org.polarsys.capella.studio.ad.viewpoint.rcptt/target/aut-ws-0/org.polarsys.capella.vp.security4capella.vpdsl/src 0 files
[JaCoCo plugin] - /home/hudson/genie.capella/.jenkins/jobs/capella-studio-gerrit/workspace/vpdsl/tests/org.polarsys.capella.studio.ad.viewpoint.rcptt/target/aut-ws-0/org.polarsys.kitalpha.vp.security.af/src 0 files
[JaCoCo plugin] - /home/hudson/genie.capella/.jenkins/jobs/capella-studio-gerrit/workspace/vpdsl/tests/org.polarsys.capella.studio.ad.viewpoint.rcptt/target/aut-ws-0/org.polarsys.kitalpha.vp.security.contextual.explorer/src 7 files
[JaCoCo plugin] - /home/hudson/genie.capella/.jenkins/jobs/capella-studio-gerrit/workspace/vpdsl/tests/org.polarsys.capella.studio.ad.viewpoint.rcptt/target/aut-ws-0/org.polarsys.kitalpha.vp.security.contextual.explorer/src/org 7 files
[JaCoCo plugin] - /home/hudson/genie.capella/.jenkins/jobs/capella-studio-gerrit/workspace/vpdsl/tests/org.polarsys.capella.studio.ad.viewpoint.rcptt/target/aut-ws-0/org.polarsys.kitalpha.vp.security.contextual.explorer/src/org/polarsys 7 files
[JaCoCo plugin] - /home/hudson/genie.capella/.jenkins/jobs/capella-studio-gerrit/workspace/vpdsl/tests/org.polarsys.capella.studio.ad.viewpoint.rcptt/target/aut-ws-0/org.polarsys.kitalpha.vp.security.contextual.explorer/src/org/polarsys/kitalpha 7 files
[JaCoCo plugin] - /home/hudson/genie.capella/.jenkins/jobs/capella-studio-gerrit/workspace/vpdsl/tests/org.polarsys.capella.studio.ad.viewpoint.rcptt/target/aut-ws-0/org.polarsys.kitalpha.vp.security.contextual.explorer/src/org/polarsys/kitalpha/vp 7 files
[JaCoCo plugin] - /home/hudson/genie.capella/.jenkins/jobs/capella-studio-gerrit/workspace/vpdsl/tests/org.polarsys.capella.studio.ad.viewpoint.rcptt/target/aut-ws-0/org.polarsys.kitalpha.vp.security.contextual.explorer/src/org/polarsys/kitalpha/vp/security 7 files
[JaCoCo plugin] - /home/hudson/genie.capella/.jenkins/jobs/capella-studio-gerrit/workspace/vpdsl/tests/org.polarsys.capella.studio.ad.viewpoint.rcptt/target/aut-ws-0/org.polarsys.kitalpha.vp.security.contextual.explorer/src/org/polarsys/kitalpha/vp/security/contextual 7 files
[JaCoCo plugin] - /home/hudson/genie.capella/.jenkins/jobs/capella-studio-gerrit/workspace/vpdsl/tests/org.polarsys.capella.studio.ad.viewpoint.rcptt/target/aut-ws-0/org.polarsys.kitalpha.vp.security.contextual.explorer/src/org/polarsys/kitalpha/vp/security/contextual/explorer 7 files
[JaCoCo plugin] - /home/hudson/genie.capella/.jenkins/jobs/capella-studio-gerrit/workspace/vpdsl/tests/org.polarsys.capella.studio.ad.viewpoint.rcptt/target/aut-ws-0/org.polarsys.kitalpha.vp.security.contextual.explorer/src/org/polarsys/kitalpha/vp/security/contextual/explorer/queries 7 files
[JaCoCo plugin] - /home/hudson/genie.capella/.jenkins/jobs/capella-studio-gerrit/workspace/vpdsl/tests/org.polarsys.capella.studio.ad.viewpoint.rcptt/target/aut-ws-0/org.polarsys.kitalpha.vp.security.contextual.explorer/src/org/polarsys/kitalpha/vp/security/contextual/explorer/queries/securitycountermeasure 2 files
[JaCoCo plugin] - /home/hudson/genie.capella/.jenkins/jobs/capella-studio-gerrit/workspace/vpdsl/tests/org.polarsys.capella.studio.ad.viewpoint.rcptt/target/aut-ws-0/org.polarsys.kitalpha.vp.security.contextual.explorer/src/org/polarsys/kitalpha/vp/security/contextual/explorer/queries/securitymeasure 1 files
[JaCoCo plugin] - /home/hudson/genie.capella/.jenkins/jobs/capella-studio-gerrit/workspace/vpdsl/tests/org.polarsys.capella.studio.ad.viewpoint.rcptt/target/aut-ws-0/org.polarsys.kitalpha.vp.security.contextual.explorer/src/org/polarsys/kitalpha/vp/security/contextual/explorer/queries/securitythreat 2 files
[JaCoCo plugin] - /home/hudson/genie.capella/.jenkins/jobs/capella-studio-gerrit/workspace/vpdsl/tests/org.polarsys.capella.studio.ad.viewpoint.rcptt/target/aut-ws-0/org.polarsys.kitalpha.vp.security.contextual.explorer/src/org/polarsys/kitalpha/vp/security/contextual/explorer/queries/securityvulnerability 2 files
[JaCoCo plugin] - /home/hudson/genie.capella/.jenkins/jobs/capella-studio-gerrit/workspace/vpdsl/tests/org.polarsys.capella.studio.ad.viewpoint.rcptt/target/aut-ws-0/org.polarsys.kitalpha.vp.security.model.edit/src 12 files
[JaCoCo plugin] - /home/hudson/genie.capella/.jenkins/jobs/capella-studio-gerrit/workspace/vpdsl/tests/org.polarsys.capella.studio.ad.viewpoint.rcptt/target/aut-ws-0/org.polarsys.kitalpha.vp.security.model.edit/src/org 12 files
[JaCoCo plugin] - /home/hudson/genie.capella/.jenkins/jobs/capella-studio-gerrit/workspace/vpdsl/tests/org.polarsys.capella.studio.ad.viewpoint.rcptt/target/aut-ws-0/org.polarsys.kitalpha.vp.security.model.edit/src/org/polarsys 12 files
[JaCoCo plugin] - /home/hudson/genie.capella/.jenkins/jobs/capella-studio-gerrit/workspace/vpdsl/tests/org.polarsys.capella.studio.ad.viewpoint.rcptt/target/aut-ws-0/org.polarsys.kitalpha.vp.security.model.edit/src/org/polarsys/kitalpha 12 files
[JaCoCo plugin] - /home/hudson/genie.capella/.jenkins/jobs/capella-studio-gerrit/workspace/vpdsl/tests/org.polarsys.capella.studio.ad.viewpoint.rcptt/target/aut-ws-0/org.polarsys.kitalpha.vp.security.model.edit/src/org/polarsys/kitalpha/vp 12 files
[JaCoCo plugin] - /home/hudson/genie.capella/.jenkins/jobs/capella-studio-gerrit/workspace/vpdsl/tests/org.polarsys.capella.studio.ad.viewpoint.rcptt/target/aut-ws-0/org.polarsys.kitalpha.vp.security.model.edit/src/org/polarsys/kitalpha/vp/security 12 files
[JaCoCo plugin] - /home/hudson/genie.capella/.jenkins/jobs/capella-studio-gerrit/workspace/vpdsl/tests/org.polarsys.capella.studio.ad.viewpoint.rcptt/target/aut-ws-0/org.polarsys.kitalpha.vp.security.model.edit/src/org/polarsys/kitalpha/vp/security/security 12 files
[JaCoCo plugin] - /home/hudson/genie.capella/.jenkins/jobs/capella-studio-gerrit/workspace/vpdsl/tests/org.polarsys.capella.studio.ad.viewpoint.rcptt/target/aut-ws-0/org.polarsys.kitalpha.vp.security.model.edit/src/org/polarsys/kitalpha/vp/security/security/provider 12 files
[JaCoCo plugin] - /home/hudson/genie.capella/.jenkins/jobs/capella-studio-gerrit/workspace/vpdsl/tests/org.polarsys.capella.studio.ad.viewpoint.rcptt/target/aut-ws-0/org.polarsys.kitalpha.vp.security.model/src 29 files
[JaCoCo plugin] - /home/hudson/genie.capella/.jenkins/jobs/capella-studio-gerrit/workspace/vpdsl/tests/org.polarsys.capella.studio.ad.viewpoint.rcptt/target/aut-ws-0/org.polarsys.kitalpha.vp.security.model/src/org 29 files
[JaCoCo plugin] - /home/hudson/genie.capella/.jenkins/jobs/capella-studio-gerrit/workspace/vpdsl/tests/org.polarsys.capella.studio.ad.viewpoint.rcptt/target/aut-ws-0/org.polarsys.kitalpha.vp.security.model/src/org/polarsys 29 files
[JaCoCo plugin] - /home/hudson/genie.capella/.jenkins/jobs/capella-studio-gerrit/workspace/vpdsl/tests/org.polarsys.capella.studio.ad.viewpoint.rcptt/target/aut-ws-0/org.polarsys.kitalpha.vp.security.model/src/org/polarsys/kitalpha 29 files
[JaCoCo plugin] - /home/hudson/genie.capella/.jenkins/jobs/capella-studio-gerrit/workspace/vpdsl/tests/org.polarsys.capella.studio.ad.viewpoint.rcptt/target/aut-ws-0/org.polarsys.kitalpha.vp.security.model/src/org/polarsys/kitalpha/vp 29 files
[JaCoCo plugin] - /home/hudson/genie.capella/.jenkins/jobs/capella-studio-gerrit/workspace/vpdsl/tests/org.polarsys.capella.studio.ad.viewpoint.rcptt/target/aut-ws-0/org.polarsys.kitalpha.vp.security.model/src/org/polarsys/kitalpha/vp/security 29 files
[JaCoCo plugin] - /home/hudson/genie.capella/.jenkins/jobs/capella-studio-gerrit/workspace/vpdsl/tests/org.polarsys.capella.studio.ad.viewpoint.rcptt/target/aut-ws-0/org.polarsys.kitalpha.vp.security.model/src/org/polarsys/kitalpha/vp/security/security 29 files
[JaCoCo plugin] - /home/hudson/genie.capella/.jenkins/jobs/capella-studio-gerrit/workspace/vpdsl/tests/org.polarsys.capella.studio.ad.viewpoint.rcptt/target/aut-ws-0/org.polarsys.kitalpha.vp.security.model/src/org/polarsys/kitalpha/vp/security/security/impl 12 files
[JaCoCo plugin] - /home/hudson/genie.capella/.jenkins/jobs/capella-studio-gerrit/workspace/vpdsl/tests/org.polarsys.capella.studio.ad.viewpoint.rcptt/target/aut-ws-0/org.polarsys.kitalpha.vp.security.model/src/org/polarsys/kitalpha/vp/security/security/util 4 files
[JaCoCo plugin] - /home/hudson/genie.capella/.jenkins/jobs/capella-studio-gerrit/workspace/vpdsl/tests/org.polarsys.capella.studio.ad.viewpoint.rcptt/target/aut-ws-0/org.polarsys.kitalpha.vp.security.rules.analysis/src 0 files
[JaCoCo plugin] - /home/hudson/genie.capella/.jenkins/jobs/capella-studio-gerrit/workspace/vpdsl/tests/org.polarsys.capella.studio.ad.viewpoint.rcptt/target/aut-ws-0/org.polarsys.kitalpha.vp.security.rules.computation/src 0 files
[JaCoCo plugin] - /home/hudson/genie.capella/.jenkins/jobs/capella-studio-gerrit/workspace/vpdsl/tests/org.polarsys.capella.studio.ad.viewpoint.rcptt/target/aut-ws-0/org.polarsys.kitalpha.vp.security.rules.generation/src 0 files
[JaCoCo plugin] - /home/hudson/genie.capella/.jenkins/jobs/capella-studio-gerrit/workspace/vpdsl/tests/org.polarsys.capella.studio.ad.viewpoint.rcptt/target/aut-ws-0/org.polarsys.kitalpha.vp.security.rules.transformation/src 0 files
[JaCoCo plugin] - /home/hudson/genie.capella/.jenkins/jobs/capella-studio-gerrit/workspace/vpdsl/tests/org.polarsys.capella.studio.ad.viewpoint.rcptt/target/aut-ws-0/org.polarsys.kitalpha.vp.security.rules.validation/src 0 files
[JaCoCo plugin] - /home/hudson/genie.capella/.jenkins/jobs/capella-studio-gerrit/workspace/vpdsl/tests/org.polarsys.capella.studio.ad.viewpoint.rcptt/target/aut-ws-0/org.polarsys.kitalpha.vp.security.vpdsl/src 0 files
[JaCoCo plugin] - /home/hudson/genie.capella/.jenkins/jobs/capella-studio-gerrit/workspace/vpdsl/tests/org.polarsys.capella.studio.ad.viewpoint.rcptt/target/aut-ws-0/org.polarsys.kitalpha.vp.security/src 0 files
[JaCoCo plugin] Loading inclusions files..
[JaCoCo plugin] inclusions: []
[JaCoCo plugin] exclusions: []
[JaCoCo plugin] Thresholds: JacocoHealthReportThresholds [minClass=0, maxClass=0, minMethod=0, maxMethod=0, minLine=0, maxLine=0, minBranch=0, maxBranch=0, minInstruction=0, maxInstruction=0, minComplexity=0, maxComplexity=0]
[JaCoCo plugin] Publishing the results..
[JaCoCo plugin] Loading packages..
[JaCoCo plugin] Done.
[JaCoCo plugin] Overall coverage: class: 75, method: 60, line: 66, branch: 43, instruction: 72
Started calculate disk usage of build
Finished Calculation of disk usage of build in 0 seconds
Started calculate disk usage of workspace
Finished Calculation of disk usage of workspace in  1 second
[WS-CLEANUP] Deleting project workspace...
[WS-CLEANUP] Deferred wipeout is used...
[WS-CLEANUP] done
Finished: UNSTABLE