FailedConsole Output

Started by an SCM change
Started by an SCM change
Started by an SCM change
Started by an SCM change
Started by an SCM change
Started by an SCM change
Started by an SCM change
Building in workspace /home/hudson/genie.capella/.jenkins/jobs/capella-addon-transitionsystem2subsystem-v1.2.x/workspace
 > /usr/local/bin/git rev-parse --is-inside-work-tree # timeout=10
Fetching changes from the remote Git repository
 > /usr/local/bin/git config remote.origin.url http://git.polarsys.org/gitroot/capella/capella-sss-transition.git # timeout=10
Fetching upstream changes from http://git.polarsys.org/gitroot/capella/capella-sss-transition.git
 > /usr/local/bin/git --version # timeout=10
 > /usr/local/bin/git fetch --tags --progress http://git.polarsys.org/gitroot/capella/capella-sss-transition.git +refs/heads/*:refs/remotes/origin/*
 > /usr/local/bin/git rev-parse origin/v1.2.x^{commit} # timeout=10
Checking out Revision b7fcbe6276b903e4e8e7c90e35a813463a62b5a8 (origin/v1.2.x)
 > /usr/local/bin/git config core.sparsecheckout # timeout=10
 > /usr/local/bin/git checkout -f b7fcbe6276b903e4e8e7c90e35a813463a62b5a8
Commit message: "[2298] Adding NOTICE, CONTRIBUTING and LICENSE files to git repositories"
 > /usr/local/bin/git rev-list --no-walk 138916721f334a27cd8100982dc1010b5e3a05d6 # timeout=10
Starting xvnc
[workspace] $ Xvnc :2001 -geometry 1024x768 -depth 24 -ac -SecurityTypes none -noreset
[workspace] $ /shared/common/apache-maven-latest/bin/mvn -f releng/org.polarsys.capella.transition.system2subsystem.target/pom.xml -Dmaven.repo.local=/home/hudson/genie.capella/.jenkins/jobs/capella-addon-transitionsystem2subsystem-v1.2.x/workspace/.repository clean verify

Xvnc TigerVNC 1.4.3 - built ??? ?? ???? ??:??:??
Copyright (C) 1999-2015 TigerVNC Team and many others (see README.txt)
See http://www.tigervnc.org for information on TigerVNC.
Underlying X server release 11502000, The X.Org Foundation

Initializing built-in extension VNC-EXTENSION
Initializing built-in extension Generic Event Extension
Initializing built-in extension SHAPE
Initializing built-in extension MIT-SHM
Initializing built-in extension XInputExtension
Initializing built-in extension XTEST
Initializing built-in extension BIG-REQUESTS
Initializing built-in extension SYNC
Initializing built-in extension XKEYBOARD
Initializing built-in extension XC-MISC
Initializing built-in extension XFIXES
Initializing built-in extension RENDER
Initializing built-in extension RANDR
Initializing built-in extension COMPOSITE
Initializing built-in extension DAMAGE
Initializing built-in extension MIT-SCREEN-SAVER
Initializing built-in extension DOUBLE-BUFFER
Initializing built-in extension RECORD
Initializing built-in extension DPMS
Initializing built-in extension Present
Initializing built-in extension X-Resource
Initializing built-in extension XVideo
Initializing built-in extension XVideo-MotionCompensation
Initializing built-in extension GLX

Tue Dec  4 10:21:22 2018
 vncext:      VNC extension running!
 vncext:      Listening for VNC connections on all interface(s), port 7901
 vncext:      created VNC server for screen 0
[dix] Could not init font path element /usr/share/fonts/TTF/, removing from list!
[dix] Could not init font path element /usr/share/fonts/OTF/, removing from list!
Picked up JAVA_TOOL_OPTIONS: -Xmx2G -Djava.io.tmpdir=/tmp/genie.capella
[INFO] Scanning for projects...
[INFO] 
[INFO] ---------------< org.polarsys:capella.target-definition >---------------
[INFO] Building capella.target-definition 1.2.1-SNAPSHOT
[INFO] --------------------------------[ pom ]---------------------------------
Downloading from eclipse.maven.central.mirror: https://repo.eclipse.org/content/repositories/maven_central/org/apache/maven/plugins/maven-clean-plugin/2.5/maven-clean-plugin-2.5.pom
Progress (1): 3.9 kB
                    
Downloaded from eclipse.maven.central.mirror: https://repo.eclipse.org/content/repositories/maven_central/org/apache/maven/plugins/maven-clean-plugin/2.5/maven-clean-plugin-2.5.pom (3.9 kB at 6.6 kB/s)
Downloading from eclipse.maven.central.mirror: https://repo.eclipse.org/content/repositories/maven_central/org/apache/maven/plugins/maven-plugins/22/maven-plugins-22.pom
Progress (1): 4.1/13 kB
Progress (1): 7.7/13 kB
Progress (1): 12/13 kB 
Progress (1): 13 kB   
                   
Downloaded from eclipse.maven.central.mirror: https://repo.eclipse.org/content/repositories/maven_central/org/apache/maven/plugins/maven-plugins/22/maven-plugins-22.pom (13 kB at 395 kB/s)
Downloading from eclipse.maven.central.mirror: https://repo.eclipse.org/content/repositories/maven_central/org/apache/maven/maven-parent/21/maven-parent-21.pom
Progress (1): 4.1/26 kB
Progress (1): 7.7/26 kB
Progress (1): 12/26 kB 
Progress (1): 16/26 kB
Progress (1): 20/26 kB
Progress (1): 24/26 kB
Progress (1): 26 kB   
                   
Downloaded from eclipse.maven.central.mirror: https://repo.eclipse.org/content/repositories/maven_central/org/apache/maven/maven-parent/21/maven-parent-21.pom (26 kB at 976 kB/s)
Downloading from eclipse.maven.central.mirror: https://repo.eclipse.org/content/repositories/maven_central/org/apache/apache/10/apache-10.pom
Progress (1): 4.1/15 kB
Progress (1): 7.7/15 kB
Progress (1): 12/15 kB 
Progress (1): 15 kB   
                   
Downloaded from eclipse.maven.central.mirror: https://repo.eclipse.org/content/repositories/maven_central/org/apache/apache/10/apache-10.pom (15 kB at 477 kB/s)
Downloading from eclipse.maven.central.mirror: https://repo.eclipse.org/content/repositories/maven_central/org/apache/maven/plugins/maven-clean-plugin/2.5/maven-clean-plugin-2.5.jar
Progress (1): 4.1/25 kB
Progress (1): 7.7/25 kB
Progress (1): 12/25 kB 
Progress (1): 16/25 kB
Progress (1): 20/25 kB
Progress (1): 24/25 kB
Progress (1): 25 kB   
                   
Downloaded from eclipse.maven.central.mirror: https://repo.eclipse.org/content/repositories/maven_central/org/apache/maven/plugins/maven-clean-plugin/2.5/maven-clean-plugin-2.5.jar (25 kB at 1.0 MB/s)
[INFO] 
[INFO] --- maven-clean-plugin:2.5:clean (default-clean) @ capella.target-definition ---
Downloading from eclipse.maven.central.mirror: https://repo.eclipse.org/content/repositories/maven_central/org/apache/maven/maven-plugin-api/2.0.6/maven-plugin-api-2.0.6.pom
Progress (1): 1.5 kB
                    
Downloaded from eclipse.maven.central.mirror: https://repo.eclipse.org/content/repositories/maven_central/org/apache/maven/maven-plugin-api/2.0.6/maven-plugin-api-2.0.6.pom (1.5 kB at 29 kB/s)
Downloading from eclipse.maven.central.mirror: https://repo.eclipse.org/content/repositories/maven_central/org/apache/maven/maven/2.0.6/maven-2.0.6.pom
Progress (1): 4.1/9.0 kB
Progress (1): 7.7/9.0 kB
Progress (1): 9.0 kB    
                    
Downloaded from eclipse.maven.central.mirror: https://repo.eclipse.org/content/repositories/maven_central/org/apache/maven/maven/2.0.6/maven-2.0.6.pom (9.0 kB at 323 kB/s)
Downloading from eclipse.maven.central.mirror: https://repo.eclipse.org/content/repositories/maven_central/org/apache/maven/maven-parent/5/maven-parent-5.pom
Progress (1): 4.1/15 kB
Progress (1): 7.7/15 kB
Progress (1): 12/15 kB 
Progress (1): 15 kB   
                   
Downloaded from eclipse.maven.central.mirror: https://repo.eclipse.org/content/repositories/maven_central/org/apache/maven/maven-parent/5/maven-parent-5.pom (15 kB at 726 kB/s)
Downloading from eclipse.maven.central.mirror: https://repo.eclipse.org/content/repositories/maven_central/org/apache/apache/3/apache-3.pom
Progress (1): 3.4 kB
                    
Downloaded from eclipse.maven.central.mirror: https://repo.eclipse.org/content/repositories/maven_central/org/apache/apache/3/apache-3.pom (3.4 kB at 202 kB/s)
Downloading from eclipse.maven.central.mirror: https://repo.eclipse.org/content/repositories/maven_central/org/codehaus/plexus/plexus-utils/3.0/plexus-utils-3.0.pom
Progress (1): 4.1 kB
                    
Downloaded from eclipse.maven.central.mirror: https://repo.eclipse.org/content/repositories/maven_central/org/codehaus/plexus/plexus-utils/3.0/plexus-utils-3.0.pom (4.1 kB at 185 kB/s)
Downloading from eclipse.maven.central.mirror: https://repo.eclipse.org/content/repositories/maven_central/org/sonatype/spice/spice-parent/16/spice-parent-16.pom
Progress (1): 4.1/8.4 kB
Progress (1): 7.7/8.4 kB
Progress (1): 8.4 kB    
                    
Downloaded from eclipse.maven.central.mirror: https://repo.eclipse.org/content/repositories/maven_central/org/sonatype/spice/spice-parent/16/spice-parent-16.pom (8.4 kB at 440 kB/s)
Downloading from eclipse.maven.central.mirror: https://repo.eclipse.org/content/repositories/maven_central/org/sonatype/forge/forge-parent/5/forge-parent-5.pom
Progress (1): 4.1/8.4 kB
Progress (1): 7.7/8.4 kB
Progress (1): 8.4 kB    
                    
Downloaded from eclipse.maven.central.mirror: https://repo.eclipse.org/content/repositories/maven_central/org/sonatype/forge/forge-parent/5/forge-parent-5.pom (8.4 kB at 335 kB/s)
Downloading from eclipse.maven.central.mirror: https://repo.eclipse.org/content/repositories/maven_central/org/apache/maven/maven-plugin-api/2.0.6/maven-plugin-api-2.0.6.jar
Downloading from eclipse.maven.central.mirror: https://repo.eclipse.org/content/repositories/maven_central/org/codehaus/plexus/plexus-utils/3.0/plexus-utils-3.0.jar
Progress (1): 4.1/13 kB
Progress (1): 7.7/13 kB
Progress (1): 12/13 kB 
Progress (1): 13 kB   
                   
Downloaded from eclipse.maven.central.mirror: https://repo.eclipse.org/content/repositories/maven_central/org/apache/maven/maven-plugin-api/2.0.6/maven-plugin-api-2.0.6.jar (13 kB at 314 kB/s)
Progress (1): 4.1/226 kB
Progress (1): 7.7/226 kB
Progress (1): 12/226 kB 
Progress (1): 16/226 kB
Progress (1): 20/226 kB
Progress (1): 24/226 kB
Progress (1): 28/226 kB
Progress (1): 32/226 kB
Progress (1): 33/226 kB
Progress (1): 37/226 kB
Progress (1): 41/226 kB
Progress (1): 45/226 kB
Progress (1): 49/226 kB
Progress (1): 53/226 kB
Progress (1): 57/226 kB
Progress (1): 61/226 kB
Progress (1): 65/226 kB
Progress (1): 66/226 kB
Progress (1): 70/226 kB
Progress (1): 74/226 kB
Progress (1): 78/226 kB
Progress (1): 82/226 kB
Progress (1): 86/226 kB
Progress (1): 90/226 kB
Progress (1): 94/226 kB
Progress (1): 98/226 kB
Progress (1): 102/226 kB
Progress (1): 106/226 kB
Progress (1): 110/226 kB
Progress (1): 114/226 kB
Progress (1): 118/226 kB
Progress (1): 122/226 kB
Progress (1): 126/226 kB
Progress (1): 130/226 kB
Progress (1): 131/226 kB
Progress (1): 135/226 kB
Progress (1): 139/226 kB
Progress (1): 143/226 kB
Progress (1): 147/226 kB
Progress (1): 151/226 kB
Progress (1): 155/226 kB
Progress (1): 159/226 kB
Progress (1): 163/226 kB
Progress (1): 164/226 kB
Progress (1): 168/226 kB
Progress (1): 172/226 kB
Progress (1): 176/226 kB
Progress (1): 180/226 kB
Progress (1): 184/226 kB
Progress (1): 188/226 kB
Progress (1): 192/226 kB
Progress (1): 196/226 kB
Progress (1): 200/226 kB
Progress (1): 204/226 kB
Progress (1): 208/226 kB
Progress (1): 212/226 kB
Progress (1): 216/226 kB
Progress (1): 220/226 kB
Progress (1): 224/226 kB
Progress (1): 226 kB    
                    
Downloaded from eclipse.maven.central.mirror: https://repo.eclipse.org/content/repositories/maven_central/org/codehaus/plexus/plexus-utils/3.0/plexus-utils-3.0.jar (226 kB at 2.7 MB/s)
[INFO] Deleting /jobs/genie.capella/capella-addon-transitionsystem2subsystem-v1.2.x/workspace/releng/org.polarsys.capella.transition.system2subsystem.target/target
[INFO] 
[INFO] --- tycho-eclipserun-plugin:0.26.0:eclipse-run (generate.target) @ capella.target-definition ---
[INFO] Fetching p2.index from http://download.eclipse.org/releases/oxygen/201709271000/
[INFO] Fetching p2.index from http://download.eclipse.org/releases/oxygen/201709271000/
[INFO] Adding repository http://download.eclipse.org/releases/oxygen/201709271000
[INFO] Fetching content.xml.xz from http://download.eclipse.org/releases/oxygen/201709271000/
[INFO] Fetching content.xml.xz from http://download.eclipse.org/releases/oxygen/201709271000/
[INFO] Adding repository http://pdulth.github.io/fr.obeo.releng.targetplatform/p2/latest
[INFO] Fetching content.jar from http://pdulth.github.io/fr.obeo.releng.targetplatform/p2/latest/ (4.87kB)
[INFO] Fetching content.jar from http://pdulth.github.io/fr.obeo.releng.targetplatform/p2/latest/ (4.87kB)
[INFO] Fetching fr.obeo.releng.targetplatform_2.1.1.201810231422.jar from http://pdulth.github.io/fr.obeo.releng.targetplatform/p2/latest/plugins/ (388.35kB)
[INFO] Fetching fr.obeo.releng.targetplatform_2.1.1.201810231422.jar from http://pdulth.github.io/fr.obeo.releng.targetplatform/p2/latest/plugins/ (388.35kB)
[INFO] Fetching fr.obeo.releng.targetplatform.ui_2.1.1.201810231422.jar from http://pdulth.github.io/fr.obeo.releng.targetplatform/p2/latest/plugins/ (224.18kB)
[INFO] Fetching fr.obeo.releng.targetplatform.ui_2.1.1.201810231422.jar from http://pdulth.github.io/fr.obeo.releng.targetplatform/p2/latest/plugins/ (224.18kB)
[INFO] Fetching fr.obeo.releng.targetplatform-feature_2.1.1.201810231422.jar from http://pdulth.github.io/fr.obeo.releng.targetplatform/p2/latest/features/ (13.24kB)
[INFO] Fetching fr.obeo.releng.targetplatform-feature_2.1.1.201810231422.jar from http://pdulth.github.io/fr.obeo.releng.targetplatform/p2/latest/features/ (13.24kB)
[INFO] Toolchain in tycho-eclipserun-plugin: JDK[/opt/public/common/jdk1.8.0_x64-latest/jre]
[INFO] Expected eclipse log file: /jobs/genie.capella/capella-addon-transitionsystem2subsystem-v1.2.x/workspace/releng/org.polarsys.capella.transition.system2subsystem.target/target/eclipserun-work/data/.metadata/.log
[INFO] Command line:
	[/opt/public/common/jdk1.8.0_x64-latest/jre/bin/java, -jar, /jobs/genie.capella/capella-addon-transitionsystem2subsystem-v1.2.x/workspace/.repository/p2/osgi/bundle/org.eclipse.equinox.launcher/1.4.0.v20161219-1356/org.eclipse.equinox.launcher-1.4.0.v20161219-1356.jar, -install, /jobs/genie.capella/capella-addon-transitionsystem2subsystem-v1.2.x/workspace/releng/org.polarsys.capella.transition.system2subsystem.target/target/eclipserun-work, -configuration, /jobs/genie.capella/capella-addon-transitionsystem2subsystem-v1.2.x/workspace/releng/org.polarsys.capella.transition.system2subsystem.target/target/eclipserun-work/configuration, -application, fr.obeo.releng.targetplatform.targetPlatform.converter, tp/capella.target-definition.targetplatform]
Picked up JAVA_TOOL_OPTIONS: -Xmx2G -Djava.io.tmpdir=/tmp/genie.capella
Retrieve included location:http://git.polarsys.org/c/capella/capella.git/plain/releng/plugins/org.polarsys.capella.targets/full/capella.target-definition.targetplatform?h=v1.2.x
Error while retrieving location:http://git.polarsys.org/c/capella/capella.git/plain/releng/plugins/org.polarsys.capella.targets/full/capella.target-definition.targetplatform?h=v1.2.x
org.eclipse.emf.ecore.resource.impl.ResourceSetImpl$1DiagnosticWrappedException: java.net.SocketTimeoutException: Read timed out
	at org.eclipse.emf.ecore.resource.impl.ResourceSetImpl.handleDemandLoadException(ResourceSetImpl.java:319)
	at org.eclipse.emf.ecore.resource.impl.ResourceSetImpl.demandLoadHelper(ResourceSetImpl.java:278)
	at org.eclipse.xtext.resource.XtextResourceSet.getResource(XtextResourceSet.java:265)
	at org.eclipse.xtext.resource.SynchronizedXtextResourceSet.getResource(SynchronizedXtextResourceSet.java:25)
	at fr.obeo.releng.targetplatform.util.ResourceUtil.getResource(ResourceUtil.java:25)
	at fr.obeo.releng.targetplatform.util.LocationIndexBuilder.getImportedTargetPlatform(LocationIndexBuilder.java:215)
	at fr.obeo.releng.targetplatform.util.LocationIndexBuilder$3.apply(LocationIndexBuilder.java:104)
	at fr.obeo.releng.targetplatform.util.LocationIndexBuilder$3.apply(LocationIndexBuilder.java:1)
	at org.eclipse.xtext.xbase.lib.internal.FunctionDelegate.apply(FunctionDelegate.java:42)
	at com.google.common.collect.Lists$TransformingSequentialList$1.transform(Lists.java:542)
	at com.google.common.collect.TransformedIterator.next(TransformedIterator.java:48)
	at com.google.common.collect.Iterators$7.computeNext(Iterators.java:646)
	at com.google.common.collect.AbstractIterator.tryToComputeNext(AbstractIterator.java:143)
	at com.google.common.collect.AbstractIterator.hasNext(AbstractIterator.java:138)
	at com.google.common.collect.Iterators$7.computeNext(Iterators.java:645)
	at com.google.common.collect.AbstractIterator.tryToComputeNext(AbstractIterator.java:143)
	at com.google.common.collect.AbstractIterator.hasNext(AbstractIterator.java:138)
	at com.google.common.collect.Iterators.addAll(Iterators.java:356)
	at com.google.common.collect.Lists.newArrayList(Lists.java:146)
	at com.google.common.collect.Lists.newArrayList(Lists.java:128)
	at org.eclipse.xtext.xbase.lib.IterableExtensions.toList(IterableExtensions.java:573)
	at fr.obeo.releng.targetplatform.util.LocationIndexBuilder.getLocationFromVisitedIncludes(LocationIndexBuilder.java:117)
	at fr.obeo.releng.targetplatform.util.LocationIndexBuilder.access$0(LocationIndexBuilder.java:99)
	at fr.obeo.releng.targetplatform.util.LocationIndexBuilder$2.accept(LocationIndexBuilder.java:89)
	at fr.obeo.releng.targetplatform.util.LocationIndexBuilder$2.accept(LocationIndexBuilder.java:1)
	at java.lang.Iterable.forEach(Iterable.java:75)
	at fr.obeo.releng.targetplatform.util.LocationIndexBuilder.getLocations(LocationIndexBuilder.java:95)
	at fr.obeo.releng.targetplatform.util.LocationIndexBuilder.getLocationIndex(LocationIndexBuilder.java:47)
	at fr.obeo.releng.targetplatform.validation.TargetPlatformValidator.checkIDUniqueOnAllLocations(TargetPlatformValidator.java:348)
	at sun.reflect.NativeMethodAccessorImpl.invoke0(Native Method)
	at sun.reflect.NativeMethodAccessorImpl.invoke(NativeMethodAccessorImpl.java:62)
	at sun.reflect.DelegatingMethodAccessorImpl.invoke(DelegatingMethodAccessorImpl.java:43)
	at java.lang.reflect.Method.invoke(Method.java:498)
	at org.eclipse.xtext.validation.AbstractDeclarativeValidator$MethodWrapper.invoke(AbstractDeclarativeValidator.java:118)
	at org.eclipse.xtext.validation.AbstractDeclarativeValidator.internalValidate(AbstractDeclarativeValidator.java:312)
	at org.eclipse.xtext.validation.AbstractInjectableValidator.validate(AbstractInjectableValidator.java:71)
	at org.eclipse.xtext.validation.CompositeEValidator.validate(CompositeEValidator.java:151)
	at org.eclipse.emf.ecore.util.Diagnostician.doValidate(Diagnostician.java:171)
	at org.eclipse.emf.ecore.util.Diagnostician.validate(Diagnostician.java:158)
	at fr.obeo.releng.targetplatform.pde.Converter$CustomDiagnostician.validate(Converter.java:239)
	at org.eclipse.emf.ecore.util.Diagnostician.validate(Diagnostician.java:137)
	at org.eclipse.emf.ecore.util.Diagnostician.validate(Diagnostician.java:108)
	at fr.obeo.releng.targetplatform.pde.Converter.doGenerateTargetDefinitionFile(Converter.java:106)
	at fr.obeo.releng.targetplatform.pde.Converter.generateTargetDefinitionFile(Converter.java:74)
	at fr.obeo.releng.targetplatform.pde.ConverterApplication.start(ConverterApplication.java:60)
	at org.eclipse.equinox.internal.app.EclipseAppHandle.run(EclipseAppHandle.java:196)
	at org.eclipse.core.runtime.internal.adaptor.EclipseAppLauncher.runApplication(EclipseAppLauncher.java:134)
	at org.eclipse.core.runtime.internal.adaptor.EclipseAppLauncher.start(EclipseAppLauncher.java:104)
	at org.eclipse.core.runtime.adaptor.EclipseStarter.run(EclipseStarter.java:388)
	at org.eclipse.core.runtime.adaptor.EclipseStarter.run(EclipseStarter.java:243)
	at sun.reflect.NativeMethodAccessorImpl.invoke0(Native Method)
	at sun.reflect.NativeMethodAccessorImpl.invoke(NativeMethodAccessorImpl.java:62)
	at sun.reflect.DelegatingMethodAccessorImpl.invoke(DelegatingMethodAccessorImpl.java:43)
	at java.lang.reflect.Method.invoke(Method.java:498)
	at org.eclipse.equinox.launcher.Main.invokeFramework(Main.java:653)
	at org.eclipse.equinox.launcher.Main.basicRun(Main.java:590)
	at org.eclipse.equinox.launcher.Main.run(Main.java:1499)
	at org.eclipse.equinox.launcher.Main.main(Main.java:1472)
Caused by: java.net.SocketTimeoutException: Read timed out
	at java.net.SocketInputStream.socketRead0(Native Method)
	at java.net.SocketInputStream.socketRead(SocketInputStream.java:116)
	at java.net.SocketInputStream.read(SocketInputStream.java:171)
	at java.net.SocketInputStream.read(SocketInputStream.java:141)
	at java.io.BufferedInputStream.fill(BufferedInputStream.java:246)
	at java.io.BufferedInputStream.read1(BufferedInputStream.java:286)
	at java.io.BufferedInputStream.read(BufferedInputStream.java:345)
	at sun.net.www.http.HttpClient.parseHTTPHeader(HttpClient.java:735)
	at sun.net.www.http.HttpClient.parseHTTP(HttpClient.java:678)
	at sun.net.www.protocol.http.HttpURLConnection.getInputStream0(HttpURLConnection.java:1587)
	at sun.net.www.protocol.http.HttpURLConnection.getInputStream(HttpURLConnection.java:1492)
	at org.eclipse.emf.ecore.resource.impl.URIHandlerImpl.createInputStream(URIHandlerImpl.java:207)
	at org.eclipse.emf.ecore.resource.impl.ExtensibleURIConverterImpl.createInputStream(ExtensibleURIConverterImpl.java:360)
	at org.eclipse.xtext.resource.XtextResourceSet$1.createInputStream(XtextResourceSet.java:298)
	at org.eclipse.emf.ecore.resource.impl.ResourceImpl.load(ResourceImpl.java:1269)
	at org.eclipse.emf.ecore.resource.impl.ResourceSetImpl.demandLoad(ResourceSetImpl.java:259)
	at org.eclipse.emf.ecore.resource.impl.ResourceSetImpl.demandLoadHelper(ResourceSetImpl.java:274)
	... 56 more
Retry:1/10
Error while retrieving location:http://git.polarsys.org/c/capella/capella.git/plain/releng/plugins/org.polarsys.capella.targets/full/capella.target-definition.targetplatform?h=v1.2.x
org.eclipse.emf.ecore.resource.impl.ResourceSetImpl$1DiagnosticWrappedException: java.net.SocketTimeoutException: Read timed out
	at org.eclipse.emf.ecore.resource.impl.ResourceSetImpl.handleDemandLoadException(ResourceSetImpl.java:319)
	at org.eclipse.emf.ecore.resource.impl.ResourceSetImpl.demandLoadHelper(ResourceSetImpl.java:278)
	at org.eclipse.xtext.resource.XtextResourceSet.getResource(XtextResourceSet.java:265)
	at org.eclipse.xtext.resource.SynchronizedXtextResourceSet.getResource(SynchronizedXtextResourceSet.java:25)
	at fr.obeo.releng.targetplatform.util.ResourceUtil.getResource(ResourceUtil.java:28)
	at fr.obeo.releng.targetplatform.util.LocationIndexBuilder.getImportedTargetPlatform(LocationIndexBuilder.java:215)
	at fr.obeo.releng.targetplatform.util.LocationIndexBuilder$3.apply(LocationIndexBuilder.java:104)
	at fr.obeo.releng.targetplatform.util.LocationIndexBuilder$3.apply(LocationIndexBuilder.java:1)
	at org.eclipse.xtext.xbase.lib.internal.FunctionDelegate.apply(FunctionDelegate.java:42)
	at com.google.common.collect.Lists$TransformingSequentialList$1.transform(Lists.java:542)
	at com.google.common.collect.TransformedIterator.next(TransformedIterator.java:48)
	at com.google.common.collect.Iterators$7.computeNext(Iterators.java:646)
	at com.google.common.collect.AbstractIterator.tryToComputeNext(AbstractIterator.java:143)
	at com.google.common.collect.AbstractIterator.hasNext(AbstractIterator.java:138)
	at com.google.common.collect.Iterators$7.computeNext(Iterators.java:645)
	at com.google.common.collect.AbstractIterator.tryToComputeNext(AbstractIterator.java:143)
	at com.google.common.collect.AbstractIterator.hasNext(AbstractIterator.java:138)
	at com.google.common.collect.Iterators.addAll(Iterators.java:356)
	at com.google.common.collect.Lists.newArrayList(Lists.java:146)
	at com.google.common.collect.Lists.newArrayList(Lists.java:128)
	at org.eclipse.xtext.xbase.lib.IterableExtensions.toList(IterableExtensions.java:573)
	at fr.obeo.releng.targetplatform.util.LocationIndexBuilder.getLocationFromVisitedIncludes(LocationIndexBuilder.java:117)
	at fr.obeo.releng.targetplatform.util.LocationIndexBuilder.access$0(LocationIndexBuilder.java:99)
Retry:2/10
	at fr.obeo.releng.targetplatform.util.LocationIndexBuilder$2.accept(LocationIndexBuilder.java:89)
	at fr.obeo.releng.targetplatform.util.LocationIndexBuilder$2.accept(LocationIndexBuilder.java:1)
	at java.lang.Iterable.forEach(Iterable.java:75)
	at fr.obeo.releng.targetplatform.util.LocationIndexBuilder.getLocations(LocationIndexBuilder.java:95)
	at fr.obeo.releng.targetplatform.util.LocationIndexBuilder.getLocationIndex(LocationIndexBuilder.java:47)
	at fr.obeo.releng.targetplatform.validation.TargetPlatformValidator.checkIDUniqueOnAllLocations(TargetPlatformValidator.java:348)
	at sun.reflect.NativeMethodAccessorImpl.invoke0(Native Method)
	at sun.reflect.NativeMethodAccessorImpl.invoke(NativeMethodAccessorImpl.java:62)
	at sun.reflect.DelegatingMethodAccessorImpl.invoke(DelegatingMethodAccessorImpl.java:43)
	at java.lang.reflect.Method.invoke(Method.java:498)
	at org.eclipse.xtext.validation.AbstractDeclarativeValidator$MethodWrapper.invoke(AbstractDeclarativeValidator.java:118)
	at org.eclipse.xtext.validation.AbstractDeclarativeValidator.internalValidate(AbstractDeclarativeValidator.java:312)
	at org.eclipse.xtext.validation.AbstractInjectableValidator.validate(AbstractInjectableValidator.java:71)
	at org.eclipse.xtext.validation.CompositeEValidator.validate(CompositeEValidator.java:151)
	at org.eclipse.emf.ecore.util.Diagnostician.doValidate(Diagnostician.java:171)
	at org.eclipse.emf.ecore.util.Diagnostician.validate(Diagnostician.java:158)
	at fr.obeo.releng.targetplatform.pde.Converter$CustomDiagnostician.validate(Converter.java:239)
	at org.eclipse.emf.ecore.util.Diagnostician.validate(Diagnostician.java:137)
	at org.eclipse.emf.ecore.util.Diagnostician.validate(Diagnostician.java:108)
	at fr.obeo.releng.targetplatform.pde.Converter.doGenerateTargetDefinitionFile(Converter.java:106)
	at fr.obeo.releng.targetplatform.pde.Converter.generateTargetDefinitionFile(Converter.java:74)
	at fr.obeo.releng.targetplatform.pde.ConverterApplication.start(ConverterApplication.java:60)
	at org.eclipse.equinox.internal.app.EclipseAppHandle.run(EclipseAppHandle.java:196)
	at org.eclipse.core.runtime.internal.adaptor.EclipseAppLauncher.runApplication(EclipseAppLauncher.java:134)
	at org.eclipse.core.runtime.internal.adaptor.EclipseAppLauncher.start(EclipseAppLauncher.java:104)
	at org.eclipse.core.runtime.adaptor.EclipseStarter.run(EclipseStarter.java:388)
	at org.eclipse.core.runtime.adaptor.EclipseStarter.run(EclipseStarter.java:243)
	at sun.reflect.NativeMethodAccessorImpl.invoke0(Native Method)
	at sun.reflect.NativeMethodAccessorImpl.invoke(NativeMethodAccessorImpl.java:62)
	at sun.reflect.DelegatingMethodAccessorImpl.invoke(DelegatingMethodAccessorImpl.java:43)
	at java.lang.reflect.Method.invoke(Method.java:498)
	at org.eclipse.equinox.launcher.Main.invokeFramework(Main.java:653)
	at org.eclipse.equinox.launcher.Main.basicRun(Main.java:590)
	at org.eclipse.equinox.launcher.Main.run(Main.java:1499)
	at org.eclipse.equinox.launcher.Main.main(Main.java:1472)
Caused by: java.net.SocketTimeoutException: Read timed out
	at java.net.SocketInputStream.socketRead0(Native Method)
	at java.net.SocketInputStream.socketRead(SocketInputStream.java:116)
	at java.net.SocketInputStream.read(SocketInputStream.java:171)
	at java.net.SocketInputStream.read(SocketInputStream.java:141)
	at java.io.BufferedInputStream.fill(BufferedInputStream.java:246)
	at java.io.BufferedInputStream.read1(BufferedInputStream.java:286)
	at java.io.BufferedInputStream.read(BufferedInputStream.java:345)
	at sun.net.www.http.HttpClient.parseHTTPHeader(HttpClient.java:735)
	at sun.net.www.http.HttpClient.parseHTTP(HttpClient.java:678)
	at sun.net.www.protocol.http.HttpURLConnection.getInputStream0(HttpURLConnection.java:1587)
	at sun.net.www.protocol.http.HttpURLConnection.getInputStream(HttpURLConnection.java:1492)
	at org.eclipse.emf.ecore.resource.impl.URIHandlerImpl.createInputStream(URIHandlerImpl.java:207)
	at org.eclipse.emf.ecore.resource.impl.ExtensibleURIConverterImpl.createInputStream(ExtensibleURIConverterImpl.java:360)
	at org.eclipse.xtext.resource.XtextResourceSet$1.createInputStream(XtextResourceSet.java:298)
	at org.eclipse.emf.ecore.resource.impl.ResourceImpl.load(ResourceImpl.java:1269)
	at org.eclipse.emf.ecore.resource.impl.ResourceSetImpl.demandLoad(ResourceSetImpl.java:259)
	at org.eclipse.emf.ecore.resource.impl.ResourceSetImpl.demandLoadHelper(ResourceSetImpl.java:274)
	... 56 more
Retrieve included location:http://git.polarsys.org/c/capella/capella.git/plain/releng/plugins/org.polarsys.capella.targets/full/capella.target-definition.targetplatform?h=v1.2.x
Retrieve included location:http://git.polarsys.org/c/capella/capella.git/plain/releng/plugins/org.polarsys.capella.targets/full/capella.target-definition.targetplatform?h=v1.2.x
Retrieve included location:http://git.polarsys.org/c/capella/capella.git/plain/releng/plugins/org.polarsys.capella.targets/full/capella.target-definition.targetplatform?h=v1.2.x
>>  Fetching content.jar from https://ci.polarsys.org/capella/view/Capella-v1.2.x/job/capella-v1.2.x/lastSuccessfulBuild/artifact/releng/plugins/org.polarsys.capella.rcp.site/target/repository/ (100.42kB)
>>  1 operation remaining.
>>  Fetching content.jar from https://ci.polarsys.org/capella/view/Capella-v1.2.x/job/capella-v1.2.x/lastSuccessfulBuild/artifact/releng/plugins/org.polarsys.capella.test.site/target/repository/ (14.62kB)
>>  1 operation remaining.
>>  Fetching content.jar from https://ci.polarsys.org/capella/view/Capella-v1.2.x/job/capella-v1.2.x/lastSuccessfulBuild/artifact/releng/plugins/org.polarsys.capella.test.site/target/repository/ (14.62kB)
>>  Fetching p2.index from http://download.eclipse.org/egit/updates/
>>  1 operation remaining.
>>  Fetching p2.index from http://download.eclipse.org/egit/updates/
>>  Fetching content.xml.xz from http://download.eclipse.org/egit/updates/
>>  1 operation remaining.
>>  Fetching content.xml.xz from http://download.eclipse.org/egit/updates/
Retrieve included location:http://git.polarsys.org/c/capella/capella.git/plain/releng/plugins/org.polarsys.capella.targets/full/capella.target-definition.targetplatform?h=v1.2.x
>>  Fetching p2.index from http://download.eclipse.org/releases/neon/201705151400/
>>  1 operation remaining.
>>  Fetching p2.index from http://download.eclipse.org/releases/neon/201705151400/
>>  Fetching p2.index from http://download.eclipse.org/sirius/updates/stable/5.1.4-S20181130-113030/neon/
>>  1 operation remaining.
>>  Fetching p2.index from http://download.eclipse.org/sirius/updates/stable/5.1.4-S20181130-113030/neon/
>>  Fetching content.xml.xz from http://download.eclipse.org/sirius/updates/stable/5.1.4-S20181130-113030/neon/
>>  1 operation remaining.
>>  Fetching content.xml.xz from http://download.eclipse.org/sirius/updates/stable/5.1.4-S20181130-113030/neon/
>>  Fetching p2.index from http://download.eclipse.org/diffmerge/releases/0.9.0/emf-diffmerge-site/
>>  1 operation remaining.
>>  Fetching p2.index from http://download.eclipse.org/diffmerge/releases/0.9.0/emf-diffmerge-site/
>>  Fetching p2.index from http://download.eclipse.org/diffmerge/releases/0.9.0/edm-patterns-site/
>>  1 operation remaining.
>>  Fetching p2.index from http://download.eclipse.org/diffmerge/releases/0.9.0/edm-patterns-site/
>>  Fetching content.jar from http://download.eclipse.org/modeling/amalgam/updates/stable/1.9.2-S20181119/capella/ (14.64kB)
>>  1 operation remaining.
>>  Fetching content.jar from http://download.eclipse.org/modeling/amalgam/updates/stable/1.9.2-S20181119/capella/ (14.64kB)
>>  Fetching p2.index from http://download.eclipse.org/cbi/updates/license/
>>  1 operation remaining.
>>  Fetching p2.index from http://download.eclipse.org/cbi/updates/license/
>>  Fetching p2.index from http://download.eclipse.org/cbi/updates/license/2.0.0.v20180130-0820/
>>  1 operation remaining.
>>  Fetching p2.index from http://download.eclipse.org/cbi/updates/license/2.0.0.v20180130-0820/
>>  Fetching p2.index from http://download.eclipse.org/cbi/updates/license/2.0.1.v20180423-1114/
>>  1 operation remaining.
>>  Fetching p2.index from http://download.eclipse.org/cbi/updates/license/2.0.1.v20180423-1114/
>>  Fetching p2.index from http://download.eclipse.org/tools/orbit/downloads/drops/R20130827064939/repository/
>>  1 operation remaining.
>>  Fetching p2.index from http://download.eclipse.org/tools/orbit/downloads/drops/R20130827064939/repository/
>>  Fetching p2.index from http://download.eclipse.org/tools/orbit/downloads/drops/R20140525021250/repository/
>>  1 operation remaining.
>>  Fetching p2.index from http://download.eclipse.org/tools/orbit/downloads/drops/R20140525021250/repository/
[ERROR]   No repository found at https://ci.polarsys.org/kitalpha/job/kitalpha-v1.2.x/82/artifact/releng/plugins/org.polarsys.kitalpha.releng.runtime.core.updatesite/target/repository/.
[ERROR]   No repository found at https://ci.polarsys.org/kitalpha/job/kitalpha-v1.2.x/82/artifact/releng/plugins/org.polarsys.kitalpha.releng.runtime.updatesite/target/repository/.
[ERROR]   No repository found at https://ci.polarsys.org/kitalpha/job/kitalpha-v1.2.x/82/artifact/releng/plugins/org.polarsys.kitalpha.releng.sdk.updatesite/target/repository/.
Problems occurred during generation of target platform definition file.
[INFO] ------------------------------------------------------------------------
[INFO] BUILD FAILURE
[INFO] ------------------------------------------------------------------------
[INFO] Total time: 02:35 min
[INFO] Finished at: 2018-12-04T10:24:03-05:00
[INFO] ------------------------------------------------------------------------
[ERROR] Failed to execute goal org.eclipse.tycho.extras:tycho-eclipserun-plugin:0.26.0:eclipse-run (generate.target) on project capella.target-definition: Error while executing platform: Error while executing platform (return code: 255) -> [Help 1]
[ERROR] 
[ERROR] To see the full stack trace of the errors, re-run Maven with the -e switch.
[ERROR] Re-run Maven using the -X switch to enable full debug logging.
[ERROR] 
[ERROR] For more information about the errors and possible solutions, please read the following articles:
[ERROR] [Help 1] http://cwiki.apache.org/confluence/display/MAVEN/MojoExecutionException
Build step 'Invoke top-level Maven targets' marked build as failure
Taking screenshot.
[workspace] $ echo $XAUTHORITY
/home/hudson/genie.capella/.jenkins/jobs/capella-addon-transitionsystem2subsystem-v1.2.x/workspace/.Xauthority-1004807877867019069
[workspace] $ ls -l $XAUTHORITY
-rw-rw-r-- 1 genie.capella polarsys.polarsys.capella 0 Dec  4 10:21 /home/hudson/genie.capella/.jenkins/jobs/capella-addon-transitionsystem2subsystem-v1.2.x/workspace/.Xauthority-1004807877867019069
[workspace] $ import -window root -display :2001 screenshot.jpg
Terminating xvnc.
Skipping sonar analysis due to bad build status FAILURE
Recording test results
ERROR: Step ‘Publish JUnit test result report’ failed: Test reports were found but none of them are new. Did leafNodes run? 
For example, /home/hudson/genie.capella/.jenkins/jobs/capella-addon-transitionsystem2subsystem-v1.2.x/workspace/plugins/org.polarsys.capella.transition.system2subsystem.tests.ju/target/surefire-reports/TEST-org.polarsys.capella.transition.system2subsystem.tests.AllSystem2SubsystemTests.xml is 7 mo 5 days old

Archiving artifacts
Performance: Recording JUnit reports 'plugins/org.polarsys.capella.transition.system2subsystem.tests.ju/target/surefire-reports/TEST-*.xml'
Performance: Parsing JMeter report file '/home/hudson/genie.capella/.jenkins/jobs/capella-addon-transitionsystem2subsystem-v1.2.x/builds/87/performance-reports/JUnit/TEST-org.polarsys.capella.transition.system2subsystem.tests.AllSystem2SubsystemTests.xml'.
Performance: No threshold configured for making the test unstable
Performance: No threshold configured for making the test failure
Performance: File TEST-org.polarsys.capella.transition.system2subsystem.tests.AllSystem2SubsystemTests.xml reported 2.174% of errors [SUCCESS]. Build status is: FAILURE
Started calculate disk usage of build
Finished Calculation of disk usage of build in  1 second
Started calculate disk usage of workspace
Finished Calculation of disk usage of workspace in  2 second
Finished: FAILURE