FailedConsole Output

Started by timer
Building in workspace /home/hudson/genie.capella/.jenkins/jobs/capella-addon-docgen-v1.1.x/workspace
No credentials specified
Cloning the remote Git repository
Cloning repository http://git.polarsys.org/gitroot/capella/capella-xhtml-docgen.git
 > /usr/local/bin/git init /home/hudson/genie.capella/.jenkins/jobs/capella-addon-docgen-v1.1.x/workspace/git # timeout=10
Fetching upstream changes from http://git.polarsys.org/gitroot/capella/capella-xhtml-docgen.git
 > /usr/local/bin/git --version # timeout=10
 > /usr/local/bin/git fetch --tags --progress http://git.polarsys.org/gitroot/capella/capella-xhtml-docgen.git +refs/heads/*:refs/remotes/origin/*
 > /usr/local/bin/git config remote.origin.url http://git.polarsys.org/gitroot/capella/capella-xhtml-docgen.git # timeout=10
 > /usr/local/bin/git config --add remote.origin.fetch +refs/heads/*:refs/remotes/origin/* # timeout=10
 > /usr/local/bin/git config remote.origin.url http://git.polarsys.org/gitroot/capella/capella-xhtml-docgen.git # timeout=10
Fetching upstream changes from http://git.polarsys.org/gitroot/capella/capella-xhtml-docgen.git
 > /usr/local/bin/git fetch --tags --progress http://git.polarsys.org/gitroot/capella/capella-xhtml-docgen.git +refs/heads/*:refs/remotes/origin/*
 > /usr/local/bin/git rev-parse origin/v1.1.x^{commit} # timeout=10
Checking out Revision 123b3753bf9757012d7bafc6f06097eddc26f216 (origin/v1.1.x)
 > /usr/local/bin/git config core.sparsecheckout # timeout=10
 > /usr/local/bin/git checkout -f 123b3753bf9757012d7bafc6f06097eddc26f216
Commit message: "[1675] Add additional fields in HTML export"
 > /usr/local/bin/git rev-list --no-walk 123b3753bf9757012d7bafc6f06097eddc26f216 # timeout=10
[releng] $ /shared/common/apache-ant-1.9.6/bin/ant -file build.xml
Picked up JAVA_TOOL_OPTIONS: -Xmx2G -Djava.io.tmpdir=/tmp/genie.capella
Buildfile: /jobs/genie.capella/capella-addon-docgen-v1.1.x/workspace/git/releng/plugins/org.polarsys.capella-addons.releng.jobs/jobs/Capella_Addons_XHTMLDocGen/releng/build.xml

Install_and_update_Capella_Clean_Result:

clean.result:

init.build.properties:

init:
     [echo] Available variables are : 
     [echo] Builtin ${relengDir} : /jobs/genie.capella/capella-addon-docgen-v1.1.x/workspace/git/releng/plugins/org.polarsys.capella-addons.releng.jobs/jobs/Capella_Addons_XHTMLDocGen/releng
     [echo] Builtin ${build.root} : /home/hudson/genie.capella/.jenkins/jobs/capella-addon-docgen-v1.1.x/workspace
     [echo] Builtin ${tools} : /home/hudson/genie.capella/.jenkins/jobs/capella-addon-docgen-v1.1.x/workspace/tools
     [echo] Builtin ${result} : /home/hudson/genie.capella/.jenkins/jobs/capella-addon-docgen-v1.1.x/workspace/result
     [echo] Builtin ${publish} : /home/hudson/genie.capella/.jenkins/jobs/capella-addon-docgen-v1.1.x/workspace/result/publish
     [echo] Builtin ${workspace} : /home/hudson/genie.capella/.jenkins/jobs/capella-addon-docgen-v1.1.x/workspace/result/workspace
     [echo] Builtin ${timestamp} : 781
     [echo] Provided ${site.pack200} : false
     [echo] Provided ${qualifier.replacement.*} : 781
     [echo] Provided ${CapellaVersion} : 1.1.2
     [echo] Provided ${hudsonJob} : https://hudson.polarsys.org/capella/job/capella-origin/v1.1.x/lastSuccessfulBuild
     [echo] Provided ${site_Kitalpha_SDK} : https://hudson.polarsys.org/kitalpha/job/Kitalpha-v1.1.x/lastSuccessfulBuild/artifact/result/publish/kitalpha_sdk/site.p2/
     [echo] Provided ${site_Kitalpha_Runtime} : https://hudson.polarsys.org/kitalpha/job/Kitalpha-v1.1.x/lastSuccessfulBuild/artifact/result/publish/kitalpha_runtime/site.p2/
     [echo] Provided ${site_EGF} : https://hudson.eclipse.org/egf/job/buckminster-egf-juno/lastSuccessfulBuild/artifact/result/publish/org.eclipse.egf.sdk/site.p2/
     [echo] Provided ${buildVersion} : 1.1.0.781

Install_and_update_Capella_delete_TP:

Install_and_update_Capella_Download_CapellaTP:

DownloadCapellaTP:
    [mkdir] Created dir: /home/hudson/genie.capella/.jenkins/jobs/capella-addon-docgen-v1.1.x/workspace/result/publish
      [get] Getting: http://download.polarsys.org/capella/core/products/releases/1.1.2-R20170801-103142/capella-1.1.2.2017-08-01_10-31-42-linux-gtk-x86_64-mars.tar.gz
      [get] To: /home/hudson/genie.capella/.jenkins/jobs/capella-addon-docgen-v1.1.x/workspace/result/publish/DocGen.tar.gz
   [gunzip] Expanding /home/hudson/genie.capella/.jenkins/jobs/capella-addon-docgen-v1.1.x/workspace/result/publish/DocGen.tar.gz to /home/hudson/genie.capella/.jenkins/jobs/capella-addon-docgen-v1.1.x/workspace/result/publish/DocGen.tar
    [untar] Expanding: /home/hudson/genie.capella/.jenkins/jobs/capella-addon-docgen-v1.1.x/workspace/result/publish/DocGen.tar into /home/hudson/genie.capella/.jenkins/jobs/capella-addon-docgen-v1.1.x/workspace/result/publish/DocGen

Install_and_update_Capella:

install.buckminster:

install.director:

do.install.director:
     [echo] Fetching headless director application
      [get] Getting: http://download.eclipse.org/tools/buckminster/products/director_latest.zip
      [get] To: /tmp/genie.capella/director-234241410.zip
      [get] Error opening connection java.io.FileNotFoundException: http://download.eclipse.org/tools/buckminster/products/director_latest.zip
      [get] Error opening connection java.io.FileNotFoundException: http://download.eclipse.org/tools/buckminster/products/director_latest.zip
      [get] Error opening connection java.io.FileNotFoundException: http://download.eclipse.org/tools/buckminster/products/director_latest.zip
      [get] Can't get http://download.eclipse.org/tools/buckminster/products/director_latest.zip to /tmp/genie.capella/director-234241410.zip

BUILD FAILED
/jobs/genie.capella/capella-addon-docgen-v1.1.x/workspace/git/releng/plugins/org.polarsys.capella-addons.releng.jobs/jobs/Capella_Addons_XHTMLDocGen/releng/build.xml:126: The following error occurred while executing this line:
/jobs/genie.capella/capella-addon-docgen-v1.1.x/workspace/git/releng/plugins/org.polarsys.capella-addons.releng.jobs/jobs/Capella_Addons_XHTMLDocGen/releng/build.xml:113: The following error occurred while executing this line:
/jobs/genie.capella/capella-addon-docgen-v1.1.x/workspace/git/releng/plugins/org.polarsys.capella-addons.releng.jobs/jobs/Capella_Addons_XHTMLDocGen/releng/build.xml:119: Can't get http://download.eclipse.org/tools/buckminster/products/director_latest.zip to /tmp/genie.capella/director-234241410.zip

Total time: 24 seconds
Build step 'Invoke Ant' marked build as failure
Archiving artifacts
Started calculate disk usage of build
Finished Calculation of disk usage of build in  3 second
Started calculate disk usage of workspace
Finished Calculation of disk usage of workspace in 0 seconds
[WS-CLEANUP] Deleting project workspace...
[WS-CLEANUP] Deferred wipeout is used...
[WS-CLEANUP] done
Finished: FAILURE