FailedConsole Output

Skipping 3,597 KB.. Full Log
NAPSHOT-pack200.jar.pack.gz
[INFO] Installing /jobs/genie.birt/derp/workspace/model/org.eclipse.birt.report.model.testhelper/target/p2content.xml to /opt/public/hipp/homes/genie.birt/.m2/repository/org/eclipse/birt/org.eclipse.birt.report.model.testhelper/4.5.0-SNAPSHOT/org.eclipse.birt.report.model.testhelper-4.5.0-SNAPSHOT-p2metadata.xml
[INFO] Installing /jobs/genie.birt/derp/workspace/model/org.eclipse.birt.report.model.testhelper/target/p2artifacts.xml to /opt/public/hipp/homes/genie.birt/.m2/repository/org/eclipse/birt/org.eclipse.birt.report.model.testhelper/4.5.0-SNAPSHOT/org.eclipse.birt.report.model.testhelper-4.5.0-SNAPSHOT-p2artifacts.xml
[INFO] 
[INFO] --- tycho-p2-plugin:0.21.0:update-local-index (default-update-local-index) @ org.eclipse.birt.report.model.testhelper ---
[INFO]                                                                         
[INFO] ------------------------------------------------------------------------
[INFO] Building org.eclipse.birt.testhelper 4.5.0-SNAPSHOT
[INFO] ------------------------------------------------------------------------
[INFO] 
[INFO] --- maven-clean-plugin:2.5:clean (default-clean) @ org.eclipse.birt.testhelper ---
[INFO] Deleting /jobs/genie.birt/derp/workspace/features/org.eclipse.birt.testhelper.feature/target
[INFO] 
[INFO] --- tycho-packaging-plugin:0.21.0:build-qualifier-aggregator (default-build-qualifier-aggregator) @ org.eclipse.birt.testhelper ---
[INFO] The project's OSGi version is 4.5.0.v201510220855
[INFO] 
[INFO] --- tycho-packaging-plugin:0.21.0:validate-id (default-validate-id) @ org.eclipse.birt.testhelper ---
[INFO] 
[INFO] --- tycho-packaging-plugin:0.21.0:validate-version (default-validate-version) @ org.eclipse.birt.testhelper ---
[INFO] 
[INFO] --- maven-toolchains-plugin:1.1:toolchain (default) @ org.eclipse.birt.testhelper ---
[INFO] Required toolchain: jdk [ id='JavaSE-1.7' ]
[INFO] Found matching toolchain for type jdk: JDK[/opt/public/common/jdk1.7.0-latest/jre]
[INFO] 
[INFO] --- tycho-source-plugin:0.21.0:plugin-source (plugin-source) @ org.eclipse.birt.testhelper ---
[INFO] 
[INFO] --- maven-resources-plugin:2.6:copy-resources (process-about.mappings) @ org.eclipse.birt.testhelper ---
[INFO] Using 'UTF-8' encoding to copy filtered resources.
[INFO] Copying 0 resource
[INFO] 
[INFO] --- target-platform-configuration:0.21.0:target-platform (default-target-platform) @ org.eclipse.birt.testhelper ---
[INFO] 
[INFO] --- tycho-packaging-plugin:0.21.0:package-feature (default-package-feature) @ org.eclipse.birt.testhelper ---
[INFO] Building jar: /jobs/genie.birt/derp/workspace/features/org.eclipse.birt.testhelper.feature/target/org.eclipse.birt.testhelper-4.5.0-SNAPSHOT.jar
[INFO] 
[INFO] --- tycho-p2-plugin:0.21.0:p2-metadata-default (default-p2-metadata-default) @ org.eclipse.birt.testhelper ---
[INFO] 
[INFO] --- tycho-p2-plugin:0.21.0:feature-p2-metadata (default-feature-p2-metadata) @ org.eclipse.birt.testhelper ---
[INFO] 
[INFO] --- tycho-pack200a-plugin:0.21.0:normalize (pack200-normalize) @ org.eclipse.birt.testhelper ---
[INFO] 
[INFO] --- eclipse-jarsigner-plugin:1.1.2:sign (sign) @ org.eclipse.birt.testhelper ---
[INFO] Searching org.eclipse.birt.testhelper-4.5.0-SNAPSHOT.jar for inner jars...
[INFO] Signed org.eclipse.birt.features:org.eclipse.birt.testhelper:eclipse-feature:4.5.0-SNAPSHOT in 5 seconds.
[INFO] 
[INFO] --- tycho-pack200b-plugin:0.21.0:pack (pack200-pack) @ org.eclipse.birt.testhelper ---
[INFO] 
[INFO] --- tycho-source-feature-plugin:0.21.0:source-feature (source-feature) @ org.eclipse.birt.testhelper ---
[INFO] Building jar: /jobs/genie.birt/derp/workspace/features/org.eclipse.birt.testhelper.feature/target/org.eclipse.birt.testhelper-4.5.0-SNAPSHOT-sources-feature.jar
[INFO] 
[INFO] --- tycho-p2-plugin:0.21.0:p2-metadata (attached-p2-metadata) @ org.eclipse.birt.testhelper ---
[INFO] 
[INFO] --- jacoco-maven-plugin:0.7.4.201502262128:prepare-agent-integration (prepare-integration-tests) @ org.eclipse.birt.testhelper ---
[INFO] argLine set to -javaagent:/opt/public/hipp/homes/genie.birt/.m2/repository/org/jacoco/org.jacoco.agent/0.7.4.201502262128/org.jacoco.agent-0.7.4.201502262128-runtime.jar=destfile=/jobs/genie.birt/derp/workspace/features/org.eclipse.birt.testhelper.feature/target/coverage/jacoco-integration.exec,append=true,output=file
[INFO] 
[INFO] --- jacoco-maven-plugin:0.7.4.201502262128:report-integration (report-integration) @ org.eclipse.birt.testhelper ---
[INFO] Skipping JaCoCo execution due to missing execution data file:/jobs/genie.birt/derp/workspace/features/org.eclipse.birt.testhelper.feature/target/coverage/jacoco-integration.exec
[INFO] 
[INFO] --- maven-install-plugin:2.3.1:install (default-install) @ org.eclipse.birt.testhelper ---
[INFO] Installing /jobs/genie.birt/derp/workspace/features/org.eclipse.birt.testhelper.feature/target/org.eclipse.birt.testhelper-4.5.0-SNAPSHOT.jar to /opt/public/hipp/homes/genie.birt/.m2/repository/org/eclipse/birt/features/org.eclipse.birt.testhelper/4.5.0-SNAPSHOT/org.eclipse.birt.testhelper-4.5.0-SNAPSHOT.jar
[INFO] Installing /jobs/genie.birt/derp/workspace/features/org.eclipse.birt.testhelper.feature/pom.xml to /opt/public/hipp/homes/genie.birt/.m2/repository/org/eclipse/birt/features/org.eclipse.birt.testhelper/4.5.0-SNAPSHOT/org.eclipse.birt.testhelper-4.5.0-SNAPSHOT.pom
[INFO] Installing /jobs/genie.birt/derp/workspace/features/org.eclipse.birt.testhelper.feature/target/org.eclipse.birt.testhelper-4.5.0-SNAPSHOT-sources-feature.jar to /opt/public/hipp/homes/genie.birt/.m2/repository/org/eclipse/birt/features/org.eclipse.birt.testhelper/4.5.0-SNAPSHOT/org.eclipse.birt.testhelper-4.5.0-SNAPSHOT-sources-feature.jar
[INFO] Installing /jobs/genie.birt/derp/workspace/features/org.eclipse.birt.testhelper.feature/target/p2content.xml to /opt/public/hipp/homes/genie.birt/.m2/repository/org/eclipse/birt/features/org.eclipse.birt.testhelper/4.5.0-SNAPSHOT/org.eclipse.birt.testhelper-4.5.0-SNAPSHOT-p2metadata.xml
[INFO] Installing /jobs/genie.birt/derp/workspace/features/org.eclipse.birt.testhelper.feature/target/p2artifacts.xml to /opt/public/hipp/homes/genie.birt/.m2/repository/org/eclipse/birt/features/org.eclipse.birt.testhelper/4.5.0-SNAPSHOT/org.eclipse.birt.testhelper-4.5.0-SNAPSHOT-p2artifacts.xml
[INFO] 
[INFO] --- tycho-p2-plugin:0.21.0:update-local-index (default-update-local-index) @ org.eclipse.birt.testhelper ---
[INFO]                                                                         
[INFO] ------------------------------------------------------------------------
[INFO] Building org.eclipse.birt.report.data.oda.jdbc.tests 4.5.0-SNAPSHOT
[INFO] ------------------------------------------------------------------------
[INFO] 
[INFO] --- maven-clean-plugin:2.5:clean (default-clean) @ org.eclipse.birt.report.data.oda.jdbc.tests ---
[INFO] 
[INFO] --- tycho-packaging-plugin:0.21.0:build-qualifier (default-build-qualifier) @ org.eclipse.birt.report.data.oda.jdbc.tests ---
[INFO] The project's OSGi version is 4.5.0.v201510220855
[INFO] 
[INFO] --- tycho-packaging-plugin:0.21.0:validate-id (default-validate-id) @ org.eclipse.birt.report.data.oda.jdbc.tests ---
[INFO] 
[INFO] --- tycho-packaging-plugin:0.21.0:validate-version (default-validate-version) @ org.eclipse.birt.report.data.oda.jdbc.tests ---
[INFO] 
[INFO] --- maven-toolchains-plugin:1.1:toolchain (default) @ org.eclipse.birt.report.data.oda.jdbc.tests ---
[INFO] Required toolchain: jdk [ id='JavaSE-1.7' ]
[INFO] Found matching toolchain for type jdk: JDK[/opt/public/common/jdk1.7.0-latest/jre]
[INFO] 
[INFO] --- maven-resources-plugin:2.6:resources (default-resources) @ org.eclipse.birt.report.data.oda.jdbc.tests ---
[INFO] Using 'UTF-8' encoding to copy filtered resources.
[INFO] skip non existing resourceDirectory /jobs/genie.birt/derp/workspace/data/org.eclipse.birt.report.data.oda.jdbc.tests/src/main/resources
[INFO] 
[INFO] --- tycho-compiler-plugin:0.21.0:compile (default-compile) @ org.eclipse.birt.report.data.oda.jdbc.tests ---
[INFO] Compiling 14 source files to /jobs/genie.birt/derp/workspace/data/org.eclipse.birt.report.data.oda.jdbc.tests/target/classes
[INFO] 
[INFO] --- maven-resources-plugin:2.6:testResources (default-testResources) @ org.eclipse.birt.report.data.oda.jdbc.tests ---
[INFO] Not copying test resources
[INFO] 
[INFO] --- tycho-source-plugin:0.21.0:plugin-source (plugin-source) @ org.eclipse.birt.report.data.oda.jdbc.tests ---
[WARNING] bundle localization file /jobs/genie.birt/derp/workspace/data/org.eclipse.birt.report.data.oda.jdbc.tests/plugin.properties not found
[INFO] Building jar: /jobs/genie.birt/derp/workspace/data/org.eclipse.birt.report.data.oda.jdbc.tests/target/org.eclipse.birt.report.data.oda.jdbc.tests-4.5.0-SNAPSHOT-sources.jar
[INFO] 
[INFO] --- maven-resources-plugin:2.6:copy-resources (process-about.mappings) @ org.eclipse.birt.report.data.oda.jdbc.tests ---
[INFO] Using 'UTF-8' encoding to copy filtered resources.
[INFO] Copying 0 resource
[INFO] 
[INFO] --- target-platform-configuration:0.21.0:target-platform (default-target-platform) @ org.eclipse.birt.report.data.oda.jdbc.tests ---
[INFO] 
[INFO] --- tycho-packaging-plugin:0.21.0:package-plugin (default-package-plugin) @ org.eclipse.birt.report.data.oda.jdbc.tests ---
[INFO] Building jar: /jobs/genie.birt/derp/workspace/data/org.eclipse.birt.report.data.oda.jdbc.tests/odajdbctests.jar
[INFO] Building jar: /jobs/genie.birt/derp/workspace/data/org.eclipse.birt.report.data.oda.jdbc.tests/target/org.eclipse.birt.report.data.oda.jdbc.tests-4.5.0-SNAPSHOT.jar
[INFO] 
[INFO] --- tycho-p2-plugin:0.21.0:p2-metadata-default (default-p2-metadata-default) @ org.eclipse.birt.report.data.oda.jdbc.tests ---
[INFO] 
[INFO] --- tycho-pack200a-plugin:0.21.0:normalize (pack200-normalize) @ org.eclipse.birt.report.data.oda.jdbc.tests ---
[INFO] Pack200 normalizing jar /jobs/genie.birt/derp/workspace/data/org.eclipse.birt.report.data.oda.jdbc.tests/target/org.eclipse.birt.report.data.oda.jdbc.tests-4.5.0-SNAPSHOT.jar
[INFO] 
[INFO] --- eclipse-jarsigner-plugin:1.1.2:sign (sign) @ org.eclipse.birt.report.data.oda.jdbc.tests ---
[INFO] Searching org.eclipse.birt.report.data.oda.jdbc.tests-4.5.0-SNAPSHOT.jar for inner jars...
[INFO] Signed odajdbctests.jar in 3 seconds.
[INFO] Signed org.eclipse.birt:org.eclipse.birt.report.data.oda.jdbc.tests:eclipse-test-plugin:4.5.0-SNAPSHOT in 8 seconds.
[INFO] Searching org.eclipse.birt.report.data.oda.jdbc.tests-4.5.0-SNAPSHOT-sources.jar for inner jars...
[INFO] Signed org.eclipse.birt:org.eclipse.birt.report.data.oda.jdbc.tests:java-source:sources:4.5.0-SNAPSHOT in 0 seconds.
[INFO] 
[INFO] --- tycho-pack200b-plugin:0.21.0:pack (pack200-pack) @ org.eclipse.birt.report.data.oda.jdbc.tests ---
[INFO] Pack200 packing jar /jobs/genie.birt/derp/workspace/data/org.eclipse.birt.report.data.oda.jdbc.tests/target/org.eclipse.birt.report.data.oda.jdbc.tests-4.5.0-SNAPSHOT.jar
[INFO] 
[INFO] --- tycho-p2-plugin:0.21.0:p2-metadata (attached-p2-metadata) @ org.eclipse.birt.report.data.oda.jdbc.tests ---
[INFO] 
[INFO] --- jacoco-maven-plugin:0.7.4.201502262128:prepare-agent-integration (prepare-integration-tests) @ org.eclipse.birt.report.data.oda.jdbc.tests ---
[INFO] tycho.testArgLine set to -javaagent:/opt/public/hipp/homes/genie.birt/.m2/repository/org/jacoco/org.jacoco.agent/0.7.4.201502262128/org.jacoco.agent-0.7.4.201502262128-runtime.jar=destfile=/jobs/genie.birt/derp/workspace/data/org.eclipse.birt.report.data.oda.jdbc.tests/target/coverage/jacoco-integration.exec,append=true,output=file
[INFO] 
[INFO] --- tycho-surefire-plugin:0.21.0:test (default-test) @ org.eclipse.birt.report.data.oda.jdbc.tests ---
[INFO] Skipping tests
[INFO] 
[INFO] --- jacoco-maven-plugin:0.7.4.201502262128:report-integration (report-integration) @ org.eclipse.birt.report.data.oda.jdbc.tests ---
[INFO] Skipping JaCoCo execution due to missing execution data file:/jobs/genie.birt/derp/workspace/data/org.eclipse.birt.report.data.oda.jdbc.tests/target/coverage/jacoco-integration.exec
[INFO] 
[INFO] --- maven-install-plugin:2.3.1:install (default-install) @ org.eclipse.birt.report.data.oda.jdbc.tests ---
[INFO] Installing /jobs/genie.birt/derp/workspace/data/org.eclipse.birt.report.data.oda.jdbc.tests/target/org.eclipse.birt.report.data.oda.jdbc.tests-4.5.0-SNAPSHOT.jar to /opt/public/hipp/homes/genie.birt/.m2/repository/org/eclipse/birt/org.eclipse.birt.report.data.oda.jdbc.tests/4.5.0-SNAPSHOT/org.eclipse.birt.report.data.oda.jdbc.tests-4.5.0-SNAPSHOT.jar
[INFO] Installing /jobs/genie.birt/derp/workspace/data/org.eclipse.birt.report.data.oda.jdbc.tests/pom.xml to /opt/public/hipp/homes/genie.birt/.m2/repository/org/eclipse/birt/org.eclipse.birt.report.data.oda.jdbc.tests/4.5.0-SNAPSHOT/org.eclipse.birt.report.data.oda.jdbc.tests-4.5.0-SNAPSHOT.pom
[INFO] Installing /jobs/genie.birt/derp/workspace/data/org.eclipse.birt.report.data.oda.jdbc.tests/target/org.eclipse.birt.report.data.oda.jdbc.tests-4.5.0-SNAPSHOT-sources.jar to /opt/public/hipp/homes/genie.birt/.m2/repository/org/eclipse/birt/org.eclipse.birt.report.data.oda.jdbc.tests/4.5.0-SNAPSHOT/org.eclipse.birt.report.data.oda.jdbc.tests-4.5.0-SNAPSHOT-sources.jar
[INFO] Installing /jobs/genie.birt/derp/workspace/data/org.eclipse.birt.report.data.oda.jdbc.tests/target/org.eclipse.birt.report.data.oda.jdbc.tests-4.5.0-SNAPSHOT.jar.pack.gz to /opt/public/hipp/homes/genie.birt/.m2/repository/org/eclipse/birt/org.eclipse.birt.report.data.oda.jdbc.tests/4.5.0-SNAPSHOT/org.eclipse.birt.report.data.oda.jdbc.tests-4.5.0-SNAPSHOT-pack200.jar.pack.gz
[INFO] Installing /jobs/genie.birt/derp/workspace/data/org.eclipse.birt.report.data.oda.jdbc.tests/target/p2content.xml to /opt/public/hipp/homes/genie.birt/.m2/repository/org/eclipse/birt/org.eclipse.birt.report.data.oda.jdbc.tests/4.5.0-SNAPSHOT/org.eclipse.birt.report.data.oda.jdbc.tests-4.5.0-SNAPSHOT-p2metadata.xml
[INFO] Installing /jobs/genie.birt/derp/workspace/data/org.eclipse.birt.report.data.oda.jdbc.tests/target/p2artifacts.xml to /opt/public/hipp/homes/genie.birt/.m2/repository/org/eclipse/birt/org.eclipse.birt.report.data.oda.jdbc.tests/4.5.0-SNAPSHOT/org.eclipse.birt.report.data.oda.jdbc.tests-4.5.0-SNAPSHOT-p2artifacts.xml
[INFO] 
[INFO] --- tycho-p2-plugin:0.21.0:update-local-index (default-update-local-index) @ org.eclipse.birt.report.data.oda.jdbc.tests ---
[INFO]                                                                         
[INFO] ------------------------------------------------------------------------
[INFO] Building org.eclipse.birt.report.designer.tests 4.5.0-SNAPSHOT
[INFO] ------------------------------------------------------------------------
[INFO] 
[INFO] --- maven-clean-plugin:2.5:clean (default-clean) @ org.eclipse.birt.report.designer.tests ---
[INFO] 
[INFO] --- tycho-packaging-plugin:0.21.0:build-qualifier (default-build-qualifier) @ org.eclipse.birt.report.designer.tests ---
[INFO] The project's OSGi version is 4.5.0.v201510220855
[INFO] 
[INFO] --- tycho-packaging-plugin:0.21.0:validate-id (default-validate-id) @ org.eclipse.birt.report.designer.tests ---
[INFO] 
[INFO] --- tycho-packaging-plugin:0.21.0:validate-version (default-validate-version) @ org.eclipse.birt.report.designer.tests ---
[INFO] 
[INFO] --- maven-toolchains-plugin:1.1:toolchain (default) @ org.eclipse.birt.report.designer.tests ---
[INFO] Required toolchain: jdk [ id='JavaSE-1.7' ]
[INFO] Found matching toolchain for type jdk: JDK[/opt/public/common/jdk1.7.0-latest/jre]
[INFO] 
[INFO] --- maven-resources-plugin:2.6:resources (default-resources) @ org.eclipse.birt.report.designer.tests ---
[INFO] Using 'UTF-8' encoding to copy filtered resources.
[INFO] skip non existing resourceDirectory /jobs/genie.birt/derp/workspace/UI/org.eclipse.birt.report.designer.tests/src/main/resources
[INFO] 
[INFO] --- tycho-compiler-plugin:0.21.0:compile (default-compile) @ org.eclipse.birt.report.designer.tests ---
[INFO] Compiling 64 source files to /jobs/genie.birt/derp/workspace/UI/org.eclipse.birt.report.designer.tests/target/classes
[INFO] 
[INFO] --- maven-resources-plugin:2.6:testResources (default-testResources) @ org.eclipse.birt.report.designer.tests ---
[INFO] Not copying test resources
[INFO] 
[INFO] --- tycho-source-plugin:0.21.0:plugin-source (plugin-source) @ org.eclipse.birt.report.designer.tests ---
[WARNING] bundle localization file /jobs/genie.birt/derp/workspace/UI/org.eclipse.birt.report.designer.tests/plugin.properties not found
[INFO] Building jar: /jobs/genie.birt/derp/workspace/UI/org.eclipse.birt.report.designer.tests/target/org.eclipse.birt.report.designer.tests-4.5.0-SNAPSHOT-sources.jar
[INFO] 
[INFO] --- maven-resources-plugin:2.6:copy-resources (process-about.mappings) @ org.eclipse.birt.report.designer.tests ---
[INFO] Using 'UTF-8' encoding to copy filtered resources.
[INFO] Copying 0 resource
[INFO] 
[INFO] --- target-platform-configuration:0.21.0:target-platform (default-target-platform) @ org.eclipse.birt.report.designer.tests ---
[INFO] 
[INFO] --- tycho-packaging-plugin:0.21.0:package-plugin (default-package-plugin) @ org.eclipse.birt.report.designer.tests ---
[INFO] Building jar: /jobs/genie.birt/derp/workspace/UI/org.eclipse.birt.report.designer.tests/designertests.jar
[INFO] Building jar: /jobs/genie.birt/derp/workspace/UI/org.eclipse.birt.report.designer.tests/target/org.eclipse.birt.report.designer.tests-4.5.0-SNAPSHOT.jar
[INFO] 
[INFO] --- tycho-p2-plugin:0.21.0:p2-metadata-default (default-p2-metadata-default) @ org.eclipse.birt.report.designer.tests ---
[INFO] 
[INFO] --- tycho-pack200a-plugin:0.21.0:normalize (pack200-normalize) @ org.eclipse.birt.report.designer.tests ---
[INFO] Pack200 normalizing jar /jobs/genie.birt/derp/workspace/UI/org.eclipse.birt.report.designer.tests/target/org.eclipse.birt.report.designer.tests-4.5.0-SNAPSHOT.jar
[INFO] 
[INFO] --- eclipse-jarsigner-plugin:1.1.2:sign (sign) @ org.eclipse.birt.report.designer.tests ---
[INFO] Searching org.eclipse.birt.report.designer.tests-4.5.0-SNAPSHOT.jar for inner jars...
[INFO] Signed designertests.jar in 1 seconds.
[INFO] Signed org.eclipse.birt:org.eclipse.birt.report.designer.tests:eclipse-test-plugin:4.5.0-SNAPSHOT in 2 seconds.
[INFO] Searching org.eclipse.birt.report.designer.tests-4.5.0-SNAPSHOT-sources.jar for inner jars...
[INFO] Signed org.eclipse.birt:org.eclipse.birt.report.designer.tests:java-source:sources:4.5.0-SNAPSHOT in 1 seconds.
[INFO] 
[INFO] --- tycho-pack200b-plugin:0.21.0:pack (pack200-pack) @ org.eclipse.birt.report.designer.tests ---
[INFO] Pack200 packing jar /jobs/genie.birt/derp/workspace/UI/org.eclipse.birt.report.designer.tests/target/org.eclipse.birt.report.designer.tests-4.5.0-SNAPSHOT.jar
[INFO] 
[INFO] --- tycho-p2-plugin:0.21.0:p2-metadata (attached-p2-metadata) @ org.eclipse.birt.report.designer.tests ---
[INFO] 
[INFO] --- jacoco-maven-plugin:0.7.4.201502262128:prepare-agent-integration (prepare-integration-tests) @ org.eclipse.birt.report.designer.tests ---
[INFO] tycho.testArgLine set to -javaagent:/opt/public/hipp/homes/genie.birt/.m2/repository/org/jacoco/org.jacoco.agent/0.7.4.201502262128/org.jacoco.agent-0.7.4.201502262128-runtime.jar=destfile=/jobs/genie.birt/derp/workspace/UI/org.eclipse.birt.report.designer.tests/target/coverage/jacoco-integration.exec,append=true,output=file
[INFO] 
[INFO] --- tycho-surefire-plugin:0.21.0:test (default-test) @ org.eclipse.birt.report.designer.tests ---
[INFO] Skipping tests
[INFO] 
[INFO] --- jacoco-maven-plugin:0.7.4.201502262128:report-integration (report-integration) @ org.eclipse.birt.report.designer.tests ---
[INFO] Skipping JaCoCo execution due to missing execution data file:/jobs/genie.birt/derp/workspace/UI/org.eclipse.birt.report.designer.tests/target/coverage/jacoco-integration.exec
[INFO] 
[INFO] --- maven-install-plugin:2.3.1:install (default-install) @ org.eclipse.birt.report.designer.tests ---
[INFO] Installing /jobs/genie.birt/derp/workspace/UI/org.eclipse.birt.report.designer.tests/target/org.eclipse.birt.report.designer.tests-4.5.0-SNAPSHOT.jar to /opt/public/hipp/homes/genie.birt/.m2/repository/org/eclipse/birt/org.eclipse.birt.report.designer.tests/4.5.0-SNAPSHOT/org.eclipse.birt.report.designer.tests-4.5.0-SNAPSHOT.jar
[INFO] Installing /jobs/genie.birt/derp/workspace/UI/org.eclipse.birt.report.designer.tests/pom.xml to /opt/public/hipp/homes/genie.birt/.m2/repository/org/eclipse/birt/org.eclipse.birt.report.designer.tests/4.5.0-SNAPSHOT/org.eclipse.birt.report.designer.tests-4.5.0-SNAPSHOT.pom
[INFO] Installing /jobs/genie.birt/derp/workspace/UI/org.eclipse.birt.report.designer.tests/target/org.eclipse.birt.report.designer.tests-4.5.0-SNAPSHOT-sources.jar to /opt/public/hipp/homes/genie.birt/.m2/repository/org/eclipse/birt/org.eclipse.birt.report.designer.tests/4.5.0-SNAPSHOT/org.eclipse.birt.report.designer.tests-4.5.0-SNAPSHOT-sources.jar
[INFO] Installing /jobs/genie.birt/derp/workspace/UI/org.eclipse.birt.report.designer.tests/target/org.eclipse.birt.report.designer.tests-4.5.0-SNAPSHOT.jar.pack.gz to /opt/public/hipp/homes/genie.birt/.m2/repository/org/eclipse/birt/org.eclipse.birt.report.designer.tests/4.5.0-SNAPSHOT/org.eclipse.birt.report.designer.tests-4.5.0-SNAPSHOT-pack200.jar.pack.gz
[INFO] Installing /jobs/genie.birt/derp/workspace/UI/org.eclipse.birt.report.designer.tests/target/p2content.xml to /opt/public/hipp/homes/genie.birt/.m2/repository/org/eclipse/birt/org.eclipse.birt.report.designer.tests/4.5.0-SNAPSHOT/org.eclipse.birt.report.designer.tests-4.5.0-SNAPSHOT-p2metadata.xml
[INFO] Installing /jobs/genie.birt/derp/workspace/UI/org.eclipse.birt.report.designer.tests/target/p2artifacts.xml to /opt/public/hipp/homes/genie.birt/.m2/repository/org/eclipse/birt/org.eclipse.birt.report.designer.tests/4.5.0-SNAPSHOT/org.eclipse.birt.report.designer.tests-4.5.0-SNAPSHOT-p2artifacts.xml
[INFO] 
[INFO] --- tycho-p2-plugin:0.21.0:update-local-index (default-update-local-index) @ org.eclipse.birt.report.designer.tests ---
[INFO]                                                                         
[INFO] ------------------------------------------------------------------------
[INFO] Building org.eclipse.birt.report.engine.emitter.html.tests 4.5.0-SNAPSHOT
[INFO] ------------------------------------------------------------------------
[INFO] 
[INFO] --- maven-clean-plugin:2.5:clean (default-clean) @ org.eclipse.birt.report.engine.emitter.html.tests ---
[INFO] 
[INFO] --- tycho-packaging-plugin:0.21.0:build-qualifier (default-build-qualifier) @ org.eclipse.birt.report.engine.emitter.html.tests ---
[INFO] The project's OSGi version is 4.5.0.v201510220855
[INFO] 
[INFO] --- tycho-packaging-plugin:0.21.0:validate-id (default-validate-id) @ org.eclipse.birt.report.engine.emitter.html.tests ---
[INFO] 
[INFO] --- tycho-packaging-plugin:0.21.0:validate-version (default-validate-version) @ org.eclipse.birt.report.engine.emitter.html.tests ---
[INFO] 
[INFO] --- maven-toolchains-plugin:1.1:toolchain (default) @ org.eclipse.birt.report.engine.emitter.html.tests ---
[INFO] Required toolchain: jdk [ id='JavaSE-1.7' ]
[INFO] Found matching toolchain for type jdk: JDK[/opt/public/common/jdk1.7.0-latest/jre]
[INFO] 
[INFO] --- maven-resources-plugin:2.6:resources (default-resources) @ org.eclipse.birt.report.engine.emitter.html.tests ---
[INFO] Using 'UTF-8' encoding to copy filtered resources.
[INFO] skip non existing resourceDirectory /jobs/genie.birt/derp/workspace/engine/org.eclipse.birt.report.engine.emitter.html.tests/src/main/resources
[INFO] 
[INFO] --- tycho-compiler-plugin:0.21.0:compile (default-compile) @ org.eclipse.birt.report.engine.emitter.html.tests ---
[INFO] Compiling 13 source files to /jobs/genie.birt/derp/workspace/engine/org.eclipse.birt.report.engine.emitter.html.tests/target/classes
[INFO] 
[INFO] --- maven-resources-plugin:2.6:testResources (default-testResources) @ org.eclipse.birt.report.engine.emitter.html.tests ---
[INFO] Not copying test resources
[INFO] 
[INFO] --- tycho-source-plugin:0.21.0:plugin-source (plugin-source) @ org.eclipse.birt.report.engine.emitter.html.tests ---
[WARNING] bundle localization file /jobs/genie.birt/derp/workspace/engine/org.eclipse.birt.report.engine.emitter.html.tests/plugin.properties not found
[INFO] Building jar: /jobs/genie.birt/derp/workspace/engine/org.eclipse.birt.report.engine.emitter.html.tests/target/org.eclipse.birt.report.engine.emitter.html.tests-4.5.0-SNAPSHOT-sources.jar
[INFO] 
[INFO] --- maven-resources-plugin:2.6:copy-resources (process-about.mappings) @ org.eclipse.birt.report.engine.emitter.html.tests ---
[INFO] Using 'UTF-8' encoding to copy filtered resources.
[INFO] Copying 0 resource
[INFO] 
[INFO] --- target-platform-configuration:0.21.0:target-platform (default-target-platform) @ org.eclipse.birt.report.engine.emitter.html.tests ---
[INFO] 
[INFO] --- tycho-packaging-plugin:0.21.0:package-plugin (default-package-plugin) @ org.eclipse.birt.report.engine.emitter.html.tests ---
[INFO] Building jar: /jobs/genie.birt/derp/workspace/engine/org.eclipse.birt.report.engine.emitter.html.tests/emitterhtmltests.jar
[INFO] Building jar: /jobs/genie.birt/derp/workspace/engine/org.eclipse.birt.report.engine.emitter.html.tests/target/org.eclipse.birt.report.engine.emitter.html.tests-4.5.0-SNAPSHOT.jar
[INFO] 
[INFO] --- tycho-p2-plugin:0.21.0:p2-metadata-default (default-p2-metadata-default) @ org.eclipse.birt.report.engine.emitter.html.tests ---
[INFO] 
[INFO] --- tycho-pack200a-plugin:0.21.0:normalize (pack200-normalize) @ org.eclipse.birt.report.engine.emitter.html.tests ---
[INFO] Pack200 normalizing jar /jobs/genie.birt/derp/workspace/engine/org.eclipse.birt.report.engine.emitter.html.tests/target/org.eclipse.birt.report.engine.emitter.html.tests-4.5.0-SNAPSHOT.jar
[INFO] 
[INFO] --- eclipse-jarsigner-plugin:1.1.2:sign (sign) @ org.eclipse.birt.report.engine.emitter.html.tests ---
[INFO] Searching org.eclipse.birt.report.engine.emitter.html.tests-4.5.0-SNAPSHOT.jar for inner jars...
[INFO] Signed emitterhtmltests.jar in 0 seconds.
[INFO] Signed org.eclipse.birt:org.eclipse.birt.report.engine.emitter.html.tests:eclipse-test-plugin:4.5.0-SNAPSHOT in 2 seconds.
[INFO] Searching org.eclipse.birt.report.engine.emitter.html.tests-4.5.0-SNAPSHOT-sources.jar for inner jars...
[INFO] Signed org.eclipse.birt:org.eclipse.birt.report.engine.emitter.html.tests:java-source:sources:4.5.0-SNAPSHOT in 1 seconds.
[INFO] 
[INFO] --- tycho-pack200b-plugin:0.21.0:pack (pack200-pack) @ org.eclipse.birt.report.engine.emitter.html.tests ---
[INFO] Pack200 packing jar /jobs/genie.birt/derp/workspace/engine/org.eclipse.birt.report.engine.emitter.html.tests/target/org.eclipse.birt.report.engine.emitter.html.tests-4.5.0-SNAPSHOT.jar
[INFO] 
[INFO] --- tycho-p2-plugin:0.21.0:p2-metadata (attached-p2-metadata) @ org.eclipse.birt.report.engine.emitter.html.tests ---
[INFO] 
[INFO] --- jacoco-maven-plugin:0.7.4.201502262128:prepare-agent-integration (prepare-integration-tests) @ org.eclipse.birt.report.engine.emitter.html.tests ---
[INFO] tycho.testArgLine set to -javaagent:/opt/public/hipp/homes/genie.birt/.m2/repository/org/jacoco/org.jacoco.agent/0.7.4.201502262128/org.jacoco.agent-0.7.4.201502262128-runtime.jar=destfile=/jobs/genie.birt/derp/workspace/engine/org.eclipse.birt.report.engine.emitter.html.tests/target/coverage/jacoco-integration.exec,append=true,output=file
[INFO] 
[INFO] --- tycho-surefire-plugin:0.21.0:test (default-test) @ org.eclipse.birt.report.engine.emitter.html.tests ---
[INFO] Skipping tests
[INFO] 
[INFO] --- jacoco-maven-plugin:0.7.4.201502262128:report-integration (report-integration) @ org.eclipse.birt.report.engine.emitter.html.tests ---
[INFO] Skipping JaCoCo execution due to missing execution data file:/jobs/genie.birt/derp/workspace/engine/org.eclipse.birt.report.engine.emitter.html.tests/target/coverage/jacoco-integration.exec
[INFO] 
[INFO] --- maven-install-plugin:2.3.1:install (default-install) @ org.eclipse.birt.report.engine.emitter.html.tests ---
[INFO] Installing /jobs/genie.birt/derp/workspace/engine/org.eclipse.birt.report.engine.emitter.html.tests/target/org.eclipse.birt.report.engine.emitter.html.tests-4.5.0-SNAPSHOT.jar to /opt/public/hipp/homes/genie.birt/.m2/repository/org/eclipse/birt/org.eclipse.birt.report.engine.emitter.html.tests/4.5.0-SNAPSHOT/org.eclipse.birt.report.engine.emitter.html.tests-4.5.0-SNAPSHOT.jar
[INFO] Installing /jobs/genie.birt/derp/workspace/engine/org.eclipse.birt.report.engine.emitter.html.tests/pom.xml to /opt/public/hipp/homes/genie.birt/.m2/repository/org/eclipse/birt/org.eclipse.birt.report.engine.emitter.html.tests/4.5.0-SNAPSHOT/org.eclipse.birt.report.engine.emitter.html.tests-4.5.0-SNAPSHOT.pom
[INFO] Installing /jobs/genie.birt/derp/workspace/engine/org.eclipse.birt.report.engine.emitter.html.tests/target/org.eclipse.birt.report.engine.emitter.html.tests-4.5.0-SNAPSHOT-sources.jar to /opt/public/hipp/homes/genie.birt/.m2/repository/org/eclipse/birt/org.eclipse.birt.report.engine.emitter.html.tests/4.5.0-SNAPSHOT/org.eclipse.birt.report.engine.emitter.html.tests-4.5.0-SNAPSHOT-sources.jar
[INFO] Installing /jobs/genie.birt/derp/workspace/engine/org.eclipse.birt.report.engine.emitter.html.tests/target/org.eclipse.birt.report.engine.emitter.html.tests-4.5.0-SNAPSHOT.jar.pack.gz to /opt/public/hipp/homes/genie.birt/.m2/repository/org/eclipse/birt/org.eclipse.birt.report.engine.emitter.html.tests/4.5.0-SNAPSHOT/org.eclipse.birt.report.engine.emitter.html.tests-4.5.0-SNAPSHOT-pack200.jar.pack.gz
[INFO] Installing /jobs/genie.birt/derp/workspace/engine/org.eclipse.birt.report.engine.emitter.html.tests/target/p2content.xml to /opt/public/hipp/homes/genie.birt/.m2/repository/org/eclipse/birt/org.eclipse.birt.report.engine.emitter.html.tests/4.5.0-SNAPSHOT/org.eclipse.birt.report.engine.emitter.html.tests-4.5.0-SNAPSHOT-p2metadata.xml
[INFO] Installing /jobs/genie.birt/derp/workspace/engine/org.eclipse.birt.report.engine.emitter.html.tests/target/p2artifacts.xml to /opt/public/hipp/homes/genie.birt/.m2/repository/org/eclipse/birt/org.eclipse.birt.report.engine.emitter.html.tests/4.5.0-SNAPSHOT/org.eclipse.birt.report.engine.emitter.html.tests-4.5.0-SNAPSHOT-p2artifacts.xml
[INFO] 
[INFO] --- tycho-p2-plugin:0.21.0:update-local-index (default-update-local-index) @ org.eclipse.birt.report.engine.emitter.html.tests ---
[INFO]                                                                         
[INFO] ------------------------------------------------------------------------
[INFO] Building org.eclipse.birt.report.engine.emitter.pdf.tests 4.5.0-SNAPSHOT
[INFO] ------------------------------------------------------------------------
[INFO] 
[INFO] --- maven-clean-plugin:2.5:clean (default-clean) @ org.eclipse.birt.report.engine.emitter.pdf.tests ---
[INFO] 
[INFO] --- tycho-packaging-plugin:0.21.0:build-qualifier (default-build-qualifier) @ org.eclipse.birt.report.engine.emitter.pdf.tests ---
[INFO] The project's OSGi version is 4.5.0.v201510220855
[INFO] 
[INFO] --- tycho-packaging-plugin:0.21.0:validate-id (default-validate-id) @ org.eclipse.birt.report.engine.emitter.pdf.tests ---
[INFO] 
[INFO] --- tycho-packaging-plugin:0.21.0:validate-version (default-validate-version) @ org.eclipse.birt.report.engine.emitter.pdf.tests ---
[INFO] 
[INFO] --- maven-toolchains-plugin:1.1:toolchain (default) @ org.eclipse.birt.report.engine.emitter.pdf.tests ---
[INFO] Required toolchain: jdk [ id='JavaSE-1.7' ]
[INFO] Found matching toolchain for type jdk: JDK[/opt/public/common/jdk1.7.0-latest/jre]
[INFO] 
[INFO] --- maven-resources-plugin:2.6:resources (default-resources) @ org.eclipse.birt.report.engine.emitter.pdf.tests ---
[INFO] Using 'UTF-8' encoding to copy filtered resources.
[INFO] skip non existing resourceDirectory /jobs/genie.birt/derp/workspace/engine/org.eclipse.birt.report.engine.emitter.pdf.tests/src/main/resources
[INFO] 
[INFO] --- tycho-compiler-plugin:0.21.0:compile (default-compile) @ org.eclipse.birt.report.engine.emitter.pdf.tests ---
[INFO] Compiling 3 source files to /jobs/genie.birt/derp/workspace/engine/org.eclipse.birt.report.engine.emitter.pdf.tests/target/classes
[INFO] 
[INFO] --- maven-resources-plugin:2.6:testResources (default-testResources) @ org.eclipse.birt.report.engine.emitter.pdf.tests ---
[INFO] Not copying test resources
[INFO] 
[INFO] --- tycho-source-plugin:0.21.0:plugin-source (plugin-source) @ org.eclipse.birt.report.engine.emitter.pdf.tests ---
[WARNING] bundle localization file /jobs/genie.birt/derp/workspace/engine/org.eclipse.birt.report.engine.emitter.pdf.tests/plugin.properties not found
[INFO] Building jar: /jobs/genie.birt/derp/workspace/engine/org.eclipse.birt.report.engine.emitter.pdf.tests/target/org.eclipse.birt.report.engine.emitter.pdf.tests-4.5.0-SNAPSHOT-sources.jar
[INFO] 
[INFO] --- maven-resources-plugin:2.6:copy-resources (process-about.mappings) @ org.eclipse.birt.report.engine.emitter.pdf.tests ---
[INFO] Using 'UTF-8' encoding to copy filtered resources.
[INFO] Copying 0 resource
[INFO] 
[INFO] --- target-platform-configuration:0.21.0:target-platform (default-target-platform) @ org.eclipse.birt.report.engine.emitter.pdf.tests ---
[INFO] 
[INFO] --- tycho-packaging-plugin:0.21.0:package-plugin (default-package-plugin) @ org.eclipse.birt.report.engine.emitter.pdf.tests ---
[INFO] Building jar: /jobs/genie.birt/derp/workspace/engine/org.eclipse.birt.report.engine.emitter.pdf.tests/emitterpdf.jar
[INFO] Building jar: /jobs/genie.birt/derp/workspace/engine/org.eclipse.birt.report.engine.emitter.pdf.tests/target/org.eclipse.birt.report.engine.emitter.pdf.tests-4.5.0-SNAPSHOT.jar
[INFO] 
[INFO] --- tycho-p2-plugin:0.21.0:p2-metadata-default (default-p2-metadata-default) @ org.eclipse.birt.report.engine.emitter.pdf.tests ---
[INFO] 
[INFO] --- tycho-pack200a-plugin:0.21.0:normalize (pack200-normalize) @ org.eclipse.birt.report.engine.emitter.pdf.tests ---
[INFO] Pack200 normalizing jar /jobs/genie.birt/derp/workspace/engine/org.eclipse.birt.report.engine.emitter.pdf.tests/target/org.eclipse.birt.report.engine.emitter.pdf.tests-4.5.0-SNAPSHOT.jar
[INFO] 
[INFO] --- eclipse-jarsigner-plugin:1.1.2:sign (sign) @ org.eclipse.birt.report.engine.emitter.pdf.tests ---
[INFO] Searching org.eclipse.birt.report.engine.emitter.pdf.tests-4.5.0-SNAPSHOT.jar for inner jars...
[INFO] Signed emitterpdf.jar in 4 seconds.
[INFO] Signed org.eclipse.birt:org.eclipse.birt.report.engine.emitter.pdf.tests:eclipse-test-plugin:4.5.0-SNAPSHOT in 5 seconds.
[INFO] Searching org.eclipse.birt.report.engine.emitter.pdf.tests-4.5.0-SNAPSHOT-sources.jar for inner jars...
[INFO] Signed org.eclipse.birt:org.eclipse.birt.report.engine.emitter.pdf.tests:java-source:sources:4.5.0-SNAPSHOT in 1 seconds.
[INFO] 
[INFO] --- tycho-pack200b-plugin:0.21.0:pack (pack200-pack) @ org.eclipse.birt.report.engine.emitter.pdf.tests ---
[INFO] Pack200 packing jar /jobs/genie.birt/derp/workspace/engine/org.eclipse.birt.report.engine.emitter.pdf.tests/target/org.eclipse.birt.report.engine.emitter.pdf.tests-4.5.0-SNAPSHOT.jar
[INFO] 
[INFO] --- tycho-p2-plugin:0.21.0:p2-metadata (attached-p2-metadata) @ org.eclipse.birt.report.engine.emitter.pdf.tests ---
[INFO] 
[INFO] --- jacoco-maven-plugin:0.7.4.201502262128:prepare-agent-integration (prepare-integration-tests) @ org.eclipse.birt.report.engine.emitter.pdf.tests ---
[INFO] tycho.testArgLine set to -javaagent:/opt/public/hipp/homes/genie.birt/.m2/repository/org/jacoco/org.jacoco.agent/0.7.4.201502262128/org.jacoco.agent-0.7.4.201502262128-runtime.jar=destfile=/jobs/genie.birt/derp/workspace/engine/org.eclipse.birt.report.engine.emitter.pdf.tests/target/coverage/jacoco-integration.exec,append=true,output=file
[INFO] 
[INFO] --- tycho-surefire-plugin:0.21.0:test (default-test) @ org.eclipse.birt.report.engine.emitter.pdf.tests ---
[INFO] Skipping tests
[INFO] 
[INFO] --- jacoco-maven-plugin:0.7.4.201502262128:report-integration (report-integration) @ org.eclipse.birt.report.engine.emitter.pdf.tests ---
[INFO] Skipping JaCoCo execution due to missing execution data file:/jobs/genie.birt/derp/workspace/engine/org.eclipse.birt.report.engine.emitter.pdf.tests/target/coverage/jacoco-integration.exec
[INFO] 
[INFO] --- maven-install-plugin:2.3.1:install (default-install) @ org.eclipse.birt.report.engine.emitter.pdf.tests ---
[INFO] Installing /jobs/genie.birt/derp/workspace/engine/org.eclipse.birt.report.engine.emitter.pdf.tests/target/org.eclipse.birt.report.engine.emitter.pdf.tests-4.5.0-SNAPSHOT.jar to /opt/public/hipp/homes/genie.birt/.m2/repository/org/eclipse/birt/org.eclipse.birt.report.engine.emitter.pdf.tests/4.5.0-SNAPSHOT/org.eclipse.birt.report.engine.emitter.pdf.tests-4.5.0-SNAPSHOT.jar
[INFO] Installing /jobs/genie.birt/derp/workspace/engine/org.eclipse.birt.report.engine.emitter.pdf.tests/pom.xml to /opt/public/hipp/homes/genie.birt/.m2/repository/org/eclipse/birt/org.eclipse.birt.report.engine.emitter.pdf.tests/4.5.0-SNAPSHOT/org.eclipse.birt.report.engine.emitter.pdf.tests-4.5.0-SNAPSHOT.pom
[INFO] Installing /jobs/genie.birt/derp/workspace/engine/org.eclipse.birt.report.engine.emitter.pdf.tests/target/org.eclipse.birt.report.engine.emitter.pdf.tests-4.5.0-SNAPSHOT-sources.jar to /opt/public/hipp/homes/genie.birt/.m2/repository/org/eclipse/birt/org.eclipse.birt.report.engine.emitter.pdf.tests/4.5.0-SNAPSHOT/org.eclipse.birt.report.engine.emitter.pdf.tests-4.5.0-SNAPSHOT-sources.jar
[INFO] Installing /jobs/genie.birt/derp/workspace/engine/org.eclipse.birt.report.engine.emitter.pdf.tests/target/org.eclipse.birt.report.engine.emitter.pdf.tests-4.5.0-SNAPSHOT.jar.pack.gz to /opt/public/hipp/homes/genie.birt/.m2/repository/org/eclipse/birt/org.eclipse.birt.report.engine.emitter.pdf.tests/4.5.0-SNAPSHOT/org.eclipse.birt.report.engine.emitter.pdf.tests-4.5.0-SNAPSHOT-pack200.jar.pack.gz
[INFO] Installing /jobs/genie.birt/derp/workspace/engine/org.eclipse.birt.report.engine.emitter.pdf.tests/target/p2content.xml to /opt/public/hipp/homes/genie.birt/.m2/repository/org/eclipse/birt/org.eclipse.birt.report.engine.emitter.pdf.tests/4.5.0-SNAPSHOT/org.eclipse.birt.report.engine.emitter.pdf.tests-4.5.0-SNAPSHOT-p2metadata.xml
[INFO] Installing /jobs/genie.birt/derp/workspace/engine/org.eclipse.birt.report.engine.emitter.pdf.tests/target/p2artifacts.xml to /opt/public/hipp/homes/genie.birt/.m2/repository/org/eclipse/birt/org.eclipse.birt.report.engine.emitter.pdf.tests/4.5.0-SNAPSHOT/org.eclipse.birt.report.engine.emitter.pdf.tests-4.5.0-SNAPSHOT-p2artifacts.xml
[INFO] 
[INFO] --- tycho-p2-plugin:0.21.0:update-local-index (default-update-local-index) @ org.eclipse.birt.report.engine.emitter.pdf.tests ---
[INFO]                                                                         
[INFO] ------------------------------------------------------------------------
[INFO] Building org.eclipse.birt.report.engine.emitter.postscript.tests 4.5.0-SNAPSHOT
[INFO] ------------------------------------------------------------------------
[INFO] 
[INFO] --- maven-clean-plugin:2.5:clean (default-clean) @ org.eclipse.birt.report.engine.emitter.postscript.tests ---
[INFO] 
[INFO] --- tycho-packaging-plugin:0.21.0:build-qualifier (default-build-qualifier) @ org.eclipse.birt.report.engine.emitter.postscript.tests ---
[INFO] The project's OSGi version is 4.5.0.v201510220855
[INFO] 
[INFO] --- tycho-packaging-plugin:0.21.0:validate-id (default-validate-id) @ org.eclipse.birt.report.engine.emitter.postscript.tests ---
[INFO] 
[INFO] --- tycho-packaging-plugin:0.21.0:validate-version (default-validate-version) @ org.eclipse.birt.report.engine.emitter.postscript.tests ---
[INFO] 
[INFO] --- maven-toolchains-plugin:1.1:toolchain (default) @ org.eclipse.birt.report.engine.emitter.postscript.tests ---
[INFO] Required toolchain: jdk [ id='JavaSE-1.7' ]
[INFO] Found matching toolchain for type jdk: JDK[/opt/public/common/jdk1.7.0-latest/jre]
[INFO] 
[INFO] --- maven-resources-plugin:2.6:resources (default-resources) @ org.eclipse.birt.report.engine.emitter.postscript.tests ---
[INFO] Using 'UTF-8' encoding to copy filtered resources.
[INFO] skip non existing resourceDirectory /jobs/genie.birt/derp/workspace/engine/org.eclipse.birt.report.engine.emitter.postscript.tests/src/main/resources
[INFO] 
[INFO] --- tycho-compiler-plugin:0.21.0:compile (default-compile) @ org.eclipse.birt.report.engine.emitter.postscript.tests ---
[INFO] Compiling 4 source files to /jobs/genie.birt/derp/workspace/engine/org.eclipse.birt.report.engine.emitter.postscript.tests/target/classes
[INFO] 
[INFO] --- maven-resources-plugin:2.6:testResources (default-testResources) @ org.eclipse.birt.report.engine.emitter.postscript.tests ---
[INFO] Not copying test resources
[INFO] 
[INFO] --- tycho-source-plugin:0.21.0:plugin-source (plugin-source) @ org.eclipse.birt.report.engine.emitter.postscript.tests ---
[WARNING] bundle localization file /jobs/genie.birt/derp/workspace/engine/org.eclipse.birt.report.engine.emitter.postscript.tests/plugin.properties not found
[INFO] Building jar: /jobs/genie.birt/derp/workspace/engine/org.eclipse.birt.report.engine.emitter.postscript.tests/target/org.eclipse.birt.report.engine.emitter.postscript.tests-4.5.0-SNAPSHOT-sources.jar
[INFO] 
[INFO] --- maven-resources-plugin:2.6:copy-resources (process-about.mappings) @ org.eclipse.birt.report.engine.emitter.postscript.tests ---
[INFO] Using 'UTF-8' encoding to copy filtered resources.
[INFO] Copying 0 resource
[INFO] 
[INFO] --- target-platform-configuration:0.21.0:target-platform (default-target-platform) @ org.eclipse.birt.report.engine.emitter.postscript.tests ---
[INFO] 
[INFO] --- tycho-packaging-plugin:0.21.0:package-plugin (default-package-plugin) @ org.eclipse.birt.report.engine.emitter.postscript.tests ---
[INFO] Building jar: /jobs/genie.birt/derp/workspace/engine/org.eclipse.birt.report.engine.emitter.postscript.tests/emitterpostscript.jar
[INFO] Building jar: /jobs/genie.birt/derp/workspace/engine/org.eclipse.birt.report.engine.emitter.postscript.tests/target/org.eclipse.birt.report.engine.emitter.postscript.tests-4.5.0-SNAPSHOT.jar
[INFO] 
[INFO] --- tycho-p2-plugin:0.21.0:p2-metadata-default (default-p2-metadata-default) @ org.eclipse.birt.report.engine.emitter.postscript.tests ---
[INFO] 
[INFO] --- tycho-pack200a-plugin:0.21.0:normalize (pack200-normalize) @ org.eclipse.birt.report.engine.emitter.postscript.tests ---
[INFO] Pack200 normalizing jar /jobs/genie.birt/derp/workspace/engine/org.eclipse.birt.report.engine.emitter.postscript.tests/target/org.eclipse.birt.report.engine.emitter.postscript.tests-4.5.0-SNAPSHOT.jar
[INFO] 
[INFO] --- eclipse-jarsigner-plugin:1.1.2:sign (sign) @ org.eclipse.birt.report.engine.emitter.postscript.tests ---
[INFO] Searching org.eclipse.birt.report.engine.emitter.postscript.tests-4.5.0-SNAPSHOT.jar for inner jars...
[INFO] Signed emitterpostscript.jar in 1 seconds.
[INFO] Signed org.eclipse.birt:org.eclipse.birt.report.engine.emitter.postscript.tests:eclipse-test-plugin:4.5.0-SNAPSHOT in 3 seconds.
[INFO] Searching org.eclipse.birt.report.engine.emitter.postscript.tests-4.5.0-SNAPSHOT-sources.jar for inner jars...
[INFO] Signed org.eclipse.birt:org.eclipse.birt.report.engine.emitter.postscript.tests:java-source:sources:4.5.0-SNAPSHOT in 1 seconds.
[INFO] 
[INFO] --- tycho-pack200b-plugin:0.21.0:pack (pack200-pack) @ org.eclipse.birt.report.engine.emitter.postscript.tests ---
[INFO] Pack200 packing jar /jobs/genie.birt/derp/workspace/engine/org.eclipse.birt.report.engine.emitter.postscript.tests/target/org.eclipse.birt.report.engine.emitter.postscript.tests-4.5.0-SNAPSHOT.jar
[INFO] 
[INFO] --- tycho-p2-plugin:0.21.0:p2-metadata (attached-p2-metadata) @ org.eclipse.birt.report.engine.emitter.postscript.tests ---
[INFO] 
[INFO] --- jacoco-maven-plugin:0.7.4.201502262128:prepare-agent-integration (prepare-integration-tests) @ org.eclipse.birt.report.engine.emitter.postscript.tests ---
[INFO] tycho.testArgLine set to -javaagent:/opt/public/hipp/homes/genie.birt/.m2/repository/org/jacoco/org.jacoco.agent/0.7.4.201502262128/org.jacoco.agent-0.7.4.201502262128-runtime.jar=destfile=/jobs/genie.birt/derp/workspace/engine/org.eclipse.birt.report.engine.emitter.postscript.tests/target/coverage/jacoco-integration.exec,append=true,output=file
[INFO] 
[INFO] --- tycho-surefire-plugin:0.21.0:test (default-test) @ org.eclipse.birt.report.engine.emitter.postscript.tests ---
[INFO] Skipping tests
[INFO] 
[INFO] --- jacoco-maven-plugin:0.7.4.201502262128:report-integration (report-integration) @ org.eclipse.birt.report.engine.emitter.postscript.tests ---
[INFO] Skipping JaCoCo execution due to missing execution data file:/jobs/genie.birt/derp/workspace/engine/org.eclipse.birt.report.engine.emitter.postscript.tests/target/coverage/jacoco-integration.exec
[INFO] 
[INFO] --- maven-install-plugin:2.3.1:install (default-install) @ org.eclipse.birt.report.engine.emitter.postscript.tests ---
[INFO] Installing /jobs/genie.birt/derp/workspace/engine/org.eclipse.birt.report.engine.emitter.postscript.tests/target/org.eclipse.birt.report.engine.emitter.postscript.tests-4.5.0-SNAPSHOT.jar to /opt/public/hipp/homes/genie.birt/.m2/repository/org/eclipse/birt/org.eclipse.birt.report.engine.emitter.postscript.tests/4.5.0-SNAPSHOT/org.eclipse.birt.report.engine.emitter.postscript.tests-4.5.0-SNAPSHOT.jar
[INFO] Installing /jobs/genie.birt/derp/workspace/engine/org.eclipse.birt.report.engine.emitter.postscript.tests/pom.xml to /opt/public/hipp/homes/genie.birt/.m2/repository/org/eclipse/birt/org.eclipse.birt.report.engine.emitter.postscript.tests/4.5.0-SNAPSHOT/org.eclipse.birt.report.engine.emitter.postscript.tests-4.5.0-SNAPSHOT.pom
[INFO] Installing /jobs/genie.birt/derp/workspace/engine/org.eclipse.birt.report.engine.emitter.postscript.tests/target/org.eclipse.birt.report.engine.emitter.postscript.tests-4.5.0-SNAPSHOT-sources.jar to /opt/public/hipp/homes/genie.birt/.m2/repository/org/eclipse/birt/org.eclipse.birt.report.engine.emitter.postscript.tests/4.5.0-SNAPSHOT/org.eclipse.birt.report.engine.emitter.postscript.tests-4.5.0-SNAPSHOT-sources.jar
[INFO] Installing /jobs/genie.birt/derp/workspace/engine/org.eclipse.birt.report.engine.emitter.postscript.tests/target/org.eclipse.birt.report.engine.emitter.postscript.tests-4.5.0-SNAPSHOT.jar.pack.gz to /opt/public/hipp/homes/genie.birt/.m2/repository/org/eclipse/birt/org.eclipse.birt.report.engine.emitter.postscript.tests/4.5.0-SNAPSHOT/org.eclipse.birt.report.engine.emitter.postscript.tests-4.5.0-SNAPSHOT-pack200.jar.pack.gz
[INFO] Installing /jobs/genie.birt/derp/workspace/engine/org.eclipse.birt.report.engine.emitter.postscript.tests/target/p2content.xml to /opt/public/hipp/homes/genie.birt/.m2/repository/org/eclipse/birt/org.eclipse.birt.report.engine.emitter.postscript.tests/4.5.0-SNAPSHOT/org.eclipse.birt.report.engine.emitter.postscript.tests-4.5.0-SNAPSHOT-p2metadata.xml
[INFO] Installing /jobs/genie.birt/derp/workspace/engine/org.eclipse.birt.report.engine.emitter.postscript.tests/target/p2artifacts.xml to /opt/public/hipp/homes/genie.birt/.m2/repository/org/eclipse/birt/org.eclipse.birt.report.engine.emitter.postscript.tests/4.5.0-SNAPSHOT/org.eclipse.birt.report.engine.emitter.postscript.tests-4.5.0-SNAPSHOT-p2artifacts.xml
[INFO] 
[INFO] --- tycho-p2-plugin:0.21.0:update-local-index (default-update-local-index) @ org.eclipse.birt.report.engine.emitter.postscript.tests ---
[INFO]                                                                         
[INFO] ------------------------------------------------------------------------
[INFO] Building org.eclipse.birt.report.engine.emitter.prototype.excel.tests 4.5.0-SNAPSHOT
[INFO] ------------------------------------------------------------------------
[INFO] 
[INFO] --- maven-clean-plugin:2.5:clean (default-clean) @ org.eclipse.birt.report.engine.emitter.prototype.excel.tests ---
[INFO] 
[INFO] --- tycho-packaging-plugin:0.21.0:build-qualifier (default-build-qualifier) @ org.eclipse.birt.report.engine.emitter.prototype.excel.tests ---
[INFO] The project's OSGi version is 4.5.0.v201510220855
[INFO] 
[INFO] --- tycho-packaging-plugin:0.21.0:validate-id (default-validate-id) @ org.eclipse.birt.report.engine.emitter.prototype.excel.tests ---
[INFO] 
[INFO] --- tycho-packaging-plugin:0.21.0:validate-version (default-validate-version) @ org.eclipse.birt.report.engine.emitter.prototype.excel.tests ---
[INFO] 
[INFO] --- maven-toolchains-plugin:1.1:toolchain (default) @ org.eclipse.birt.report.engine.emitter.prototype.excel.tests ---
[INFO] Required toolchain: jdk [ id='JavaSE-1.7' ]
[INFO] Found matching toolchain for type jdk: JDK[/opt/public/common/jdk1.7.0-latest/jre]
[INFO] 
[INFO] --- maven-resources-plugin:2.6:resources (default-resources) @ org.eclipse.birt.report.engine.emitter.prototype.excel.tests ---
[INFO] Using 'UTF-8' encoding to copy filtered resources.
[INFO] skip non existing resourceDirectory /jobs/genie.birt/derp/workspace/engine/org.eclipse.birt.report.engine.emitter.prototype.excel.tests/src/main/resources
[INFO] 
[INFO] --- tycho-compiler-plugin:0.21.0:compile (default-compile) @ org.eclipse.birt.report.engine.emitter.prototype.excel.tests ---
[INFO] Compiling 4 source files to /jobs/genie.birt/derp/workspace/engine/org.eclipse.birt.report.engine.emitter.prototype.excel.tests/target/classes
[INFO] 
[INFO] --- maven-resources-plugin:2.6:testResources (default-testResources) @ org.eclipse.birt.report.engine.emitter.prototype.excel.tests ---
[INFO] Not copying test resources
[INFO] 
[INFO] --- tycho-source-plugin:0.21.0:plugin-source (plugin-source) @ org.eclipse.birt.report.engine.emitter.prototype.excel.tests ---
[WARNING] bundle localization file /jobs/genie.birt/derp/workspace/engine/org.eclipse.birt.report.engine.emitter.prototype.excel.tests/plugin.properties not found
[INFO] Building jar: /jobs/genie.birt/derp/workspace/engine/org.eclipse.birt.report.engine.emitter.prototype.excel.tests/target/org.eclipse.birt.report.engine.emitter.prototype.excel.tests-4.5.0-SNAPSHOT-sources.jar
[INFO] 
[INFO] --- maven-resources-plugin:2.6:copy-resources (process-about.mappings) @ org.eclipse.birt.report.engine.emitter.prototype.excel.tests ---
[INFO] Using 'UTF-8' encoding to copy filtered resources.
[INFO] Copying 0 resource
[INFO] 
[INFO] --- target-platform-configuration:0.21.0:target-platform (default-target-platform) @ org.eclipse.birt.report.engine.emitter.prototype.excel.tests ---
[INFO] 
[INFO] --- tycho-packaging-plugin:0.21.0:package-plugin (default-package-plugin) @ org.eclipse.birt.report.engine.emitter.prototype.excel.tests ---
[INFO] Building jar: /jobs/genie.birt/derp/workspace/engine/org.eclipse.birt.report.engine.emitter.prototype.excel.tests/emitterexceltests.jar
[INFO] Building jar: /jobs/genie.birt/derp/workspace/engine/org.eclipse.birt.report.engine.emitter.prototype.excel.tests/target/org.eclipse.birt.report.engine.emitter.prototype.excel.tests-4.5.0-SNAPSHOT.jar
[INFO] 
[INFO] --- tycho-p2-plugin:0.21.0:p2-metadata-default (default-p2-metadata-default) @ org.eclipse.birt.report.engine.emitter.prototype.excel.tests ---
[INFO] 
[INFO] --- tycho-pack200a-plugin:0.21.0:normalize (pack200-normalize) @ org.eclipse.birt.report.engine.emitter.prototype.excel.tests ---
[INFO] Pack200 normalizing jar /jobs/genie.birt/derp/workspace/engine/org.eclipse.birt.report.engine.emitter.prototype.excel.tests/target/org.eclipse.birt.report.engine.emitter.prototype.excel.tests-4.5.0-SNAPSHOT.jar
[INFO] 
[INFO] --- eclipse-jarsigner-plugin:1.1.2:sign (sign) @ org.eclipse.birt.report.engine.emitter.prototype.excel.tests ---
[INFO] Searching org.eclipse.birt.report.engine.emitter.prototype.excel.tests-4.5.0-SNAPSHOT.jar for inner jars...
[INFO] Signed emitterexceltests.jar in 0 seconds.
[INFO] Signed org.eclipse.birt:org.eclipse.birt.report.engine.emitter.prototype.excel.tests:eclipse-test-plugin:4.5.0-SNAPSHOT in 2 seconds.
[INFO] Searching org.eclipse.birt.report.engine.emitter.prototype.excel.tests-4.5.0-SNAPSHOT-sources.jar for inner jars...
[INFO] Signed org.eclipse.birt:org.eclipse.birt.report.engine.emitter.prototype.excel.tests:java-source:sources:4.5.0-SNAPSHOT in 1 seconds.
[INFO] 
[INFO] --- tycho-pack200b-plugin:0.21.0:pack (pack200-pack) @ org.eclipse.birt.report.engine.emitter.prototype.excel.tests ---
[INFO] Pack200 packing jar /jobs/genie.birt/derp/workspace/engine/org.eclipse.birt.report.engine.emitter.prototype.excel.tests/target/org.eclipse.birt.report.engine.emitter.prototype.excel.tests-4.5.0-SNAPSHOT.jar
[INFO] 
[INFO] --- tycho-p2-plugin:0.21.0:p2-metadata (attached-p2-metadata) @ org.eclipse.birt.report.engine.emitter.prototype.excel.tests ---
[INFO] 
[INFO] --- jacoco-maven-plugin:0.7.4.201502262128:prepare-agent-integration (prepare-integration-tests) @ org.eclipse.birt.report.engine.emitter.prototype.excel.tests ---
[INFO] tycho.testArgLine set to -javaagent:/opt/public/hipp/homes/genie.birt/.m2/repository/org/jacoco/org.jacoco.agent/0.7.4.201502262128/org.jacoco.agent-0.7.4.201502262128-runtime.jar=destfile=/jobs/genie.birt/derp/workspace/engine/org.eclipse.birt.report.engine.emitter.prototype.excel.tests/target/coverage/jacoco-integration.exec,append=true,output=file
[INFO] 
[INFO] --- tycho-surefire-plugin:0.21.0:test (default-test) @ org.eclipse.birt.report.engine.emitter.prototype.excel.tests ---
[INFO] Skipping tests
[INFO] 
[INFO] --- jacoco-maven-plugin:0.7.4.201502262128:report-integration (report-integration) @ org.eclipse.birt.report.engine.emitter.prototype.excel.tests ---
[INFO] Skipping JaCoCo execution due to missing execution data file:/jobs/genie.birt/derp/workspace/engine/org.eclipse.birt.report.engine.emitter.prototype.excel.tests/target/coverage/jacoco-integration.exec
[INFO] 
[INFO] --- maven-install-plugin:2.3.1:install (default-install) @ org.eclipse.birt.report.engine.emitter.prototype.excel.tests ---
[INFO] Installing /jobs/genie.birt/derp/workspace/engine/org.eclipse.birt.report.engine.emitter.prototype.excel.tests/target/org.eclipse.birt.report.engine.emitter.prototype.excel.tests-4.5.0-SNAPSHOT.jar to /opt/public/hipp/homes/genie.birt/.m2/repository/org/eclipse/birt/org.eclipse.birt.report.engine.emitter.prototype.excel.tests/4.5.0-SNAPSHOT/org.eclipse.birt.report.engine.emitter.prototype.excel.tests-4.5.0-SNAPSHOT.jar
[INFO] Installing /jobs/genie.birt/derp/workspace/engine/org.eclipse.birt.report.engine.emitter.prototype.excel.tests/pom.xml to /opt/public/hipp/homes/genie.birt/.m2/repository/org/eclipse/birt/org.eclipse.birt.report.engine.emitter.prototype.excel.tests/4.5.0-SNAPSHOT/org.eclipse.birt.report.engine.emitter.prototype.excel.tests-4.5.0-SNAPSHOT.pom
[INFO] Installing /jobs/genie.birt/derp/workspace/engine/org.eclipse.birt.report.engine.emitter.prototype.excel.tests/target/org.eclipse.birt.report.engine.emitter.prototype.excel.tests-4.5.0-SNAPSHOT-sources.jar to /opt/public/hipp/homes/genie.birt/.m2/repository/org/eclipse/birt/org.eclipse.birt.report.engine.emitter.prototype.excel.tests/4.5.0-SNAPSHOT/org.eclipse.birt.report.engine.emitter.prototype.excel.tests-4.5.0-SNAPSHOT-sources.jar
[INFO] Installing /jobs/genie.birt/derp/workspace/engine/org.eclipse.birt.report.engine.emitter.prototype.excel.tests/target/org.eclipse.birt.report.engine.emitter.prototype.excel.tests-4.5.0-SNAPSHOT.jar.pack.gz to /opt/public/hipp/homes/genie.birt/.m2/repository/org/eclipse/birt/org.eclipse.birt.report.engine.emitter.prototype.excel.tests/4.5.0-SNAPSHOT/org.eclipse.birt.report.engine.emitter.prototype.excel.tests-4.5.0-SNAPSHOT-pack200.jar.pack.gz
[INFO] Installing /jobs/genie.birt/derp/workspace/engine/org.eclipse.birt.report.engine.emitter.prototype.excel.tests/target/p2content.xml to /opt/public/hipp/homes/genie.birt/.m2/repository/org/eclipse/birt/org.eclipse.birt.report.engine.emitter.prototype.excel.tests/4.5.0-SNAPSHOT/org.eclipse.birt.report.engine.emitter.prototype.excel.tests-4.5.0-SNAPSHOT-p2metadata.xml
[INFO] Installing /jobs/genie.birt/derp/workspace/engine/org.eclipse.birt.report.engine.emitter.prototype.excel.tests/target/p2artifacts.xml to /opt/public/hipp/homes/genie.birt/.m2/repository/org/eclipse/birt/org.eclipse.birt.report.engine.emitter.prototype.excel.tests/4.5.0-SNAPSHOT/org.eclipse.birt.report.engine.emitter.prototype.excel.tests-4.5.0-SNAPSHOT-p2artifacts.xml
[INFO] 
[INFO] --- tycho-p2-plugin:0.21.0:update-local-index (default-update-local-index) @ org.eclipse.birt.report.engine.emitter.prototype.excel.tests ---
[INFO]                                                                         
[INFO] ------------------------------------------------------------------------
[INFO] Building org.eclipse.birt.report.engine.tests 4.5.0-SNAPSHOT
[INFO] ------------------------------------------------------------------------
[INFO] 
[INFO] --- maven-clean-plugin:2.5:clean (default-clean) @ org.eclipse.birt.report.engine.tests ---
[INFO] 
[INFO] --- tycho-packaging-plugin:0.21.0:build-qualifier (default-build-qualifier) @ org.eclipse.birt.report.engine.tests ---
[INFO] The project's OSGi version is 4.5.0.v201510220855
[INFO] 
[INFO] --- tycho-packaging-plugin:0.21.0:validate-id (default-validate-id) @ org.eclipse.birt.report.engine.tests ---
[INFO] 
[INFO] --- tycho-packaging-plugin:0.21.0:validate-version (default-validate-version) @ org.eclipse.birt.report.engine.tests ---
[INFO] 
[INFO] --- maven-toolchains-plugin:1.1:toolchain (default) @ org.eclipse.birt.report.engine.tests ---
[INFO] Required toolchain: jdk [ id='JavaSE-1.7' ]
[INFO] Found matching toolchain for type jdk: JDK[/opt/public/common/jdk1.7.0-latest/jre]
[INFO] 
[INFO] --- maven-resources-plugin:2.6:resources (default-resources) @ org.eclipse.birt.report.engine.tests ---
[INFO] Using 'UTF-8' encoding to copy filtered resources.
[INFO] skip non existing resourceDirectory /jobs/genie.birt/derp/workspace/engine/org.eclipse.birt.report.engine.tests/src/main/resources
[INFO] 
[INFO] --- tycho-compiler-plugin:0.21.0:compile (default-compile) @ org.eclipse.birt.report.engine.tests ---
[INFO] Compiling 184 source files to /jobs/genie.birt/derp/workspace/engine/org.eclipse.birt.report.engine.tests/target/classes
[INFO] 
[INFO] --- maven-resources-plugin:2.6:testResources (default-testResources) @ org.eclipse.birt.report.engine.tests ---
[INFO] Not copying test resources
[INFO] 
[INFO] --- tycho-source-plugin:0.21.0:plugin-source (plugin-source) @ org.eclipse.birt.report.engine.tests ---
[WARNING] bundle localization file /jobs/genie.birt/derp/workspace/engine/org.eclipse.birt.report.engine.tests/plugin.properties not found
[INFO] Building jar: /jobs/genie.birt/derp/workspace/engine/org.eclipse.birt.report.engine.tests/target/org.eclipse.birt.report.engine.tests-4.5.0-SNAPSHOT-sources.jar
[INFO] 
[INFO] --- maven-resources-plugin:2.6:copy-resources (process-about.mappings) @ org.eclipse.birt.report.engine.tests ---
[INFO] Using 'UTF-8' encoding to copy filtered resources.
[INFO] Copying 0 resource
[INFO] 
[INFO] --- target-platform-configuration:0.21.0:target-platform (default-target-platform) @ org.eclipse.birt.report.engine.tests ---
[INFO] 
[INFO] --- tycho-packaging-plugin:0.21.0:package-plugin (default-package-plugin) @ org.eclipse.birt.report.engine.tests ---
[INFO] Building jar: /jobs/genie.birt/derp/workspace/engine/org.eclipse.birt.report.engine.tests/reportenginetests.jar
[INFO] Building jar: /jobs/genie.birt/derp/workspace/engine/org.eclipse.birt.report.engine.tests/target/org.eclipse.birt.report.engine.tests-4.5.0-SNAPSHOT.jar
[INFO] 
[INFO] --- tycho-p2-plugin:0.21.0:p2-metadata-default (default-p2-metadata-default) @ org.eclipse.birt.report.engine.tests ---
[INFO] 
[INFO] --- tycho-pack200a-plugin:0.21.0:normalize (pack200-normalize) @ org.eclipse.birt.report.engine.tests ---
[INFO] Pack200 normalizing jar /jobs/genie.birt/derp/workspace/engine/org.eclipse.birt.report.engine.tests/target/org.eclipse.birt.report.engine.tests-4.5.0-SNAPSHOT.jar
[INFO] 
[INFO] --- eclipse-jarsigner-plugin:1.1.2:sign (sign) @ org.eclipse.birt.report.engine.tests ---
[INFO] Searching org.eclipse.birt.report.engine.tests-4.5.0-SNAPSHOT.jar for inner jars...
[INFO] Signed reportenginetests.jar in 1 seconds.
[INFO] Signed org.eclipse.birt:org.eclipse.birt.report.engine.tests:eclipse-test-plugin:4.5.0-SNAPSHOT in 3 seconds.
[INFO] Searching org.eclipse.birt.report.engine.tests-4.5.0-SNAPSHOT-sources.jar for inner jars...
[INFO] Signed org/eclipse/birt/report/engine/api/script/script.jar in 0 seconds.
[INFO] Signed org.eclipse.birt:org.eclipse.birt.report.engine.tests:java-source:sources:4.5.0-SNAPSHOT in 3 seconds.
[INFO] 
[INFO] --- tycho-pack200b-plugin:0.21.0:pack (pack200-pack) @ org.eclipse.birt.report.engine.tests ---
[INFO] Pack200 packing jar /jobs/genie.birt/derp/workspace/engine/org.eclipse.birt.report.engine.tests/target/org.eclipse.birt.report.engine.tests-4.5.0-SNAPSHOT.jar
[INFO] 
[INFO] --- tycho-p2-plugin:0.21.0:p2-metadata (attached-p2-metadata) @ org.eclipse.birt.report.engine.tests ---
[INFO] 
[INFO] --- jacoco-maven-plugin:0.7.4.201502262128:prepare-agent-integration (prepare-integration-tests) @ org.eclipse.birt.report.engine.tests ---
[INFO] tycho.testArgLine set to -javaagent:/opt/public/hipp/homes/genie.birt/.m2/repository/org/jacoco/org.jacoco.agent/0.7.4.201502262128/org.jacoco.agent-0.7.4.201502262128-runtime.jar=destfile=/jobs/genie.birt/derp/workspace/engine/org.eclipse.birt.report.engine.tests/target/coverage/jacoco-integration.exec,append=true,output=file
[INFO] 
[INFO] --- tycho-surefire-plugin:0.21.0:test (default-test) @ org.eclipse.birt.report.engine.tests ---
[INFO] Skipping tests
[INFO] 
[INFO] --- jacoco-maven-plugin:0.7.4.201502262128:report-integration (report-integration) @ org.eclipse.birt.report.engine.tests ---
[INFO] Skipping JaCoCo execution due to missing execution data file:/jobs/genie.birt/derp/workspace/engine/org.eclipse.birt.report.engine.tests/target/coverage/jacoco-integration.exec
[INFO] 
[INFO] --- maven-install-plugin:2.3.1:install (default-install) @ org.eclipse.birt.report.engine.tests ---
[INFO] Installing /jobs/genie.birt/derp/workspace/engine/org.eclipse.birt.report.engine.tests/target/org.eclipse.birt.report.engine.tests-4.5.0-SNAPSHOT.jar to /opt/public/hipp/homes/genie.birt/.m2/repository/org/eclipse/birt/org.eclipse.birt.report.engine.tests/4.5.0-SNAPSHOT/org.eclipse.birt.report.engine.tests-4.5.0-SNAPSHOT.jar
[INFO] Installing /jobs/genie.birt/derp/workspace/engine/org.eclipse.birt.report.engine.tests/pom.xml to /opt/public/hipp/homes/genie.birt/.m2/repository/org/eclipse/birt/org.eclipse.birt.report.engine.tests/4.5.0-SNAPSHOT/org.eclipse.birt.report.engine.tests-4.5.0-SNAPSHOT.pom
[INFO] Installing /jobs/genie.birt/derp/workspace/engine/org.eclipse.birt.report.engine.tests/target/org.eclipse.birt.report.engine.tests-4.5.0-SNAPSHOT-sources.jar to /opt/public/hipp/homes/genie.birt/.m2/repository/org/eclipse/birt/org.eclipse.birt.report.engine.tests/4.5.0-SNAPSHOT/org.eclipse.birt.report.engine.tests-4.5.0-SNAPSHOT-sources.jar
[INFO] Installing /jobs/genie.birt/derp/workspace/engine/org.eclipse.birt.report.engine.tests/target/org.eclipse.birt.report.engine.tests-4.5.0-SNAPSHOT.jar.pack.gz to /opt/public/hipp/homes/genie.birt/.m2/repository/org/eclipse/birt/org.eclipse.birt.report.engine.tests/4.5.0-SNAPSHOT/org.eclipse.birt.report.engine.tests-4.5.0-SNAPSHOT-pack200.jar.pack.gz
[INFO] Installing /jobs/genie.birt/derp/workspace/engine/org.eclipse.birt.report.engine.tests/target/p2content.xml to /opt/public/hipp/homes/genie.birt/.m2/repository/org/eclipse/birt/org.eclipse.birt.report.engine.tests/4.5.0-SNAPSHOT/org.eclipse.birt.report.engine.tests-4.5.0-SNAPSHOT-p2metadata.xml
[INFO] Installing /jobs/genie.birt/derp/workspace/engine/org.eclipse.birt.report.engine.tests/target/p2artifacts.xml to /opt/public/hipp/homes/genie.birt/.m2/repository/org/eclipse/birt/org.eclipse.birt.report.engine.tests/4.5.0-SNAPSHOT/org.eclipse.birt.report.engine.tests-4.5.0-SNAPSHOT-p2artifacts.xml
[INFO] 
[INFO] --- tycho-p2-plugin:0.21.0:update-local-index (default-update-local-index) @ org.eclipse.birt.report.engine.tests ---
[INFO]                                                                         
[INFO] ------------------------------------------------------------------------
[INFO] Building org.eclipse.birt.report.model.adapter.oda.tests 4.5.0-SNAPSHOT
[INFO] ------------------------------------------------------------------------
[INFO] 
[INFO] --- maven-clean-plugin:2.5:clean (default-clean) @ org.eclipse.birt.report.model.adapter.oda.tests ---
[INFO] 
[INFO] --- tycho-packaging-plugin:0.21.0:build-qualifier (default-build-qualifier) @ org.eclipse.birt.report.model.adapter.oda.tests ---
[INFO] The project's OSGi version is 4.5.0.v201510220855
[INFO] 
[INFO] --- tycho-packaging-plugin:0.21.0:validate-id (default-validate-id) @ org.eclipse.birt.report.model.adapter.oda.tests ---
[INFO] 
[INFO] --- tycho-packaging-plugin:0.21.0:validate-version (default-validate-version) @ org.eclipse.birt.report.model.adapter.oda.tests ---
[INFO] 
[INFO] --- maven-toolchains-plugin:1.1:toolchain (default) @ org.eclipse.birt.report.model.adapter.oda.tests ---
[INFO] Required toolchain: jdk [ id='JavaSE-1.7' ]
[INFO] Found matching toolchain for type jdk: JDK[/opt/public/common/jdk1.7.0-latest/jre]
[INFO] 
[INFO] --- maven-resources-plugin:2.6:resources (default-resources) @ org.eclipse.birt.report.model.adapter.oda.tests ---
[INFO] Using 'UTF-8' encoding to copy filtered resources.
[INFO] skip non existing resourceDirectory /jobs/genie.birt/derp/workspace/model/org.eclipse.birt.report.model.adapter.oda.tests/src/main/resources
[INFO] 
[INFO] --- tycho-compiler-plugin:0.21.0:compile (default-compile) @ org.eclipse.birt.report.model.adapter.oda.tests ---
[INFO] Compiling 12 source files to /jobs/genie.birt/derp/workspace/model/org.eclipse.birt.report.model.adapter.oda.tests/target/classes
[INFO] 
[INFO] --- maven-resources-plugin:2.6:testResources (default-testResources) @ org.eclipse.birt.report.model.adapter.oda.tests ---
[INFO] Not copying test resources
[INFO] 
[INFO] --- tycho-source-plugin:0.21.0:plugin-source (plugin-source) @ org.eclipse.birt.report.model.adapter.oda.tests ---
[WARNING] bundle localization file /jobs/genie.birt/derp/workspace/model/org.eclipse.birt.report.model.adapter.oda.tests/plugin.properties not found
[INFO] Building jar: /jobs/genie.birt/derp/workspace/model/org.eclipse.birt.report.model.adapter.oda.tests/target/org.eclipse.birt.report.model.adapter.oda.tests-4.5.0-SNAPSHOT-sources.jar
[INFO] 
[INFO] --- maven-resources-plugin:2.6:copy-resources (process-about.mappings) @ org.eclipse.birt.report.model.adapter.oda.tests ---
[INFO] Using 'UTF-8' encoding to copy filtered resources.
[INFO] Copying 0 resource
[INFO] 
[INFO] --- target-platform-configuration:0.21.0:target-platform (default-target-platform) @ org.eclipse.birt.report.model.adapter.oda.tests ---
[INFO] 
[INFO] --- tycho-packaging-plugin:0.21.0:package-plugin (default-package-plugin) @ org.eclipse.birt.report.model.adapter.oda.tests ---
[INFO] Building jar: /jobs/genie.birt/derp/workspace/model/org.eclipse.birt.report.model.adapter.oda.tests/modeladapterodatests.jar
[INFO] Building jar: /jobs/genie.birt/derp/workspace/model/org.eclipse.birt.report.model.adapter.oda.tests/target/org.eclipse.birt.report.model.adapter.oda.tests-4.5.0-SNAPSHOT.jar
[INFO] 
[INFO] --- tycho-p2-plugin:0.21.0:p2-metadata-default (default-p2-metadata-default) @ org.eclipse.birt.report.model.adapter.oda.tests ---
[INFO] 
[INFO] --- tycho-pack200a-plugin:0.21.0:normalize (pack200-normalize) @ org.eclipse.birt.report.model.adapter.oda.tests ---
[INFO] Pack200 normalizing jar /jobs/genie.birt/derp/workspace/model/org.eclipse.birt.report.model.adapter.oda.tests/target/org.eclipse.birt.report.model.adapter.oda.tests-4.5.0-SNAPSHOT.jar
[INFO] 
[INFO] --- eclipse-jarsigner-plugin:1.1.2:sign (sign) @ org.eclipse.birt.report.model.adapter.oda.tests ---
[INFO] Searching org.eclipse.birt.report.model.adapter.oda.tests-4.5.0-SNAPSHOT.jar for inner jars...
[INFO] Signed modeladapterodatests.jar in 0 seconds.
[INFO] Signed org.eclipse.birt:org.eclipse.birt.report.model.adapter.oda.tests:eclipse-test-plugin:4.5.0-SNAPSHOT in 4 seconds.
[INFO] Searching org.eclipse.birt.report.model.adapter.oda.tests-4.5.0-SNAPSHOT-sources.jar for inner jars...
[INFO] Signed org.eclipse.birt:org.eclipse.birt.report.model.adapter.oda.tests:java-source:sources:4.5.0-SNAPSHOT in 1 seconds.
[INFO] 
[INFO] --- tycho-pack200b-plugin:0.21.0:pack (pack200-pack) @ org.eclipse.birt.report.model.adapter.oda.tests ---
[INFO] Pack200 packing jar /jobs/genie.birt/derp/workspace/model/org.eclipse.birt.report.model.adapter.oda.tests/target/org.eclipse.birt.report.model.adapter.oda.tests-4.5.0-SNAPSHOT.jar
[INFO] 
[INFO] --- tycho-p2-plugin:0.21.0:p2-metadata (attached-p2-metadata) @ org.eclipse.birt.report.model.adapter.oda.tests ---
[INFO] 
[INFO] --- jacoco-maven-plugin:0.7.4.201502262128:prepare-agent-integration (prepare-integration-tests) @ org.eclipse.birt.report.model.adapter.oda.tests ---
[INFO] tycho.testArgLine set to -javaagent:/opt/public/hipp/homes/genie.birt/.m2/repository/org/jacoco/org.jacoco.agent/0.7.4.201502262128/org.jacoco.agent-0.7.4.201502262128-runtime.jar=destfile=/jobs/genie.birt/derp/workspace/model/org.eclipse.birt.report.model.adapter.oda.tests/target/coverage/jacoco-integration.exec,append=true,output=file
[INFO] 
[INFO] --- tycho-surefire-plugin:0.21.0:test (default-test) @ org.eclipse.birt.report.model.adapter.oda.tests ---
[INFO] Skipping tests
[INFO] 
[INFO] --- jacoco-maven-plugin:0.7.4.201502262128:report-integration (report-integration) @ org.eclipse.birt.report.model.adapter.oda.tests ---
[INFO] Skipping JaCoCo execution due to missing execution data file:/jobs/genie.birt/derp/workspace/model/org.eclipse.birt.report.model.adapter.oda.tests/target/coverage/jacoco-integration.exec
[INFO] 
[INFO] --- maven-install-plugin:2.3.1:install (default-install) @ org.eclipse.birt.report.model.adapter.oda.tests ---
[INFO] Installing /jobs/genie.birt/derp/workspace/model/org.eclipse.birt.report.model.adapter.oda.tests/target/org.eclipse.birt.report.model.adapter.oda.tests-4.5.0-SNAPSHOT.jar to /opt/public/hipp/homes/genie.birt/.m2/repository/org/eclipse/birt/org.eclipse.birt.report.model.adapter.oda.tests/4.5.0-SNAPSHOT/org.eclipse.birt.report.model.adapter.oda.tests-4.5.0-SNAPSHOT.jar
[INFO] Installing /jobs/genie.birt/derp/workspace/model/org.eclipse.birt.report.model.adapter.oda.tests/pom.xml to /opt/public/hipp/homes/genie.birt/.m2/repository/org/eclipse/birt/org.eclipse.birt.report.model.adapter.oda.tests/4.5.0-SNAPSHOT/org.eclipse.birt.report.model.adapter.oda.tests-4.5.0-SNAPSHOT.pom
[INFO] Installing /jobs/genie.birt/derp/workspace/model/org.eclipse.birt.report.model.adapter.oda.tests/target/org.eclipse.birt.report.model.adapter.oda.tests-4.5.0-SNAPSHOT-sources.jar to /opt/public/hipp/homes/genie.birt/.m2/repository/org/eclipse/birt/org.eclipse.birt.report.model.adapter.oda.tests/4.5.0-SNAPSHOT/org.eclipse.birt.report.model.adapter.oda.tests-4.5.0-SNAPSHOT-sources.jar
[INFO] Installing /jobs/genie.birt/derp/workspace/model/org.eclipse.birt.report.model.adapter.oda.tests/target/org.eclipse.birt.report.model.adapter.oda.tests-4.5.0-SNAPSHOT.jar.pack.gz to /opt/public/hipp/homes/genie.birt/.m2/repository/org/eclipse/birt/org.eclipse.birt.report.model.adapter.oda.tests/4.5.0-SNAPSHOT/org.eclipse.birt.report.model.adapter.oda.tests-4.5.0-SNAPSHOT-pack200.jar.pack.gz
[INFO] Installing /jobs/genie.birt/derp/workspace/model/org.eclipse.birt.report.model.adapter.oda.tests/target/p2content.xml to /opt/public/hipp/homes/genie.birt/.m2/repository/org/eclipse/birt/org.eclipse.birt.report.model.adapter.oda.tests/4.5.0-SNAPSHOT/org.eclipse.birt.report.model.adapter.oda.tests-4.5.0-SNAPSHOT-p2metadata.xml
[INFO] Installing /jobs/genie.birt/derp/workspace/model/org.eclipse.birt.report.model.adapter.oda.tests/target/p2artifacts.xml to /opt/public/hipp/homes/genie.birt/.m2/repository/org/eclipse/birt/org.eclipse.birt.report.model.adapter.oda.tests/4.5.0-SNAPSHOT/org.eclipse.birt.report.model.adapter.oda.tests-4.5.0-SNAPSHOT-p2artifacts.xml
[INFO] 
[INFO] --- tycho-p2-plugin:0.21.0:update-local-index (default-update-local-index) @ org.eclipse.birt.report.model.adapter.oda.tests ---
[INFO]                                                                         
[INFO] ------------------------------------------------------------------------
[INFO] Building org.eclipse.birt.report.model.testresources 4.5.0-SNAPSHOT
[INFO] ------------------------------------------------------------------------
[INFO] 
[INFO] --- maven-clean-plugin:2.5:clean (default-clean) @ org.eclipse.birt.report.model.testresources ---
[INFO] 
[INFO] --- tycho-packaging-plugin:0.21.0:build-qualifier (default-build-qualifier) @ org.eclipse.birt.report.model.testresources ---
[INFO] The project's OSGi version is 4.5.0.v201510220855
[INFO] 
[INFO] --- tycho-packaging-plugin:0.21.0:validate-id (default-validate-id) @ org.eclipse.birt.report.model.testresources ---
[INFO] 
[INFO] --- tycho-packaging-plugin:0.21.0:validate-version (default-validate-version) @ org.eclipse.birt.report.model.testresources ---
[INFO] 
[INFO] --- maven-toolchains-plugin:1.1:toolchain (default) @ org.eclipse.birt.report.model.testresources ---
[INFO] Required toolchain: jdk [ id='JavaSE-1.7' ]
[INFO] Found matching toolchain for type jdk: JDK[/opt/public/common/jdk1.7.0-latest/jre]
[INFO] 
[INFO] --- maven-resources-plugin:2.6:resources (default-resources) @ org.eclipse.birt.report.model.testresources ---
[INFO] Using 'UTF-8' encoding to copy filtered resources.
[INFO] skip non existing resourceDirectory /jobs/genie.birt/derp/workspace/model/org.eclipse.birt.report.model.testresources/src/main/resources
[INFO] 
[INFO] --- tycho-compiler-plugin:0.21.0:compile (default-compile) @ org.eclipse.birt.report.model.testresources ---
[INFO] 
[INFO] --- maven-resources-plugin:2.6:testResources (default-testResources) @ org.eclipse.birt.report.model.testresources ---
[INFO] Not copying test resources
[INFO] 
[INFO] --- tycho-source-plugin:0.21.0:plugin-source (plugin-source) @ org.eclipse.birt.report.model.testresources ---
[INFO] 
[INFO] --- maven-resources-plugin:2.6:copy-resources (process-about.mappings) @ org.eclipse.birt.report.model.testresources ---
[INFO] Using 'UTF-8' encoding to copy filtered resources.
[INFO] Copying 0 resource
[INFO] 
[INFO] --- target-platform-configuration:0.21.0:target-platform (default-target-platform) @ org.eclipse.birt.report.model.testresources ---
[INFO] 
[INFO] --- tycho-packaging-plugin:0.21.0:package-plugin (default-package-plugin) @ org.eclipse.birt.report.model.testresources ---
[INFO] Building jar: /jobs/genie.birt/derp/workspace/model/org.eclipse.birt.report.model.testresources/target/org.eclipse.birt.report.model.testresources-4.5.0-SNAPSHOT.jar
[INFO] 
[INFO] --- tycho-p2-plugin:0.21.0:p2-metadata-default (default-p2-metadata-default) @ org.eclipse.birt.report.model.testresources ---
[INFO] 
[INFO] --- tycho-pack200a-plugin:0.21.0:normalize (pack200-normalize) @ org.eclipse.birt.report.model.testresources ---
[INFO] Pack200 normalizing jar /jobs/genie.birt/derp/workspace/model/org.eclipse.birt.report.model.testresources/target/org.eclipse.birt.report.model.testresources-4.5.0-SNAPSHOT.jar
[INFO] 
[INFO] --- eclipse-jarsigner-plugin:1.1.2:sign (sign) @ org.eclipse.birt.report.model.testresources ---
[INFO] Searching org.eclipse.birt.report.model.testresources-4.5.0-SNAPSHOT.jar for inner jars...
[INFO] Signed org.eclipse.birt:org.eclipse.birt.report.model.testresources:eclipse-plugin:4.5.0-SNAPSHOT in 0 seconds.
[INFO] 
[INFO] --- tycho-pack200b-plugin:0.21.0:pack (pack200-pack) @ org.eclipse.birt.report.model.testresources ---
[INFO] Pack200 packing jar /jobs/genie.birt/derp/workspace/model/org.eclipse.birt.report.model.testresources/target/org.eclipse.birt.report.model.testresources-4.5.0-SNAPSHOT.jar
[INFO] 
[INFO] --- tycho-p2-plugin:0.21.0:p2-metadata (attached-p2-metadata) @ org.eclipse.birt.report.model.testresources ---
[INFO] 
[INFO] --- jacoco-maven-plugin:0.7.4.201502262128:prepare-agent-integration (prepare-integration-tests) @ org.eclipse.birt.report.model.testresources ---
[INFO] argLine set to -javaagent:/opt/public/hipp/homes/genie.birt/.m2/repository/org/jacoco/org.jacoco.agent/0.7.4.201502262128/org.jacoco.agent-0.7.4.201502262128-runtime.jar=destfile=/jobs/genie.birt/derp/workspace/model/org.eclipse.birt.report.model.testresources/target/coverage/jacoco-integration.exec,append=true,output=file
[INFO] 
[INFO] --- jacoco-maven-plugin:0.7.4.201502262128:report-integration (report-integration) @ org.eclipse.birt.report.model.testresources ---
[INFO] Skipping JaCoCo execution due to missing execution data file:/jobs/genie.birt/derp/workspace/model/org.eclipse.birt.report.model.testresources/target/coverage/jacoco-integration.exec
[INFO] 
[INFO] --- maven-install-plugin:2.3.1:install (default-install) @ org.eclipse.birt.report.model.testresources ---
[INFO] Installing /jobs/genie.birt/derp/workspace/model/org.eclipse.birt.report.model.testresources/target/org.eclipse.birt.report.model.testresources-4.5.0-SNAPSHOT.jar to /opt/public/hipp/homes/genie.birt/.m2/repository/org/eclipse/birt/org.eclipse.birt.report.model.testresources/4.5.0-SNAPSHOT/org.eclipse.birt.report.model.testresources-4.5.0-SNAPSHOT.jar
[INFO] Installing /jobs/genie.birt/derp/workspace/model/org.eclipse.birt.report.model.testresources/pom.xml to /opt/public/hipp/homes/genie.birt/.m2/repository/org/eclipse/birt/org.eclipse.birt.report.model.testresources/4.5.0-SNAPSHOT/org.eclipse.birt.report.model.testresources-4.5.0-SNAPSHOT.pom
[INFO] Installing /jobs/genie.birt/derp/workspace/model/org.eclipse.birt.report.model.testresources/target/org.eclipse.birt.report.model.testresources-4.5.0-SNAPSHOT.jar.pack.gz to /opt/public/hipp/homes/genie.birt/.m2/repository/org/eclipse/birt/org.eclipse.birt.report.model.testresources/4.5.0-SNAPSHOT/org.eclipse.birt.report.model.testresources-4.5.0-SNAPSHOT-pack200.jar.pack.gz
[INFO] Installing /jobs/genie.birt/derp/workspace/model/org.eclipse.birt.report.model.testresources/target/p2content.xml to /opt/public/hipp/homes/genie.birt/.m2/repository/org/eclipse/birt/org.eclipse.birt.report.model.testresources/4.5.0-SNAPSHOT/org.eclipse.birt.report.model.testresources-4.5.0-SNAPSHOT-p2metadata.xml
[INFO] Installing /jobs/genie.birt/derp/workspace/model/org.eclipse.birt.report.model.testresources/target/p2artifacts.xml to /opt/public/hipp/homes/genie.birt/.m2/repository/org/eclipse/birt/org.eclipse.birt.report.model.testresources/4.5.0-SNAPSHOT/org.eclipse.birt.report.model.testresources-4.5.0-SNAPSHOT-p2artifacts.xml
[INFO] 
[INFO] --- tycho-p2-plugin:0.21.0:update-local-index (default-update-local-index) @ org.eclipse.birt.report.model.testresources ---
[INFO]                                                                         
[INFO] ------------------------------------------------------------------------
[INFO] Building org.eclipse.birt.report.modelextension.tests 4.5.0-SNAPSHOT
[INFO] ------------------------------------------------------------------------
[INFO] 
[INFO] --- maven-clean-plugin:2.5:clean (default-clean) @ org.eclipse.birt.report.modelextension.tests ---
[INFO] 
[INFO] --- tycho-packaging-plugin:0.21.0:build-qualifier (default-build-qualifier) @ org.eclipse.birt.report.modelextension.tests ---
[INFO] The project's OSGi version is 4.5.0.v201510220855
[INFO] 
[INFO] --- tycho-packaging-plugin:0.21.0:validate-id (default-validate-id) @ org.eclipse.birt.report.modelextension.tests ---
[INFO] 
[INFO] --- tycho-packaging-plugin:0.21.0:validate-version (default-validate-version) @ org.eclipse.birt.report.modelextension.tests ---
[INFO] 
[INFO] --- maven-toolchains-plugin:1.1:toolchain (default) @ org.eclipse.birt.report.modelextension.tests ---
[INFO] Required toolchain: jdk [ id='JavaSE-1.7' ]
[INFO] Found matching toolchain for type jdk: JDK[/opt/public/common/jdk1.7.0-latest/jre]
[INFO] 
[INFO] --- maven-resources-plugin:2.6:resources (default-resources) @ org.eclipse.birt.report.modelextension.tests ---
[INFO] Using 'UTF-8' encoding to copy filtered resources.
[INFO] skip non existing resourceDirectory /jobs/genie.birt/derp/workspace/model/org.eclipse.birt.report.modelextension.tests/src/main/resources
[INFO] 
[INFO] --- tycho-compiler-plugin:0.21.0:compile (default-compile) @ org.eclipse.birt.report.modelextension.tests ---
[INFO] Compiling 28 source files to /jobs/genie.birt/derp/workspace/model/org.eclipse.birt.report.modelextension.tests/target/classes
[INFO] 
[INFO] --- maven-resources-plugin:2.6:testResources (default-testResources) @ org.eclipse.birt.report.modelextension.tests ---
[INFO] Not copying test resources
[INFO] 
[INFO] --- tycho-source-plugin:0.21.0:plugin-source (plugin-source) @ org.eclipse.birt.report.modelextension.tests ---
[WARNING] bundle localization file /jobs/genie.birt/derp/workspace/model/org.eclipse.birt.report.modelextension.tests/plugin.properties not found
[INFO] Building jar: /jobs/genie.birt/derp/workspace/model/org.eclipse.birt.report.modelextension.tests/target/org.eclipse.birt.report.modelextension.tests-4.5.0-SNAPSHOT-sources.jar
[INFO] 
[INFO] --- maven-resources-plugin:2.6:copy-resources (process-about.mappings) @ org.eclipse.birt.report.modelextension.tests ---
[INFO] Using 'UTF-8' encoding to copy filtered resources.
[INFO] Copying 0 resource
[INFO] 
[INFO] --- target-platform-configuration:0.21.0:target-platform (default-target-platform) @ org.eclipse.birt.report.modelextension.tests ---
[INFO] 
[INFO] --- tycho-packaging-plugin:0.21.0:package-plugin (default-package-plugin) @ org.eclipse.birt.report.modelextension.tests ---
[INFO] Building jar: /jobs/genie.birt/derp/workspace/model/org.eclipse.birt.report.modelextension.tests/target/org.eclipse.birt.report.modelextension.tests-4.5.0-SNAPSHOT.jar
[INFO] 
[INFO] --- tycho-p2-plugin:0.21.0:p2-metadata-default (default-p2-metadata-default) @ org.eclipse.birt.report.modelextension.tests ---
[INFO] 
[INFO] --- tycho-pack200a-plugin:0.21.0:normalize (pack200-normalize) @ org.eclipse.birt.report.modelextension.tests ---
[INFO] Pack200 normalizing jar /jobs/genie.birt/derp/workspace/model/org.eclipse.birt.report.modelextension.tests/target/org.eclipse.birt.report.modelextension.tests-4.5.0-SNAPSHOT.jar
[INFO] 
[INFO] --- eclipse-jarsigner-plugin:1.1.2:sign (sign) @ org.eclipse.birt.report.modelextension.tests ---
[INFO] Searching org.eclipse.birt.report.modelextension.tests-4.5.0-SNAPSHOT.jar for inner jars...
[INFO] Signed tests.jar in 3 seconds.
[INFO] Signed org.eclipse.birt:org.eclipse.birt.report.modelextension.tests:eclipse-plugin:4.5.0-SNAPSHOT in 4 seconds.
[INFO] Searching org.eclipse.birt.report.modelextension.tests-4.5.0-SNAPSHOT-sources.jar for inner jars...
[INFO] Signed org.eclipse.birt:org.eclipse.birt.report.modelextension.tests:java-source:sources:4.5.0-SNAPSHOT in 1 seconds.
[INFO] 
[INFO] --- tycho-pack200b-plugin:0.21.0:pack (pack200-pack) @ org.eclipse.birt.report.modelextension.tests ---
[INFO] Pack200 packing jar /jobs/genie.birt/derp/workspace/model/org.eclipse.birt.report.modelextension.tests/target/org.eclipse.birt.report.modelextension.tests-4.5.0-SNAPSHOT.jar
[INFO] 
[INFO] --- tycho-p2-plugin:0.21.0:p2-metadata (attached-p2-metadata) @ org.eclipse.birt.report.modelextension.tests ---
[INFO] 
[INFO] --- jacoco-maven-plugin:0.7.4.201502262128:prepare-agent-integration (prepare-integration-tests) @ org.eclipse.birt.report.modelextension.tests ---
[INFO] argLine set to -javaagent:/opt/public/hipp/homes/genie.birt/.m2/repository/org/jacoco/org.jacoco.agent/0.7.4.201502262128/org.jacoco.agent-0.7.4.201502262128-runtime.jar=destfile=/jobs/genie.birt/derp/workspace/model/org.eclipse.birt.report.modelextension.tests/target/coverage/jacoco-integration.exec,append=true,output=file
[INFO] 
[INFO] --- jacoco-maven-plugin:0.7.4.201502262128:report-integration (report-integration) @ org.eclipse.birt.report.modelextension.tests ---
[INFO] Skipping JaCoCo execution due to missing execution data file:/jobs/genie.birt/derp/workspace/model/org.eclipse.birt.report.modelextension.tests/target/coverage/jacoco-integration.exec
[INFO] 
[INFO] --- maven-install-plugin:2.3.1:install (default-install) @ org.eclipse.birt.report.modelextension.tests ---
[INFO] Installing /jobs/genie.birt/derp/workspace/model/org.eclipse.birt.report.modelextension.tests/target/org.eclipse.birt.report.modelextension.tests-4.5.0-SNAPSHOT.jar to /opt/public/hipp/homes/genie.birt/.m2/repository/org/eclipse/birt/org.eclipse.birt.report.modelextension.tests/4.5.0-SNAPSHOT/org.eclipse.birt.report.modelextension.tests-4.5.0-SNAPSHOT.jar
[INFO] Installing /jobs/genie.birt/derp/workspace/model/org.eclipse.birt.report.modelextension.tests/pom.xml to /opt/public/hipp/homes/genie.birt/.m2/repository/org/eclipse/birt/org.eclipse.birt.report.modelextension.tests/4.5.0-SNAPSHOT/org.eclipse.birt.report.modelextension.tests-4.5.0-SNAPSHOT.pom
[INFO] Installing /jobs/genie.birt/derp/workspace/model/org.eclipse.birt.report.modelextension.tests/target/org.eclipse.birt.report.modelextension.tests-4.5.0-SNAPSHOT-sources.jar to /opt/public/hipp/homes/genie.birt/.m2/repository/org/eclipse/birt/org.eclipse.birt.report.modelextension.tests/4.5.0-SNAPSHOT/org.eclipse.birt.report.modelextension.tests-4.5.0-SNAPSHOT-sources.jar
[INFO] Installing /jobs/genie.birt/derp/workspace/model/org.eclipse.birt.report.modelextension.tests/target/org.eclipse.birt.report.modelextension.tests-4.5.0-SNAPSHOT.jar.pack.gz to /opt/public/hipp/homes/genie.birt/.m2/repository/org/eclipse/birt/org.eclipse.birt.report.modelextension.tests/4.5.0-SNAPSHOT/org.eclipse.birt.report.modelextension.tests-4.5.0-SNAPSHOT-pack200.jar.pack.gz
[INFO] Installing /jobs/genie.birt/derp/workspace/model/org.eclipse.birt.report.modelextension.tests/target/p2content.xml to /opt/public/hipp/homes/genie.birt/.m2/repository/org/eclipse/birt/org.eclipse.birt.report.modelextension.tests/4.5.0-SNAPSHOT/org.eclipse.birt.report.modelextension.tests-4.5.0-SNAPSHOT-p2metadata.xml
[INFO] Installing /jobs/genie.birt/derp/workspace/model/org.eclipse.birt.report.modelextension.tests/target/p2artifacts.xml to /opt/public/hipp/homes/genie.birt/.m2/repository/org/eclipse/birt/org.eclipse.birt.report.modelextension.tests/4.5.0-SNAPSHOT/org.eclipse.birt.report.modelextension.tests-4.5.0-SNAPSHOT-p2artifacts.xml
[INFO] 
[INFO] --- tycho-p2-plugin:0.21.0:update-local-index (default-update-local-index) @ org.eclipse.birt.report.modelextension.tests ---
[INFO]                                                                         
[INFO] ------------------------------------------------------------------------
[INFO] Building org.eclipse.birt.report.model.tests 4.5.0-SNAPSHOT
[INFO] ------------------------------------------------------------------------
[INFO] 
[INFO] --- maven-clean-plugin:2.5:clean (default-clean) @ org.eclipse.birt.report.model.tests ---
[INFO] 
[INFO] --- tycho-packaging-plugin:0.21.0:build-qualifier (default-build-qualifier) @ org.eclipse.birt.report.model.tests ---
[INFO] The project's OSGi version is 4.5.0.v201510220855
[INFO] 
[INFO] --- tycho-packaging-plugin:0.21.0:validate-id (default-validate-id) @ org.eclipse.birt.report.model.tests ---
[INFO] 
[INFO] --- tycho-packaging-plugin:0.21.0:validate-version (default-validate-version) @ org.eclipse.birt.report.model.tests ---
[INFO] 
[INFO] --- maven-toolchains-plugin:1.1:toolchain (default) @ org.eclipse.birt.report.model.tests ---
[INFO] Required toolchain: jdk [ id='JavaSE-1.7' ]
[INFO] Found matching toolchain for type jdk: JDK[/opt/public/common/jdk1.7.0-latest/jre]
[INFO] 
[INFO] --- maven-resources-plugin:2.6:resources (default-resources) @ org.eclipse.birt.report.model.tests ---
[INFO] Using 'UTF-8' encoding to copy filtered resources.
[INFO] skip non existing resourceDirectory /jobs/genie.birt/derp/workspace/model/org.eclipse.birt.report.model.tests/src/main/resources
[INFO] 
[INFO] --- tycho-compiler-plugin:0.21.0:compile (default-compile) @ org.eclipse.birt.report.model.tests ---
[INFO] Compiling 273 source files to /jobs/genie.birt/derp/workspace/model/org.eclipse.birt.report.model.tests/target/classes
[INFO] 
[INFO] --- maven-resources-plugin:2.6:testResources (default-testResources) @ org.eclipse.birt.report.model.tests ---
[INFO] Not copying test resources
[INFO] 
[INFO] --- tycho-source-plugin:0.21.0:plugin-source (plugin-source) @ org.eclipse.birt.report.model.tests ---
[WARNING] bundle localization file /jobs/genie.birt/derp/workspace/model/org.eclipse.birt.report.model.tests/plugin.properties not found
[INFO] Building jar: /jobs/genie.birt/derp/workspace/model/org.eclipse.birt.report.model.tests/target/org.eclipse.birt.report.model.tests-4.5.0-SNAPSHOT-sources.jar
[INFO] 
[INFO] --- maven-resources-plugin:2.6:copy-resources (process-about.mappings) @ org.eclipse.birt.report.model.tests ---
[INFO] Using 'UTF-8' encoding to copy filtered resources.
[INFO] Copying 0 resource
[INFO] 
[INFO] --- target-platform-configuration:0.21.0:target-platform (default-target-platform) @ org.eclipse.birt.report.model.tests ---
[INFO] 
[INFO] --- tycho-packaging-plugin:0.21.0:package-plugin (default-package-plugin) @ org.eclipse.birt.report.model.tests ---
[INFO] Building jar: /jobs/genie.birt/derp/workspace/model/org.eclipse.birt.report.model.tests/modeltests.jar
[INFO] Building jar: /jobs/genie.birt/derp/workspace/model/org.eclipse.birt.report.model.tests/target/org.eclipse.birt.report.model.tests-4.5.0-SNAPSHOT.jar
[INFO] 
[INFO] --- tycho-p2-plugin:0.21.0:p2-metadata-default (default-p2-metadata-default) @ org.eclipse.birt.report.model.tests ---
[INFO] 
[INFO] --- tycho-pack200a-plugin:0.21.0:normalize (pack200-normalize) @ org.eclipse.birt.report.model.tests ---
[INFO] Pack200 normalizing jar /jobs/genie.birt/derp/workspace/model/org.eclipse.birt.report.model.tests/target/org.eclipse.birt.report.model.tests-4.5.0-SNAPSHOT.jar
[INFO] 
[INFO] --- tycho-pack200b-plugin:0.21.0:pack (pack200-pack) @ org.eclipse.birt.report.model.tests ---
[INFO] Pack200 packing jar /jobs/genie.birt/derp/workspace/model/org.eclipse.birt.report.model.tests/target/org.eclipse.birt.report.model.tests-4.5.0-SNAPSHOT.jar
[INFO] 
[INFO] --- tycho-p2-plugin:0.21.0:p2-metadata (attached-p2-metadata) @ org.eclipse.birt.report.model.tests ---
[INFO] 
[INFO] --- jacoco-maven-plugin:0.7.4.201502262128:prepare-agent-integration (prepare-integration-tests) @ org.eclipse.birt.report.model.tests ---
[INFO] tycho.testArgLine set to -javaagent:/opt/public/hipp/homes/genie.birt/.m2/repository/org/jacoco/org.jacoco.agent/0.7.4.201502262128/org.jacoco.agent-0.7.4.201502262128-runtime.jar=destfile=/jobs/genie.birt/derp/workspace/model/org.eclipse.birt.report.model.tests/target/coverage/jacoco-integration.exec,append=true,output=file
[INFO] 
[INFO] --- tycho-surefire-plugin:0.21.0:test (default-test) @ org.eclipse.birt.report.model.tests ---
[INFO] Skipping tests
[INFO] 
[INFO] --- jacoco-maven-plugin:0.7.4.201502262128:report-integration (report-integration) @ org.eclipse.birt.report.model.tests ---
[INFO] Skipping JaCoCo execution due to missing execution data file:/jobs/genie.birt/derp/workspace/model/org.eclipse.birt.report.model.tests/target/coverage/jacoco-integration.exec
[INFO] 
[INFO] --- maven-install-plugin:2.3.1:install (default-install) @ org.eclipse.birt.report.model.tests ---
[INFO] Installing /jobs/genie.birt/derp/workspace/model/org.eclipse.birt.report.model.tests/target/org.eclipse.birt.report.model.tests-4.5.0-SNAPSHOT.jar to /opt/public/hipp/homes/genie.birt/.m2/repository/org/eclipse/birt/org.eclipse.birt.report.model.tests/4.5.0-SNAPSHOT/org.eclipse.birt.report.model.tests-4.5.0-SNAPSHOT.jar
[INFO] Installing /jobs/genie.birt/derp/workspace/model/org.eclipse.birt.report.model.tests/pom.xml to /opt/public/hipp/homes/genie.birt/.m2/repository/org/eclipse/birt/org.eclipse.birt.report.model.tests/4.5.0-SNAPSHOT/org.eclipse.birt.report.model.tests-4.5.0-SNAPSHOT.pom
[INFO] Installing /jobs/genie.birt/derp/workspace/model/org.eclipse.birt.report.model.tests/target/org.eclipse.birt.report.model.tests-4.5.0-SNAPSHOT-sources.jar to /opt/public/hipp/homes/genie.birt/.m2/repository/org/eclipse/birt/org.eclipse.birt.report.model.tests/4.5.0-SNAPSHOT/org.eclipse.birt.report.model.tests-4.5.0-SNAPSHOT-sources.jar
[INFO] Installing /jobs/genie.birt/derp/workspace/model/org.eclipse.birt.report.model.tests/target/org.eclipse.birt.report.model.tests-4.5.0-SNAPSHOT.jar.pack.gz to /opt/public/hipp/homes/genie.birt/.m2/repository/org/eclipse/birt/org.eclipse.birt.report.model.tests/4.5.0-SNAPSHOT/org.eclipse.birt.report.model.tests-4.5.0-SNAPSHOT-pack200.jar.pack.gz
[INFO] Installing /jobs/genie.birt/derp/workspace/model/org.eclipse.birt.report.model.tests/target/p2content.xml to /opt/public/hipp/homes/genie.birt/.m2/repository/org/eclipse/birt/org.eclipse.birt.report.model.tests/4.5.0-SNAPSHOT/org.eclipse.birt.report.model.tests-4.5.0-SNAPSHOT-p2metadata.xml
[INFO] Installing /jobs/genie.birt/derp/workspace/model/org.eclipse.birt.report.model.tests/target/p2artifacts.xml to /opt/public/hipp/homes/genie.birt/.m2/repository/org/eclipse/birt/org.eclipse.birt.report.model.tests/4.5.0-SNAPSHOT/org.eclipse.birt.report.model.tests-4.5.0-SNAPSHOT-p2artifacts.xml
[INFO] 
[INFO] --- tycho-p2-plugin:0.21.0:update-local-index (default-update-local-index) @ org.eclipse.birt.report.model.tests ---
[INFO]                                                                         
[INFO] ------------------------------------------------------------------------
[INFO] Building org.eclipse.birt.tests.core 4.5.0-SNAPSHOT
[INFO] ------------------------------------------------------------------------
[INFO] 
[INFO] --- maven-clean-plugin:2.5:clean (default-clean) @ org.eclipse.birt.tests.core ---
[INFO] 
[INFO] --- tycho-packaging-plugin:0.21.0:build-qualifier (default-build-qualifier) @ org.eclipse.birt.tests.core ---
[INFO] The project's OSGi version is 4.5.0.v201510220855
[INFO] 
[INFO] --- tycho-packaging-plugin:0.21.0:validate-id (default-validate-id) @ org.eclipse.birt.tests.core ---
[INFO] 
[INFO] --- tycho-packaging-plugin:0.21.0:validate-version (default-validate-version) @ org.eclipse.birt.tests.core ---
[INFO] 
[INFO] --- maven-toolchains-plugin:1.1:toolchain (default) @ org.eclipse.birt.tests.core ---
[INFO] Required toolchain: jdk [ id='JavaSE-1.7' ]
[INFO] Found matching toolchain for type jdk: JDK[/opt/public/common/jdk1.7.0-latest/jre]
[INFO] 
[INFO] --- maven-resources-plugin:2.6:resources (default-resources) @ org.eclipse.birt.tests.core ---
[INFO] Using 'UTF-8' encoding to copy filtered resources.
[INFO] skip non existing resourceDirectory /jobs/genie.birt/derp/workspace/testsuites/org.eclipse.birt.tests.core/src/main/resources
[INFO] 
[INFO] --- tycho-compiler-plugin:0.21.0:compile (default-compile) @ org.eclipse.birt.tests.core ---
[INFO] Compiling 8 source files to /jobs/genie.birt/derp/workspace/testsuites/org.eclipse.birt.tests.core/target/classes
[INFO] 
[INFO] --- maven-resources-plugin:2.6:testResources (default-testResources) @ org.eclipse.birt.tests.core ---
[INFO] Not copying test resources
[INFO] 
[INFO] --- tycho-source-plugin:0.21.0:plugin-source (plugin-source) @ org.eclipse.birt.tests.core ---
[WARNING] bundle localization file /jobs/genie.birt/derp/workspace/testsuites/org.eclipse.birt.tests.core/plugin.properties not found
[INFO] Building jar: /jobs/genie.birt/derp/workspace/testsuites/org.eclipse.birt.tests.core/target/org.eclipse.birt.tests.core-4.5.0-SNAPSHOT-sources.jar
[INFO] 
[INFO] --- maven-resources-plugin:2.6:copy-resources (process-about.mappings) @ org.eclipse.birt.tests.core ---
[INFO] Using 'UTF-8' encoding to copy filtered resources.
[INFO] Copying 0 resource
[INFO] 
[INFO] --- target-platform-configuration:0.21.0:target-platform (default-target-platform) @ org.eclipse.birt.tests.core ---
[INFO] 
[INFO] --- tycho-packaging-plugin:0.21.0:package-plugin (default-package-plugin) @ org.eclipse.birt.tests.core ---
[INFO] Building jar: /jobs/genie.birt/derp/workspace/testsuites/org.eclipse.birt.tests.core/utility.jar
[INFO] Building jar: /jobs/genie.birt/derp/workspace/testsuites/org.eclipse.birt.tests.core/target/org.eclipse.birt.tests.core-4.5.0-SNAPSHOT.jar
[INFO] 
[INFO] --- tycho-p2-plugin:0.21.0:p2-metadata-default (default-p2-metadata-default) @ org.eclipse.birt.tests.core ---
[INFO] 
[INFO] --- tycho-pack200a-plugin:0.21.0:normalize (pack200-normalize) @ org.eclipse.birt.tests.core ---
[INFO] Pack200 normalizing jar /jobs/genie.birt/derp/workspace/testsuites/org.eclipse.birt.tests.core/target/org.eclipse.birt.tests.core-4.5.0-SNAPSHOT.jar
[INFO] 
[INFO] --- eclipse-jarsigner-plugin:1.1.2:sign (sign) @ org.eclipse.birt.tests.core ---
[INFO] Searching org.eclipse.birt.tests.core-4.5.0-SNAPSHOT.jar for inner jars...
[INFO] Signed org.eclipse.birt:org.eclipse.birt.tests.core:eclipse-test-plugin:4.5.0-SNAPSHOT in 2 seconds.
[INFO] Searching org.eclipse.birt.tests.core-4.5.0-SNAPSHOT-sources.jar for inner jars...
[INFO] Signed org.eclipse.birt:org.eclipse.birt.tests.core:java-source:sources:4.5.0-SNAPSHOT in 3 seconds.
[INFO] 
[INFO] --- tycho-pack200b-plugin:0.21.0:pack (pack200-pack) @ org.eclipse.birt.tests.core ---
[INFO] Pack200 packing jar /jobs/genie.birt/derp/workspace/testsuites/org.eclipse.birt.tests.core/target/org.eclipse.birt.tests.core-4.5.0-SNAPSHOT.jar
[INFO] 
[INFO] --- tycho-p2-plugin:0.21.0:p2-metadata (attached-p2-metadata) @ org.eclipse.birt.tests.core ---
[INFO] 
[INFO] --- jacoco-maven-plugin:0.7.4.201502262128:prepare-agent-integration (prepare-integration-tests) @ org.eclipse.birt.tests.core ---
[INFO] tycho.testArgLine set to -javaagent:/opt/public/hipp/homes/genie.birt/.m2/repository/org/jacoco/org.jacoco.agent/0.7.4.201502262128/org.jacoco.agent-0.7.4.201502262128-runtime.jar=destfile=/jobs/genie.birt/derp/workspace/testsuites/org.eclipse.birt.tests.core/target/coverage/jacoco-integration.exec,append=true,output=file
[INFO] 
[INFO] --- tycho-surefire-plugin:0.21.0:test (default-test) @ org.eclipse.birt.tests.core ---
[INFO] Skipping tests
[INFO] 
[INFO] --- jacoco-maven-plugin:0.7.4.201502262128:report-integration (report-integration) @ org.eclipse.birt.tests.core ---
[INFO] Skipping JaCoCo execution due to missing execution data file:/jobs/genie.birt/derp/workspace/testsuites/org.eclipse.birt.tests.core/target/coverage/jacoco-integration.exec
[INFO] 
[INFO] --- maven-install-plugin:2.3.1:install (default-install) @ org.eclipse.birt.tests.core ---
[INFO] Installing /jobs/genie.birt/derp/workspace/testsuites/org.eclipse.birt.tests.core/target/org.eclipse.birt.tests.core-4.5.0-SNAPSHOT.jar to /opt/public/hipp/homes/genie.birt/.m2/repository/org/eclipse/birt/org.eclipse.birt.tests.core/4.5.0-SNAPSHOT/org.eclipse.birt.tests.core-4.5.0-SNAPSHOT.jar
[INFO] Installing /jobs/genie.birt/derp/workspace/testsuites/org.eclipse.birt.tests.core/pom.xml to /opt/public/hipp/homes/genie.birt/.m2/repository/org/eclipse/birt/org.eclipse.birt.tests.core/4.5.0-SNAPSHOT/org.eclipse.birt.tests.core-4.5.0-SNAPSHOT.pom
[INFO] Installing /jobs/genie.birt/derp/workspace/testsuites/org.eclipse.birt.tests.core/target/org.eclipse.birt.tests.core-4.5.0-SNAPSHOT-sources.jar to /opt/public/hipp/homes/genie.birt/.m2/repository/org/eclipse/birt/org.eclipse.birt.tests.core/4.5.0-SNAPSHOT/org.eclipse.birt.tests.core-4.5.0-SNAPSHOT-sources.jar
[INFO] Installing /jobs/genie.birt/derp/workspace/testsuites/org.eclipse.birt.tests.core/target/org.eclipse.birt.tests.core-4.5.0-SNAPSHOT.jar.pack.gz to /opt/public/hipp/homes/genie.birt/.m2/repository/org/eclipse/birt/org.eclipse.birt.tests.core/4.5.0-SNAPSHOT/org.eclipse.birt.tests.core-4.5.0-SNAPSHOT-pack200.jar.pack.gz
[INFO] Installing /jobs/genie.birt/derp/workspace/testsuites/org.eclipse.birt.tests.core/target/p2content.xml to /opt/public/hipp/homes/genie.birt/.m2/repository/org/eclipse/birt/org.eclipse.birt.tests.core/4.5.0-SNAPSHOT/org.eclipse.birt.tests.core-4.5.0-SNAPSHOT-p2metadata.xml
[INFO] Installing /jobs/genie.birt/derp/workspace/testsuites/org.eclipse.birt.tests.core/target/p2artifacts.xml to /opt/public/hipp/homes/genie.birt/.m2/repository/org/eclipse/birt/org.eclipse.birt.tests.core/4.5.0-SNAPSHOT/org.eclipse.birt.tests.core-4.5.0-SNAPSHOT-p2artifacts.xml
[INFO] 
[INFO] --- tycho-p2-plugin:0.21.0:update-local-index (default-update-local-index) @ org.eclipse.birt.tests.core ---
[INFO]                                                                         
[INFO] ------------------------------------------------------------------------
[INFO] Building org.eclipse.birt.report.tests.chart 4.5.0-SNAPSHOT
[INFO] ------------------------------------------------------------------------
[INFO] 
[INFO] --- maven-clean-plugin:2.5:clean (default-clean) @ org.eclipse.birt.report.tests.chart ---
[INFO] 
[INFO] --- tycho-packaging-plugin:0.21.0:build-qualifier (default-build-qualifier) @ org.eclipse.birt.report.tests.chart ---
[INFO] The project's OSGi version is 4.5.0.v201510220855
[INFO] 
[INFO] --- tycho-packaging-plugin:0.21.0:validate-id (default-validate-id) @ org.eclipse.birt.report.tests.chart ---
[INFO] 
[INFO] --- tycho-packaging-plugin:0.21.0:validate-version (default-validate-version) @ org.eclipse.birt.report.tests.chart ---
[INFO] 
[INFO] --- maven-toolchains-plugin:1.1:toolchain (default) @ org.eclipse.birt.report.tests.chart ---
[INFO] Required toolchain: jdk [ id='JavaSE-1.7' ]
[INFO] Found matching toolchain for type jdk: JDK[/opt/public/common/jdk1.7.0-latest/jre]
[INFO] 
[INFO] --- maven-resources-plugin:2.6:resources (default-resources) @ org.eclipse.birt.report.tests.chart ---
[INFO] Using 'UTF-8' encoding to copy filtered resources.
[INFO] skip non existing resourceDirectory /jobs/genie.birt/derp/workspace/testsuites/org.eclipse.birt.report.tests.chart/src/main/resources
[INFO] 
[INFO] --- tycho-compiler-plugin:0.21.0:compile (default-compile) @ org.eclipse.birt.report.tests.chart ---
[INFO] Compiling 149 source files to /jobs/genie.birt/derp/workspace/testsuites/org.eclipse.birt.report.tests.chart/target/classes
[INFO] 
[INFO] --- maven-resources-plugin:2.6:testResources (default-testResources) @ org.eclipse.birt.report.tests.chart ---
[INFO] Not copying test resources
[INFO] 
[INFO] --- tycho-source-plugin:0.21.0:plugin-source (plugin-source) @ org.eclipse.birt.report.tests.chart ---
[WARNING] bundle localization file /jobs/genie.birt/derp/workspace/testsuites/org.eclipse.birt.report.tests.chart/plugin.properties not found
[INFO] Building jar: /jobs/genie.birt/derp/workspace/testsuites/org.eclipse.birt.report.tests.chart/target/org.eclipse.birt.report.tests.chart-4.5.0-SNAPSHOT-sources.jar
[INFO] 
[INFO] --- maven-resources-plugin:2.6:copy-resources (process-about.mappings) @ org.eclipse.birt.report.tests.chart ---
[INFO] Using 'UTF-8' encoding to copy filtered resources.
[INFO] Copying 0 resource
[INFO] 
[INFO] --- target-platform-configuration:0.21.0:target-platform (default-target-platform) @ org.eclipse.birt.report.tests.chart ---
[INFO] 
[INFO] --- tycho-packaging-plugin:0.21.0:package-plugin (default-package-plugin) @ org.eclipse.birt.report.tests.chart ---
[INFO] Building jar: /jobs/genie.birt/derp/workspace/testsuites/org.eclipse.birt.report.tests.chart/test-chart.jar
[INFO] Building jar: /jobs/genie.birt/derp/workspace/testsuites/org.eclipse.birt.report.tests.chart/target/org.eclipse.birt.report.tests.chart-4.5.0-SNAPSHOT.jar
[INFO] 
[INFO] --- tycho-p2-plugin:0.21.0:p2-metadata-default (default-p2-metadata-default) @ org.eclipse.birt.report.tests.chart ---
[INFO] 
[INFO] --- tycho-pack200a-plugin:0.21.0:normalize (pack200-normalize) @ org.eclipse.birt.report.tests.chart ---
[INFO] Pack200 normalizing jar /jobs/genie.birt/derp/workspace/testsuites/org.eclipse.birt.report.tests.chart/target/org.eclipse.birt.report.tests.chart-4.5.0-SNAPSHOT.jar
[INFO] 
[INFO] --- eclipse-jarsigner-plugin:1.1.2:sign (sign) @ org.eclipse.birt.report.tests.chart ---
[INFO] Searching org.eclipse.birt.report.tests.chart-4.5.0-SNAPSHOT.jar for inner jars...
[INFO] Signed org.eclipse.birt:org.eclipse.birt.report.tests.chart:eclipse-test-plugin:4.5.0-SNAPSHOT in 4 seconds.
[INFO] Searching org.eclipse.birt.report.tests.chart-4.5.0-SNAPSHOT-sources.jar for inner jars...
[INFO] Signed org.eclipse.birt:org.eclipse.birt.report.tests.chart:java-source:sources:4.5.0-SNAPSHOT in 3 seconds.
[INFO] 
[INFO] --- tycho-pack200b-plugin:0.21.0:pack (pack200-pack) @ org.eclipse.birt.report.tests.chart ---
[INFO] Pack200 packing jar /jobs/genie.birt/derp/workspace/testsuites/org.eclipse.birt.report.tests.chart/target/org.eclipse.birt.report.tests.chart-4.5.0-SNAPSHOT.jar
[INFO] 
[INFO] --- tycho-p2-plugin:0.21.0:p2-metadata (attached-p2-metadata) @ org.eclipse.birt.report.tests.chart ---
[INFO] 
[INFO] --- jacoco-maven-plugin:0.7.4.201502262128:prepare-agent-integration (prepare-integration-tests) @ org.eclipse.birt.report.tests.chart ---
[INFO] tycho.testArgLine set to -javaagent:/opt/public/hipp/homes/genie.birt/.m2/repository/org/jacoco/org.jacoco.agent/0.7.4.201502262128/org.jacoco.agent-0.7.4.201502262128-runtime.jar=destfile=/jobs/genie.birt/derp/workspace/testsuites/org.eclipse.birt.report.tests.chart/target/coverage/jacoco-integration.exec,append=true,output=file
[INFO] 
[INFO] --- tycho-surefire-plugin:0.21.0:test (default-test) @ org.eclipse.birt.report.tests.chart ---
[INFO] Skipping tests
[INFO] 
[INFO] --- jacoco-maven-plugin:0.7.4.201502262128:report-integration (report-integration) @ org.eclipse.birt.report.tests.chart ---
[INFO] Skipping JaCoCo execution due to missing execution data file:/jobs/genie.birt/derp/workspace/testsuites/org.eclipse.birt.report.tests.chart/target/coverage/jacoco-integration.exec
[INFO] 
[INFO] --- maven-install-plugin:2.3.1:install (default-install) @ org.eclipse.birt.report.tests.chart ---
[INFO] Installing /jobs/genie.birt/derp/workspace/testsuites/org.eclipse.birt.report.tests.chart/target/org.eclipse.birt.report.tests.chart-4.5.0-SNAPSHOT.jar to /opt/public/hipp/homes/genie.birt/.m2/repository/org/eclipse/birt/org.eclipse.birt.report.tests.chart/4.5.0-SNAPSHOT/org.eclipse.birt.report.tests.chart-4.5.0-SNAPSHOT.jar
[INFO] Installing /jobs/genie.birt/derp/workspace/testsuites/org.eclipse.birt.report.tests.chart/pom.xml to /opt/public/hipp/homes/genie.birt/.m2/repository/org/eclipse/birt/org.eclipse.birt.report.tests.chart/4.5.0-SNAPSHOT/org.eclipse.birt.report.tests.chart-4.5.0-SNAPSHOT.pom
[INFO] Installing /jobs/genie.birt/derp/workspace/testsuites/org.eclipse.birt.report.tests.chart/target/org.eclipse.birt.report.tests.chart-4.5.0-SNAPSHOT-sources.jar to /opt/public/hipp/homes/genie.birt/.m2/repository/org/eclipse/birt/org.eclipse.birt.report.tests.chart/4.5.0-SNAPSHOT/org.eclipse.birt.report.tests.chart-4.5.0-SNAPSHOT-sources.jar
[INFO] Installing /jobs/genie.birt/derp/workspace/testsuites/org.eclipse.birt.report.tests.chart/target/org.eclipse.birt.report.tests.chart-4.5.0-SNAPSHOT.jar.pack.gz to /opt/public/hipp/homes/genie.birt/.m2/repository/org/eclipse/birt/org.eclipse.birt.report.tests.chart/4.5.0-SNAPSHOT/org.eclipse.birt.report.tests.chart-4.5.0-SNAPSHOT-pack200.jar.pack.gz
[INFO] Installing /jobs/genie.birt/derp/workspace/testsuites/org.eclipse.birt.report.tests.chart/target/p2content.xml to /opt/public/hipp/homes/genie.birt/.m2/repository/org/eclipse/birt/org.eclipse.birt.report.tests.chart/4.5.0-SNAPSHOT/org.eclipse.birt.report.tests.chart-4.5.0-SNAPSHOT-p2metadata.xml
[INFO] Installing /jobs/genie.birt/derp/workspace/testsuites/org.eclipse.birt.report.tests.chart/target/p2artifacts.xml to /opt/public/hipp/homes/genie.birt/.m2/repository/org/eclipse/birt/org.eclipse.birt.report.tests.chart/4.5.0-SNAPSHOT/org.eclipse.birt.report.tests.chart-4.5.0-SNAPSHOT-p2artifacts.xml
[INFO] 
[INFO] --- tycho-p2-plugin:0.21.0:update-local-index (default-update-local-index) @ org.eclipse.birt.report.tests.chart ---
[INFO]                                                                         
[INFO] ------------------------------------------------------------------------
[INFO] Building org.eclipse.birt.testsuites-parent 0.0.1-SNAPSHOT
[INFO] ------------------------------------------------------------------------
[INFO] 
[INFO] --- maven-clean-plugin:2.5:clean (default-clean) @ org.eclipse.birt.testsuites-parent ---
[INFO] 
[INFO] --- maven-toolchains-plugin:1.1:toolchain (default) @ org.eclipse.birt.testsuites-parent ---
[INFO] Required toolchain: jdk [ id='JavaSE-1.7' ]
[INFO] Found matching toolchain for type jdk: JDK[/opt/public/common/jdk1.7.0-latest/jre]
[INFO] 
[INFO] --- tycho-source-plugin:0.21.0:plugin-source (plugin-source) @ org.eclipse.birt.testsuites-parent ---
[INFO] 
[INFO] --- maven-resources-plugin:2.6:copy-resources (process-about.mappings) @ org.eclipse.birt.testsuites-parent ---
[INFO] Using 'UTF-8' encoding to copy filtered resources.
[INFO] Copying 0 resource
[INFO] 
[INFO] --- tycho-pack200a-plugin:0.21.0:normalize (pack200-normalize) @ org.eclipse.birt.testsuites-parent ---
[INFO] 
[INFO] --- eclipse-jarsigner-plugin:1.1.2:sign (sign) @ org.eclipse.birt.testsuites-parent ---
[INFO] 
[INFO] --- tycho-pack200b-plugin:0.21.0:pack (pack200-pack) @ org.eclipse.birt.testsuites-parent ---
[INFO] 
[INFO] --- jacoco-maven-plugin:0.7.4.201502262128:prepare-agent-integration (prepare-integration-tests) @ org.eclipse.birt.testsuites-parent ---
[INFO] argLine set to -javaagent:/opt/public/hipp/homes/genie.birt/.m2/repository/org/jacoco/org.jacoco.agent/0.7.4.201502262128/org.jacoco.agent-0.7.4.201502262128-runtime.jar=destfile=/jobs/genie.birt/derp/workspace/testsuites/target/coverage/jacoco-integration.exec,append=true,output=file
[INFO] 
[INFO] --- jacoco-maven-plugin:0.7.4.201502262128:report-integration (report-integration) @ org.eclipse.birt.testsuites-parent ---
[INFO] Skipping JaCoCo execution due to missing execution data file:/jobs/genie.birt/derp/workspace/testsuites/target/coverage/jacoco-integration.exec
[INFO] 
[INFO] --- maven-install-plugin:2.4:install (default-install) @ org.eclipse.birt.testsuites-parent ---
[INFO] Installing /jobs/genie.birt/derp/workspace/testsuites/pom.xml to /opt/public/hipp/homes/genie.birt/.m2/repository/org/eclipse/birt/testsuites/org.eclipse.birt.testsuites-parent/0.0.1-SNAPSHOT/org.eclipse.birt.testsuites-parent-0.0.1-SNAPSHOT.pom
[INFO]                                                                         
[INFO] ------------------------------------------------------------------------
[INFO] Building org.eclipse.birt.report.tests.engine 4.5.0-SNAPSHOT
[INFO] ------------------------------------------------------------------------
[INFO] 
[INFO] --- maven-clean-plugin:2.5:clean (default-clean) @ org.eclipse.birt.report.tests.engine ---
[INFO] 
[INFO] --- tycho-packaging-plugin:0.21.0:build-qualifier (default-build-qualifier) @ org.eclipse.birt.report.tests.engine ---
[INFO] The project's OSGi version is 4.5.0.v201510220855
[INFO] 
[INFO] --- tycho-packaging-plugin:0.21.0:validate-id (default-validate-id) @ org.eclipse.birt.report.tests.engine ---
[INFO] 
[INFO] --- tycho-packaging-plugin:0.21.0:validate-version (default-validate-version) @ org.eclipse.birt.report.tests.engine ---
[INFO] 
[INFO] --- maven-toolchains-plugin:1.1:toolchain (default) @ org.eclipse.birt.report.tests.engine ---
[INFO] Required toolchain: jdk [ id='JavaSE-1.7' ]
[INFO] Found matching toolchain for type jdk: JDK[/opt/public/common/jdk1.7.0-latest/jre]
[INFO] 
[INFO] --- maven-resources-plugin:2.6:resources (default-resources) @ org.eclipse.birt.report.tests.engine ---
[INFO] Using 'UTF-8' encoding to copy filtered resources.
[INFO] skip non existing resourceDirectory /jobs/genie.birt/derp/workspace/testsuites/org.eclipse.birt.report.tests.engine/src/main/resources
[INFO] 
[INFO] --- tycho-compiler-plugin:0.21.0:compile (default-compile) @ org.eclipse.birt.report.tests.engine ---
[INFO] Compiling 43 source files to /jobs/genie.birt/derp/workspace/testsuites/org.eclipse.birt.report.tests.engine/target/classes
[INFO] 
[INFO] --- maven-resources-plugin:2.6:testResources (default-testResources) @ org.eclipse.birt.report.tests.engine ---
[INFO] Not copying test resources
[INFO] 
[INFO] --- tycho-source-plugin:0.21.0:plugin-source (plugin-source) @ org.eclipse.birt.report.tests.engine ---
[WARNING] bundle localization file /jobs/genie.birt/derp/workspace/testsuites/org.eclipse.birt.report.tests.engine/plugin.properties not found
[INFO] Building jar: /jobs/genie.birt/derp/workspace/testsuites/org.eclipse.birt.report.tests.engine/target/org.eclipse.birt.report.tests.engine-4.5.0-SNAPSHOT-sources.jar
[INFO] 
[INFO] --- maven-resources-plugin:2.6:copy-resources (process-about.mappings) @ org.eclipse.birt.report.tests.engine ---
[INFO] Using 'UTF-8' encoding to copy filtered resources.
[INFO] Copying 0 resource
[INFO] 
[INFO] --- target-platform-configuration:0.21.0:target-platform (default-target-platform) @ org.eclipse.birt.report.tests.engine ---
[INFO] 
[INFO] --- tycho-packaging-plugin:0.21.0:package-plugin (default-package-plugin) @ org.eclipse.birt.report.tests.engine ---
[INFO] Building jar: /jobs/genie.birt/derp/workspace/testsuites/org.eclipse.birt.report.tests.engine/test-engine.jar
[INFO] Building jar: /jobs/genie.birt/derp/workspace/testsuites/org.eclipse.birt.report.tests.engine/target/org.eclipse.birt.report.tests.engine-4.5.0-SNAPSHOT.jar
[INFO] 
[INFO] --- tycho-p2-plugin:0.21.0:p2-metadata-default (default-p2-metadata-default) @ org.eclipse.birt.report.tests.engine ---
[INFO] 
[INFO] --- tycho-pack200a-plugin:0.21.0:normalize (pack200-normalize) @ org.eclipse.birt.report.tests.engine ---
[INFO] Pack200 normalizing jar /jobs/genie.birt/derp/workspace/testsuites/org.eclipse.birt.report.tests.engine/target/org.eclipse.birt.report.tests.engine-4.5.0-SNAPSHOT.jar
[INFO] 
[INFO] --- eclipse-jarsigner-plugin:1.1.2:sign (sign) @ org.eclipse.birt.report.tests.engine ---
[INFO] Searching org.eclipse.birt.report.tests.engine-4.5.0-SNAPSHOT.jar for inner jars...
[INFO] Signed org.eclipse.birt:org.eclipse.birt.report.tests.engine:eclipse-test-plugin:4.5.0-SNAPSHOT in 1 seconds.
[INFO] Searching org.eclipse.birt.report.tests.engine-4.5.0-SNAPSHOT-sources.jar for inner jars...
[INFO] Signed org.eclipse.birt:org.eclipse.birt.report.tests.engine:java-source:sources:4.5.0-SNAPSHOT in 3 seconds.
[INFO] 
[INFO] --- tycho-pack200b-plugin:0.21.0:pack (pack200-pack) @ org.eclipse.birt.report.tests.engine ---
[INFO] Pack200 packing jar /jobs/genie.birt/derp/workspace/testsuites/org.eclipse.birt.report.tests.engine/target/org.eclipse.birt.report.tests.engine-4.5.0-SNAPSHOT.jar
[INFO] 
[INFO] --- tycho-p2-plugin:0.21.0:p2-metadata (attached-p2-metadata) @ org.eclipse.birt.report.tests.engine ---
[INFO] 
[INFO] --- jacoco-maven-plugin:0.7.4.201502262128:prepare-agent-integration (prepare-integration-tests) @ org.eclipse.birt.report.tests.engine ---
[INFO] tycho.testArgLine set to -javaagent:/opt/public/hipp/homes/genie.birt/.m2/repository/org/jacoco/org.jacoco.agent/0.7.4.201502262128/org.jacoco.agent-0.7.4.201502262128-runtime.jar=destfile=/jobs/genie.birt/derp/workspace/testsuites/org.eclipse.birt.report.tests.engine/target/coverage/jacoco-integration.exec,append=true,output=file
[INFO] 
[INFO] --- tycho-surefire-plugin:0.21.0:test (default-test) @ org.eclipse.birt.report.tests.engine ---
[INFO] Skipping tests
[INFO] 
[INFO] --- jacoco-maven-plugin:0.7.4.201502262128:report-integration (report-integration) @ org.eclipse.birt.report.tests.engine ---
[INFO] Skipping JaCoCo execution due to missing execution data file:/jobs/genie.birt/derp/workspace/testsuites/org.eclipse.birt.report.tests.engine/target/coverage/jacoco-integration.exec
[INFO] 
[INFO] --- maven-install-plugin:2.3.1:install (default-install) @ org.eclipse.birt.report.tests.engine ---
[INFO] Installing /jobs/genie.birt/derp/workspace/testsuites/org.eclipse.birt.report.tests.engine/target/org.eclipse.birt.report.tests.engine-4.5.0-SNAPSHOT.jar to /opt/public/hipp/homes/genie.birt/.m2/repository/org/eclipse/birt/org.eclipse.birt.report.tests.engine/4.5.0-SNAPSHOT/org.eclipse.birt.report.tests.engine-4.5.0-SNAPSHOT.jar
[INFO] Installing /jobs/genie.birt/derp/workspace/testsuites/org.eclipse.birt.report.tests.engine/pom.xml to /opt/public/hipp/homes/genie.birt/.m2/repository/org/eclipse/birt/org.eclipse.birt.report.tests.engine/4.5.0-SNAPSHOT/org.eclipse.birt.report.tests.engine-4.5.0-SNAPSHOT.pom
[INFO] Installing /jobs/genie.birt/derp/workspace/testsuites/org.eclipse.birt.report.tests.engine/target/org.eclipse.birt.report.tests.engine-4.5.0-SNAPSHOT-sources.jar to /opt/public/hipp/homes/genie.birt/.m2/repository/org/eclipse/birt/org.eclipse.birt.report.tests.engine/4.5.0-SNAPSHOT/org.eclipse.birt.report.tests.engine-4.5.0-SNAPSHOT-sources.jar
[INFO] Installing /jobs/genie.birt/derp/workspace/testsuites/org.eclipse.birt.report.tests.engine/target/org.eclipse.birt.report.tests.engine-4.5.0-SNAPSHOT.jar.pack.gz to /opt/public/hipp/homes/genie.birt/.m2/repository/org/eclipse/birt/org.eclipse.birt.report.tests.engine/4.5.0-SNAPSHOT/org.eclipse.birt.report.tests.engine-4.5.0-SNAPSHOT-pack200.jar.pack.gz
[INFO] Installing /jobs/genie.birt/derp/workspace/testsuites/org.eclipse.birt.report.tests.engine/target/p2content.xml to /opt/public/hipp/homes/genie.birt/.m2/repository/org/eclipse/birt/org.eclipse.birt.report.tests.engine/4.5.0-SNAPSHOT/org.eclipse.birt.report.tests.engine-4.5.0-SNAPSHOT-p2metadata.xml
[INFO] Installing /jobs/genie.birt/derp/workspace/testsuites/org.eclipse.birt.report.tests.engine/target/p2artifacts.xml to /opt/public/hipp/homes/genie.birt/.m2/repository/org/eclipse/birt/org.eclipse.birt.report.tests.engine/4.5.0-SNAPSHOT/org.eclipse.birt.report.tests.engine-4.5.0-SNAPSHOT-p2artifacts.xml
[INFO] 
[INFO] --- tycho-p2-plugin:0.21.0:update-local-index (default-update-local-index) @ org.eclipse.birt.report.tests.engine ---
[INFO]                                                                         
[INFO] ------------------------------------------------------------------------
[INFO] Building org.eclipse.birt.report.tests.engine.emitter.html 4.5.0-SNAPSHOT
[INFO] ------------------------------------------------------------------------
[INFO] 
[INFO] --- maven-clean-plugin:2.5:clean (default-clean) @ org.eclipse.birt.report.tests.engine.emitter.html ---
[INFO] 
[INFO] --- tycho-packaging-plugin:0.21.0:build-qualifier (default-build-qualifier) @ org.eclipse.birt.report.tests.engine.emitter.html ---
[INFO] The project's OSGi version is 4.5.0.v201510220855
[INFO] 
[INFO] --- tycho-packaging-plugin:0.21.0:validate-id (default-validate-id) @ org.eclipse.birt.report.tests.engine.emitter.html ---
[INFO] 
[INFO] --- tycho-packaging-plugin:0.21.0:validate-version (default-validate-version) @ org.eclipse.birt.report.tests.engine.emitter.html ---
[INFO] 
[INFO] --- maven-toolchains-plugin:1.1:toolchain (default) @ org.eclipse.birt.report.tests.engine.emitter.html ---
[INFO] Required toolchain: jdk [ id='JavaSE-1.7' ]
[INFO] Found matching toolchain for type jdk: JDK[/opt/public/common/jdk1.7.0-latest/jre]
[INFO] 
[INFO] --- maven-resources-plugin:2.6:resources (default-resources) @ org.eclipse.birt.report.tests.engine.emitter.html ---
[INFO] Using 'UTF-8' encoding to copy filtered resources.
[INFO] skip non existing resourceDirectory /jobs/genie.birt/derp/workspace/testsuites/org.eclipse.birt.report.tests.engine.emitter.html/src/main/resources
[INFO] 
[INFO] --- tycho-compiler-plugin:0.21.0:compile (default-compile) @ org.eclipse.birt.report.tests.engine.emitter.html ---
[INFO] Compiling 1 source file to /jobs/genie.birt/derp/workspace/testsuites/org.eclipse.birt.report.tests.engine.emitter.html/target/classes
[INFO] 
[INFO] --- maven-resources-plugin:2.6:testResources (default-testResources) @ org.eclipse.birt.report.tests.engine.emitter.html ---
[INFO] Not copying test resources
[INFO] 
[INFO] --- tycho-source-plugin:0.21.0:plugin-source (plugin-source) @ org.eclipse.birt.report.tests.engine.emitter.html ---
[WARNING] bundle localization file /jobs/genie.birt/derp/workspace/testsuites/org.eclipse.birt.report.tests.engine.emitter.html/plugin.properties not found
[INFO] Building jar: /jobs/genie.birt/derp/workspace/testsuites/org.eclipse.birt.report.tests.engine.emitter.html/target/org.eclipse.birt.report.tests.engine.emitter.html-4.5.0-SNAPSHOT-sources.jar
[INFO] 
[INFO] --- maven-resources-plugin:2.6:copy-resources (process-about.mappings) @ org.eclipse.birt.report.tests.engine.emitter.html ---
[INFO] Using 'UTF-8' encoding to copy filtered resources.
[INFO] Copying 0 resource
[INFO] 
[INFO] --- target-platform-configuration:0.21.0:target-platform (default-target-platform) @ org.eclipse.birt.report.tests.engine.emitter.html ---
[INFO] 
[INFO] --- tycho-packaging-plugin:0.21.0:package-plugin (default-package-plugin) @ org.eclipse.birt.report.tests.engine.emitter.html ---
[INFO] Building jar: /jobs/genie.birt/derp/workspace/testsuites/org.eclipse.birt.report.tests.engine.emitter.html/target/org.eclipse.birt.report.tests.engine.emitter.html-4.5.0-SNAPSHOT.jar
[INFO] 
[INFO] --- tycho-p2-plugin:0.21.0:p2-metadata-default (default-p2-metadata-default) @ org.eclipse.birt.report.tests.engine.emitter.html ---
[INFO] 
[INFO] --- tycho-pack200a-plugin:0.21.0:normalize (pack200-normalize) @ org.eclipse.birt.report.tests.engine.emitter.html ---
[INFO] Pack200 normalizing jar /jobs/genie.birt/derp/workspace/testsuites/org.eclipse.birt.report.tests.engine.emitter.html/target/org.eclipse.birt.report.tests.engine.emitter.html-4.5.0-SNAPSHOT.jar
[INFO] 
[INFO] --- eclipse-jarsigner-plugin:1.1.2:sign (sign) @ org.eclipse.birt.report.tests.engine.emitter.html ---
[INFO] Searching org.eclipse.birt.report.tests.engine.emitter.html-4.5.0-SNAPSHOT.jar for inner jars...
[INFO] Signed org.eclipse.birt:org.eclipse.birt.report.tests.engine.emitter.html:eclipse-plugin:4.5.0-SNAPSHOT in 2 seconds.
[INFO] Searching org.eclipse.birt.report.tests.engine.emitter.html-4.5.0-SNAPSHOT-sources.jar for inner jars...
[INFO] Signed org.eclipse.birt:org.eclipse.birt.report.tests.engine.emitter.html:java-source:sources:4.5.0-SNAPSHOT in 3 seconds.
[INFO] 
[INFO] --- tycho-pack200b-plugin:0.21.0:pack (pack200-pack) @ org.eclipse.birt.report.tests.engine.emitter.html ---
[INFO] Pack200 packing jar /jobs/genie.birt/derp/workspace/testsuites/org.eclipse.birt.report.tests.engine.emitter.html/target/org.eclipse.birt.report.tests.engine.emitter.html-4.5.0-SNAPSHOT.jar
[INFO] 
[INFO] --- tycho-p2-plugin:0.21.0:p2-metadata (attached-p2-metadata) @ org.eclipse.birt.report.tests.engine.emitter.html ---
[INFO] 
[INFO] --- jacoco-maven-plugin:0.7.4.201502262128:prepare-agent-integration (prepare-integration-tests) @ org.eclipse.birt.report.tests.engine.emitter.html ---
[INFO] argLine set to -javaagent:/opt/public/hipp/homes/genie.birt/.m2/repository/org/jacoco/org.jacoco.agent/0.7.4.201502262128/org.jacoco.agent-0.7.4.201502262128-runtime.jar=destfile=/jobs/genie.birt/derp/workspace/testsuites/org.eclipse.birt.report.tests.engine.emitter.html/target/coverage/jacoco-integration.exec,append=true,output=file
[INFO] 
[INFO] --- jacoco-maven-plugin:0.7.4.201502262128:report-integration (report-integration) @ org.eclipse.birt.report.tests.engine.emitter.html ---
[INFO] Skipping JaCoCo execution due to missing execution data file:/jobs/genie.birt/derp/workspace/testsuites/org.eclipse.birt.report.tests.engine.emitter.html/target/coverage/jacoco-integration.exec
[INFO] 
[INFO] --- maven-install-plugin:2.3.1:install (default-install) @ org.eclipse.birt.report.tests.engine.emitter.html ---
[INFO] Installing /jobs/genie.birt/derp/workspace/testsuites/org.eclipse.birt.report.tests.engine.emitter.html/target/org.eclipse.birt.report.tests.engine.emitter.html-4.5.0-SNAPSHOT.jar to /opt/public/hipp/homes/genie.birt/.m2/repository/org/eclipse/birt/org.eclipse.birt.report.tests.engine.emitter.html/4.5.0-SNAPSHOT/org.eclipse.birt.report.tests.engine.emitter.html-4.5.0-SNAPSHOT.jar
[INFO] Installing /jobs/genie.birt/derp/workspace/testsuites/org.eclipse.birt.report.tests.engine.emitter.html/pom.xml to /opt/public/hipp/homes/genie.birt/.m2/repository/org/eclipse/birt/org.eclipse.birt.report.tests.engine.emitter.html/4.5.0-SNAPSHOT/org.eclipse.birt.report.tests.engine.emitter.html-4.5.0-SNAPSHOT.pom
[INFO] Installing /jobs/genie.birt/derp/workspace/testsuites/org.eclipse.birt.report.tests.engine.emitter.html/target/org.eclipse.birt.report.tests.engine.emitter.html-4.5.0-SNAPSHOT-sources.jar to /opt/public/hipp/homes/genie.birt/.m2/repository/org/eclipse/birt/org.eclipse.birt.report.tests.engine.emitter.html/4.5.0-SNAPSHOT/org.eclipse.birt.report.tests.engine.emitter.html-4.5.0-SNAPSHOT-sources.jar
[INFO] Installing /jobs/genie.birt/derp/workspace/testsuites/org.eclipse.birt.report.tests.engine.emitter.html/target/org.eclipse.birt.report.tests.engine.emitter.html-4.5.0-SNAPSHOT.jar.pack.gz to /opt/public/hipp/homes/genie.birt/.m2/repository/org/eclipse/birt/org.eclipse.birt.report.tests.engine.emitter.html/4.5.0-SNAPSHOT/org.eclipse.birt.report.tests.engine.emitter.html-4.5.0-SNAPSHOT-pack200.jar.pack.gz
[INFO] Installing /jobs/genie.birt/derp/workspace/testsuites/org.eclipse.birt.report.tests.engine.emitter.html/target/p2content.xml to /opt/public/hipp/homes/genie.birt/.m2/repository/org/eclipse/birt/org.eclipse.birt.report.tests.engine.emitter.html/4.5.0-SNAPSHOT/org.eclipse.birt.report.tests.engine.emitter.html-4.5.0-SNAPSHOT-p2metadata.xml
[INFO] Installing /jobs/genie.birt/derp/workspace/testsuites/org.eclipse.birt.report.tests.engine.emitter.html/target/p2artifacts.xml to /opt/public/hipp/homes/genie.birt/.m2/repository/org/eclipse/birt/org.eclipse.birt.report.tests.engine.emitter.html/4.5.0-SNAPSHOT/org.eclipse.birt.report.tests.engine.emitter.html-4.5.0-SNAPSHOT-p2artifacts.xml
[INFO] 
[INFO] --- tycho-p2-plugin:0.21.0:update-local-index (default-update-local-index) @ org.eclipse.birt.report.tests.engine.emitter.html ---
[INFO]                                                                         
[INFO] ------------------------------------------------------------------------
[INFO] Building org.eclipse.birt.report.tests.model 4.5.0-SNAPSHOT
[INFO] ------------------------------------------------------------------------
[INFO] 
[INFO] --- maven-clean-plugin:2.5:clean (default-clean) @ org.eclipse.birt.report.tests.model ---
[INFO] 
[INFO] --- tycho-packaging-plugin:0.21.0:build-qualifier (default-build-qualifier) @ org.eclipse.birt.report.tests.model ---
[INFO] The project's OSGi version is 4.5.0.v201510220855
[INFO] 
[INFO] --- tycho-packaging-plugin:0.21.0:validate-id (default-validate-id) @ org.eclipse.birt.report.tests.model ---
[INFO] 
[INFO] --- tycho-packaging-plugin:0.21.0:validate-version (default-validate-version) @ org.eclipse.birt.report.tests.model ---
[INFO] 
[INFO] --- maven-toolchains-plugin:1.1:toolchain (default) @ org.eclipse.birt.report.tests.model ---
[INFO] Required toolchain: jdk [ id='JavaSE-1.7' ]
[INFO] Found matching toolchain for type jdk: JDK[/opt/public/common/jdk1.7.0-latest/jre]
[INFO] 
[INFO] --- maven-resources-plugin:2.6:resources (default-resources) @ org.eclipse.birt.report.tests.model ---
[INFO] Using 'UTF-8' encoding to copy filtered resources.
[INFO] skip non existing resourceDirectory /jobs/genie.birt/derp/workspace/testsuites/org.eclipse.birt.report.tests.model/src/main/resources
[INFO] 
[INFO] --- tycho-compiler-plugin:0.21.0:compile (default-compile) @ org.eclipse.birt.report.tests.model ---
[INFO] Compiling 271 source files to /jobs/genie.birt/derp/workspace/testsuites/org.eclipse.birt.report.tests.model/target/classes
[INFO] 
[INFO] --- maven-resources-plugin:2.6:testResources (default-testResources) @ org.eclipse.birt.report.tests.model ---
[INFO] Not copying test resources
[INFO] 
[INFO] --- tycho-source-plugin:0.21.0:plugin-source (plugin-source) @ org.eclipse.birt.report.tests.model ---
[WARNING] bundle localization file /jobs/genie.birt/derp/workspace/testsuites/org.eclipse.birt.report.tests.model/plugin.properties not found
[INFO] Building jar: /jobs/genie.birt/derp/workspace/testsuites/org.eclipse.birt.report.tests.model/target/org.eclipse.birt.report.tests.model-4.5.0-SNAPSHOT-sources.jar
[INFO] 
[INFO] --- maven-resources-plugin:2.6:copy-resources (process-about.mappings) @ org.eclipse.birt.report.tests.model ---
[INFO] Using 'UTF-8' encoding to copy filtered resources.
[INFO] Copying 0 resource
[INFO] 
[INFO] --- target-platform-configuration:0.21.0:target-platform (default-target-platform) @ org.eclipse.birt.report.tests.model ---
[INFO] 
[INFO] --- tycho-packaging-plugin:0.21.0:package-plugin (default-package-plugin) @ org.eclipse.birt.report.tests.model ---
[INFO] Building jar: /jobs/genie.birt/derp/workspace/testsuites/org.eclipse.birt.report.tests.model/tests-model.jar
[INFO] Building jar: /jobs/genie.birt/derp/workspace/testsuites/org.eclipse.birt.report.tests.model/target/org.eclipse.birt.report.tests.model-4.5.0-SNAPSHOT.jar
[INFO] 
[INFO] --- tycho-p2-plugin:0.21.0:p2-metadata-default (default-p2-metadata-default) @ org.eclipse.birt.report.tests.model ---
[INFO] 
[INFO] --- tycho-pack200a-plugin:0.21.0:normalize (pack200-normalize) @ org.eclipse.birt.report.tests.model ---
[INFO] Pack200 normalizing jar /jobs/genie.birt/derp/workspace/testsuites/org.eclipse.birt.report.tests.model/target/org.eclipse.birt.report.tests.model-4.5.0-SNAPSHOT.jar
[INFO] 
[INFO] --- eclipse-jarsigner-plugin:1.1.2:sign (sign) @ org.eclipse.birt.report.tests.model ---
[INFO] Searching org.eclipse.birt.report.tests.model-4.5.0-SNAPSHOT.jar for inner jars...
[INFO] Signed org.eclipse.birt:org.eclipse.birt.report.tests.model:eclipse-test-plugin:4.5.0-SNAPSHOT in 5 seconds.
[INFO] Searching org.eclipse.birt.report.tests.model-4.5.0-SNAPSHOT-sources.jar for inner jars...
[INFO] Failed to sign Regression_155509.jar with server. Retrying...
[INFO] Failed to sign Regression_155509.jar with server. Retrying...
[INFO] Failed to sign Regression_155509.jar with server. Retrying...
[INFO] ------------------------------------------------------------------------
[INFO] Reactor Summary:
[INFO] 
[INFO] org.eclipse.birt-parent ............................ SUCCESS [  1.457 s]
[INFO] org.eclipse.birt.build-parent ...................... SUCCESS [  0.094 s]
[INFO] org.eclipse.birt.axis.overlay ...................... SUCCESS [  4.173 s]
[INFO] org.eclipse.birt.chart.cshelp ...................... SUCCESS [  1.448 s]
[INFO] org.eclipse.birt.features-parent ................... SUCCESS [  0.073 s]
[INFO] org.eclipse.birt.chart.cshelp ...................... SUCCESS [  2.248 s]
[INFO] org.eclipse.birt.core-parent ....................... SUCCESS [  0.079 s]
[INFO] org.eclipse.birt.core .............................. SUCCESS [ 11.337 s]
[INFO] org.eclipse.birt.chart.engine ...................... SUCCESS [ 15.465 s]
[INFO] org.eclipse.birt.chart.device.extension ............ SUCCESS [  3.447 s]
[INFO] org.eclipse.birt.nl-parent ......................... SUCCESS [  2.007 s]
[INFO] org.eclipse.birt.chart.device.extension.nl1 ........ SUCCESS [  4.918 s]
[INFO] org.eclipse.birt.chart.device.svg .................. SUCCESS [  3.011 s]
[INFO] org.eclipse.birt.chart.device.pdf .................. SUCCESS [  3.781 s]
[INFO] org.eclipse.birt.chart.device.svg.nl1 .............. SUCCESS [ 11.686 s]
[INFO] org.eclipse.birt.chart.device.swt .................. SUCCESS [  5.329 s]
[INFO] org.eclipse.birt.chart.device.swt.nl1 .............. SUCCESS [  4.799 s]
[INFO] org.eclipse.birt.data .............................. SUCCESS [ 13.701 s]
[INFO] org.w3c.sac ........................................ SUCCESS [  5.586 s]
[INFO] org.eclipse.birt.model-parent ...................... SUCCESS [  0.074 s]
[INFO] org.eclipse.birt.report.model ...................... SUCCESS [ 20.494 s]
[INFO] org.eclipse.birt.data.aggregation .................. SUCCESS [  3.148 s]
[INFO] org.eclipse.birt.report.data.adapter ............... SUCCESS [  3.657 s]
[INFO] org.eclipse.birt.report.engine.fonts ............... SUCCESS [  2.362 s]
[INFO] org.eclipse.birt.report.engine ..................... SUCCESS [ 26.292 s]
[INFO] org.eclipse.birt.report.item.crosstab.core ......... SUCCESS [  6.168 s]
[INFO] org.eclipse.birt.chart.reportitem .................. SUCCESS [  4.645 s]
[INFO] org.eclipse.birt.core.ui ........................... SUCCESS [  2.784 s]
[INFO] org.eclipse.birt.chart.ui .......................... SUCCESS [  3.862 s]
[INFO] org.eclipse.birt.chart.doc.isv ..................... SUCCESS [ 33.544 s]
[INFO] org.eclipse.birt.chart.doc.isv ..................... SUCCESS [  1.360 s]
[INFO] org.eclipse.birt.chart.engine.extension ............ SUCCESS [  4.113 s]
[INFO] org.eclipse.birt.chart.engine.extension.nl1 ........ SUCCESS [  3.514 s]
[INFO] org.eclipse.birt.chart.engine.nl1 .................. SUCCESS [  2.364 s]
[INFO] org.eclipse.birt.chart.ui.extension ................ SUCCESS [  6.927 s]
[INFO] org.eclipse.birt.chart.examples.core ............... SUCCESS [  2.947 s]
[INFO] org.eclipse.birt.chart.examples .................... SUCCESS [  8.887 s]
[INFO] org.eclipse.birt.chart.examples.core.nl1 ........... SUCCESS [  4.385 s]
[INFO] org.eclipse.birt.chart.examples.nl1 ................ SUCCESS [  4.876 s]
[INFO] org.eclipse.birt.chart ............................. SUCCESS [  1.805 s]
[INFO] org.eclipse.birt.chart.integration.wtp.ui .......... SUCCESS [  3.981 s]
[INFO] org.eclipse.birt.chart.integration.wtp ............. SUCCESS [  2.987 s]
[INFO] org.eclipse.birt.chart.integration.wtp.ui.nl1 ...... SUCCESS [  2.203 s]
[INFO] org.eclipse.birt.chart.osgi.runtime ................ SUCCESS [  1.844 s]
[INFO] org.eclipse.birt.chart.osgi.runtime.sdk ............ SUCCESS [  1.597 s]
[INFO] org.eclipse.birt.chart.reportitem.nl1 .............. SUCCESS [  2.958 s]
[INFO] org.eclipse.birt.report.designer.core .............. SUCCESS [  3.561 s]
[INFO] org.eclipse.birt.report.designer.ui ................ SUCCESS [ 19.053 s]
[INFO] org.eclipse.birt.report.designer.ui.views .......... SUCCESS [  9.772 s]
[INFO] org.eclipse.birt.report.designer.ui.editors ........ SUCCESS [  4.918 s]
[INFO] org.eclipse.birt.report.designer.ui.editors.schematic SUCCESS [  4.957 s]
[INFO] org.eclipse.birt.report.designer.ui.lib ............ SUCCESS [  3.238 s]
[INFO] org.eclipse.birt.report.designer.ui.lib.explorer ... SUCCESS [  3.057 s]
[INFO] org.eclipse.birt.report.designer.ui.ide ............ SUCCESS [  9.532 s]
[INFO] org.eclipse.birt.report.designer.ui.cubebuilder .... SUCCESS [  7.372 s]
[INFO] org.eclipse.birt.report.model.adapter.oda .......... SUCCESS [  8.063 s]
[INFO] org.eclipse.birt.report.designer.ui.data ........... SUCCESS [  9.202 s]
[INFO] org.eclipse.birt.report.item.crosstab.ui ........... SUCCESS [  7.580 s]
[INFO] org.eclipse.birt.chart.reportitem.ui ............... SUCCESS [  4.378 s]
[INFO] org.eclipse.birt.chart.reportitem.ui.nl1 ........... SUCCESS [  2.413 s]
[INFO] org.eclipse.birt.chart.tests ....................... SUCCESS [  6.865 s]
[INFO] org.eclipse.birt.chart.ui.extension.nl1 ............ SUCCESS [  2.318 s]
[INFO] org.eclipse.birt.chart.ui.nl1 ...................... SUCCESS [  4.066 s]
[INFO] org.eclipse.birt.core.nl1 .......................... SUCCESS [  4.073 s]
[INFO] org.eclipse.birt.core.script.function .............. SUCCESS [  4.746 s]
[INFO] org.eclipse.birt.core.script.function.nl1 .......... SUCCESS [  2.340 s]
[INFO] org.eclipse.birt.core.testhelper ................... SUCCESS [  3.716 s]
[INFO] org.eclipse.birt.data.oda.mongodb .................. SUCCESS [  4.616 s]
[INFO] org.eclipse.birt.data.oda.mongodb.ui ............... SUCCESS [  2.916 s]
[INFO] org.eclipse.birt.data.oda.pojo ..................... SUCCESS [  2.918 s]
[INFO] org.eclipse.birt.me.prettyprint.hector ............. SUCCESS [  2.082 s]
[INFO] org.eclipse.birt.report.data.bidi.utils ............ SUCCESS [  2.359 s]
[INFO] org.apache.derby.core .............................. SUCCESS [  5.957 s]
[INFO] org.eclipse.birt.report.data.oda.jdbc .............. SUCCESS [  3.892 s]
[INFO] org.eclipse.birt.report.data.oda.hive .............. SUCCESS [  4.459 s]
[INFO] org.eclipse.birt.report.data.oda.xml ............... SUCCESS [  2.676 s]
[INFO] org.eclipse.birt.report.engine.emitter.html ........ SUCCESS [  4.952 s]
[INFO] org.eclipse.birt.report.engine.emitter.pdf ......... SUCCESS [  4.691 s]
[INFO] org.eclipse.birt.resources ......................... SUCCESS [  2.558 s]
[INFO] org.eclipse.birt.report.engine.dataextraction ...... SUCCESS [  6.628 s]
[INFO] org.eclipse.birt.report.viewer ..................... SUCCESS [ 30.099 s]
[INFO] org.eclipse.birt.report.engine.dataextraction.csv .. SUCCESS [  2.660 s]
[INFO] org.eclipse.birt.report.engine.emitter.wpml ........ SUCCESS [  3.198 s]
[INFO] org.eclipse.birt.report.engine.emitter.postscript .. SUCCESS [  2.892 s]
[INFO] org.eclipse.birt.report.engine.emitter.ppt ......... SUCCESS [  5.104 s]
[INFO] org.eclipse.birt.report.engine.emitter.config ...... SUCCESS [  3.638 s]
[INFO] org.eclipse.birt.report.data.oda.sampledb .......... SUCCESS [  8.452 s]
[INFO] org.eclipse.birt.report.data.oda.jdbc.dbprofile .... SUCCESS [  4.339 s]
[INFO] org.eclipse.birt.report.data.oda.jdbc.dbprofile.sampledb SUCCESS [  8.991 s]
[INFO] org.eclipse.birt.report.engine.emitter.config.excel  SUCCESS [  4.700 s]
[INFO] org.eclipse.birt.report.engine.emitter.config.html . SUCCESS [  6.178 s]
[INFO] org.eclipse.birt.report.engine.emitter.config.pdf .. SUCCESS [  4.519 s]
[INFO] org.eclipse.birt.report.engine.emitter.config.postscript SUCCESS [  5.026 s]
[INFO] org.eclipse.birt.report.engine.emitter.config.ppt .. SUCCESS [  5.155 s]
[INFO] org.eclipse.birt.report.engine.emitter.config.wpml . SUCCESS [  8.253 s]
[INFO] org.eclipse.birt.report.engine.script.javascript ... SUCCESS [  7.217 s]
[INFO] org.eclipse.birt.report.engine.emitter.config.odp .. SUCCESS [  4.384 s]
[INFO] org.eclipse.birt.report.engine.emitter.config.ods .. SUCCESS [  4.345 s]
[INFO] org.eclipse.birt.report.engine.emitter.config.odt .. SUCCESS [  6.898 s]
[INFO] org.eclipse.birt.report.engine.odf ................. SUCCESS [  5.758 s]
[INFO] org.eclipse.birt.report.engine.emitter.odp ......... SUCCESS [  5.213 s]
[INFO] org.eclipse.birt.report.engine.emitter.ods ......... SUCCESS [  5.116 s]
[INFO] org.eclipse.birt.report.engine.emitter.odt ......... SUCCESS [  6.432 s]
[INFO] org.eclipse.birt.report.data.oda.excel ............. SUCCESS [ 20.093 s]
[INFO] org.eclipse.birt.report.engine.ooxml ............... SUCCESS [  5.815 s]
[INFO] org.eclipse.birt.report.engine.emitter.config.docx . SUCCESS [  3.161 s]
[INFO] org.eclipse.birt.report.engine.emitter.pptx ........ SUCCESS [  4.812 s]
[INFO] org.eclipse.birt.report.engine.emitter.config.pptx . SUCCESS [  4.910 s]
[INFO] org.eclipse.birt.report.engine.emitter.docx ........ SUCCESS [  6.894 s]
[INFO] uk.co.spudsoft.birt.emitters.excel ................. SUCCESS [ 20.995 s]
[INFO] org.eclipse.birt.osgi.runtime ...................... SUCCESS [  2.807 s]
[INFO] org.eclipse.birt.core.tests ........................ SUCCESS [  4.439 s]
[INFO] org.eclipse.birt.core.ui.nl1 ....................... SUCCESS [  2.409 s]
[INFO] org.eclipse.birt.cshelp ............................ SUCCESS [  1.404 s]
[INFO] org.eclipse.birt.cshelp ............................ SUCCESS [  1.336 s]
[INFO] org.eclipse.birt.data.aggregation.nl1 .............. SUCCESS [  2.482 s]
[INFO] org.eclipse.birt.data.nl1 .......................... SUCCESS [  2.310 s]
[INFO] org.eclipse.birt.data.oda.mongodb.nl1 .............. SUCCESS [  2.288 s]
[INFO] org.eclipse.birt.data.oda.mongodb.ui.nl1 ........... SUCCESS [  4.405 s]
[INFO] org.eclipse.birt.data.oda.pojo.nl1 ................. SUCCESS [  4.161 s]
[INFO] org.eclipse.birt.data.oda.pojo.ui .................. SUCCESS [  7.463 s]
[INFO] org.eclipse.birt.data.oda.pojo.ui.nl1 .............. SUCCESS [  2.374 s]
[INFO] org.eclipse.birt.report.engine.testhelper .......... SUCCESS [  7.278 s]
[INFO] org.eclipse.birt.data.tests ........................ SUCCESS [ 13.442 s]
[INFO] org.eclipse.birt.report.designer.ui.editor.xml.wtp . SUCCESS [  4.657 s]
[INFO] org.eclipse.birt.report.designer.editor.xml.wtp .... SUCCESS [  1.735 s]
[INFO] org.eclipse.birt ................................... SUCCESS [  2.004 s]
[INFO] org.eclipse.birt.report.data.bidi.utils.ui ......... SUCCESS [  2.386 s]
[INFO] org.eclipse.birt.report.data.oda.jdbc.ui ........... SUCCESS [  5.603 s]
[INFO] org.eclipse.birt.report.data.oda.xml.ui ............ SUCCESS [  3.769 s]
[INFO] org.eclipse.birt.report.designer.ui.preview.web .... SUCCESS [  5.972 s]
[INFO] org.eclipse.birt.report.designer.ui.editor.script .. SUCCESS [  2.438 s]
[INFO] org.eclipse.birt.report.data.oda.hive.ui ........... SUCCESS [  2.491 s]
[INFO] org.eclipse.birt.report.data.oda.jdbc.dbprofile.ui . SUCCESS [  5.012 s]
[INFO] org.eclipse.birt.report.debug.core ................. SUCCESS [  4.418 s]
[INFO] org.eclipse.birt.report.debug.ui ................... SUCCESS [  3.379 s]
[INFO] org.eclipse.birt.report.data.oda.sampledb.ui ....... SUCCESS [  3.035 s]
[INFO] org.eclipse.birt.report.data.oda.jdbc.dbprofile.sampledb.ui SUCCESS [  4.612 s]
[INFO] org.eclipse.birt.report.data.oda.excel.ui .......... SUCCESS [  4.791 s]
[INFO] org.eclipse.birt ................................... SUCCESS [  5.602 s]
[INFO] org.eclipse.birt.doc ............................... SUCCESS [  4.313 s]
[INFO] org.eclipse.birt.doc ............................... SUCCESS [  1.132 s]
[INFO] org.eclipse.birt.doc.isv ........................... SUCCESS [ 45.831 s]
[INFO] org.eclipse.birt.doc.isv ........................... SUCCESS [  5.074 s]
[INFO] org.eclipse.birt.report.engine.emitter.prototype.excel SUCCESS [  3.522 s]
[INFO] org.eclipse.birt.engine.runtime .................... SUCCESS [  4.158 s]
[INFO] org.eclipse.birt.example ........................... SUCCESS [  2.439 s]
[INFO] org.eclipse.birt.report.designer.samplereports ..... SUCCESS [  5.640 s]
[INFO] org.eclipse.birt.report.designer.ui.samplesview .... SUCCESS [  4.596 s]
[INFO] org.eclipse.birt.report.designer.ui.samples.ide .... SUCCESS [  4.451 s]
[INFO] org.eclipse.birt.report.designer.ui.samples.rcp .... SUCCESS [  2.416 s]
[INFO] org.eclipse.birt.example ........................... SUCCESS [  1.620 s]
[INFO] org.eclipse.birt.integration.wtp.ui ................ SUCCESS [  4.311 s]
[INFO] org.eclipse.birt.integration.wtp ................... SUCCESS [  6.239 s]
[INFO] org.eclipse.birt.integration.wtp.ui.nl1 ............ SUCCESS [  2.227 s]
[INFO] org.eclipse.birt.resources.nl1 ..................... SUCCESS [  4.419 s]
[INFO] org.eclipse.birt.report.data.oda.jdbc.nl1 .......... SUCCESS [  5.306 s]
[INFO] org.eclipse.birt.report.data.oda.jdbc.ui.nl1 ....... SUCCESS [  5.581 s]
[INFO] org.eclipse.birt.report.data.oda.sampledb.nl1 ...... SUCCESS [  2.491 s]
[INFO] org.eclipse.birt.report.data.oda.sampledb.ui.nl1 ... SUCCESS [  2.230 s]
[INFO] org.eclipse.birt.report.data.oda.xml.nl1 ........... SUCCESS [  2.258 s]
[INFO] org.eclipse.birt.report.data.oda.xml.ui.nl1 ........ SUCCESS [  4.574 s]
[INFO] org.eclipse.birt.report.debug.core.nl1 ............. SUCCESS [  2.341 s]
[INFO] org.eclipse.birt.report.debug.ui.nl1 ............... SUCCESS [  2.431 s]
[INFO] org.eclipse.birt.report.designer.core.nl1 .......... SUCCESS [  2.200 s]
[INFO] org.eclipse.birt.report.designer.ui.editors.schematic.nl1 SUCCESS [  5.561 s]
[INFO] org.eclipse.birt.report.designer.ui.ide.nl1 ........ SUCCESS [  2.454 s]
[INFO] org.eclipse.birt.report.designer.ui.lib.explorer.nl1 SUCCESS [  2.091 s]
[INFO] org.eclipse.birt.report.designer.ui.lib.nl1 ........ SUCCESS [  2.663 s]
[INFO] org.eclipse.birt.report.designer.ui.nl1 ............ SUCCESS [  2.599 s]
[INFO] org.eclipse.birt.report.engine.nl1 ................. SUCCESS [  2.134 s]
[INFO] org.eclipse.birt.report.model.nl1 .................. SUCCESS [  2.479 s]
[INFO] org.eclipse.birt.report.viewers.nl1 ................ SUCCESS [  2.359 s]
[INFO] org.eclipse.birt.report.item.crosstab.core.nl1 ..... SUCCESS [  2.395 s]
[INFO] org.eclipse.birt.report.item.crosstab.ui.nl1 ....... SUCCESS [  2.726 s]
[INFO] org.eclipse.birt.report.designer.ui.editor.xml.wtp.nl1 SUCCESS [  2.353 s]
[INFO] org.eclipse.birt.report.designer.ui.views.nl1 ...... SUCCESS [  2.179 s]
[INFO] org.eclipse.birt.report.data.adapter.nl1 ........... SUCCESS [  2.535 s]
[INFO] org.eclipse.birt.report.designer.ui.preview ........ SUCCESS [  4.640 s]
[INFO] org.eclipse.birt.report.designer.ui.preview.nl1 .... SUCCESS [  5.179 s]
[INFO] org.eclipse.birt.report.designer.ui.preview.web.nl1  SUCCESS [  5.768 s]
[INFO] org.eclipse.birt.report.designer.ui.cubebuilder.nl1  SUCCESS [  3.615 s]
[INFO] org.eclipse.birt.report.engine.dataextraction.csv.nl1 SUCCESS [  2.133 s]
[INFO] org.eclipse.birt.report.designer.ui.editor.script.nl1 SUCCESS [  2.274 s]
[INFO] org.eclipse.birt.report.data.oda.jdbc.dbprofile.nl1  SUCCESS [  5.504 s]
[INFO] org.eclipse.birt.report.data.oda.jdbc.dbprofile.ui.nl1 SUCCESS [  2.743 s]
[INFO] org.eclipse.birt.report.data.oda.jdbc.dbprofile.sampledb.nl1 SUCCESS [  2.934 s]
[INFO] org.eclipse.birt.report.designer.ui.editors.nl1 .... SUCCESS [  2.138 s]
[INFO] org.eclipse.birt.report.engine.dataextraction.nl1 .. SUCCESS [  5.469 s]
[INFO] org.eclipse.birt.report.engine.emitter.config.excel.nl1 SUCCESS [  4.310 s]
[INFO] org.eclipse.birt.report.engine.emitter.config.pdf.nl1 SUCCESS [  6.228 s]
[INFO] org.eclipse.birt.report.engine.emitter.config.html.nl1 SUCCESS [  4.394 s]
[INFO] org.eclipse.birt.report.engine.emitter.config.nl1 .. SUCCESS [  2.304 s]
[INFO] org.eclipse.birt.report.engine.emitter.config.ppt.nl1 SUCCESS [  3.219 s]
[INFO] org.eclipse.birt.report.engine.emitter.config.postscript.nl1 SUCCESS [  4.352 s]
[INFO] org.eclipse.birt.report.engine.emitter.config.wpml.nl1 SUCCESS [  4.165 s]
[INFO] org.eclipse.birt.report.data.bidi.utils.nl1 ........ SUCCESS [  2.453 s]
[INFO] org.eclipse.birt.report.data.oda.hive.nl1 .......... SUCCESS [  2.412 s]
[INFO] org.eclipse.birt.report.data.oda.hive.ui.nl1 ....... SUCCESS [  4.699 s]
[INFO] org.eclipse.birt.report.data.oda.excel.nl1 ......... SUCCESS [  2.870 s]
[INFO] org.eclipse.birt.report.data.oda.excel.ui.nl1 ...... SUCCESS [  4.350 s]
[INFO] org.eclipse.birt.report.engine.emitter.config.docx.nl1 SUCCESS [  2.511 s]
[INFO] org.eclipse.birt.report.engine.emitter.config.pptx.nl1 SUCCESS [  2.428 s]
[INFO] org.eclipse.birt.nl ................................ SUCCESS [  1.942 s]
[INFO] org.eclipse.birt.osgi.runtime.sdk .................. SUCCESS [  3.411 s]
[INFO] org.eclipse.birt.report.model.testhelper ........... SUCCESS [  9.219 s]
[INFO] org.eclipse.birt.testhelper ........................ SUCCESS [  5.553 s]
[INFO] org.eclipse.birt.report.data.oda.jdbc.tests ........ SUCCESS [  9.601 s]
[INFO] org.eclipse.birt.report.designer.tests ............. SUCCESS [  4.946 s]
[INFO] org.eclipse.birt.report.engine.emitter.html.tests .. SUCCESS [  4.328 s]
[INFO] org.eclipse.birt.report.engine.emitter.pdf.tests ... SUCCESS [  7.393 s]
[INFO] org.eclipse.birt.report.engine.emitter.postscript.tests SUCCESS [  6.144 s]
[INFO] org.eclipse.birt.report.engine.emitter.prototype.excel.tests SUCCESS [  4.005 s]
[INFO] org.eclipse.birt.report.engine.tests ............... SUCCESS [  8.598 s]
[INFO] org.eclipse.birt.report.model.adapter.oda.tests .... SUCCESS [  5.732 s]
[INFO] org.eclipse.birt.report.model.testresources ........ SUCCESS [  1.071 s]
[INFO] org.eclipse.birt.report.modelextension.tests ....... SUCCESS [  6.445 s]
[INFO] org.eclipse.birt.report.model.tests ................ SUCCESS [  4.114 s]
[INFO] org.eclipse.birt.tests.core ........................ SUCCESS [  6.289 s]
[INFO] org.eclipse.birt.report.tests.chart ................ SUCCESS [  9.779 s]
[INFO] org.eclipse.birt.testsuites-parent ................. SUCCESS [  0.102 s]
[INFO] org.eclipse.birt.report.tests.engine ............... SUCCESS [  5.679 s]
[INFO] org.eclipse.birt.report.tests.engine.emitter.html .. SUCCESS [  5.397 s]
[INFO] org.eclipse.birt.report.tests.model ................ FAILURE [01:40 min]
[INFO] org.eclipse.birt.tests.data ........................ SKIPPED
[INFO] org.eclipse.birt.tests ............................. SKIPPED
[INFO] org.eclipse.birt.tests ............................. SKIPPED
[INFO] org.eclipse.birt.wtp.nl ............................ SKIPPED
[INFO] org.eclipse.birt.report.designer.ui.rcp ............ SKIPPED
[INFO] org.eclipse.birt.report.designer.ui.rcp.nl1 ........ SKIPPED
[INFO] org.eclipse.birt.rcp.nl ............................ SKIPPED
[INFO] org.eclipse.birt.p2updatesite ...................... SKIPPED
[INFO] org.eclipse.birt.api ............................... SKIPPED
[INFO] org.eclipse.birt.build ............................. SKIPPED
[INFO] org.eclipse.birt.build.package-parent .............. SKIPPED
[INFO] ChartRuntime ....................................... SKIPPED
[INFO] ChartSDK ........................................... SKIPPED
[INFO] DeploymentRuntime .................................. SKIPPED
[INFO] birt-charts ........................................ SKIPPED
[INFO] birt-epp ........................................... SKIPPED
[INFO] org.eclipse.birt.rcp ............................... SKIPPED
[INFO] birt-report-rcp .................................... SKIPPED
[INFO] birt-report-all-in-one ............................. SKIPPED
[INFO] birt-report-framework .............................. SKIPPED
[INFO] birt-report-framework-sdk .......................... SKIPPED
[INFO] birt-runtime-osgi .................................. SKIPPED
[INFO] birt-runtime ....................................... SKIPPED
[INFO] birt-sample-plugins ................................ SKIPPED
[INFO] birt-tests-suite ................................... SKIPPED
[INFO] org.eclipse.birt.integration.wtp.sdk ............... SKIPPED
[INFO] birt-wtp-integration-sdk ........................... SKIPPED
[INFO] org.eclipse.birt.chart.viewer ...................... SKIPPED
[INFO] org.eclipse.birt.chart.viewer ...................... SKIPPED
[INFO] birt-source ........................................ SKIPPED
[INFO] org.eclipse.birt.build.package.nl-parent ........... SKIPPED
[INFO] NLpack1-birt-charts ................................ SKIPPED
[INFO] NLpack1-birt-rcp-report-designer ................... SKIPPED
[INFO] NLpack1-birt-report-designer-all-in-one ............ SKIPPED
[INFO] NLpack1-birt-report-framework ...................... SKIPPED
[INFO] NLpack1-birt-runtime ............................... SKIPPED
[INFO] birt-publish ....................................... SKIPPED
[INFO] org.eclipse.birt.chart-parent ...................... SKIPPED
[INFO] org.eclipse.birt.common-parent ..................... SKIPPED
[INFO] org.eclipse.birt.data.oda.pojo.tests ............... SKIPPED
[INFO] org.eclipse.birt.data-parent ....................... SKIPPED
[INFO] org.eclipse.birt.docs-parent ....................... SKIPPED
[INFO] org.eclipse.birt.report.engine.dataextraction.csv.tests SKIPPED
[INFO] org.eclipse.birt.report.engine.emitter.pptx.tests .. SKIPPED
[INFO] uk.co.spudsoft.birt.emitters.excel.tests ........... SKIPPED
[INFO] org.eclipse.birt.engine-parent ..................... SKIPPED
[INFO] org.eclipse.birt.sdk ............................... SKIPPED
[INFO] org.eclipse.birt.report.designer.ui.samples.ide.nl1  SKIPPED
[INFO] org.eclipse.birt.report.designer.ui.samplesview.nl1  SKIPPED
[INFO] org.eclipse.birt.report.designer.ui.preview.static_html SKIPPED
[INFO] org.eclipse.birt.report.designer.ui.preview.test ... SKIPPED
[INFO] org.eclipse.birt.UI-parent ......................... SKIPPED
[INFO] org.eclipse.birt.jetty.overlay ..................... SKIPPED
[INFO] org.eclipse.birt.viewer-parent ..................... SKIPPED
[INFO] org.eclipse.birt.report.item.crosstab.core.tests ... SKIPPED
[INFO] org.eclipse.birt.xtab-parent ....................... SKIPPED
[INFO] ------------------------------------------------------------------------
[INFO] BUILD FAILURE
[INFO] ------------------------------------------------------------------------
[INFO] Total time: 28:13 min
[INFO] Finished at: 2015-10-22T05:16:30-04:00
[INFO] Final Memory: 628M/1645M
[INFO] ------------------------------------------------------------------------
[INFO] o.h.m.e.h.MavenExecutionResultHandler - Build failed with exception(s)
[INFO] o.h.m.e.h.MavenExecutionResultHandler - [1] org.apache.maven.lifecycle.LifecycleExecutionException: Failed to execute goal org.eclipse.cbi.maven.plugins:eclipse-jarsigner-plugin:1.1.2:sign (sign) on project org.eclipse.birt.report.tests.model: Failed to sign file.
[DEBUG] Closing connection to remote
[ERROR] Failed to execute goal org.eclipse.cbi.maven.plugins:eclipse-jarsigner-plugin:1.1.2:sign (sign) on project org.eclipse.birt.report.tests.model: Failed to sign file. -> [Help 1]
[ERROR] 
[ERROR] To see the full stack trace of the errors, re-run Maven with the -e switch.
[ERROR] Re-run Maven using the -X switch to enable full debug logging.
[ERROR] 
[ERROR] For more information about the errors and possible solutions, please read the following articles:
[ERROR] [Help 1] http://cwiki.apache.org/confluence/display/MAVEN/MojoExecutionException
[ERROR] 
[ERROR] After correcting the problems, you can resume the build with the command
[ERROR]   mvn <goals> -rf :org.eclipse.birt.report.tests.model
[DEBUG] Waiting for process to finish
[DEBUG] Result: 1
Finished: FAILURE