UnstableConsole Output

Skipping 53,575 KB.. Full Log
n-eclipse-47/workspace/org.eclipse.ajdt.ui.tests/target/work/configuration/org.eclipse.osgi/221/0/.cp (could be getting managed by JDT)
Timer event: 0ms: OutputLocationManager: binary folder to declaring project map creation: P/DefaultEmptyProject
Preparing for build: planning to be an incremental build
AspectJ reports build successful, build was: INCREMENTAL
AJDE Callback: finish. Was full build: false
Timer event: 4ms: Total time spent in AJDE
Timer event: 0ms: Refresh after build
Crosscutting model sanity checked with no problems
Timer event: 0ms: Model sanity check for: DefaultEmptyProject
Timer event: 8ms: Total time spent in AJBuilder.build()
>> finished a build
>> scheduled a build
Tests run: 438, Failures: 3, Errors: 0, Skipped: 0, Time elapsed: 2,820.928 sec <<< FAILURE! - in org.eclipse.ajdt.ui.tests.AllAJDTUITests
testAddsAJNature(org.eclipse.ajdt.ui.tests.actions.AddAJNatureActionTest)  Time elapsed: 45.826 sec
testRemovesAJNatureKeepClasspath(org.eclipse.ajdt.ui.tests.actions.RemoveAJNatureActionTest)  Time elapsed: 15.366 sec
testRemovesAJNature(org.eclipse.ajdt.ui.tests.actions.RemoveAJNatureActionTest)  Time elapsed: 14.366 sec
testSetDefaultsIfValueNotAlreadySet(org.eclipse.ajdt.ui.tests.preferences.AJCompilerPreferencePageTest)  Time elapsed: 3.169 sec
testRemoveValues(org.eclipse.ajdt.ui.tests.preferences.AJCompilerPreferencePageTest)  Time elapsed: 3.123 sec
testNewXlintOptions(org.eclipse.ajdt.ui.tests.preferences.AJCompilerPreferencePageTest)  Time elapsed: 6.615 sec
testSetDefaults(org.eclipse.ajdt.ui.tests.preferences.AJCompilerPreferencePageTest)  Time elapsed: 2.682 sec
testPerformApplyAndDontBuild_2(org.eclipse.ajdt.ui.tests.preferences.AJCompilerPreferencePageTest2)  Time elapsed: 4.211 sec
testPerformApplyAndBuild(org.eclipse.ajdt.ui.tests.preferences.AJCompilerPreferencePageTest2)  Time elapsed: 5.138 sec
testChangeUseProjectSettingsAndApply(org.eclipse.ajdt.ui.tests.preferences.AJCompilerPreferencePageTest2)  Time elapsed: 3.904 sec
testPerformApplyAndDontBuild(org.eclipse.ajdt.ui.tests.preferences.AJCompilerPreferencePageTest2)  Time elapsed: 4.241 sec
testChangeNonStandardOptionsAndApply_2(org.eclipse.ajdt.ui.tests.preferences.AJCompilerPreferencePageTest2)  Time elapsed: 5.021 sec
testChangeNonStandardOptionsAndApply_3(org.eclipse.ajdt.ui.tests.preferences.AJCompilerPreferencePageTest2)  Time elapsed: 3.452 sec
testChangeNonStandardOptionsAndApply(org.eclipse.ajdt.ui.tests.preferences.AJCompilerPreferencePageTest2)  Time elapsed: 3.396 sec
testChangeUseWorkspaceSettingsAndApply(org.eclipse.ajdt.ui.tests.preferences.AJCompilerPreferencePageTest2)  Time elapsed: 4.803 sec
testPerformApplyAndDontBuild_2(org.eclipse.ajdt.ui.tests.preferences.AJCompilerPreferencePageWorkbenchTest)  Time elapsed: 3.916 sec
testPerformApplyAndBuild(org.eclipse.ajdt.ui.tests.preferences.AJCompilerPreferencePageWorkbenchTest)  Time elapsed: 3.774 sec
testPerformApplyAndDontBuild(org.eclipse.ajdt.ui.tests.preferences.AJCompilerPreferencePageWorkbenchTest)  Time elapsed: 3.929 sec
testChangeNonStandardOptionsAndApply_2(org.eclipse.ajdt.ui.tests.preferences.AJCompilerPreferencePageWorkbenchTest)  Time elapsed: 3.825 sec
testChangeNonStandardOptionsAndApply_3(org.eclipse.ajdt.ui.tests.preferences.AJCompilerPreferencePageWorkbenchTest)  Time elapsed: 3.879 sec
testChangeNonStandardOptionsAndApply(org.eclipse.ajdt.ui.tests.preferences.AJCompilerPreferencePageWorkbenchTest)  Time elapsed: 3.273 sec
testSetCheckedFilters(org.eclipse.ajdt.ui.tests.preferences.AspectJFilterPreferencesTest)  Time elapsed: 1.601 sec
testGetAdvancedOptionViaProjectPreferences(org.eclipse.ajdt.ui.tests.preferences.AspectJPreferencesTest)  Time elapsed: 2.314 sec
testGetShowWeaveMessagesOptionViaProjectPreferences(org.eclipse.ajdt.ui.tests.preferences.AspectJPreferencesTest)  Time elapsed: 3.184 sec
testGetShowWeaveMessagesOptionViaWorkbenchPreferences(org.eclipse.ajdt.ui.tests.preferences.AspectJPreferencesTest)  Time elapsed: 3.226 sec
testGetCompilerOptions(org.eclipse.ajdt.ui.tests.preferences.AspectJPreferencesTest)  Time elapsed: 2.957 sec
testGetAdvancedOptionViaWorkbenchPreferences(org.eclipse.ajdt.ui.tests.preferences.AspectJPreferencesTest)  Time elapsed: 3.265 sec
testIsUsingProjectSettings(org.eclipse.ajdt.ui.tests.preferences.AspectJPreferencesTest)  Time elapsed: 3 sec
testGetXLintOptions(org.eclipse.ajdt.ui.tests.preferences.AspectJPreferencesTest)  Time elapsed: 3.164 sec
testSetUsingProjectSettings2(org.eclipse.ajdt.ui.tests.preferences.AspectJPreferencesTest)  Time elapsed: 2.988 sec
testSetCompilerOptions(org.eclipse.ajdt.ui.tests.preferences.AspectJPreferencesTest)  Time elapsed: 6.942 sec
testSetUsingProjectSettings(org.eclipse.ajdt.ui.tests.preferences.AspectJPreferencesTest)  Time elapsed: 3.162 sec
testPerformApply(org.eclipse.ajdt.ui.tests.preferences.AspectJProjectPropertiesPageTest)  Time elapsed: 3.33 sec
testPerformCancel(org.eclipse.ajdt.ui.tests.preferences.AspectJProjectPropertiesPageTest)  Time elapsed: 3.043 sec
testPerformApplyThenOk(org.eclipse.ajdt.ui.tests.preferences.AspectJProjectPropertiesPageTest)  Time elapsed: 3.853 sec
testPerformOk(org.eclipse.ajdt.ui.tests.preferences.AspectJProjectPropertiesPageTest)  Time elapsed: 3.078 sec
testPerformDefaults(org.eclipse.ajdt.ui.tests.preferences.AspectJProjectPropertiesPageTest)  Time elapsed: 3.378 sec
testPerformApplyAndBuild(org.eclipse.ajdt.ui.tests.preferences.Bug162211Test)  Time elapsed: 7.982 sec
testOpenAJFile(org.eclipse.ajdt.ui.tests.editor.AspectJEditorTest)  Time elapsed: 2.951 sec
testSetBreakpointA(org.eclipse.ajdt.ui.tests.editor.AspectJBreakpointRulerActionTest)  Time elapsed: 8.635 sec
testSetBreakpointB(org.eclipse.ajdt.ui.tests.editor.AspectJBreakpointRulerActionTest)  Time elapsed: 8.683 sec
testSetBreakpointC(org.eclipse.ajdt.ui.tests.editor.AspectJBreakpointRulerActionTest)  Time elapsed: 8.766 sec
testEditorIcon(org.eclipse.ajdt.ui.tests.editor.AspectJEditorIconTest)  Time elapsed: 5.914 sec
testOrganizeImportITD1(org.eclipse.ajdt.ui.tests.editor.AJOrganizeImportsTests)  Time elapsed: 8.98 sec
testOrganizeImportITD2(org.eclipse.ajdt.ui.tests.editor.AJOrganizeImportsTests)  Time elapsed: 6.453 sec
testOrganizeImportITD3(org.eclipse.ajdt.ui.tests.editor.AJOrganizeImportsTests)  Time elapsed: 5.927 sec
testOrganizeImportITD4(org.eclipse.ajdt.ui.tests.editor.AJOrganizeImportsTests)  Time elapsed: 6.177 sec
testOrganizeImportITD5(org.eclipse.ajdt.ui.tests.editor.AJOrganizeImportsTests)  Time elapsed: 5.937 sec
testOrganizeImportITD6(org.eclipse.ajdt.ui.tests.editor.AJOrganizeImportsTests)  Time elapsed: 5.762 sec
testOnDemand1(org.eclipse.ajdt.ui.tests.editor.AJOrganizeImportsTests)  Time elapsed: 6.115 sec
testOnDemand2(org.eclipse.ajdt.ui.tests.editor.AJOrganizeImportsTests)  Time elapsed: 6.828 sec
testOrganizeImportsSimple1(org.eclipse.ajdt.ui.tests.editor.AJOrganizeImportsTests)  Time elapsed: 6.285 sec
testOrganizeImport2a(org.eclipse.ajdt.ui.tests.editor.AJOrganizeImportsTests)  Time elapsed: 6.916 sec
testOrganizeImport3a(org.eclipse.ajdt.ui.tests.editor.AJOrganizeImportsTests)  Time elapsed: 6.352 sec
testOrganizeImports1(org.eclipse.ajdt.ui.tests.editor.AJOrganizeImportsTests)  Time elapsed: 6.546 sec
testOrganizeImport2(org.eclipse.ajdt.ui.tests.editor.AJOrganizeImportsTests)  Time elapsed: 5.922 sec
testOrganizeImport3(org.eclipse.ajdt.ui.tests.editor.AJOrganizeImportsTests)  Time elapsed: 6.416 sec
testOrganizeImport4(org.eclipse.ajdt.ui.tests.editor.AJOrganizeImportsTests)  Time elapsed: 5.88 sec
testDeclare1(org.eclipse.ajdt.ui.tests.editor.AJOrganizeImportsTests)  Time elapsed: 6.064 sec
testDeclare2(org.eclipse.ajdt.ui.tests.editor.AJOrganizeImportsTests)  Time elapsed: 5.867 sec
testDeclare4(org.eclipse.ajdt.ui.tests.editor.AJOrganizeImportsTests)  Time elapsed: 7.822 sec
testCodeFormat(org.eclipse.ajdt.ui.tests.editor.codeformat.CodeFormatTest)  Time elapsed: 8.036 sec
testGetNonStandardOptionsViaWorkbenchPreferences(org.eclipse.ajdt.ui.tests.ajde.BuildOptionsAdapterTest)  Time elapsed: 7.901 sec
testGetNonStandardOptionsViaProjectPreferences(org.eclipse.ajdt.ui.tests.ajde.BuildOptionsAdapterTest)  Time elapsed: 3.161 sec
testGetShowWeaveMessagesViaWorkbenchPreferences(org.eclipse.ajdt.ui.tests.ajde.BuildOptionsAdapterTest)  Time elapsed: 2.021 sec
testGetShowWeaveMessagesViaProjectPreferences(org.eclipse.ajdt.ui.tests.ajde.BuildOptionsAdapterTest)  Time elapsed: 3.235 sec
testClasspathOrder(org.eclipse.ajdt.ui.tests.ajde.ClasspathOrderTest)  Time elapsed: 6.495 sec
testBug148055(org.eclipse.ajdt.ui.tests.ajde.ProjectPropertiesTest)  Time elapsed: 8.1 sec
testHandleAJDTErrorWithMessageAndTitle(org.eclipse.ajdt.ui.tests.ajde.AJDTErrorHandlerTest)  Time elapsed: 2.063 sec
testHandleAJDTErrorWithMessage(org.eclipse.ajdt.ui.tests.ajde.AJDTErrorHandlerTest)  Time elapsed: 7.25 sec
testShowWeaveInfoMessagesAreNotIgnoredIProjectPreferenceAlreadySet(org.eclipse.ajdt.ui.tests.ajde.UIMessageHandlerTest)  Time elapsed: 7.645 sec
testShowWeaveInfoMessagesAreNotIgnoredIProjectPreferenceAlreadySet_2(org.eclipse.ajdt.ui.tests.ajde.UIMessageHandlerTest)  Time elapsed: 7.843 sec
testShowWeaveInfoMessagesAreNotIgnoredIfWorkbenchPreferenceAlreadySet_2(org.eclipse.ajdt.ui.tests.ajde.UIMessageHandlerTest)  Time elapsed: 6.827 sec
testShowWeaveInfoMessagesAreNotIgnoredIfWorkbenchPreferenceAlreadySet(org.eclipse.ajdt.ui.tests.ajde.UIMessageHandlerTest)  Time elapsed: 7.38 sec
testShowWeaveInfoMessagesAreNotIgnoredAfterWorkbenchPreferenceSet(org.eclipse.ajdt.ui.tests.ajde.UIMessageHandlerTest)  Time elapsed: 6.92 sec
testShowWeaveInfoMessagesAreNotIgnoredAfterProjectPreferenceSet(org.eclipse.ajdt.ui.tests.ajde.UIMessageHandlerTest)  Time elapsed: 7.143 sec
testHandleErrorWithMessageAndThrowable(org.eclipse.ajdt.ui.tests.ajde.UIMessageHandlerTest)  Time elapsed: 7.472 sec
testDefaultSettingsMessagesThatAreIgnored(org.eclipse.ajdt.ui.tests.ajde.UIMessageHandlerTest)  Time elapsed: 7.305 sec
testHandleAbortWithMessageAndThrowable(org.eclipse.ajdt.ui.tests.ajde.UIMessageHandlerTest)  Time elapsed: 7.078 sec
testJavaWithAspectQuickFixSetUp(org.eclipse.ajdt.ui.tests.editor.quickfix.AspectJQuickFixTest)  Time elapsed: 8.452 sec
testAspectQuickFixSetUp(org.eclipse.ajdt.ui.tests.editor.quickfix.AspectJQuickFixTest)  Time elapsed: 3.435 sec
testJavaQuickFixSetUp(org.eclipse.ajdt.ui.tests.editor.quickfix.AspectJQuickFixTest)  Time elapsed: 3.463 sec
testJavaWithAspectHasQuickFixes(org.eclipse.ajdt.ui.tests.editor.quickfix.AspectJQuickFixTest)  Time elapsed: 3.11 sec
testAspectHasQuickFixes(org.eclipse.ajdt.ui.tests.editor.quickfix.AspectJQuickFixTest)  Time elapsed: 3.282 sec
testJavaHasQuickFixes(org.eclipse.ajdt.ui.tests.editor.quickfix.AspectJQuickFixTest)  Time elapsed: 3.125 sec
testMainInAspect(org.eclipse.ajdt.ui.tests.launching.AJMainMethodSearchEngineTest)  Time elapsed: 1.912 sec
testMainInPackage(org.eclipse.ajdt.ui.tests.launching.AJMainMethodSearchEngineTest)  Time elapsed: 8.155 sec
testMainInClass(org.eclipse.ajdt.ui.tests.launching.AJMainMethodSearchEngineTest)  Time elapsed: 6.152 sec
testMainInPackageRoot(org.eclipse.ajdt.ui.tests.launching.AJMainMethodSearchEngineTest)  Time elapsed: 6.102 sec
testMainInProject(org.eclipse.ajdt.ui.tests.launching.AJMainMethodSearchEngineTest)  Time elapsed: 5.933 sec
testMainInClassWithAspect(org.eclipse.ajdt.ui.tests.launching.AJMainMethodSearchEngineTest)  Time elapsed: 5.846 sec
testWithTracingExample(org.eclipse.ajdt.ui.tests.launching.AJMainMethodSearchEngineTest)  Time elapsed: 12.126 sec
testMainInAspectInJavaFile(org.eclipse.ajdt.ui.tests.launching.AJMainMethodSearchEngineTest)  Time elapsed: 2.113 sec
testMainInNestedClassInAJFile(org.eclipse.ajdt.ui.tests.launching.AJMainMethodSearchEngineTest)  Time elapsed: 6.3 sec
testGenerateLTWConfigFile1(org.eclipse.ajdt.ui.tests.launching.LTWUtilsTest)  Time elapsed: 8.534 sec
testGenerateLTWConfigFile2(org.eclipse.ajdt.ui.tests.launching.LTWUtilsTest)  Time elapsed: 5.616 sec
testGenerateLTWConfigFile3(org.eclipse.ajdt.ui.tests.launching.LTWUtilsTest)  Time elapsed: 13.172 sec
testGenerateLTWConfigFile4(org.eclipse.ajdt.ui.tests.launching.LTWUtilsTest)  Time elapsed: 3.244 sec
testGenerateLTWConfigFile5(org.eclipse.ajdt.ui.tests.launching.LTWUtilsTest)  Time elapsed: 4.26 sec
testGenerateLTWConfigFile6(org.eclipse.ajdt.ui.tests.launching.LTWUtilsTest)  Time elapsed: 12.36 sec
testGenerateLTWConfigFile7(org.eclipse.ajdt.ui.tests.launching.LTWUtilsTest)  Time elapsed: 4.209 sec
testGetAspects(org.eclipse.ajdt.ui.tests.launching.LTWUtilsTest)  Time elapsed: 5.005 sec
testGenerateLTWConfigFile2(org.eclipse.ajdt.ui.tests.launching.LTWUtilsTest2)  Time elapsed: 5.615 sec
testGenerateLTWConfigFile3(org.eclipse.ajdt.ui.tests.launching.LTWUtilsTest2)  Time elapsed: 8.954 sec
testGenerateLTWConfigFile5(org.eclipse.ajdt.ui.tests.launching.LTWUtilsTest2)  Time elapsed: 4.295 sec
testGenerateLTWConfigFile6(org.eclipse.ajdt.ui.tests.launching.LTWUtilsTest2)  Time elapsed: 11.426 sec
testGenerateLTWConfigFile7(org.eclipse.ajdt.ui.tests.launching.LTWUtilsTest2)  Time elapsed: 4.44 sec
testGenerateLTWConfigFile8(org.eclipse.ajdt.ui.tests.launching.LTWUtilsTest2)  Time elapsed: 4.192 sec
testGetAspects(org.eclipse.ajdt.ui.tests.launching.LTWUtilsTest2)  Time elapsed: 4.987 sec
testBug158937(org.eclipse.ajdt.ui.tests.lazystart.ImageDecoratorTest)  Time elapsed: 3.13 sec
testBug159873(org.eclipse.ajdt.ui.tests.model.BinaryWeavingSupportTest)  Time elapsed: 5.149 sec
testIfAJCodeTemplatesAvailable(org.eclipse.ajdt.ui.tests.CodeTemplatesTest)  Time elapsed: 1.685 sec
testContentAssistA(org.eclipse.ajdt.ui.tests.editor.contentassist.ContentAssistTests)  Time elapsed: 7.797 sec
testContentAssistB(org.eclipse.ajdt.ui.tests.editor.contentassist.ContentAssistTests)  Time elapsed: 7.42 sec
testContentAssistC(org.eclipse.ajdt.ui.tests.editor.contentassist.ContentAssistTests)  Time elapsed: 7.118 sec
testContentAssistD(org.eclipse.ajdt.ui.tests.editor.contentassist.ContentAssistTests)  Time elapsed: 8.009 sec
testContentAssistE(org.eclipse.ajdt.ui.tests.editor.contentassist.ContentAssistTests)  Time elapsed: 6.982 sec
testContentAssistF(org.eclipse.ajdt.ui.tests.editor.contentassist.ContentAssistTests)  Time elapsed: 8.463 sec
testITDField(org.eclipse.ajdt.ui.tests.editor.contentassist.ContentAssistTests2)  Time elapsed: 8.375 sec
testITDMethod(org.eclipse.ajdt.ui.tests.editor.contentassist.ContentAssistTests2)  Time elapsed: 3.04 sec
testITDConstructor(org.eclipse.ajdt.ui.tests.editor.contentassist.ContentAssistTests2)  Time elapsed: 3.138 sec
testITDFieldInField(org.eclipse.ajdt.ui.tests.editor.contentassist.ContentAssistTests2)  Time elapsed: 3.053 sec
testITDFieldInFieldInOtherClass(org.eclipse.ajdt.ui.tests.editor.contentassist.ContentAssistTests2)  Time elapsed: 3.225 sec
testFromDeclareParent(org.eclipse.ajdt.ui.tests.editor.contentassist.ContentAssistTests2)  Time elapsed: 3.02 sec
testITDConstructorInOtherClass(org.eclipse.ajdt.ui.tests.editor.contentassist.ContentAssistTests2)  Time elapsed: 3.202 sec
testITDMethodInOtherClass(org.eclipse.ajdt.ui.tests.editor.contentassist.ContentAssistTests2)  Time elapsed: 2.969 sec
testFromITDOnDeclareParentInOtherClass(org.eclipse.ajdt.ui.tests.editor.contentassist.ContentAssistTests2)  Time elapsed: 3.218 sec
testFromDeclareParentInOtherClass(org.eclipse.ajdt.ui.tests.editor.contentassist.ContentAssistTests2)  Time elapsed: 2.883 sec
testFromITDOnDeclareParent(org.eclipse.ajdt.ui.tests.editor.contentassist.ContentAssistTests2)  Time elapsed: 3.274 sec
testITDFieldInOtherClass(org.eclipse.ajdt.ui.tests.editor.contentassist.ContentAssistTests2)  Time elapsed: 3.051 sec
testITDField(org.eclipse.ajdt.ui.tests.editor.contentassist.ContentAssistTests3)  Time elapsed: 2.222 sec
testITDMethod(org.eclipse.ajdt.ui.tests.editor.contentassist.ContentAssistTests3)  Time elapsed: 3.061 sec
testITDConstructor(org.eclipse.ajdt.ui.tests.editor.contentassist.ContentAssistTests3)  Time elapsed: 3.059 sec
testITDFieldInField(org.eclipse.ajdt.ui.tests.editor.contentassist.ContentAssistTests3)  Time elapsed: 3.195 sec
testITDFieldInFieldInOtherClass(org.eclipse.ajdt.ui.tests.editor.contentassist.ContentAssistTests3)  Time elapsed: 3.161 sec
testFromDeclareParent(org.eclipse.ajdt.ui.tests.editor.contentassist.ContentAssistTests3)  Time elapsed: 2.922 sec
testITDConstructorInOtherClass(org.eclipse.ajdt.ui.tests.editor.contentassist.ContentAssistTests3)  Time elapsed: 3.288 sec
testITDMethodInOtherClass(org.eclipse.ajdt.ui.tests.editor.contentassist.ContentAssistTests3)  Time elapsed: 3.076 sec
testFromITDOnDeclareParentInOtherClass(org.eclipse.ajdt.ui.tests.editor.contentassist.ContentAssistTests3)  Time elapsed: 3.134 sec
testFromDeclareParentInOtherClass(org.eclipse.ajdt.ui.tests.editor.contentassist.ContentAssistTests3)  Time elapsed: 2.997 sec
testFromITDOnDeclareParent(org.eclipse.ajdt.ui.tests.editor.contentassist.ContentAssistTests3)  Time elapsed: 2.935 sec
testITDFieldInOtherClass(org.eclipse.ajdt.ui.tests.editor.contentassist.ContentAssistTests3)  Time elapsed: 3.154 sec
testInITD(org.eclipse.ajdt.ui.tests.editor.contentassist.ContentAssistTests4)  Time elapsed: 3.047 sec
testInMainMethod(org.eclipse.ajdt.ui.tests.editor.contentassist.ContentAssistTests4)  Time elapsed: 3.257 sec
testInAdvice(org.eclipse.ajdt.ui.tests.editor.contentassist.ContentAssistTests4)  Time elapsed: 3.059 sec
testGenericContentAssist(org.eclipse.ajdt.ui.tests.editor.contentassist.ContentAssistTests5)  Time elapsed: 2.945 sec
testGenericContentAssist2(org.eclipse.ajdt.ui.tests.editor.contentassist.ContentAssistTests5)  Time elapsed: 3.284 sec
testGenericContentAssist3(org.eclipse.ajdt.ui.tests.editor.contentassist.ContentAssistTests5)  Time elapsed: 3.117 sec
testGenericContentAssist4(org.eclipse.ajdt.ui.tests.editor.contentassist.ContentAssistTests5)  Time elapsed: 2.929 sec
testGenericContentAssist(org.eclipse.ajdt.ui.tests.editor.contentassist.Bug273691ContentAssist)  Time elapsed: 3.204 sec
testHasAspectInClass(org.eclipse.ajdt.ui.tests.editor.contentassist.Bug280508ContentAssist)  Time elapsed: 7.934 sec
testAspectOfTypeInClass(org.eclipse.ajdt.ui.tests.editor.contentassist.Bug280508ContentAssist)  Time elapsed: 7.995 sec
testGetWithinTypeName(org.eclipse.ajdt.ui.tests.editor.contentassist.Bug280508ContentAssist)  Time elapsed: 6.986 sec
testAspectOfInClass(org.eclipse.ajdt.ui.tests.editor.contentassist.Bug280508ContentAssist)  Time elapsed: 6.894 sec
testAspectOfInAspect(org.eclipse.ajdt.ui.tests.editor.contentassist.Bug280508ContentAssist)  Time elapsed: 7.678 sec
testAspectOfTypeInAspect(org.eclipse.ajdt.ui.tests.editor.contentassist.Bug280508ContentAssist)  Time elapsed: 8.542 sec
testContentAssistInOtherType(org.eclipse.ajdt.ui.tests.editor.contentassist.ITITContentAssistTests)  Time elapsed: 7.528 sec
testContentAssistInAspect(org.eclipse.ajdt.ui.tests.editor.contentassist.ITITContentAssistTests)  Time elapsed: 8.311 sec
testContentAssistInTargetType(org.eclipse.ajdt.ui.tests.editor.contentassist.ITITContentAssistTests)  Time elapsed: 7.353 sec
testPrivateContentAssistShouldNotAppear(org.eclipse.ajdt.ui.tests.editor.contentassist.PetClinicTests)  Time elapsed: 14.499 sec
testPackageProtectedContentAssistShouldAppear(org.eclipse.ajdt.ui.tests.editor.contentassist.PetClinicTests)  Time elapsed: 7.582 sec
testPrivateContentAssistShouldAppear(org.eclipse.ajdt.ui.tests.editor.contentassist.PetClinicTests)  Time elapsed: 8.169 sec
testContentAssist(org.eclipse.ajdt.ui.tests.editor.contentassist.PetClinicTests)  Time elapsed: 7.748 sec
testPackageProtectedContentAssistShouldNotAppear(org.eclipse.ajdt.ui.tests.editor.contentassist.PetClinicTests)  Time elapsed: 7.429 sec
testPublicContentAssistShouldAppear(org.eclipse.ajdt.ui.tests.editor.contentassist.PetClinicTests)  Time elapsed: 7.968 sec
testModelCheck(org.eclipse.ajdt.ui.tests.editor.contentassist.PetClinicTests)  Time elapsed: 7.696 sec
testReconciling(org.eclipse.ajdt.ui.tests.editor.contentassist.PetClinicTests)  Time elapsed: 9.171 sec
testProjectWizardPerformFinish(org.eclipse.ajdt.ui.tests.wizards.AspectJProjectWizardTest)  Time elapsed: 6.383 sec
testProjectWizardPageAddition(org.eclipse.ajdt.ui.tests.wizards.AspectJProjectWizardTest)  Time elapsed: 2.011 sec
testHowDealingWithProjectDependencies(org.eclipse.ajdt.ui.tests.builder.ProjectDependenciesTest)  Time elapsed: 16.032 sec
testProjectDependencies1(org.eclipse.ajdt.ui.tests.builder.ProjectDependenciesTest)  Time elapsed: 26.217 sec
testProjectDependenciesWithPluginProjects(org.eclipse.ajdt.ui.tests.builder.ProjectDependenciesTest)  Time elapsed: 11.611 sec
testWithOutJarSwitch1(org.eclipse.ajdt.ui.tests.builder.ProjectDependenciesWithJarFilesTest)  Time elapsed: 26.224 sec
testWithOutJarSwitch2(org.eclipse.ajdt.ui.tests.builder.ProjectDependenciesWithJarFilesTest)  Time elapsed: 16.044 sec  <<< FAILURE!
junit.framework.AssertionFailedError: project X should have project Y's outjar on it's classpath
	at junit.framework.Assert.fail(Assert.java:57)
	at junit.framework.Assert.assertTrue(Assert.java:22)
	at junit.framework.TestCase.assertTrue(TestCase.java:192)
	at org.eclipse.ajdt.ui.tests.builder.ProjectDependenciesWithJarFilesTest.testWithOutJarSwitch2_aroundBody8(ProjectDependenciesWithJarFilesTest.java:496)
	at org.eclipse.ajdt.ui.tests.builder.ProjectDependenciesWithJarFilesTest.testWithOutJarSwitch2_aroundBody9$advice(ProjectDependenciesWithJarFilesTest.java:52)
	at org.eclipse.ajdt.ui.tests.builder.ProjectDependenciesWithJarFilesTest.testWithOutJarSwitch2(ProjectDependenciesWithJarFilesTest.java:1)

testWithOutJarSwitch3(org.eclipse.ajdt.ui.tests.builder.ProjectDependenciesWithJarFilesTest)  Time elapsed: 24.732 sec
testWithExportedJarFile(org.eclipse.ajdt.ui.tests.builder.ProjectDependenciesWithJarFilesTest)  Time elapsed: 12.348 sec
testWithExportedJarFileAndBinaryProject(org.eclipse.ajdt.ui.tests.builder.ProjectDependenciesWithJarFilesTest)  Time elapsed: 15.365 sec
testBuildTwiceWithOutJar(org.eclipse.ajdt.ui.tests.builder.ProjectDependenciesWithJarFilesTest)  Time elapsed: 16.323 sec
testWithExportedJarFileAndNoSrcEntry(org.eclipse.ajdt.ui.tests.builder.ProjectDependenciesWithJarFilesTest)  Time elapsed: 10.991 sec
testDependingProjectBuiltWhenOutjarChanges(org.eclipse.ajdt.ui.tests.builder.ProjectDependenciesWithJarFilesTest)  Time elapsed: 6.166 sec  <<< FAILURE!
junit.framework.AssertionFailedError:  P/jarCreatingProject should have P/jarDependentProject as it's list of referencing projects - if not, see JDT bug 84214 expected:<1> but was:<0>
	at junit.framework.Assert.fail(Assert.java:57)
	at junit.framework.Assert.failNotEquals(Assert.java:329)
	at junit.framework.Assert.assertEquals(Assert.java:78)
	at junit.framework.Assert.assertEquals(Assert.java:234)
	at junit.framework.TestCase.assertEquals(TestCase.java:401)
	at org.eclipse.ajdt.ui.tests.builder.ProjectDependenciesWithJarFilesTest.checkForJDTBug84214(ProjectDependenciesWithJarFilesTest.java:883)
	at org.eclipse.ajdt.ui.tests.builder.ProjectDependenciesWithJarFilesTest.testDependingProjectBuiltWhenOutjarChanges_aroundBody14(ProjectDependenciesWithJarFilesTest.java:775)
	at org.eclipse.ajdt.ui.tests.builder.ProjectDependenciesWithJarFilesTest.testDependingProjectBuiltWhenOutjarChanges_aroundBody15$advice(ProjectDependenciesWithJarFilesTest.java:52)
	at org.eclipse.ajdt.ui.tests.builder.ProjectDependenciesWithJarFilesTest.testDependingProjectBuiltWhenOutjarChanges(ProjectDependenciesWithJarFilesTest.java:1)

testMarkersAreAdded(org.eclipse.ajdt.ui.tests.builder.AdviceMarkersTest)  Time elapsed: 2.813 sec
testMarkers(org.eclipse.ajdt.ui.tests.builder.AdviceMarkersTest2)  Time elapsed: 3.037 sec
testMarkers(org.eclipse.ajdt.ui.tests.builder.AdviceMarkersTest3)  Time elapsed: 3.349 sec
testMarkers(org.eclipse.ajdt.ui.tests.builder.AdviceMarkersTest4)  Time elapsed: 3.122 sec
testMarkers(org.eclipse.ajdt.ui.tests.builder.AdviceMarkersTest5)  Time elapsed: 3.037 sec
testBug235204(org.eclipse.ajdt.ui.tests.builder.AdviceMarkersTest6)  Time elapsed: 3.397 sec
testChangeInProject(org.eclipse.ajdt.ui.tests.builder.AdviceMarkersTest7)  Time elapsed: 13.497 sec
testChangeOnAspectPath(org.eclipse.ajdt.ui.tests.builder.AdviceMarkersTest7)  Time elapsed: 7.504 sec
testDeclareErrorOnMultipleProjects(org.eclipse.ajdt.ui.tests.builder.Bug285188DecErrorTests)  Time elapsed: 6.355 sec
testBug128803(org.eclipse.ajdt.ui.tests.builder.Bug128803Test)  Time elapsed: 10.326 sec
testBug151818(org.eclipse.ajdt.ui.tests.builder.Bug151818Test)  Time elapsed: 3.335 sec
testnothing(org.eclipse.ajdt.ui.tests.builder.Bug243376Test)  Time elapsed: 2.127 sec
testCopyAndRemoveNewNonSrcFileWithNonStandardOutputDir(org.eclipse.ajdt.ui.tests.builder.BuilderTest)  Time elapsed: 12.223 sec
testCopyAndRemoveResourceWithoutSrcFolder(org.eclipse.ajdt.ui.tests.builder.BuilderTest)  Time elapsed: 5.608 sec
testCreateAndDeleteNewFolder(org.eclipse.ajdt.ui.tests.builder.BuilderTest)  Time elapsed: 9.105 sec
testIncrementalBuildWithSrcFolder(org.eclipse.ajdt.ui.tests.builder.BuilderTest)  Time elapsed: 8.232 sec
testCopyAndRemoveNewNonSrcFileWithMultipleSrcDirs(org.eclipse.ajdt.ui.tests.builder.BuilderTest)  Time elapsed: 7.33 sec
testCreateAndDeleteNewPackage(org.eclipse.ajdt.ui.tests.builder.BuilderTest)  Time elapsed: 9.018 sec
testIncrementalBuildWithoutSrcFolder(org.eclipse.ajdt.ui.tests.builder.BuilderTest)  Time elapsed: 7.883 sec
testCopyAndRemoveNewNonSrcFile(org.eclipse.ajdt.ui.tests.builder.BuilderTest)  Time elapsed: 9.52 sec
testUpdateNonSrcFile(org.eclipse.ajdt.ui.tests.builder.BuilderTest)  Time elapsed: 13.493 sec
testCreateAndRemoveNewNonSrcFileFromDefaultPackage(org.eclipse.ajdt.ui.tests.builder.BuilderTest)  Time elapsed: 12.34 sec
testAspectPath(org.eclipse.ajdt.ui.tests.builder.BuildPathTests)  Time elapsed: 26.183 sec
testInpath(org.eclipse.ajdt.ui.tests.builder.BuildPathTests)  Time elapsed: 25.153 sec
testMarkersUpdatedAfterChangedProject(org.eclipse.ajdt.ui.tests.builder.ChangingMarkersTest)  Time elapsed: 9.287 sec
testSavedMarkerPreferences(org.eclipse.ajdt.ui.tests.builder.CustomMarkersTest)  Time elapsed: 9.336 sec
testClean(org.eclipse.ajdt.ui.tests.builder.InpathOutFolderTest)  Time elapsed: 10.332 sec
testChangeInpathOutLocation(org.eclipse.ajdt.ui.tests.builder.InpathOutFolderTest)  Time elapsed: 5.712 sec
testJarOnInpath(org.eclipse.ajdt.ui.tests.builder.InpathOutFolderTest)  Time elapsed: 7.345 sec
testJarOnInpath(org.eclipse.ajdt.ui.tests.builder.InpathOutFolderTest2)  Time elapsed: 4.068 sec  <<< FAILURE!
junit.framework.AssertionFailedError: AspectJ RT should exist in the in path out folder
	at junit.framework.Assert.fail(Assert.java:57)
	at junit.framework.TestCase.fail(TestCase.java:227)
	at org.eclipse.ajdt.ui.tests.builder.InpathOutFolderTest2.testJarOnInpath_aroundBody0(InpathOutFolderTest2.java:63)
	at org.eclipse.ajdt.ui.tests.builder.InpathOutFolderTest2.testJarOnInpath_aroundBody1$advice(InpathOutFolderTest2.java:52)
	at org.eclipse.ajdt.ui.tests.builder.InpathOutFolderTest2.testJarOnInpath(InpathOutFolderTest2.java:1)

testBug121810(org.eclipse.ajdt.ui.tests.builder.ITDinSeparateProjects)  Time elapsed: 5.51 sec
testMarkerIsNotRemoved(org.eclipse.ajdt.ui.tests.builder.ProblemMarkerTest)  Time elapsed: 2.861 sec
testJavaNature(org.eclipse.ajdt.ui.tests.builder.EnsureAJBuilderTests)  Time elapsed: 3.147 sec
testAJBuilder(org.eclipse.ajdt.ui.tests.builder.EnsureAJBuilderTests)  Time elapsed: 8.153 sec
testNoRemoveJavaBuilder(org.eclipse.ajdt.ui.tests.builder.EnsureAJBuilderTests)  Time elapsed: 7.166 sec
testJavaBuilder(org.eclipse.ajdt.ui.tests.builder.EnsureAJBuilderTests)  Time elapsed: 7.963 sec
testNoBuilder(org.eclipse.ajdt.ui.tests.builder.EnsureAJBuilderTests)  Time elapsed: 7.441 sec
testBothBuilders(org.eclipse.ajdt.ui.tests.builder.EnsureAJBuilderTests)  Time elapsed: 7.988 sec
testDeletingAJCompilationUnits(org.eclipse.ajdt.ui.tests.javamodel.elements.AJCompilationUnitTest2)  Time elapsed: 8.982 sec
testWhenProjectIsConverted(org.eclipse.ajdt.ui.tests.javamodel.Bug154339Test)  Time elapsed: 5.808 sec
testWhenProjectIsDeleted(org.eclipse.ajdt.ui.tests.javamodel.Bug154339Test)  Time elapsed: 4.678 sec
testWhenProjectIsClosed(org.eclipse.ajdt.ui.tests.javamodel.Bug154339Test)  Time elapsed: 10.695 sec
testAspectInPackageDeclaration(org.eclipse.ajdt.ui.tests.reconciling.ProblemFinderTests4)  Time elapsed: 3.044 sec
testAspectFile(org.eclipse.ajdt.ui.tests.reconciling.ProblemFinderTests4)  Time elapsed: 3.424 sec
testJavaFile(org.eclipse.ajdt.ui.tests.reconciling.ProblemFinderTests4)  Time elapsed: 3.329 sec
testSwitchStatement(org.eclipse.ajdt.ui.tests.reconciling.ProblemFinderTests4)  Time elapsed: 3.066 sec
testProblemFindingAll(org.eclipse.ajdt.ui.tests.reconciling.ProblemFinderTests10)  Time elapsed: 3.923 sec
testProblemFindingErrors(org.eclipse.ajdt.ui.tests.reconciling.ProblemFinderTests10)  Time elapsed: 9.007 sec
testProblemFinding0(org.eclipse.ajdt.ui.tests.reconciling.ProblemFinderTests5)  Time elapsed: 7.738 sec
testProblemFinding1(org.eclipse.ajdt.ui.tests.reconciling.ProblemFinderTests5)  Time elapsed: 3.09 sec
testProblemFinding2(org.eclipse.ajdt.ui.tests.reconciling.ProblemFinderTests5)  Time elapsed: 1.926 sec
testProblemFinding3(org.eclipse.ajdt.ui.tests.reconciling.ProblemFinderTests5)  Time elapsed: 3.189 sec
testProblemFinding4(org.eclipse.ajdt.ui.tests.reconciling.ProblemFinderTests5)  Time elapsed: 2.083 sec
testProblemFinding5(org.eclipse.ajdt.ui.tests.reconciling.ProblemFinderTests5)  Time elapsed: 2.886 sec
testProblemFinding6(org.eclipse.ajdt.ui.tests.reconciling.ProblemFinderTests5)  Time elapsed: 2.297 sec
testProblemFinding0(org.eclipse.ajdt.ui.tests.reconciling.ProblemFinderTests6)  Time elapsed: 3.296 sec
testProblemFinding1(org.eclipse.ajdt.ui.tests.reconciling.ProblemFinderTests6)  Time elapsed: 3.217 sec
testProblemFinding2(org.eclipse.ajdt.ui.tests.reconciling.ProblemFinderTests6)  Time elapsed: 3.191 sec
testProblemFinding3(org.eclipse.ajdt.ui.tests.reconciling.ProblemFinderTests6)  Time elapsed: 3.171 sec
testProblemFinding4(org.eclipse.ajdt.ui.tests.reconciling.ProblemFinderTests6)  Time elapsed: 3.137 sec
testProblemFinding5(org.eclipse.ajdt.ui.tests.reconciling.ProblemFinderTests6)  Time elapsed: 3.258 sec
testProblemFinding0(org.eclipse.ajdt.ui.tests.reconciling.ProblemFinderTests8)  Time elapsed: 2.962 sec
testProblemFinding1(org.eclipse.ajdt.ui.tests.reconciling.ProblemFinderTests8)  Time elapsed: 7.8 sec
testProblemFinding2(org.eclipse.ajdt.ui.tests.reconciling.ProblemFinderTests8)  Time elapsed: 7.622 sec
testProblemFinding3(org.eclipse.ajdt.ui.tests.reconciling.ProblemFinderTests8)  Time elapsed: 7.572 sec
testProblemFinding4(org.eclipse.ajdt.ui.tests.reconciling.ProblemFinderTests8)  Time elapsed: 7.602 sec
testProblemFinding5(org.eclipse.ajdt.ui.tests.reconciling.ProblemFinderTests8)  Time elapsed: 7.632 sec
testProblemFinding6(org.eclipse.ajdt.ui.tests.reconciling.ProblemFinderTests8)  Time elapsed: 7.577 sec
testProblemFinding7(org.eclipse.ajdt.ui.tests.reconciling.ProblemFinderTests8)  Time elapsed: 7.468 sec
testProblemFindingAll(org.eclipse.ajdt.ui.tests.reconciling.ProblemFinderTests11)  Time elapsed: 7.076 sec
testProblemFindingErrors(org.eclipse.ajdt.ui.tests.reconciling.ProblemFinderTests11)  Time elapsed: 7.211 sec
testProblemFindingAll(org.eclipse.ajdt.ui.tests.reconciling.ProblemFinderTests12)  Time elapsed: 7.513 sec
testProblemFindingAll(org.eclipse.ajdt.ui.tests.reconciling.Bug279439Reconciling)  Time elapsed: 7.232 sec
testHyperlink(org.eclipse.ajdt.ui.tests.debug.JavaConsoleHyperlinkTest)  Time elapsed: 10.763 sec
testBreakpointInAJFile1(org.eclipse.ajdt.ui.tests.debug.DebugBreakpointsTests)  Time elapsed: 3.634 sec
testBreakpointInAJFile2(org.eclipse.ajdt.ui.tests.debug.DebugBreakpointsTests)  Time elapsed: 9.782 sec
testBreakpointInAJFile3(org.eclipse.ajdt.ui.tests.debug.DebugBreakpointsTests)  Time elapsed: 8.928 sec
testBreakpointInAJFile4(org.eclipse.ajdt.ui.tests.debug.DebugBreakpointsTests)  Time elapsed: 9.325 sec
testBreakpointInAJFile5(org.eclipse.ajdt.ui.tests.debug.DebugBreakpointsTests)  Time elapsed: 9.453 sec
testBreakpointInAJFile6(org.eclipse.ajdt.ui.tests.debug.DebugBreakpointsTests)  Time elapsed: 8.351 sec
testBreakpointInAJFile7(org.eclipse.ajdt.ui.tests.debug.DebugBreakpointsTests)  Time elapsed: 8.621 sec
testBreakpointInAJFile8(org.eclipse.ajdt.ui.tests.debug.DebugBreakpointsTests)  Time elapsed: 8.872 sec
testBreakpointInAJFile9(org.eclipse.ajdt.ui.tests.debug.DebugBreakpointsTests)  Time elapsed: 9.103 sec
testFFDC(org.eclipse.ajdt.ui.tests.ras.PluginFFDCTest)  Time elapsed: 7.567 sec
testRogueFFDC(org.eclipse.ajdt.ui.tests.ras.PluginFFDCTest)  Time elapsed: 7.219 sec
testRenamePackage(org.eclipse.ajdt.ui.tests.refactoring.RenamePackageTest)  Time elapsed: 8.329 sec
testBug106589(org.eclipse.ajdt.ui.tests.refactoring.OrganizeImportsTest)  Time elapsed: 8.718 sec
testBug188845(org.eclipse.ajdt.ui.tests.refactoring.OrganizeImportsTest)  Time elapsed: 8.472 sec
testBug236352(org.eclipse.ajdt.ui.tests.refactoring.OrganizeImportsTest)  Time elapsed: 6.811 sec
testCopyPasteAJ(org.eclipse.ajdt.ui.tests.refactoring.CopyPasteAJTest)  Time elapsed: 7.975 sec
testDeclareParents(org.eclipse.ajdt.ui.tests.refactoring.PushinRefactoringTests)  Time elapsed: 12.867 sec
testDeclareAnnotation(org.eclipse.ajdt.ui.tests.refactoring.PushinRefactoringTests)  Time elapsed: 6.454 sec
testDeclareAnnotationBig(org.eclipse.ajdt.ui.tests.refactoring.PushinRefactoringTests)  Time elapsed: 6.495 sec
testITDsWillDelete(org.eclipse.ajdt.ui.tests.refactoring.PushinRefactoringTests)  Time elapsed: 6.402 sec
testBug283657(org.eclipse.ajdt.ui.tests.refactoring.PushinRefactoringTests)  Time elapsed: 11.897 sec
testBug321065(org.eclipse.ajdt.ui.tests.refactoring.PushinRefactoringTests)  Time elapsed: 10.413 sec
testSimpleITDsNoDelete(org.eclipse.ajdt.ui.tests.refactoring.PushinRefactoringTests)  Time elapsed: 6.806 sec
testPushInRemoveFieldClassFullyQualified(org.eclipse.ajdt.ui.tests.refactoring.PushInRefactoringRemoveAnnotationTests)  Time elapsed: 4.289 sec
testPushInRemoveFieldAspectFullyQualified(org.eclipse.ajdt.ui.tests.refactoring.PushInRefactoringRemoveAnnotationTests)  Time elapsed: 6.324 sec
testPushInRemoveFieldMultiple(org.eclipse.ajdt.ui.tests.refactoring.PushInRefactoringRemoveAnnotationTests)  Time elapsed: 6.194 sec
testPushInRemoveFieldSimple(org.eclipse.ajdt.ui.tests.refactoring.PushInRefactoringRemoveAnnotationTests)  Time elapsed: 6.335 sec
testPushInRemoveFieldBothFullyQualified(org.eclipse.ajdt.ui.tests.refactoring.PushInRefactoringRemoveAnnotationTests)  Time elapsed: 6.323 sec
testPushInRemoveFieldMultiple2(org.eclipse.ajdt.ui.tests.refactoring.PushInRefactoringRemoveAnnotationTests)  Time elapsed: 6.479 sec
testPushInRemoveFieldDifferentPackages(org.eclipse.ajdt.ui.tests.refactoring.PushInRefactoringRemoveAnnotationTests)  Time elapsed: 6.36 sec
testPushInRemoveFieldClassFullyQualifiedMultiple1(org.eclipse.ajdt.ui.tests.refactoring.PushInRefactoringRemoveAnnotationTests)  Time elapsed: 6.56 sec
testPushInRemoveFieldClassFullyQualifiedMultiple2(org.eclipse.ajdt.ui.tests.refactoring.PushInRefactoringRemoveAnnotationTests)  Time elapsed: 6.427 sec
testImportRequired(org.eclipse.ajdt.ui.tests.refactoring.PushInRefactoringITITTests)  Time elapsed: 6.219 sec
testEmptyFullyQualifiedITIT(org.eclipse.ajdt.ui.tests.refactoring.PushInRefactoringITITTests)  Time elapsed: 6.244 sec
testOneFieldNoImports(org.eclipse.ajdt.ui.tests.refactoring.PushInRefactoringITITTests)  Time elapsed: 5.929 sec
testImportAlreadyThere(org.eclipse.ajdt.ui.tests.refactoring.PushInRefactoringITITTests)  Time elapsed: 6.306 sec
testEmptyITIT(org.eclipse.ajdt.ui.tests.refactoring.PushInRefactoringITITTests)  Time elapsed: 5.827 sec
testTwoITITsOneAspectDifferentTargets(org.eclipse.ajdt.ui.tests.refactoring.PushInRefactoringITITTests)  Time elapsed: 6.065 sec
testFullyQualifiedReference(org.eclipse.ajdt.ui.tests.refactoring.PushInRefactoringITITTests)  Time elapsed: 6.28 sec
testTwoITITsOneAspect(org.eclipse.ajdt.ui.tests.refactoring.PushInRefactoringITITTests)  Time elapsed: 5.951 sec
testTwoITITsOneAspectFirstOnly(org.eclipse.ajdt.ui.tests.refactoring.PushInRefactoringITITTests)  Time elapsed: 5.92 sec
testTwoFieldsNoImports(org.eclipse.ajdt.ui.tests.refactoring.PushInRefactoringITITTests)  Time elapsed: 5.814 sec
testAspectNotDeleted(org.eclipse.ajdt.ui.tests.refactoring.PushInRefactoringITITTests)  Time elapsed: 5.873 sec
testDefaultPackage1(org.eclipse.ajdt.ui.tests.refactoring.PushInRefactoringDeclareParentsTests)  Time elapsed: 5.999 sec
testDefaultPackage2(org.eclipse.ajdt.ui.tests.refactoring.PushInRefactoringDeclareParentsTests)  Time elapsed: 5.846 sec
testDefaultPackage3(org.eclipse.ajdt.ui.tests.refactoring.PushInRefactoringDeclareParentsTests)  Time elapsed: 6.31 sec
testDefaultPackage4(org.eclipse.ajdt.ui.tests.refactoring.PushInRefactoringDeclareParentsTests)  Time elapsed: 6.249 sec
testDefaultPackage5(org.eclipse.ajdt.ui.tests.refactoring.PushInRefactoringDeclareParentsTests)  Time elapsed: 6.027 sec
testDefaultPackage6(org.eclipse.ajdt.ui.tests.refactoring.PushInRefactoringDeclareParentsTests)  Time elapsed: 6.101 sec
testDefaultPackage7(org.eclipse.ajdt.ui.tests.refactoring.PushInRefactoringDeclareParentsTests)  Time elapsed: 6.225 sec
testDefaultPackage8(org.eclipse.ajdt.ui.tests.refactoring.PushInRefactoringDeclareParentsTests)  Time elapsed: 6.563 sec
testSamePackage1(org.eclipse.ajdt.ui.tests.refactoring.PushInRefactoringDeclareParentsTests)  Time elapsed: 6.201 sec
testSamePackage2(org.eclipse.ajdt.ui.tests.refactoring.PushInRefactoringDeclareParentsTests)  Time elapsed: 6.774 sec
testSamePackage3(org.eclipse.ajdt.ui.tests.refactoring.PushInRefactoringDeclareParentsTests)  Time elapsed: 6.845 sec
testGenerics1(org.eclipse.ajdt.ui.tests.refactoring.PushInRefactoringDeclareParentsTests)  Time elapsed: 6.054 sec
testOtherPackage1(org.eclipse.ajdt.ui.tests.refactoring.PushInRefactoringDeclareParentsTests)  Time elapsed: 6.548 sec
testOtherPackage2(org.eclipse.ajdt.ui.tests.refactoring.PushInRefactoringDeclareParentsTests)  Time elapsed: 6.753 sec
testPullProtected(org.eclipse.ajdt.ui.tests.refactoring.PullOutRefactoringTests)  Time elapsed: 6.069 sec
testPullSamePackage(org.eclipse.ajdt.ui.tests.refactoring.PullOutRefactoringTests)  Time elapsed: 6.594 sec
testGenericParamPrivateTypeRef(org.eclipse.ajdt.ui.tests.refactoring.PullOutRefactoringTests)  Time elapsed: 5.926 sec
testPullSameAspect(org.eclipse.ajdt.ui.tests.refactoring.PullOutRefactoringTests)  Time elapsed: 6.171 sec
testAddModifierWeirdComments(org.eclipse.ajdt.ui.tests.refactoring.PullOutRefactoringTests)  Time elapsed: 6.49 sec
testScaffolding(org.eclipse.ajdt.ui.tests.refactoring.PullOutRefactoringTests)  Time elapsed: 5.817 sec
testPullAbstractMethodWarnings(org.eclipse.ajdt.ui.tests.refactoring.PullOutRefactoringTests)  Time elapsed: 5.907 sec
testPullITDField(org.eclipse.ajdt.ui.tests.refactoring.PullOutRefactoringTests)  Time elapsed: 6.664 sec
testPullMultipleTargetsCanPrivate(org.eclipse.ajdt.ui.tests.refactoring.PullOutRefactoringTests)  Time elapsed: 6.667 sec
testPullWeirdComments(org.eclipse.ajdt.ui.tests.refactoring.PullOutRefactoringTests)  Time elapsed: 6.418 sec
testPrivateFieldReference2(org.eclipse.ajdt.ui.tests.refactoring.PullOutRefactoringTests)  Time elapsed: 6.06 sec
testPullMultipleTargetsSimple(org.eclipse.ajdt.ui.tests.refactoring.PullOutRefactoringTests)  Time elapsed: 6.61 sec
testPrivateMethodReference(org.eclipse.ajdt.ui.tests.refactoring.PullOutRefactoringTests)  Time elapsed: 5.892 sec
testPublicizeITDs(org.eclipse.ajdt.ui.tests.refactoring.PullOutRefactoringTests)  Time elapsed: 6.2 sec
testImportNameCollisionInDeclaringTypeRef(org.eclipse.ajdt.ui.tests.refactoring.PullOutRefactoringTests)  Time elapsed: 6.38 sec
testPrivateFieldReference(org.eclipse.ajdt.ui.tests.refactoring.PullOutRefactoringTests)  Time elapsed: 6.054 sec
testMakePrivilegedPrivileged(org.eclipse.ajdt.ui.tests.refactoring.PullOutRefactoringTests)  Time elapsed: 6.655 sec
testPullITDMethod(org.eclipse.ajdt.ui.tests.refactoring.PullOutRefactoringTests)  Time elapsed: 6.686 sec
testPrivilegedAspect(org.eclipse.ajdt.ui.tests.refactoring.PullOutRefactoringTests)  Time elapsed: 6.68 sec
testSimplePrivateTypeRef(org.eclipse.ajdt.ui.tests.refactoring.PullOutRefactoringTests)  Time elapsed: 5.856 sec
testPullSameCU(org.eclipse.ajdt.ui.tests.refactoring.PullOutRefactoringTests)  Time elapsed: 6.922 sec
testPullStatic(org.eclipse.ajdt.ui.tests.refactoring.PullOutRefactoringTests)  Time elapsed: 6.535 sec
testFieldPulling(org.eclipse.ajdt.ui.tests.refactoring.PullOutRefactoringTests)  Time elapsed: 6.804 sec
testPullInterfaceMethodWarning(org.eclipse.ajdt.ui.tests.refactoring.PullOutRefactoringTests)  Time elapsed: 6.057 sec
testGenericTypeParamUsed(org.eclipse.ajdt.ui.tests.refactoring.PullOutRefactoringTests)  Time elapsed: 6.348 sec
testPullITDConstructor(org.eclipse.ajdt.ui.tests.refactoring.PullOutRefactoringTests)  Time elapsed: 6.5 sec
testProtectedDropping(org.eclipse.ajdt.ui.tests.refactoring.PullOutRefactoringTests)  Time elapsed: 6.897 sec
testPullAspectMethod(org.eclipse.ajdt.ui.tests.refactoring.PullOutRefactoringTests)  Time elapsed: 6.63 sec
testPullAbstractStubMethods(org.eclipse.ajdt.ui.tests.refactoring.PullOutRefactoringTests)  Time elapsed: 7.009 sec
testPullPrivate(org.eclipse.ajdt.ui.tests.refactoring.PullOutRefactoringTests)  Time elapsed: 6.163 sec
testPullConstructorWithThisWarning(org.eclipse.ajdt.ui.tests.refactoring.PullOutRefactoringTests)  Time elapsed: 6.019 sec
testProtectedAndDefaulReference(org.eclipse.ajdt.ui.tests.refactoring.PullOutRefactoringTests)  Time elapsed: 5.834 sec
testImports(org.eclipse.ajdt.ui.tests.refactoring.PullOutRefactoringTests)  Time elapsed: 6.577 sec
testImportNameCollision(org.eclipse.ajdt.ui.tests.refactoring.PullOutRefactoringTests)  Time elapsed: 9.11 sec
testMakePrivilegedAspect(org.eclipse.ajdt.ui.tests.refactoring.PullOutRefactoringTests)  Time elapsed: 6.822 sec
testPullConstructor(org.eclipse.ajdt.ui.tests.refactoring.PullOutRefactoringTests)  Time elapsed: 6.664 sec
testSimple(org.eclipse.ajdt.ui.tests.refactoring.PullOutRefactoringTests)  Time elapsed: 6.475 sec
testArrayPrivateTypeRef(org.eclipse.ajdt.ui.tests.refactoring.PullOutRefactoringTests)  Time elapsed: 6.006 sec
testDifferentPackage(org.eclipse.ajdt.ui.tests.refactoring.PullOutRefactoringTests)  Time elapsed: 6.611 sec
testPullInterfaceVoidStubMethods(org.eclipse.ajdt.ui.tests.refactoring.PullOutRefactoringTests)  Time elapsed: 6.394 sec
testMultipleGenericTypeParamUsed(org.eclipse.ajdt.ui.tests.refactoring.PullOutRefactoringTests)  Time elapsed: 6.596 sec
testPullConstructorWithPrivateWarnings(org.eclipse.ajdt.ui.tests.refactoring.PullOutRefactoringTests)  Time elapsed: 6.042 sec
testRipple1(org.eclipse.ajdt.ui.tests.refactoring.ITDAwareRippleSearchTests)  Time elapsed: 5.883 sec
testRipple2(org.eclipse.ajdt.ui.tests.refactoring.ITDAwareRippleSearchTests)  Time elapsed: 6.014 sec
testRipple3(org.eclipse.ajdt.ui.tests.refactoring.ITDAwareRippleSearchTests)  Time elapsed: 5.907 sec
testRipple4(org.eclipse.ajdt.ui.tests.refactoring.ITDAwareRippleSearchTests)  Time elapsed: 6.172 sec
testRipple5(org.eclipse.ajdt.ui.tests.refactoring.ITDAwareRippleSearchTests)  Time elapsed: 5.95 sec
testRipple6(org.eclipse.ajdt.ui.tests.refactoring.ITDAwareRippleSearchTests)  Time elapsed: 6.016 sec
testRippleInterface1(org.eclipse.ajdt.ui.tests.refactoring.ITDAwareRippleSearchTests)  Time elapsed: 6.334 sec
testRippleInterface2(org.eclipse.ajdt.ui.tests.refactoring.ITDAwareRippleSearchTests)  Time elapsed: 6.03 sec
testRippleInterface3(org.eclipse.ajdt.ui.tests.refactoring.ITDAwareRippleSearchTests)  Time elapsed: 5.57 sec
testRippleInterface4(org.eclipse.ajdt.ui.tests.refactoring.ITDAwareRippleSearchTests)  Time elapsed: 6.139 sec
testRippleInterface5(org.eclipse.ajdt.ui.tests.refactoring.ITDAwareRippleSearchTests)  Time elapsed: 6.169 sec
testRippleInterface6(org.eclipse.ajdt.ui.tests.refactoring.ITDAwareRippleSearchTests)  Time elapsed: 7.291 sec
testPrivateRenameField1(org.eclipse.ajdt.ui.tests.refactoring.ITDRenameProcessorTests)  Time elapsed: 5.749 sec
testMethodRenameOnInterfaceWithDeclareParents1(org.eclipse.ajdt.ui.tests.refactoring.ITDRenameProcessorTests)  Time elapsed: 6.307 sec
testMethodRenameOnInterfaceWithDeclareParents2(org.eclipse.ajdt.ui.tests.refactoring.ITDRenameProcessorTests)  Time elapsed: 5.892 sec
testSimpleRenameField1(org.eclipse.ajdt.ui.tests.refactoring.ITDRenameProcessorTests)  Time elapsed: 6.286 sec
testSimpleRenameField2(org.eclipse.ajdt.ui.tests.refactoring.ITDRenameProcessorTests)  Time elapsed: 6.174 sec
testSimpleRenameField3(org.eclipse.ajdt.ui.tests.refactoring.ITDRenameProcessorTests)  Time elapsed: 5.865 sec
testRenameMethodTwoArgs1(org.eclipse.ajdt.ui.tests.refactoring.ITDRenameProcessorTests)  Time elapsed: 5.779 sec
testRenameMethodTwoArgs2(org.eclipse.ajdt.ui.tests.refactoring.ITDRenameProcessorTests)  Time elapsed: 6.522 sec
testRenameMethodTwoArgs3(org.eclipse.ajdt.ui.tests.refactoring.ITDRenameProcessorTests)  Time elapsed: 7.899 sec
testRenameMethodPrimitiveArg1(org.eclipse.ajdt.ui.tests.refactoring.ITDRenameProcessorTests)  Time elapsed: 7.198 sec
testRenameMethodPrimitiveArg2(org.eclipse.ajdt.ui.tests.refactoring.ITDRenameProcessorTests)  Time elapsed: 5.878 sec
testRenameMethodPrimitiveArg3(org.eclipse.ajdt.ui.tests.refactoring.ITDRenameProcessorTests)  Time elapsed: 7.068 sec
testRenameMethodStringArg1(org.eclipse.ajdt.ui.tests.refactoring.ITDRenameProcessorTests)  Time elapsed: 6.3 sec
testRenameMethodStringArg2(org.eclipse.ajdt.ui.tests.refactoring.ITDRenameProcessorTests)  Time elapsed: 5.904 sec
testRenameMethodStringArg3(org.eclipse.ajdt.ui.tests.refactoring.ITDRenameProcessorTests)  Time elapsed: 6.92 sec
testRenameMethodListOfStringArg1(org.eclipse.ajdt.ui.tests.refactoring.ITDRenameProcessorTests)  Time elapsed: 6.32 sec
testRenameMethodListOfStringArg2(org.eclipse.ajdt.ui.tests.refactoring.ITDRenameProcessorTests)  Time elapsed: 6.534 sec
testRenameMethodListOfStringArg3(org.eclipse.ajdt.ui.tests.refactoring.ITDRenameProcessorTests)  Time elapsed: 7.035 sec
testMultiFileRenameField1(org.eclipse.ajdt.ui.tests.refactoring.ITDRenameProcessorTests)  Time elapsed: 6.436 sec
testRenameMethodQualifiedListArg1(org.eclipse.ajdt.ui.tests.refactoring.ITDRenameProcessorTests)  Time elapsed: 6.266 sec
testRenameMethodQualifiedListArg2(org.eclipse.ajdt.ui.tests.refactoring.ITDRenameProcessorTests)  Time elapsed: 5.984 sec
testRenameMethodQualifiedListArg3(org.eclipse.ajdt.ui.tests.refactoring.ITDRenameProcessorTests)  Time elapsed: 6.877 sec
testRenameMethodNoArgs1(org.eclipse.ajdt.ui.tests.refactoring.ITDRenameProcessorTests)  Time elapsed: 7.035 sec
testRenameMethodNoArgs2(org.eclipse.ajdt.ui.tests.refactoring.ITDRenameProcessorTests)  Time elapsed: 6.145 sec
testRenameMethodNoArgs3(org.eclipse.ajdt.ui.tests.refactoring.ITDRenameProcessorTests)  Time elapsed: 7.01 sec
testExtractLocalSimple1(org.eclipse.ajdt.ui.tests.refactoring.ExtractLocalTests)  Time elapsed: 6.354 sec
testExtractLocalSimple2(org.eclipse.ajdt.ui.tests.refactoring.ExtractLocalTests)  Time elapsed: 6.968 sec
testExtractLocalAspect1(org.eclipse.ajdt.ui.tests.refactoring.ExtractLocalTests)  Time elapsed: 5.833 sec
testExtractLocalAspect2(org.eclipse.ajdt.ui.tests.refactoring.ExtractLocalTests)  Time elapsed: 6.057 sec
testExtractLocalAspect3(org.eclipse.ajdt.ui.tests.refactoring.ExtractLocalTests)  Time elapsed: 6.506 sec
testExtractLocalAspect4(org.eclipse.ajdt.ui.tests.refactoring.ExtractLocalTests)  Time elapsed: 6.35 sec
testExtractLocalAspect5(org.eclipse.ajdt.ui.tests.refactoring.ExtractLocalTests)  Time elapsed: 5.981 sec
testExtractConstantAspect1(org.eclipse.ajdt.ui.tests.refactoring.ExtractConstantTests)  Time elapsed: 5.844 sec
testExtractConstantAspect2(org.eclipse.ajdt.ui.tests.refactoring.ExtractConstantTests)  Time elapsed: 6.125 sec
testExtractConstantAspect3(org.eclipse.ajdt.ui.tests.refactoring.ExtractConstantTests)  Time elapsed: 6.019 sec
testExtractConstantAspect4(org.eclipse.ajdt.ui.tests.refactoring.ExtractConstantTests)  Time elapsed: 5.639 sec
testExtractConstantAspect5(org.eclipse.ajdt.ui.tests.refactoring.ExtractConstantTests)  Time elapsed: 5.898 sec
testExtractConstantSimple1(org.eclipse.ajdt.ui.tests.refactoring.ExtractConstantTests)  Time elapsed: 6.194 sec
testExtractConstantSimple2(org.eclipse.ajdt.ui.tests.refactoring.ExtractConstantTests)  Time elapsed: 6.093 sec
testConvertLocalToFieldSimple1(org.eclipse.ajdt.ui.tests.refactoring.ConvertLocalToFieldTests)  Time elapsed: 5.876 sec
testConvertLocalToFieldSimple2(org.eclipse.ajdt.ui.tests.refactoring.ConvertLocalToFieldTests)  Time elapsed: 6.048 sec
testConvertLocalToFieldAspect1(org.eclipse.ajdt.ui.tests.refactoring.ConvertLocalToFieldTests)  Time elapsed: 6.024 sec
testConvertLocalToFieldAspect2(org.eclipse.ajdt.ui.tests.refactoring.ConvertLocalToFieldTests)  Time elapsed: 5.742 sec
testConvertLocalToFieldAspect3(org.eclipse.ajdt.ui.tests.refactoring.ConvertLocalToFieldTests)  Time elapsed: 6.104 sec
testConvertLocalToFieldAspect4(org.eclipse.ajdt.ui.tests.refactoring.ConvertLocalToFieldTests)  Time elapsed: 5.799 sec
testConvertLocalToFieldAspect5(org.eclipse.ajdt.ui.tests.refactoring.ConvertLocalToFieldTests)  Time elapsed: 5.813 sec
testAspectWithITD1(org.eclipse.ajdt.ui.tests.refactoring.MoveTypeIntoAspectRefactoringTests)  Time elapsed: 6.058 sec
testAspectWithITD2(org.eclipse.ajdt.ui.tests.refactoring.MoveTypeIntoAspectRefactoringTests)  Time elapsed: 6.025 sec
testSimple1(org.eclipse.ajdt.ui.tests.refactoring.MoveTypeIntoAspectRefactoringTests)  Time elapsed: 6.211 sec
testSimple2(org.eclipse.ajdt.ui.tests.refactoring.MoveTypeIntoAspectRefactoringTests)  Time elapsed: 6.147 sec
testSimple3(org.eclipse.ajdt.ui.tests.refactoring.MoveTypeIntoAspectRefactoringTests)  Time elapsed: 5.953 sec
testSimple4(org.eclipse.ajdt.ui.tests.refactoring.MoveTypeIntoAspectRefactoringTests)  Time elapsed: 5.976 sec
testSuperTypeHierarchyOfNonFocusType(org.eclipse.ajdt.ui.tests.hierarchy.ITDAwareHierarchyTests)  Time elapsed: 8.215 sec
testSuperTypeHierarchyOfFocusType(org.eclipse.ajdt.ui.tests.hierarchy.ITDAwareHierarchyTests)  Time elapsed: 3.182 sec
testSubTypeHierarchy(org.eclipse.ajdt.ui.tests.hierarchy.ITDAwareHierarchyTests)  Time elapsed: 2.839 sec
testAbstractAspectWithDeclare(org.eclipse.ajdt.ui.tests.hierarchy.ITDAwareHierarchyTests2)  Time elapsed: 4.735 sec
testAbstractGenericAspectWithDeclare(org.eclipse.ajdt.ui.tests.hierarchy.ITDAwareHierarchyTests2)  Time elapsed: 6.161 sec
testDisabled(org.eclipse.ajdt.ui.tests.ErrorLogTest)  Time elapsed: 6.705 sec
testViewsAreValid(org.eclipse.ajdt.ui.tests.VerificationTest)  Time elapsed: 7.635 sec
testAbsentNavigatorView(org.eclipse.ajdt.ui.tests.VerificationTest)  Time elapsed: 6.977 sec
testAbsentStructureModelView(org.eclipse.ajdt.ui.tests.VerificationTest)  Time elapsed: 7.373 sec
testBug106813(org.eclipse.ajdt.ui.tests.Bug106813Test)  Time elapsed: 8.408 sec
testPredefinedProjectsTool(org.eclipse.ajdt.ui.tests.testutils.TestForPredefinedProjectsTool)  Time elapsed: 7.535 sec
testProjectsToolWithClosedProjects(org.eclipse.ajdt.ui.tests.testutils.TestForPredefinedProjectsTool)  Time elapsed: 4.238 sec
testBug93532(org.eclipse.ajdt.ui.tests.utils.AJDTUtilsTest)  Time elapsed: 4.336 sec
testCaseInsensitiveNoSrcFolder(org.eclipse.ajdt.ui.tests.utils.AJDTUtilsTest)  Time elapsed: 2.038 sec
testCaseInsensitive(org.eclipse.ajdt.ui.tests.utils.AJDTUtilsTest)  Time elapsed: 2.087 sec
testAddAndRemoveAjrtToBuildPath(org.eclipse.ajdt.ui.tests.utils.AJDTUtilsTest)  Time elapsed: 5.267 sec
testAddAndRemoveWithExcludes(org.eclipse.ajdt.ui.tests.utils.AJDTUtilsTest)  Time elapsed: 3.156 sec
testAddAndRemoveAspectJNature(org.eclipse.ajdt.ui.tests.utils.AJDTUtilsTest)  Time elapsed: 3.023 sec
testCaseInsensitiveDriveLetters(org.eclipse.ajdt.ui.tests.utils.AJDTUtilsTest)  Time elapsed: 1.986 sec
testAddAndRemoveWithExcludes2(org.eclipse.ajdt.ui.tests.utils.AJDTUtilsTest)  Time elapsed: 3.247 sec
testAddAndRemoveAspectJNatureWithBundleProject(org.eclipse.ajdt.ui.tests.utils.AJDTUtilsTest)  Time elapsed: 7.332 sec

Results :

Failed tests: 
  ProjectDependenciesWithJarFilesTest.testWithOutJarSwitch2:1->testWithOutJarSwitch2_aroundBody9$advice:52->testWithOutJarSwitch2_aroundBody8:496 project X should have project Y's outjar on it's classpath
  ProjectDependenciesWithJarFilesTest.testDependingProjectBuiltWhenOutjarChanges:1->testDependingProjectBuiltWhenOutjarChanges_aroundBody15$advice:52->testDependingProjectBuiltWhenOutjarChanges_aroundBody14:775->checkForJDTBug84214:883  P/jarCreatingProject should have P/jarDependentProject as it's list of referencing projects - if not, see JDT bug 84214 expected:<1> but was:<0>
  InpathOutFolderTest2.testJarOnInpath:1->testJarOnInpath_aroundBody1$advice:52->testJarOnInpath_aroundBody0:63 AspectJ RT should exist in the in path out folder

Tests run: 438, Failures: 3, Errors: 0, Skipped: 0

Timer event: 1ms: Update visualizer, xref, advice listeners for (separate thread): DefaultEmptyProject
>> finished a build
>> scheduled a build

!ENTRY org.eclipse.core.resources 2 10035 2017-04-24 18:46:43.039
!MESSAGE The workspace will exit with unsaved changes in this session.
>> finished a build
[ERROR] There are test failures.

Please refer to /jobs/genie.ajdt/ajdt-on-eclipse-47/workspace/org.eclipse.ajdt.ui.tests/target/surefire-reports for the individual test results.
[INFO] 
[INFO] --- eclipse-jarsigner-plugin:1.0.4:sign (sign) @ org.eclipse.ajdt.ui.tests ---
[INFO] Signed org.eclipse.ajdt:org.eclipse.ajdt.ui.tests:eclipse-test-plugin:2.2.4-SNAPSHOT in 2 seconds.
[INFO] Signed org.eclipse.ajdt:org.eclipse.ajdt.ui.tests:java-source:sources:2.2.4-SNAPSHOT in 0 seconds.
[INFO] 
[INFO] --- tycho-p2-plugin:0.23.1:p2-metadata (p2-metadata) @ org.eclipse.ajdt.ui.tests ---
[INFO]                                                                         
[INFO] ------------------------------------------------------------------------
[INFO] Building org.eclipse.contribution.weaving.jdt.tests 2.2.4-SNAPSHOT
[INFO] ------------------------------------------------------------------------
[INFO] 
[INFO] --- maven-clean-plugin:2.5:clean (default-clean) @ org.eclipse.contribution.weaving.jdt.tests ---
[INFO] Deleting /jobs/genie.ajdt/ajdt-on-eclipse-47/workspace/org.eclipse.contribution.weaving.jdt.tests/target
[INFO] 
[INFO] --- tycho-packaging-plugin:0.23.1:build-qualifier (default-build-qualifier) @ org.eclipse.contribution.weaving.jdt.tests ---
[INFO] The project's OSGi version is 2.2.4.201704242114
[INFO] 
[INFO] --- tycho-packaging-plugin:0.23.1:validate-id (default-validate-id) @ org.eclipse.contribution.weaving.jdt.tests ---
[INFO] 
[INFO] --- tycho-packaging-plugin:0.23.1:validate-version (default-validate-version) @ org.eclipse.contribution.weaving.jdt.tests ---
[INFO] 
[INFO] --- maven-resources-plugin:2.4.3:resources (default-resources) @ org.eclipse.contribution.weaving.jdt.tests ---
[WARNING] Using platform encoding (UTF-8 actually) to copy filtered resources, i.e. build is platform dependent!
[INFO] skip non existing resourceDirectory /jobs/genie.ajdt/ajdt-on-eclipse-47/workspace/org.eclipse.contribution.weaving.jdt.tests/src/main/resources
[INFO] 
[INFO] --- tycho-compiler-plugin:0.23.1:compile (default-compile) @ org.eclipse.contribution.weaving.jdt.tests ---
[INFO] Compiling 20 source files to /jobs/genie.ajdt/ajdt-on-eclipse-47/workspace/org.eclipse.contribution.weaving.jdt.tests/target/classes
[INFO] 
[INFO] --- maven-resources-plugin:2.4.3:testResources (default-testResources) @ org.eclipse.contribution.weaving.jdt.tests ---
[WARNING] Using platform encoding (UTF-8 actually) to copy filtered resources, i.e. build is platform dependent!
[INFO] skip non existing resourceDirectory /jobs/genie.ajdt/ajdt-on-eclipse-47/workspace/org.eclipse.contribution.weaving.jdt.tests/src/test/resources
[INFO] 
[INFO] --- target-platform-configuration:0.23.1:target-platform (default-target-platform) @ org.eclipse.contribution.weaving.jdt.tests ---
[INFO] 
[INFO] --- tycho-packaging-plugin:0.23.1:package-plugin (default-package-plugin) @ org.eclipse.contribution.weaving.jdt.tests ---
[INFO] Building jar: /jobs/genie.ajdt/ajdt-on-eclipse-47/workspace/org.eclipse.contribution.weaving.jdt.tests/jdtweavingtests.jar
[INFO] Building jar: /jobs/genie.ajdt/ajdt-on-eclipse-47/workspace/org.eclipse.contribution.weaving.jdt.tests/target/org.eclipse.contribution.weaving.jdt.tests-2.2.4-SNAPSHOT.jar
[INFO] 
[INFO] --- tycho-p2-plugin:0.23.1:p2-metadata-default (default-p2-metadata-default) @ org.eclipse.contribution.weaving.jdt.tests ---
[INFO] 
[INFO] --- tycho-surefire-plugin:0.23.1:test (default-test) @ org.eclipse.contribution.weaving.jdt.tests ---
[INFO] Expected eclipse log file: /jobs/genie.ajdt/ajdt-on-eclipse-47/workspace/org.eclipse.contribution.weaving.jdt.tests/target/work/data/.metadata/.log
[INFO] Command line:
	[/opt/public/common/jdk1.8.0_121.x64/jre/bin/java, -Dosgi.noShutdown=false, -Dosgi.os=linux, -Dosgi.ws=gtk, -Dosgi.arch=x86_64, -Xmx1024m, -XX:MaxPermSize=256m, -Dosgi.clean=true, -jar, /jobs/genie.ajdt/ajdt-on-eclipse-47/workspace/.maven/repo/p2/osgi/bundle/org.eclipse.equinox.launcher/1.4.0.v20161219-1356/org.eclipse.equinox.launcher-1.4.0.v20161219-1356.jar, -debug, -consolelog, -data, /jobs/genie.ajdt/ajdt-on-eclipse-47/workspace/org.eclipse.contribution.weaving.jdt.tests/target/work/data, -install, /jobs/genie.ajdt/ajdt-on-eclipse-47/workspace/org.eclipse.contribution.weaving.jdt.tests/target/work, -configuration, /jobs/genie.ajdt/ajdt-on-eclipse-47/workspace/org.eclipse.contribution.weaving.jdt.tests/target/work/configuration, -application, org.eclipse.tycho.surefire.osgibooter.uitest, -testproperties, /jobs/genie.ajdt/ajdt-on-eclipse-47/workspace/org.eclipse.contribution.weaving.jdt.tests/target/surefire.properties]
Java HotSpot(TM) 64-Bit Server VM warning: ignoring option MaxPermSize=256m; support was removed in 8.0
Configuration location:
    file:/jobs/genie.ajdt/ajdt-on-eclipse-47/workspace/org.eclipse.contribution.weaving.jdt.tests/target/work/configuration/
Configuration file:
    file:/jobs/genie.ajdt/ajdt-on-eclipse-47/workspace/org.eclipse.contribution.weaving.jdt.tests/target/work/configuration/config.ini loaded
Install location:
    file:/jobs/genie.ajdt/ajdt-on-eclipse-47/workspace/org.eclipse.contribution.weaving.jdt.tests/target/work/
Framework located:
    file:/jobs/genie.ajdt/ajdt-on-eclipse-47/workspace/org.eclipse.contribution.weaving.jdt.tests/target/work/plugins/org.eclipse.osgi-3.12.0.v20170302-2050.jar
Loading extension: org.eclipse.equinox.weaving.hook
	eclipse.properties not found
Framework classpath:
    file:/jobs/genie.ajdt/ajdt-on-eclipse-47/workspace/org.eclipse.contribution.weaving.jdt.tests/target/work/plugins/org.eclipse.osgi-3.12.0.v20170302-2050.jar
    file:/jobs/genie.ajdt/ajdt-on-eclipse-47/workspace/org.eclipse.contribution.weaving.jdt.tests/target/work/plugins/
    file:/jobs/genie.ajdt/ajdt-on-eclipse-47/workspace/org.eclipse.contribution.weaving.jdt.tests/target/work/plugins/org.eclipse.equinox.weaving.hook_1.2.0.v20160929-1449/
Debug options:
    file:/jobs/genie.ajdt/ajdt-on-eclipse-47/workspace/org.eclipse.contribution.weaving.jdt.tests/.options not found
Time to load bundles: 815
!SESSION 2017-04-24 18:46:48.436 -----------------------------------------------
eclipse.buildId=unknown
java.version=1.8.0_121
java.vendor=Oracle Corporation
BootLoader constants: OS=linux, ARCH=x86_64, WS=gtk, NL=en_US
Framework arguments:  -application org.eclipse.tycho.surefire.osgibooter.uitest -testproperties /jobs/genie.ajdt/ajdt-on-eclipse-47/workspace/org.eclipse.contribution.weaving.jdt.tests/target/surefire.properties
Command-line arguments:  -debug -consolelog -data /jobs/genie.ajdt/ajdt-on-eclipse-47/workspace/org.eclipse.contribution.weaving.jdt.tests/target/work/data -application org.eclipse.tycho.surefire.osgibooter.uitest -testproperties /jobs/genie.ajdt/ajdt-on-eclipse-47/workspace/org.eclipse.contribution.weaving.jdt.tests/target/surefire.properties

!ENTRY org.eclipse.jdt.launching.macosx 4 0 2017-04-24 18:46:53.887
!MESSAGE FrameworkEvent ERROR
!STACK 0
org.osgi.framework.BundleException: Could not resolve module: org.eclipse.jdt.launching.macosx [217]
  Unresolved requirement: Require-Capability: eclipse.platform; filter:="(osgi.os=macosx)"

	at org.eclipse.osgi.container.Module.start(Module.java:444)
	at org.eclipse.osgi.container.ModuleContainer$ContainerStartLevel.incStartLevel(ModuleContainer.java:1628)
	at org.eclipse.osgi.container.ModuleContainer$ContainerStartLevel.incStartLevel(ModuleContainer.java:1607)
	at org.eclipse.osgi.container.ModuleContainer$ContainerStartLevel.doContainerStartLevel(ModuleContainer.java:1579)
	at org.eclipse.osgi.container.ModuleContainer$ContainerStartLevel.dispatchEvent(ModuleContainer.java:1522)
	at org.eclipse.osgi.container.ModuleContainer$ContainerStartLevel.dispatchEvent(ModuleContainer.java:1)
	at org.eclipse.osgi.framework.eventmgr.EventManager.dispatchEvent(EventManager.java:230)
	at org.eclipse.osgi.framework.eventmgr.EventManager$EventThread.run(EventManager.java:340)

!ENTRY org.eclipse.jdt.launching.ui.macosx 4 0 2017-04-24 18:46:53.889
!MESSAGE FrameworkEvent ERROR
!STACK 0
org.osgi.framework.BundleException: Could not resolve module: org.eclipse.jdt.launching.ui.macosx [218]
  Unresolved requirement: Require-Capability: eclipse.platform; filter:="(osgi.os=macosx)"

	at org.eclipse.osgi.container.Module.start(Module.java:444)
	at org.eclipse.osgi.container.ModuleContainer$ContainerStartLevel.incStartLevel(ModuleContainer.java:1628)
	at org.eclipse.osgi.container.ModuleContainer$ContainerStartLevel.incStartLevel(ModuleContainer.java:1607)
	at org.eclipse.osgi.container.ModuleContainer$ContainerStartLevel.doContainerStartLevel(ModuleContainer.java:1579)
	at org.eclipse.osgi.container.ModuleContainer$ContainerStartLevel.dispatchEvent(ModuleContainer.java:1522)
	at org.eclipse.osgi.container.ModuleContainer$ContainerStartLevel.dispatchEvent(ModuleContainer.java:1)
	at org.eclipse.osgi.framework.eventmgr.EventManager.dispatchEvent(EventManager.java:230)
	at org.eclipse.osgi.framework.eventmgr.EventManager$EventThread.run(EventManager.java:340)
Starting application: 6090
Application Started: 8176

-------------------------------------------------------
 T E S T S
-------------------------------------------------------
Running org.eclipse.contribution.weaving.jdt.tests.AllWeavingTests
# !SESSION 2017-04-24 18:47:57.861
# version: 1.1
# verbose: true
# The following option strings are specified for this debug session:
| main | 2017-04-24 18:47:57.861 | org.eclipse.e4.ui.workbench | /debug | org.eclipse.e4.ui.internal.workbench.WorkbenchLogger | trace | 158 | Ignored attempt to set focus during set focus for: org.eclipse.ui.internal.e4.compatibility.CompatibilityEditor@6712451a |
Tests run: 34, Failures: 0, Errors: 0, Skipped: 0, Time elapsed: 98.163 sec - in org.eclipse.contribution.weaving.jdt.tests.AllWeavingTests
testCreateCompilationUnit(org.eclipse.contribution.weaving.jdt.tests.cuprovider.CompilationUnitProviderTests)  Time elapsed: 2.858 sec
testSourceMapping(org.eclipse.contribution.weaving.jdt.tests.sourceprovider.SourceTransformerTests)  Time elapsed: 0 sec
testFormatCleanUp(org.eclipse.contribution.weaving.jdt.tests.sourceprovider.SourceTransformerTests)  Time elapsed: 3.838 sec
testTransformCompilationUnit(org.eclipse.contribution.weaving.jdt.tests.sourceprovider.SourceTransformerTests)  Time elapsed: 0.98 sec
testSourceIndexerRequestor(org.eclipse.contribution.weaving.jdt.tests.sourceprovider.SourceTransformerTests)  Time elapsed: 27.712 sec
testImageSelectDebugger(org.eclipse.contribution.weaving.jdt.tests.imagedescriptor.ImageDescriptorSelectorTests)  Time elapsed: 7.021 sec
testImageSelectComputeImage(org.eclipse.contribution.weaving.jdt.tests.imagedescriptor.ImageDescriptorSelectorTests)  Time elapsed: 0.259 sec
testImageSelectDialog(org.eclipse.contribution.weaving.jdt.tests.imagedescriptor.ImageDescriptorSelectorTests)  Time elapsed: 0.986 sec
testImageSelectHierarchy(org.eclipse.contribution.weaving.jdt.tests.imagedescriptor.ImageDescriptorSelectorTests)  Time elapsed: 1.081 sec
testAddHook(org.eclipse.contribution.weaving.jdt.tests.preferences.WeavingStateTests)  Time elapsed: 0 sec
testRemoveHookAtMiddle(org.eclipse.contribution.weaving.jdt.tests.preferences.WeavingStateTests)  Time elapsed: 0.001 sec
testRemoveHookWithSecondHookAtEnd(org.eclipse.contribution.weaving.jdt.tests.preferences.WeavingStateTests)  Time elapsed: 0 sec
testAddHookWithSecondHookAtEnd(org.eclipse.contribution.weaving.jdt.tests.preferences.WeavingStateTests)  Time elapsed: 0 sec
testRemoveHookAtStart(org.eclipse.contribution.weaving.jdt.tests.preferences.WeavingStateTests)  Time elapsed: 0 sec
testRemoveHookWithSecondHookAtStart(org.eclipse.contribution.weaving.jdt.tests.preferences.WeavingStateTests)  Time elapsed: 0.001 sec
testAddHookWithSecondHookAtMiddle(org.eclipse.contribution.weaving.jdt.tests.preferences.WeavingStateTests)  Time elapsed: 0 sec
testRemoveHookAtEnd(org.eclipse.contribution.weaving.jdt.tests.preferences.WeavingStateTests)  Time elapsed: 0 sec
testRemoveHookWithSecondHookAtMiddle(org.eclipse.contribution.weaving.jdt.tests.preferences.WeavingStateTests)  Time elapsed: 0 sec
testAddHookWithSecondHookAtStart(org.eclipse.contribution.weaving.jdt.tests.preferences.WeavingStateTests)  Time elapsed: 0 sec
testAskToEnableWeaving(org.eclipse.contribution.weaving.jdt.tests.preferences.WeavingServiceEnablementTests)  Time elapsed: 2.022 sec
testFindProblemsInMockProject(org.eclipse.contribution.weaving.jdt.tests.itdawareness.ITDAwarenessTests)  Time elapsed: 2.085 sec
testCodeSelectInJavaProject(org.eclipse.contribution.weaving.jdt.tests.itdawareness.ITDAwarenessTests)  Time elapsed: 3.036 sec
testCodeSelectInMockProject(org.eclipse.contribution.weaving.jdt.tests.itdawareness.ITDAwarenessTests)  Time elapsed: 2.043 sec
testContentAssistInJavaProject(org.eclipse.contribution.weaving.jdt.tests.itdawareness.ITDAwarenessTests)  Time elapsed: 3.144 sec
testContentAssistInMockProject(org.eclipse.contribution.weaving.jdt.tests.itdawareness.ITDAwarenessTests)  Time elapsed: 3.743 sec
testFindProblemsInJavaProject(org.eclipse.contribution.weaving.jdt.tests.itdawareness.ITDAwarenessTests)  Time elapsed: 1.958 sec
testExtractConstantInJava(org.eclipse.contribution.weaving.jdt.tests.refactoring.RefactoringHooksTests)  Time elapsed: 4.364 sec
testExtractConstantInMock(org.eclipse.contribution.weaving.jdt.tests.refactoring.RefactoringHooksTests)  Time elapsed: 5.826 sec
testCreateSourceConvertedAST1(org.eclipse.contribution.weaving.jdt.tests.refactoring.RefactoringHooksTests)  Time elapsed: 1.041 sec
testCreateSourceConvertedAST2(org.eclipse.contribution.weaving.jdt.tests.refactoring.RefactoringHooksTests)  Time elapsed: 1.128 sec
testExtractLocalVariableInJava(org.eclipse.contribution.weaving.jdt.tests.refactoring.RefactoringHooksTests)  Time elapsed: 3.407 sec
testExtractLocalVariableInMock(org.eclipse.contribution.weaving.jdt.tests.refactoring.RefactoringHooksTests)  Time elapsed: 5.441 sec
testConvertLocalInJava(org.eclipse.contribution.weaving.jdt.tests.refactoring.RefactoringHooksTests)  Time elapsed: 5.498 sec
testConvertLocalInMock(org.eclipse.contribution.weaving.jdt.tests.refactoring.RefactoringHooksTests)  Time elapsed: 5.162 sec

Results :

Tests run: 34, Failures: 0, Errors: 0, Skipped: 0


!ENTRY org.eclipse.core.resources 2 10035 2017-04-24 18:48:36.108
!MESSAGE The workspace will exit with unsaved changes in this session.
[INFO] All tests passed!
[INFO] 
[INFO] --- eclipse-jarsigner-plugin:1.0.4:sign (sign) @ org.eclipse.contribution.weaving.jdt.tests ---
[INFO] Signed org.eclipse.ajdt:org.eclipse.contribution.weaving.jdt.tests:eclipse-test-plugin:2.2.4-SNAPSHOT in 0 seconds.
[INFO] 
[INFO] --- tycho-p2-plugin:0.23.1:p2-metadata (p2-metadata) @ org.eclipse.contribution.weaving.jdt.tests ---
[INFO]                                                                         
[INFO] ------------------------------------------------------------------------
[INFO] Building org.eclipse.contribution.xref.core.tests 2.2.4-SNAPSHOT
[INFO] ------------------------------------------------------------------------
[INFO] 
[INFO] --- maven-clean-plugin:2.5:clean (default-clean) @ org.eclipse.contribution.xref.core.tests ---
[INFO] Deleting /jobs/genie.ajdt/ajdt-on-eclipse-47/workspace/org.eclipse.contribution.xref.core.tests/target
[INFO] 
[INFO] --- tycho-packaging-plugin:0.23.1:build-qualifier (default-build-qualifier) @ org.eclipse.contribution.xref.core.tests ---
[INFO] The project's OSGi version is 2.2.4.201704242114
[INFO] 
[INFO] --- tycho-packaging-plugin:0.23.1:validate-id (default-validate-id) @ org.eclipse.contribution.xref.core.tests ---
[INFO] 
[INFO] --- tycho-packaging-plugin:0.23.1:validate-version (default-validate-version) @ org.eclipse.contribution.xref.core.tests ---
[INFO] 
[INFO] --- maven-resources-plugin:2.4.3:resources (default-resources) @ org.eclipse.contribution.xref.core.tests ---
[WARNING] Using platform encoding (UTF-8 actually) to copy filtered resources, i.e. build is platform dependent!
[INFO] skip non existing resourceDirectory /jobs/genie.ajdt/ajdt-on-eclipse-47/workspace/org.eclipse.contribution.xref.core.tests/src/main/resources
[INFO] 
[INFO] --- tycho-compiler-plugin:0.23.1:compile (default-compile) @ org.eclipse.contribution.xref.core.tests ---
[INFO] Compiling 10 source files to /jobs/genie.ajdt/ajdt-on-eclipse-47/workspace/org.eclipse.contribution.xref.core.tests/target/classes
[INFO] 
[INFO] --- maven-resources-plugin:2.4.3:testResources (default-testResources) @ org.eclipse.contribution.xref.core.tests ---
[WARNING] Using platform encoding (UTF-8 actually) to copy filtered resources, i.e. build is platform dependent!
[INFO] skip non existing resourceDirectory /jobs/genie.ajdt/ajdt-on-eclipse-47/workspace/org.eclipse.contribution.xref.core.tests/src/test/resources
[INFO] 
[INFO] --- target-platform-configuration:0.23.1:target-platform (default-target-platform) @ org.eclipse.contribution.xref.core.tests ---
[INFO] 
[INFO] --- tycho-packaging-plugin:0.23.1:package-plugin (default-package-plugin) @ org.eclipse.contribution.xref.core.tests ---
[INFO] Building jar: /jobs/genie.ajdt/ajdt-on-eclipse-47/workspace/org.eclipse.contribution.xref.core.tests/xrefcoretests.jar
[INFO] Building jar: /jobs/genie.ajdt/ajdt-on-eclipse-47/workspace/org.eclipse.contribution.xref.core.tests/target/org.eclipse.contribution.xref.core.tests-2.2.4-SNAPSHOT.jar
[INFO] 
[INFO] --- tycho-p2-plugin:0.23.1:p2-metadata-default (default-p2-metadata-default) @ org.eclipse.contribution.xref.core.tests ---
[INFO] 
[INFO] --- tycho-surefire-plugin:0.23.1:test (default-test) @ org.eclipse.contribution.xref.core.tests ---
[INFO] Expected eclipse log file: /jobs/genie.ajdt/ajdt-on-eclipse-47/workspace/org.eclipse.contribution.xref.core.tests/target/work/data/.metadata/.log
[INFO] Command line:
	[/opt/public/common/jdk1.8.0_121.x64/jre/bin/java, -Dosgi.noShutdown=false, -Dosgi.os=linux, -Dosgi.ws=gtk, -Dosgi.arch=x86_64, -Xmx1024m, -XX:MaxPermSize=256m, -Dosgi.clean=true, -jar, /jobs/genie.ajdt/ajdt-on-eclipse-47/workspace/.maven/repo/p2/osgi/bundle/org.eclipse.equinox.launcher/1.4.0.v20161219-1356/org.eclipse.equinox.launcher-1.4.0.v20161219-1356.jar, -debug, -consolelog, -data, /jobs/genie.ajdt/ajdt-on-eclipse-47/workspace/org.eclipse.contribution.xref.core.tests/target/work/data, -install, /jobs/genie.ajdt/ajdt-on-eclipse-47/workspace/org.eclipse.contribution.xref.core.tests/target/work, -configuration, /jobs/genie.ajdt/ajdt-on-eclipse-47/workspace/org.eclipse.contribution.xref.core.tests/target/work/configuration, -application, org.eclipse.tycho.surefire.osgibooter.uitest, -testproperties, /jobs/genie.ajdt/ajdt-on-eclipse-47/workspace/org.eclipse.contribution.xref.core.tests/target/surefire.properties]
Java HotSpot(TM) 64-Bit Server VM warning: ignoring option MaxPermSize=256m; support was removed in 8.0
Configuration location:
    file:/jobs/genie.ajdt/ajdt-on-eclipse-47/workspace/org.eclipse.contribution.xref.core.tests/target/work/configuration/
Configuration file:
    file:/jobs/genie.ajdt/ajdt-on-eclipse-47/workspace/org.eclipse.contribution.xref.core.tests/target/work/configuration/config.ini loaded
Install location:
    file:/jobs/genie.ajdt/ajdt-on-eclipse-47/workspace/org.eclipse.contribution.xref.core.tests/target/work/
Framework located:
    file:/home/hudson/genie.ajdt/.hudson/jobs/ajdt-on-eclipse-47/workspace/.maven/repo/p2/osgi/bundle/org.eclipse.osgi/3.12.0.v20170302-2050/org.eclipse.osgi-3.12.0.v20170302-2050.jar
Framework classpath:
    file:/home/hudson/genie.ajdt/.hudson/jobs/ajdt-on-eclipse-47/workspace/.maven/repo/p2/osgi/bundle/org.eclipse.osgi/3.12.0.v20170302-2050/org.eclipse.osgi-3.12.0.v20170302-2050.jar
Debug options:
    file:/jobs/genie.ajdt/ajdt-on-eclipse-47/workspace/org.eclipse.contribution.xref.core.tests/.options not found
Time to load bundles: 749
!SESSION 2017-04-24 18:48:38.712 -----------------------------------------------
eclipse.buildId=unknown
java.version=1.8.0_121
java.vendor=Oracle Corporation
BootLoader constants: OS=linux, ARCH=x86_64, WS=gtk, NL=en_US
Framework arguments:  -application org.eclipse.tycho.surefire.osgibooter.uitest -testproperties /jobs/genie.ajdt/ajdt-on-eclipse-47/workspace/org.eclipse.contribution.xref.core.tests/target/surefire.properties
Command-line arguments:  -debug -consolelog -data /jobs/genie.ajdt/ajdt-on-eclipse-47/workspace/org.eclipse.contribution.xref.core.tests/target/work/data -application org.eclipse.tycho.surefire.osgibooter.uitest -testproperties /jobs/genie.ajdt/ajdt-on-eclipse-47/workspace/org.eclipse.contribution.xref.core.tests/target/surefire.properties

!ENTRY org.eclipse.jdt.launching.macosx 4 0 2017-04-24 18:48:42.293
!MESSAGE FrameworkEvent ERROR
!STACK 0
org.osgi.framework.BundleException: Could not resolve module: org.eclipse.jdt.launching.macosx [217]
  Unresolved requirement: Require-Capability: eclipse.platform; filter:="(osgi.os=macosx)"

	at org.eclipse.osgi.container.Module.start(Module.java:444)
	at org.eclipse.osgi.container.ModuleContainer$ContainerStartLevel.incStartLevel(ModuleContainer.java:1628)
	at org.eclipse.osgi.container.ModuleContainer$ContainerStartLevel.incStartLevel(ModuleContainer.java:1607)
	at org.eclipse.osgi.container.ModuleContainer$ContainerStartLevel.doContainerStartLevel(ModuleContainer.java:1579)
	at org.eclipse.osgi.container.ModuleContainer$ContainerStartLevel.dispatchEvent(ModuleContainer.java:1522)
	at org.eclipse.osgi.container.ModuleContainer$ContainerStartLevel.dispatchEvent(ModuleContainer.java:1)
	at org.eclipse.osgi.framework.eventmgr.EventManager.dispatchEvent(EventManager.java:230)
	at org.eclipse.osgi.framework.eventmgr.EventManager$EventThread.run(EventManager.java:340)

!ENTRY org.eclipse.jdt.launching.ui.macosx 4 0 2017-04-24 18:48:42.295
!MESSAGE FrameworkEvent ERROR
!STACK 0
org.osgi.framework.BundleException: Could not resolve module: org.eclipse.jdt.launching.ui.macosx [218]
  Unresolved requirement: Require-Capability: eclipse.platform; filter:="(osgi.os=macosx)"

	at org.eclipse.osgi.container.Module.start(Module.java:444)
	at org.eclipse.osgi.container.ModuleContainer$ContainerStartLevel.incStartLevel(ModuleContainer.java:1628)
	at org.eclipse.osgi.container.ModuleContainer$ContainerStartLevel.incStartLevel(ModuleContainer.java:1607)
	at org.eclipse.osgi.container.ModuleContainer$ContainerStartLevel.doContainerStartLevel(ModuleContainer.java:1579)
	at org.eclipse.osgi.container.ModuleContainer$ContainerStartLevel.dispatchEvent(ModuleContainer.java:1522)
	at org.eclipse.osgi.container.ModuleContainer$ContainerStartLevel.dispatchEvent(ModuleContainer.java:1)
	at org.eclipse.osgi.framework.eventmgr.EventManager.dispatchEvent(EventManager.java:230)
	at org.eclipse.osgi.framework.eventmgr.EventManager$EventThread.run(EventManager.java:340)
Starting application: 4140
Application Started: 6187

-------------------------------------------------------
 T E S T S
-------------------------------------------------------
Running org.eclipse.contribution.xref.core.tests.AllTests

!ENTRY org.eclipse.contribution.xref.core.tests 4 1 2017-04-24 18:48:45.115
!MESSAGE Testcase generated exception as expected
!STACK 0
java.lang.Throwable
	at org.eclipse.contribution.xref.core.tests.XReferencePluginTest.testLog(XReferencePluginTest.java:45)
	at sun.reflect.NativeMethodAccessorImpl.invoke0(Native Method)
	at sun.reflect.NativeMethodAccessorImpl.invoke(NativeMethodAccessorImpl.java:62)
	at sun.reflect.DelegatingMethodAccessorImpl.invoke(DelegatingMethodAccessorImpl.java:43)
	at java.lang.reflect.Method.invoke(Method.java:498)
	at junit.framework.TestCase.runTest(TestCase.java:176)
	at junit.framework.TestCase.runBare(TestCase.java:141)
	at junit.framework.TestResult$1.protect(TestResult.java:122)
	at junit.framework.TestResult.runProtected(TestResult.java:142)
	at junit.framework.TestResult.run(TestResult.java:125)
	at junit.framework.TestCase.run(TestCase.java:129)
	at junit.framework.TestSuite.runTest(TestSuite.java:252)
	at junit.framework.TestSuite.run(TestSuite.java:247)
	at junit.framework.TestSuite.runTest(TestSuite.java:252)
	at junit.framework.TestSuite.run(TestSuite.java:247)
	at org.junit.internal.runners.JUnit38ClassRunner.run(JUnit38ClassRunner.java:86)
	at org.apache.maven.surefire.junit4.JUnit4Provider.execute(JUnit4Provider.java:264)
	at org.apache.maven.surefire.junit4.JUnit4Provider.executeTestSet(JUnit4Provider.java:153)
	at org.apache.maven.surefire.junit4.JUnit4Provider.invoke(JUnit4Provider.java:124)
	at sun.reflect.NativeMethodAccessorImpl.invoke0(Native Method)
	at sun.reflect.NativeMethodAccessorImpl.invoke(NativeMethodAccessorImpl.java:62)
	at sun.reflect.DelegatingMethodAccessorImpl.invoke(DelegatingMethodAccessorImpl.java:43)
	at java.lang.reflect.Method.invoke(Method.java:498)
	at org.apache.maven.surefire.util.ReflectionUtils.invokeMethodWithArray2(ReflectionUtils.java:208)
	at org.apache.maven.surefire.booter.ProviderFactory$ProviderProxy.invoke(ProviderFactory.java:156)
	at org.apache.maven.surefire.booter.ProviderFactory.invokeProvider(ProviderFactory.java:82)
	at org.eclipse.tycho.surefire.osgibooter.OsgiSurefireBooter.run(OsgiSurefireBooter.java:91)
	at org.eclipse.tycho.surefire.osgibooter.AbstractUITestApplication$1.run(AbstractUITestApplication.java:35)
	at org.eclipse.swt.widgets.RunnableLock.run(RunnableLock.java:37)
	at org.eclipse.swt.widgets.Synchronizer.runAsyncMessages(Synchronizer.java:182)
	at org.eclipse.swt.widgets.Display.runAsyncMessages(Display.java:4470)
	at org.eclipse.swt.widgets.Display.readAndDispatch(Display.java:4083)
	at org.eclipse.e4.ui.internal.workbench.swt.PartRenderingEngine$4.run(PartRenderingEngine.java:1145)
	at org.eclipse.core.databinding.observable.Realm.runWithDefault(Realm.java:336)
	at org.eclipse.e4.ui.internal.workbench.swt.PartRenderingEngine.run(PartRenderingEngine.java:1034)
	at org.eclipse.e4.ui.internal.workbench.E4Workbench.createAndRunUI(E4Workbench.java:153)
	at org.eclipse.ui.internal.Workbench.lambda$3(Workbench.java:680)
	at org.eclipse.core.databinding.observable.Realm.runWithDefault(Realm.java:336)
	at org.eclipse.ui.internal.Workbench.createAndRunWorkbench(Workbench.java:594)
	at org.eclipse.ui.PlatformUI.createAndRunWorkbench(PlatformUI.java:148)
	at org.eclipse.ui.internal.ide.application.IDEApplication.start(IDEApplication.java:138)
	at org.eclipse.tycho.surefire.osgibooter.UITestApplication.runApplication(UITestApplication.java:31)
	at org.eclipse.tycho.surefire.osgibooter.AbstractUITestApplication.run(AbstractUITestApplication.java:120)
	at org.eclipse.tycho.surefire.osgibooter.UITestApplication.start(UITestApplication.java:37)
	at org.eclipse.equinox.internal.app.EclipseAppHandle.run(EclipseAppHandle.java:196)
	at org.eclipse.core.runtime.internal.adaptor.EclipseAppLauncher.runApplication(EclipseAppLauncher.java:134)
	at org.eclipse.core.runtime.internal.adaptor.EclipseAppLauncher.start(EclipseAppLauncher.java:104)
	at org.eclipse.core.runtime.adaptor.EclipseStarter.run(EclipseStarter.java:388)
	at org.eclipse.core.runtime.adaptor.EclipseStarter.run(EclipseStarter.java:243)
	at sun.reflect.NativeMethodAccessorImpl.invoke0(Native Method)
	at sun.reflect.NativeMethodAccessorImpl.invoke(NativeMethodAccessorImpl.java:62)
	at sun.reflect.DelegatingMethodAccessorImpl.invoke(DelegatingMethodAccessorImpl.java:43)
	at java.lang.reflect.Method.invoke(Method.java:498)
	at org.eclipse.equinox.launcher.Main.invokeFramework(Main.java:653)
	at org.eclipse.equinox.launcher.Main.basicRun(Main.java:590)
	at org.eclipse.equinox.launcher.Main.run(Main.java:1499)
	at org.eclipse.equinox.launcher.Main.main(Main.java:1472)

!ENTRY org.eclipse.contribution.xref.core 2 1 2017-04-24 18:48:45.687
!MESSAGE Could not load provider org.eclipse.contribution.xref.core.tests.unknownProvider
!STACK 1
org.eclipse.core.runtime.CoreException: Plug-in org.eclipse.contribution.xref.core.tests was unable to load class org.eclipse.contribution.xref.core.tests.UnknownProvider.
	at org.eclipse.core.internal.registry.osgi.RegistryStrategyOSGI.throwException(RegistryStrategyOSGI.java:194)
	at org.eclipse.core.internal.registry.osgi.RegistryStrategyOSGI.createExecutableExtension(RegistryStrategyOSGI.java:176)
	at org.eclipse.core.internal.registry.ExtensionRegistry.createExecutableExtension(ExtensionRegistry.java:905)
	at org.eclipse.core.internal.registry.ConfigurationElement.createExecutableExtension(ConfigurationElement.java:243)
	at org.eclipse.core.internal.registry.ConfigurationElementHandle.createExecutableExtension(ConfigurationElementHandle.java:55)
	at org.eclipse.contribution.xref.core.XReferenceProviderDefinition.<init>(XReferenceProviderDefinition.java:32)
	at org.eclipse.contribution.xref.core.XReferenceProviderManager.getRegisteredProviders(XReferenceProviderManager.java:95)
	at org.eclipse.contribution.xref.core.XReferenceProviderManager.getProvidersFor(XReferenceProviderManager.java:70)
	at org.eclipse.contribution.xref.core.XReferenceAdapter.getXReferences(XReferenceAdapter.java:67)
	at org.eclipse.contribution.xref.core.tests.XReferenceAdapterTest.testGetXReferences(XReferenceAdapterTest.java:41)
	at sun.reflect.NativeMethodAccessorImpl.invoke0(Native Method)
	at sun.reflect.NativeMethodAccessorImpl.invoke(NativeMethodAccessorImpl.java:62)
	at sun.reflect.DelegatingMethodAccessorImpl.invoke(DelegatingMethodAccessorImpl.java:43)
	at java.lang.reflect.Method.invoke(Method.java:498)
	at junit.framework.TestCase.runTest(TestCase.java:176)
	at junit.framework.TestCase.runBare(TestCase.java:141)
	at junit.framework.TestResult$1.protect(TestResult.java:122)
	at junit.framework.TestResult.runProtected(TestResult.java:142)
	at junit.framework.TestResult.run(TestResult.java:125)
	at junit.framework.TestCase.run(TestCase.java:129)
	at junit.framework.TestSuite.runTest(TestSuite.java:252)
	at junit.framework.TestSuite.run(TestSuite.java:247)
	at junit.framework.TestSuite.runTest(TestSuite.java:252)
	at junit.framework.TestSuite.run(TestSuite.java:247)
	at org.junit.internal.runners.JUnit38ClassRunner.run(JUnit38ClassRunner.java:86)
	at org.apache.maven.surefire.junit4.JUnit4Provider.execute(JUnit4Provider.java:264)
	at org.apache.maven.surefire.junit4.JUnit4Provider.executeTestSet(JUnit4Provider.java:153)
	at org.apache.maven.surefire.junit4.JUnit4Provider.invoke(JUnit4Provider.java:124)
	at sun.reflect.NativeMethodAccessorImpl.invoke0(Native Method)
	at sun.reflect.NativeMethodAccessorImpl.invoke(NativeMethodAccessorImpl.java:62)
	at sun.reflect.DelegatingMethodAccessorImpl.invoke(DelegatingMethodAccessorImpl.java:43)
	at java.lang.reflect.Method.invoke(Method.java:498)
	at org.apache.maven.surefire.util.ReflectionUtils.invokeMethodWithArray2(ReflectionUtils.java:208)
	at org.apache.maven.surefire.booter.ProviderFactory$ProviderProxy.invoke(ProviderFactory.java:156)
	at org.apache.maven.surefire.booter.ProviderFactory.invokeProvider(ProviderFactory.java:82)
	at org.eclipse.tycho.surefire.osgibooter.OsgiSurefireBooter.run(OsgiSurefireBooter.java:91)
	at org.eclipse.tycho.surefire.osgibooter.AbstractUITestApplication$1.run(AbstractUITestApplication.java:35)
	at org.eclipse.swt.widgets.RunnableLock.run(RunnableLock.java:37)
	at org.eclipse.swt.widgets.Synchronizer.runAsyncMessages(Synchronizer.java:182)
	at org.eclipse.swt.widgets.Display.runAsyncMessages(Display.java:4470)
	at org.eclipse.swt.widgets.Display.readAndDispatch(Display.java:4083)
	at org.eclipse.e4.ui.internal.workbench.swt.PartRenderingEngine$4.run(PartRenderingEngine.java:1145)
	at org.eclipse.core.databinding.observable.Realm.runWithDefault(Realm.java:336)
	at org.eclipse.e4.ui.internal.workbench.swt.PartRenderingEngine.run(PartRenderingEngine.java:1034)
	at org.eclipse.e4.ui.internal.workbench.E4Workbench.createAndRunUI(E4Workbench.java:153)
	at org.eclipse.ui.internal.Workbench.lambda$3(Workbench.java:680)
	at org.eclipse.core.databinding.observable.Realm.runWithDefault(Realm.java:336)
	at org.eclipse.ui.internal.Workbench.createAndRunWorkbench(Workbench.java:594)
	at org.eclipse.ui.PlatformUI.createAndRunWorkbench(PlatformUI.java:148)
	at org.eclipse.ui.internal.ide.application.IDEApplication.start(IDEApplication.java:138)
	at org.eclipse.tycho.surefire.osgibooter.UITestApplication.runApplication(UITestApplication.java:31)
	at org.eclipse.tycho.surefire.osgibooter.AbstractUITestApplication.run(AbstractUITestApplication.java:120)
	at org.eclipse.tycho.surefire.osgibooter.UITestApplication.start(UITestApplication.java:37)
	at org.eclipse.equinox.internal.app.EclipseAppHandle.run(EclipseAppHandle.java:196)
	at org.eclipse.core.runtime.internal.adaptor.EclipseAppLauncher.runApplication(EclipseAppLauncher.java:134)
	at org.eclipse.core.runtime.internal.adaptor.EclipseAppLauncher.start(EclipseAppLauncher.java:104)
	at org.eclipse.core.runtime.adaptor.EclipseStarter.run(EclipseStarter.java:388)
	at org.eclipse.core.runtime.adaptor.EclipseStarter.run(EclipseStarter.java:243)
	at sun.reflect.NativeMethodAccessorImpl.invoke0(Native Method)
	at sun.reflect.NativeMethodAccessorImpl.invoke(NativeMethodAccessorImpl.java:62)
	at sun.reflect.DelegatingMethodAccessorImpl.invoke(DelegatingMethodAccessorImpl.java:43)
	at java.lang.reflect.Method.invoke(Method.java:498)
	at org.eclipse.equinox.launcher.Main.invokeFramework(Main.java:653)
	at org.eclipse.equinox.launcher.Main.basicRun(Main.java:590)
	at org.eclipse.equinox.launcher.Main.run(Main.java:1499)
	at org.eclipse.equinox.launcher.Main.main(Main.java:1472)
Caused by: java.lang.ClassNotFoundException: org.eclipse.contribution.xref.core.tests.UnknownProvider cannot be found by org.eclipse.contribution.xref.core.tests_2.2.4.qualifier
	at org.eclipse.osgi.internal.loader.BundleLoader.findClassInternal(BundleLoader.java:475)
	at org.eclipse.osgi.internal.loader.BundleLoader.findClass(BundleLoader.java:386)
	at org.eclipse.osgi.internal.loader.BundleLoader.findClass(BundleLoader.java:378)
	at org.eclipse.osgi.internal.loader.ModuleClassLoader.loadClass(ModuleClassLoader.java:150)
	at java.lang.ClassLoader.loadClass(ClassLoader.java:357)
	at org.eclipse.osgi.internal.framework.EquinoxBundle.loadClass(EquinoxBundle.java:564)
	at org.eclipse.core.internal.registry.osgi.RegistryStrategyOSGI.createExecutableExtension(RegistryStrategyOSGI.java:174)
	... 64 more
!SUBENTRY 1 org.eclipse.equinox.registry 4 1 2017-04-24 18:48:45.689
!MESSAGE Plug-in org.eclipse.contribution.xref.core.tests was unable to load class org.eclipse.contribution.xref.core.tests.UnknownProvider.
!STACK 0
java.lang.ClassNotFoundException: org.eclipse.contribution.xref.core.tests.UnknownProvider cannot be found by org.eclipse.contribution.xref.core.tests_2.2.4.qualifier
	at org.eclipse.osgi.internal.loader.BundleLoader.findClassInternal(BundleLoader.java:475)
	at org.eclipse.osgi.internal.loader.BundleLoader.findClass(BundleLoader.java:386)
	at org.eclipse.osgi.internal.loader.BundleLoader.findClass(BundleLoader.java:378)
	at org.eclipse.osgi.internal.loader.ModuleClassLoader.loadClass(ModuleClassLoader.java:150)
	at java.lang.ClassLoader.loadClass(ClassLoader.java:357)
	at org.eclipse.osgi.internal.framework.EquinoxBundle.loadClass(EquinoxBundle.java:564)
	at org.eclipse.core.internal.registry.osgi.RegistryStrategyOSGI.createExecutableExtension(RegistryStrategyOSGI.java:174)
	at org.eclipse.core.internal.registry.ExtensionRegistry.createExecutableExtension(ExtensionRegistry.java:905)
	at org.eclipse.core.internal.registry.ConfigurationElement.createExecutableExtension(ConfigurationElement.java:243)
	at org.eclipse.core.internal.registry.ConfigurationElementHandle.createExecutableExtension(ConfigurationElementHandle.java:55)
	at org.eclipse.contribution.xref.core.XReferenceProviderDefinition.<init>(XReferenceProviderDefinition.java:32)
	at org.eclipse.contribution.xref.core.XReferenceProviderManager.getRegisteredProviders(XReferenceProviderManager.java:95)
	at org.eclipse.contribution.xref.core.XReferenceProviderManager.getProvidersFor(XReferenceProviderManager.java:70)
	at org.eclipse.contribution.xref.core.XReferenceAdapter.getXReferences(XReferenceAdapter.java:67)
	at org.eclipse.contribution.xref.core.tests.XReferenceAdapterTest.testGetXReferences(XReferenceAdapterTest.java:41)
	at sun.reflect.NativeMethodAccessorImpl.invoke0(Native Method)
	at sun.reflect.NativeMethodAccessorImpl.invoke(NativeMethodAccessorImpl.java:62)
	at sun.reflect.DelegatingMethodAccessorImpl.invoke(DelegatingMethodAccessorImpl.java:43)
	at java.lang.reflect.Method.invoke(Method.java:498)
	at junit.framework.TestCase.runTest(TestCase.java:176)
	at junit.framework.TestCase.runBare(TestCase.java:141)
	at junit.framework.TestResult$1.protect(TestResult.java:122)
	at junit.framework.TestResult.runProtected(TestResult.java:142)
	at junit.framework.TestResult.run(TestResult.java:125)
	at junit.framework.TestCase.run(TestCase.java:129)
	at junit.framework.TestSuite.runTest(TestSuite.java:252)
	at junit.framework.TestSuite.run(TestSuite.java:247)
	at junit.framework.TestSuite.runTest(TestSuite.java:252)
	at junit.framework.TestSuite.run(TestSuite.java:247)
	at org.junit.internal.runners.JUnit38ClassRunner.run(JUnit38ClassRunner.java:86)
	at org.apache.maven.surefire.junit4.JUnit4Provider.execute(JUnit4Provider.java:264)
	at org.apache.maven.surefire.junit4.JUnit4Provider.executeTestSet(JUnit4Provider.java:153)
	at org.apache.maven.surefire.junit4.JUnit4Provider.invoke(JUnit4Provider.java:124)
	at sun.reflect.NativeMethodAccessorImpl.invoke0(Native Method)
	at sun.reflect.NativeMethodAccessorImpl.invoke(NativeMethodAccessorImpl.java:62)
	at sun.reflect.DelegatingMethodAccessorImpl.invoke(DelegatingMethodAccessorImpl.java:43)
	at java.lang.reflect.Method.invoke(Method.java:498)
	at org.apache.maven.surefire.util.ReflectionUtils.invokeMethodWithArray2(ReflectionUtils.java:208)
	at org.apache.maven.surefire.booter.ProviderFactory$ProviderProxy.invoke(ProviderFactory.java:156)
	at org.apache.maven.surefire.booter.ProviderFactory.invokeProvider(ProviderFactory.java:82)
	at org.eclipse.tycho.surefire.osgibooter.OsgiSurefireBooter.run(OsgiSurefireBooter.java:91)
	at org.eclipse.tycho.surefire.osgibooter.AbstractUITestApplication$1.run(AbstractUITestApplication.java:35)
	at org.eclipse.swt.widgets.RunnableLock.run(RunnableLock.java:37)
	at org.eclipse.swt.widgets.Synchronizer.runAsyncMessages(Synchronizer.java:182)
	at org.eclipse.swt.widgets.Display.runAsyncMessages(Display.java:4470)
	at org.eclipse.swt.widgets.Display.readAndDispatch(Display.java:4083)
	at org.eclipse.e4.ui.internal.workbench.swt.PartRenderingEngine$4.run(PartRenderingEngine.java:1145)
	at org.eclipse.core.databinding.observable.Realm.runWithDefault(Realm.java:336)
	at org.eclipse.e4.ui.internal.workbench.swt.PartRenderingEngine.run(PartRenderingEngine.java:1034)
	at org.eclipse.e4.ui.internal.workbench.E4Workbench.createAndRunUI(E4Workbench.java:153)
	at org.eclipse.ui.internal.Workbench.lambda$3(Workbench.java:680)
	at org.eclipse.core.databinding.observable.Realm.runWithDefault(Realm.java:336)
	at org.eclipse.ui.internal.Workbench.createAndRunWorkbench(Workbench.java:594)
	at org.eclipse.ui.PlatformUI.createAndRunWorkbench(PlatformUI.java:148)
	at org.eclipse.ui.internal.ide.application.IDEApplication.start(IDEApplication.java:138)
	at org.eclipse.tycho.surefire.osgibooter.UITestApplication.runApplication(UITestApplication.java:31)
	at org.eclipse.tycho.surefire.osgibooter.AbstractUITestApplication.run(AbstractUITestApplication.java:120)
	at org.eclipse.tycho.surefire.osgibooter.UITestApplication.start(UITestApplication.java:37)
	at org.eclipse.equinox.internal.app.EclipseAppHandle.run(EclipseAppHandle.java:196)
	at org.eclipse.core.runtime.internal.adaptor.EclipseAppLauncher.runApplication(EclipseAppLauncher.java:134)
	at org.eclipse.core.runtime.internal.adaptor.EclipseAppLauncher.start(EclipseAppLauncher.java:104)
	at org.eclipse.core.runtime.adaptor.EclipseStarter.run(EclipseStarter.java:388)
	at org.eclipse.core.runtime.adaptor.EclipseStarter.run(EclipseStarter.java:243)
	at sun.reflect.NativeMethodAccessorImpl.invoke0(Native Method)
	at sun.reflect.NativeMethodAccessorImpl.invoke(NativeMethodAccessorImpl.java:62)
	at sun.reflect.DelegatingMethodAccessorImpl.invoke(DelegatingMethodAccessorImpl.java:43)
	at java.lang.reflect.Method.invoke(Method.java:498)
	at org.eclipse.equinox.launcher.Main.invokeFramework(Main.java:653)
	at org.eclipse.equinox.launcher.Main.basicRun(Main.java:590)
	at org.eclipse.equinox.launcher.Main.run(Main.java:1499)
	at org.eclipse.equinox.launcher.Main.main(Main.java:1472)

!ENTRY org.eclipse.contribution.xref.core 4 2 2017-04-24 18:48:45.698
!MESSAGE Problems occurred when invoking code from plug-in: "org.eclipse.contribution.xref.core".
!STACK 0
java.lang.RuntimeException: You should never trust a provider you know...
	at org.eclipse.contribution.xref.core.tests.TestProvider.getProviderDescription(TestProvider.java:81)
	at org.eclipse.contribution.xref.core.XReferenceProviderDefinition.getProviderDescription_aroundBody0(XReferenceProviderDefinition.java:75)
	at org.eclipse.contribution.xref.core.XReferenceProviderDefinition$AjcClosure1.run(XReferenceProviderDefinition.java:1)
	at org.eclipse.contribution.xref.core.IXReferenceProvider$SafeExecution.ajc$around$org_eclipse_contribution_xref_core_IXReferenceProvider$SafeExecution$1$b538bdbdproceed(IXReferenceProvider.aj:133)
	at org.eclipse.contribution.xref.core.IXReferenceProvider$SafeExecution$1.run(IXReferenceProvider.aj:140)
	at org.eclipse.core.runtime.SafeRunner.run(SafeRunner.java:42)
	at org.eclipse.contribution.xref.core.IXReferenceProvider$SafeExecution.ajc$around$org_eclipse_contribution_xref_core_IXReferenceProvider$SafeExecution$1$b538bdbd(IXReferenceProvider.aj:146)
	at org.eclipse.contribution.xref.core.XReferenceProviderDefinition.getDescription(XReferenceProviderDefinition.java:75)
	at org.eclipse.contribution.xref.core.tests.XReferenceProviderDefinitionTest.testSafeExecution(XReferenceProviderDefinitionTest.java:78)
	at sun.reflect.NativeMethodAccessorImpl.invoke0(Native Method)
	at sun.reflect.NativeMethodAccessorImpl.invoke(NativeMethodAccessorImpl.java:62)
	at sun.reflect.DelegatingMethodAccessorImpl.invoke(DelegatingMethodAccessorImpl.java:43)
	at java.lang.reflect.Method.invoke(Method.java:498)
	at junit.framework.TestCase.runTest(TestCase.java:176)
	at junit.framework.TestCase.runBare(TestCase.java:141)
	at junit.framework.TestResult$1.protect(TestResult.java:122)
	at junit.framework.TestResult.runProtected(TestResult.java:142)
	at junit.framework.TestResult.run(TestResult.java:125)
	at junit.framework.TestCase.run(TestCase.java:129)
	at junit.framework.TestSuite.runTest(TestSuite.java:252)
	at junit.framework.TestSuite.run(TestSuite.java:247)
	at junit.framework.TestSuite.runTest(TestSuite.java:252)
	at junit.framework.TestSuite.run(TestSuite.java:247)
	at org.junit.internal.runners.JUnit38ClassRunner.run(JUnit38ClassRunner.java:86)
	at org.apache.maven.surefire.junit4.JUnit4Provider.execute(JUnit4Provider.java:264)
	at org.apache.maven.surefire.junit4.JUnit4Provider.executeTestSet(JUnit4Provider.java:153)
	at org.apache.maven.surefire.junit4.JUnit4Provider.invoke(JUnit4Provider.java:124)
	at sun.reflect.NativeMethodAccessorImpl.invoke0(Native Method)
	at sun.reflect.NativeMethodAccessorImpl.invoke(NativeMethodAccessorImpl.java:62)
	at sun.reflect.DelegatingMethodAccessorImpl.invoke(DelegatingMethodAccessorImpl.java:43)
	at java.lang.reflect.Method.invoke(Method.java:498)
	at org.apache.maven.surefire.util.ReflectionUtils.invokeMethodWithArray2(ReflectionUtils.java:208)
	at org.apache.maven.surefire.booter.ProviderFactory$ProviderProxy.invoke(ProviderFactory.java:156)
	at org.apache.maven.surefire.booter.ProviderFactory.invokeProvider(ProviderFactory.java:82)
	at org.eclipse.tycho.surefire.osgibooter.OsgiSurefireBooter.run(OsgiSurefireBooter.java:91)
	at org.eclipse.tycho.surefire.osgibooter.AbstractUITestApplication$1.run(AbstractUITestApplication.java:35)
	at org.eclipse.swt.widgets.RunnableLock.run(RunnableLock.java:37)
	at org.eclipse.swt.widgets.Synchronizer.runAsyncMessages(Synchronizer.java:182)
	at org.eclipse.swt.widgets.Display.runAsyncMessages(Display.java:4470)
	at org.eclipse.swt.widgets.Display.readAndDispatch(Display.java:4083)
	at org.eclipse.e4.ui.internal.workbench.swt.PartRenderingEngine$4.run(PartRenderingEngine.java:1145)
	at org.eclipse.core.databinding.observable.Realm.runWithDefault(Realm.java:336)
	at org.eclipse.e4.ui.internal.workbench.swt.PartRenderingEngine.run(PartRenderingEngine.java:1034)
	at org.eclipse.e4.ui.internal.workbench.E4Workbench.createAndRunUI(E4Workbench.java:153)
	at org.eclipse.ui.internal.Workbench.lambda$3(Workbench.java:680)
	at org.eclipse.core.databinding.observable.Realm.runWithDefault(Realm.java:336)
	at org.eclipse.ui.internal.Workbench.createAndRunWorkbench(Workbench.java:594)
	at org.eclipse.ui.PlatformUI.createAndRunWorkbench(PlatformUI.java:148)
	at org.eclipse.ui.internal.ide.application.IDEApplication.start(IDEApplication.java:138)
	at org.eclipse.tycho.surefire.osgibooter.UITestApplication.runApplication(UITestApplication.java:31)
	at org.eclipse.tycho.surefire.osgibooter.AbstractUITestApplication.run(AbstractUITestApplication.java:120)
	at org.eclipse.tycho.surefire.osgibooter.UITestApplication.start(UITestApplication.java:37)
	at org.eclipse.equinox.internal.app.EclipseAppHandle.run(EclipseAppHandle.java:196)
	at org.eclipse.core.runtime.internal.adaptor.EclipseAppLauncher.runApplication(EclipseAppLauncher.java:134)
	at org.eclipse.core.runtime.internal.adaptor.EclipseAppLauncher.start(EclipseAppLauncher.java:104)
	at org.eclipse.core.runtime.adaptor.EclipseStarter.run(EclipseStarter.java:388)
	at org.eclipse.core.runtime.adaptor.EclipseStarter.run(EclipseStarter.java:243)
	at sun.reflect.NativeMethodAccessorImpl.invoke0(Native Method)
	at sun.reflect.NativeMethodAccessorImpl.invoke(NativeMethodAccessorImpl.java:62)
	at sun.reflect.DelegatingMethodAccessorImpl.invoke(DelegatingMethodAccessorImpl.java:43)
	at java.lang.reflect.Method.invoke(Method.java:498)
	at org.eclipse.equinox.launcher.Main.invokeFramework(Main.java:653)
	at org.eclipse.equinox.launcher.Main.basicRun(Main.java:590)
	at org.eclipse.equinox.launcher.Main.run(Main.java:1499)
	at org.eclipse.equinox.launcher.Main.main(Main.java:1472)
Tests run: 23, Failures: 4, Errors: 0, Skipped: 0, Time elapsed: 0.609 sec <<< FAILURE! - in org.eclipse.contribution.xref.core.tests.AllTests
testLog(org.eclipse.contribution.xref.core.tests.XReferencePluginTest)  Time elapsed: 0.015 sec
testPluginID(org.eclipse.contribution.xref.core.tests.XReferencePluginTest)  Time elapsed: 0 sec
testGetDefault(org.eclipse.contribution.xref.core.tests.XReferencePluginTest)  Time elapsed: 0 sec
testAddAssociate(org.eclipse.contribution.xref.core.tests.XReferenceTest)  Time elapsed: 0.001 sec
testRemoveAssociate(org.eclipse.contribution.xref.core.tests.XReferenceTest)  Time elapsed: 0.001 sec
testXReferenceString(org.eclipse.contribution.xref.core.tests.XReferenceTest)  Time elapsed: 0 sec
testXReferenceStringSet(org.eclipse.contribution.xref.core.tests.XReferenceTest)  Time elapsed: 0 sec
testGetAdapterList(org.eclipse.contribution.xref.core.tests.XReferenceAdapterFactoryTest)  Time elapsed: 0.001 sec
testGetWrongAdapter(org.eclipse.contribution.xref.core.tests.XReferenceAdapterFactoryTest)  Time elapsed: 0 sec
testGetAdapter(org.eclipse.contribution.xref.core.tests.XReferenceAdapterFactoryTest)  Time elapsed: 0.002 sec  <<< FAILURE!
junit.framework.AssertionFailedError: null
	at junit.framework.Assert.fail(Assert.java:55)
	at junit.framework.Assert.assertTrue(Assert.java:22)
	at junit.framework.Assert.assertNotNull(Assert.java:256)
	at junit.framework.Assert.assertNotNull(Assert.java:248)
	at junit.framework.TestCase.assertNotNull(TestCase.java:417)
	at org.eclipse.contribution.xref.core.tests.XReferenceAdapterFactoryTest.testGetAdapter(XReferenceAdapterFactoryTest.java:50)

testGetReferenceSource(org.eclipse.contribution.xref.core.tests.XReferenceAdapterTest)  Time elapsed: 0.002 sec
testGetXReferences(org.eclipse.contribution.xref.core.tests.XReferenceAdapterTest)  Time elapsed: 0.556 sec  <<< FAILURE!
junit.framework.AssertionFailedError: expected:<1> but was:<0>
	at junit.framework.Assert.fail(Assert.java:57)
	at junit.framework.Assert.failNotEquals(Assert.java:329)
	at junit.framework.Assert.assertEquals(Assert.java:78)
	at junit.framework.Assert.assertEquals(Assert.java:234)
	at junit.framework.Assert.assertEquals(Assert.java:241)
	at junit.framework.TestCase.assertEquals(TestCase.java:409)
	at org.eclipse.contribution.xref.core.tests.XReferenceAdapterTest.testGetXReferences(XReferenceAdapterTest.java:45)

testSettingOfIsInplace(org.eclipse.contribution.xref.core.tests.XReferenceProviderManagerTest)  Time elapsed: 0 sec
testGetRegisteredProviders(org.eclipse.contribution.xref.core.tests.XReferenceProviderManagerTest)  Time elapsed: 0 sec  <<< FAILURE!
junit.framework.AssertionFailedError: null
	at junit.framework.Assert.fail(Assert.java:55)
	at junit.framework.Assert.assertTrue(Assert.java:22)
	at junit.framework.Assert.assertTrue(Assert.java:31)
	at junit.framework.TestCase.assertTrue(TestCase.java:201)
	at org.eclipse.contribution.xref.core.tests.XReferenceProviderManagerTest.testGetRegisteredProviders(XReferenceProviderManagerTest.java:73)

testGetProvidersFor(org.eclipse.contribution.xref.core.tests.XReferenceProviderManagerTest)  Time elapsed: 0.001 sec  <<< FAILURE!
junit.framework.AssertionFailedError: expected:<1> but was:<0>
	at junit.framework.Assert.fail(Assert.java:57)
	at junit.framework.Assert.failNotEquals(Assert.java:329)
	at junit.framework.Assert.assertEquals(Assert.java:78)
	at junit.framework.Assert.assertEquals(Assert.java:234)
	at junit.framework.Assert.assertEquals(Assert.java:241)
	at junit.framework.TestCase.assertEquals(TestCase.java:409)
	at org.eclipse.contribution.xref.core.tests.XReferenceProviderManagerTest.testGetProvidersFor(XReferenceProviderManagerTest.java:58)

testGetManager(org.eclipse.contribution.xref.core.tests.XReferenceProviderManagerTest)  Time elapsed: 0 sec
testGetLabel(org.eclipse.contribution.xref.core.tests.XReferenceProviderDefinitionTest)  Time elapsed: 0.002 sec
testGetID(org.eclipse.contribution.xref.core.tests.XReferenceProviderDefinitionTest)  Time elapsed: 0 sec
testSetCheckedInplaceFilters(org.eclipse.contribution.xref.core.tests.XReferenceProviderDefinitionTest)  Time elapsed: 0 sec
testIsAndSetEnabled(org.eclipse.contribution.xref.core.tests.XReferenceProviderDefinitionTest)  Time elapsed: 0 sec
testGetDescription(org.eclipse.contribution.xref.core.tests.XReferenceProviderDefinitionTest)  Time elapsed: 0.001 sec
testSetCheckedFilters(org.eclipse.contribution.xref.core.tests.XReferenceProviderDefinitionTest)  Time elapsed: 0 sec
testSafeExecution(org.eclipse.contribution.xref.core.tests.XReferenceProviderDefinitionTest)  Time elapsed: 0.002 sec

Results :

Failed tests: 
  XReferenceAdapterFactoryTest.testGetAdapter:50 null
  XReferenceAdapterTest.testGetXReferences:45 expected:<1> but was:<0>
  XReferenceProviderManagerTest.testGetRegisteredProviders:73 null
  XReferenceProviderManagerTest.testGetProvidersFor:58 expected:<1> but was:<0>

Tests run: 23, Failures: 4, Errors: 0, Skipped: 0

[ERROR] There are test failures.

Please refer to /jobs/genie.ajdt/ajdt-on-eclipse-47/workspace/org.eclipse.contribution.xref.core.tests/target/surefire-reports for the individual test results.
[INFO] 
[INFO] --- eclipse-jarsigner-plugin:1.0.4:sign (sign) @ org.eclipse.contribution.xref.core.tests ---
[INFO] Signed org.eclipse.ajdt:org.eclipse.contribution.xref.core.tests:eclipse-test-plugin:2.2.4-SNAPSHOT in 0 seconds.
[INFO] 
[INFO] --- tycho-p2-plugin:0.23.1:p2-metadata (p2-metadata) @ org.eclipse.contribution.xref.core.tests ---
[INFO]                                                                         
[INFO] ------------------------------------------------------------------------
[INFO] Building org.eclipse.contribution.xref.ui.tests 2.2.4-SNAPSHOT
[INFO] ------------------------------------------------------------------------
[INFO] 
[INFO] --- maven-clean-plugin:2.5:clean (default-clean) @ org.eclipse.contribution.xref.ui.tests ---
[INFO] Deleting /jobs/genie.ajdt/ajdt-on-eclipse-47/workspace/org.eclipse.contribution.xref.ui.tests/target
[INFO] 
[INFO] --- tycho-packaging-plugin:0.23.1:build-qualifier (default-build-qualifier) @ org.eclipse.contribution.xref.ui.tests ---
[INFO] The project's OSGi version is 2.2.4.201704242114
[INFO] 
[INFO] --- tycho-packaging-plugin:0.23.1:validate-id (default-validate-id) @ org.eclipse.contribution.xref.ui.tests ---
[INFO] 
[INFO] --- tycho-packaging-plugin:0.23.1:validate-version (default-validate-version) @ org.eclipse.contribution.xref.ui.tests ---
[INFO] 
[INFO] --- maven-resources-plugin:2.4.3:resources (default-resources) @ org.eclipse.contribution.xref.ui.tests ---
[WARNING] Using platform encoding (UTF-8 actually) to copy filtered resources, i.e. build is platform dependent!
[INFO] skip non existing resourceDirectory /jobs/genie.ajdt/ajdt-on-eclipse-47/workspace/org.eclipse.contribution.xref.ui.tests/src/main/resources
[INFO] 
[INFO] --- tycho-compiler-plugin:0.23.1:compile (default-compile) @ org.eclipse.contribution.xref.ui.tests ---
[INFO] Compiling 7 source files to /jobs/genie.ajdt/ajdt-on-eclipse-47/workspace/org.eclipse.contribution.xref.ui.tests/target/classes
[INFO] 
[INFO] --- maven-resources-plugin:2.4.3:testResources (default-testResources) @ org.eclipse.contribution.xref.ui.tests ---
[WARNING] Using platform encoding (UTF-8 actually) to copy filtered resources, i.e. build is platform dependent!
[INFO] skip non existing resourceDirectory /jobs/genie.ajdt/ajdt-on-eclipse-47/workspace/org.eclipse.contribution.xref.ui.tests/src/test/resources
[INFO] 
[INFO] --- target-platform-configuration:0.23.1:target-platform (default-target-platform) @ org.eclipse.contribution.xref.ui.tests ---
[INFO] 
[INFO] --- tycho-packaging-plugin:0.23.1:package-plugin (default-package-plugin) @ org.eclipse.contribution.xref.ui.tests ---
[INFO] Building jar: /jobs/genie.ajdt/ajdt-on-eclipse-47/workspace/org.eclipse.contribution.xref.ui.tests/xrefuitests.jar
[INFO] Building jar: /jobs/genie.ajdt/ajdt-on-eclipse-47/workspace/org.eclipse.contribution.xref.ui.tests/target/org.eclipse.contribution.xref.ui.tests-2.2.4-SNAPSHOT.jar
[INFO] 
[INFO] --- tycho-p2-plugin:0.23.1:p2-metadata-default (default-p2-metadata-default) @ org.eclipse.contribution.xref.ui.tests ---
[INFO] 
[INFO] --- tycho-surefire-plugin:0.23.1:test (default-test) @ org.eclipse.contribution.xref.ui.tests ---
[INFO] Expected eclipse log file: /jobs/genie.ajdt/ajdt-on-eclipse-47/workspace/org.eclipse.contribution.xref.ui.tests/target/work/data/.metadata/.log
[INFO] Command line:
	[/opt/public/common/jdk1.8.0_121.x64/jre/bin/java, -Dosgi.noShutdown=false, -Dosgi.os=linux, -Dosgi.ws=gtk, -Dosgi.arch=x86_64, -Xmx1024m, -XX:MaxPermSize=256m, -Dosgi.clean=true, -jar, /jobs/genie.ajdt/ajdt-on-eclipse-47/workspace/.maven/repo/p2/osgi/bundle/org.eclipse.equinox.launcher/1.4.0.v20161219-1356/org.eclipse.equinox.launcher-1.4.0.v20161219-1356.jar, -debug, -consolelog, -data, /jobs/genie.ajdt/ajdt-on-eclipse-47/workspace/org.eclipse.contribution.xref.ui.tests/target/work/data, -install, /jobs/genie.ajdt/ajdt-on-eclipse-47/workspace/org.eclipse.contribution.xref.ui.tests/target/work, -configuration, /jobs/genie.ajdt/ajdt-on-eclipse-47/workspace/org.eclipse.contribution.xref.ui.tests/target/work/configuration, -application, org.eclipse.tycho.surefire.osgibooter.uitest, -testproperties, /jobs/genie.ajdt/ajdt-on-eclipse-47/workspace/org.eclipse.contribution.xref.ui.tests/target/surefire.properties]
Java HotSpot(TM) 64-Bit Server VM warning: ignoring option MaxPermSize=256m; support was removed in 8.0
Configuration location:
    file:/jobs/genie.ajdt/ajdt-on-eclipse-47/workspace/org.eclipse.contribution.xref.ui.tests/target/work/configuration/
Configuration file:
    file:/jobs/genie.ajdt/ajdt-on-eclipse-47/workspace/org.eclipse.contribution.xref.ui.tests/target/work/configuration/config.ini loaded
Install location:
    file:/jobs/genie.ajdt/ajdt-on-eclipse-47/workspace/org.eclipse.contribution.xref.ui.tests/target/work/
Framework located:
    file:/home/hudson/genie.ajdt/.hudson/jobs/ajdt-on-eclipse-47/workspace/.maven/repo/p2/osgi/bundle/org.eclipse.osgi/3.12.0.v20170302-2050/org.eclipse.osgi-3.12.0.v20170302-2050.jar
Framework classpath:
    file:/home/hudson/genie.ajdt/.hudson/jobs/ajdt-on-eclipse-47/workspace/.maven/repo/p2/osgi/bundle/org.eclipse.osgi/3.12.0.v20170302-2050/org.eclipse.osgi-3.12.0.v20170302-2050.jar
Debug options:
    file:/jobs/genie.ajdt/ajdt-on-eclipse-47/workspace/org.eclipse.contribution.xref.ui.tests/.options not found
Time to load bundles: 739
!SESSION 2017-04-24 18:48:49.632 -----------------------------------------------
eclipse.buildId=unknown
java.version=1.8.0_121
java.vendor=Oracle Corporation
BootLoader constants: OS=linux, ARCH=x86_64, WS=gtk, NL=en_US
Framework arguments:  -application org.eclipse.tycho.surefire.osgibooter.uitest -testproperties /jobs/genie.ajdt/ajdt-on-eclipse-47/workspace/org.eclipse.contribution.xref.ui.tests/target/surefire.properties
Command-line arguments:  -debug -consolelog -data /jobs/genie.ajdt/ajdt-on-eclipse-47/workspace/org.eclipse.contribution.xref.ui.tests/target/work/data -application org.eclipse.tycho.surefire.osgibooter.uitest -testproperties /jobs/genie.ajdt/ajdt-on-eclipse-47/workspace/org.eclipse.contribution.xref.ui.tests/target/surefire.properties

!ENTRY org.eclipse.jdt.launching.macosx 4 0 2017-04-24 18:48:52.598
!MESSAGE FrameworkEvent ERROR
!STACK 0
org.osgi.framework.BundleException: Could not resolve module: org.eclipse.jdt.launching.macosx [218]
  Unresolved requirement: Require-Capability: eclipse.platform; filter:="(osgi.os=macosx)"

	at org.eclipse.osgi.container.Module.start(Module.java:444)
	at org.eclipse.osgi.container.ModuleContainer$ContainerStartLevel.incStartLevel(ModuleContainer.java:1628)
	at org.eclipse.osgi.container.ModuleContainer$ContainerStartLevel.incStartLevel(ModuleContainer.java:1607)
	at org.eclipse.osgi.container.ModuleContainer$ContainerStartLevel.doContainerStartLevel(ModuleContainer.java:1579)
	at org.eclipse.osgi.container.ModuleContainer$ContainerStartLevel.dispatchEvent(ModuleContainer.java:1522)
	at org.eclipse.osgi.container.ModuleContainer$ContainerStartLevel.dispatchEvent(ModuleContainer.java:1)
	at org.eclipse.osgi.framework.eventmgr.EventManager.dispatchEvent(EventManager.java:230)
	at org.eclipse.osgi.framework.eventmgr.EventManager$EventThread.run(EventManager.java:340)

!ENTRY org.eclipse.jdt.launching.ui.macosx 4 0 2017-04-24 18:48:52.600
!MESSAGE FrameworkEvent ERROR
!STACK 0
org.osgi.framework.BundleException: Could not resolve module: org.eclipse.jdt.launching.ui.macosx [219]
  Unresolved requirement: Require-Capability: eclipse.platform; filter:="(osgi.os=macosx)"

	at org.eclipse.osgi.container.Module.start(Module.java:444)
	at org.eclipse.osgi.container.ModuleContainer$ContainerStartLevel.incStartLevel(ModuleContainer.java:1628)
	at org.eclipse.osgi.container.ModuleContainer$ContainerStartLevel.incStartLevel(ModuleContainer.java:1607)
	at org.eclipse.osgi.container.ModuleContainer$ContainerStartLevel.doContainerStartLevel(ModuleContainer.java:1579)
	at org.eclipse.osgi.container.ModuleContainer$ContainerStartLevel.dispatchEvent(ModuleContainer.java:1522)
	at org.eclipse.osgi.container.ModuleContainer$ContainerStartLevel.dispatchEvent(ModuleContainer.java:1)
	at org.eclipse.osgi.framework.eventmgr.EventManager.dispatchEvent(EventManager.java:230)
	at org.eclipse.osgi.framework.eventmgr.EventManager$EventThread.run(EventManager.java:340)
Starting application: 3553
Application Started: 5625

-------------------------------------------------------
 T E S T S
-------------------------------------------------------
Running org.eclipse.contribution.xref.ui.tests.AllTests

!ENTRY org.eclipse.contribution.xref.core 2 1 2017-04-24 18:48:57.336
!MESSAGE Could not load provider org.eclipse.contribution.xref.core.tests.unknownProvider
!STACK 1
org.eclipse.core.runtime.CoreException: Plug-in org.eclipse.contribution.xref.core.tests was unable to load class org.eclipse.contribution.xref.core.tests.UnknownProvider.
	at org.eclipse.core.internal.registry.osgi.RegistryStrategyOSGI.throwException(RegistryStrategyOSGI.java:194)
	at org.eclipse.core.internal.registry.osgi.RegistryStrategyOSGI.createExecutableExtension(RegistryStrategyOSGI.java:176)
	at org.eclipse.core.internal.registry.ExtensionRegistry.createExecutableExtension(ExtensionRegistry.java:905)
	at org.eclipse.core.internal.registry.ConfigurationElement.createExecutableExtension(ConfigurationElement.java:243)
	at org.eclipse.core.internal.registry.ConfigurationElementHandle.createExecutableExtension(ConfigurationElementHandle.java:55)
	at org.eclipse.contribution.xref.core.XReferenceProviderDefinition.<init>(XReferenceProviderDefinition.java:32)
	at org.eclipse.contribution.xref.core.XReferenceProviderManager.getRegisteredProviders(XReferenceProviderManager.java:95)
	at org.eclipse.contribution.xref.internal.ui.actions.XReferenceCustomFilterAction.<init>(XReferenceCustomFilterAction.java:58)
	at org.eclipse.contribution.xref.ui.views.XReferenceView.makeActions(XReferenceView.java:458)
	at org.eclipse.contribution.xref.ui.views.XReferenceView.createPartControl(XReferenceView.java:117)
	at org.eclipse.ui.internal.e4.compatibility.CompatibilityPart.createPartControl(CompatibilityPart.java:151)
	at org.eclipse.ui.internal.e4.compatibility.CompatibilityView.createPartControl(CompatibilityView.java:147)
	at org.eclipse.ui.internal.e4.compatibility.CompatibilityPart.create(CompatibilityPart.java:355)
	at sun.reflect.NativeMethodAccessorImpl.invoke0(Native Method)
	at sun.reflect.NativeMethodAccessorImpl.invoke(NativeMethodAccessorImpl.java:62)
	at sun.reflect.DelegatingMethodAccessorImpl.invoke(DelegatingMethodAccessorImpl.java:43)
	at java.lang.reflect.Method.invoke(Method.java:498)
	at org.eclipse.e4.core.internal.di.MethodRequestor.execute(MethodRequestor.java:55)
	at org.eclipse.e4.core.internal.di.InjectorImpl.processAnnotated(InjectorImpl.java:990)
	at org.eclipse.e4.core.internal.di.InjectorImpl.processAnnotated(InjectorImpl.java:955)
	at org.eclipse.e4.core.internal.di.InjectorImpl.inject(InjectorImpl.java:124)
	at org.eclipse.e4.core.internal.di.InjectorImpl.internalMake(InjectorImpl.java:399)
	at org.eclipse.e4.core.internal.di.InjectorImpl.make(InjectorImpl.java:318)
	at org.eclipse.e4.core.contexts.ContextInjectionFactory.make(ContextInjectionFactory.java:162)
	at org.eclipse.e4.ui.internal.workbench.ReflectionContributionFactory.createFromBundle(ReflectionContributionFactory.java:105)
	at org.eclipse.e4.ui.internal.workbench.ReflectionContributionFactory.doCreate(ReflectionContributionFactory.java:74)
	at org.eclipse.e4.ui.internal.workbench.ReflectionContributionFactory.create(ReflectionContributionFactory.java:56)
	at org.eclipse.e4.ui.workbench.renderers.swt.ContributedPartRenderer.createWidget(ContributedPartRenderer.java:129)
	at org.eclipse.e4.ui.internal.workbench.swt.PartRenderingEngine.createWidget(PartRenderingEngine.java:987)
	at org.eclipse.e4.ui.internal.workbench.swt.PartRenderingEngine.safeCreateGui(PartRenderingEngine.java:663)
	at org.eclipse.e4.ui.internal.workbench.swt.PartRenderingEngine$1.run(PartRenderingEngine.java:548)
	at org.eclipse.core.runtime.SafeRunner.run(SafeRunner.java:42)
	at org.eclipse.e4.ui.internal.workbench.swt.PartRenderingEngine.createGui(PartRenderingEngine.java:532)
	at org.eclipse.e4.ui.workbench.renderers.swt.ElementReferenceRenderer.createWidget(ElementReferenceRenderer.java:70)
	at org.eclipse.e4.ui.internal.workbench.swt.PartRenderingEngine.createWidget(PartRenderingEngine.java:987)
	at org.eclipse.e4.ui.internal.workbench.swt.PartRenderingEngine.safeCreateGui(PartRenderingEngine.java:663)
	at org.eclipse.e4.ui.internal.workbench.swt.PartRenderingEngine.safeCreateGui(PartRenderingEngine.java:769)
	at org.eclipse.e4.ui.internal.workbench.swt.PartRenderingEngine.access$0(PartRenderingEngine.java:740)
	at org.eclipse.e4.ui.internal.workbench.swt.PartRenderingEngine$2.run(PartRenderingEngine.java:734)
	at org.eclipse.core.runtime.SafeRunner.run(SafeRunner.java:42)
	at org.eclipse.e4.ui.internal.workbench.swt.PartRenderingEngine.createGui(PartRenderingEngine.java:718)
	at org.eclipse.e4.ui.internal.workbench.PartServiceImpl$1.handleEvent(PartServiceImpl.java:109)
	at org.eclipse.e4.ui.services.internal.events.UIEventHandler$1.run(UIEventHandler.java:40)
	at org.eclipse.swt.widgets.Synchronizer.syncExec(Synchronizer.java:233)
	at org.eclipse.ui.internal.UISynchronizer.syncExec(UISynchronizer.java:144)
	at org.eclipse.swt.widgets.Display.syncExec(Display.java:5412)
	at org.eclipse.e4.ui.internal.workbench.swt.E4Application$1.syncExec(E4Application.java:212)
	at org.eclipse.e4.ui.services.internal.events.UIEventHandler.handleEvent(UIEventHandler.java:36)
	at org.eclipse.equinox.internal.event.EventHandlerWrapper.handleEvent(EventHandlerWrapper.java:201)
	at org.eclipse.equinox.internal.event.EventHandlerTracker.dispatchEvent(EventHandlerTracker.java:197)
	at org.eclipse.equinox.internal.event.EventHandlerTracker.dispatchEvent(EventHandlerTracker.java:1)
	at org.eclipse.osgi.framework.eventmgr.EventManager.dispatchEvent(EventManager.java:230)
	at org.eclipse.osgi.framework.eventmgr.ListenerQueue.dispatchEventSynchronous(ListenerQueue.java:148)
	at org.eclipse.equinox.internal.event.EventAdminImpl.dispatchEvent(EventAdminImpl.java:135)
	at org.eclipse.equinox.internal.event.EventAdminImpl.sendEvent(EventAdminImpl.java:78)
	at org.eclipse.equinox.internal.event.EventComponent.sendEvent(EventComponent.java:39)
	at org.eclipse.e4.ui.services.internal.events.EventBroker.send(EventBroker.java:52)
	at org.eclipse.e4.ui.internal.workbench.UIEventPublisher.notifyChanged(UIEventPublisher.java:60)
	at org.eclipse.emf.common.notify.impl.BasicNotifierImpl.eNotify(BasicNotifierImpl.java:374)
	at org.eclipse.e4.ui.model.application.ui.impl.ElementContainerImpl.setSelectedElement(ElementContainerImpl.java:173)
	at org.eclipse.e4.ui.internal.workbench.ModelServiceImpl.showElementInWindow(ModelServiceImpl.java:620)
	at org.eclipse.e4.ui.internal.workbench.ModelServiceImpl.bringToTop(ModelServiceImpl.java:584)
	at org.eclipse.e4.ui.internal.workbench.PartServiceImpl.delegateBringToTop(PartServiceImpl.java:768)
	at org.eclipse.e4.ui.internal.workbench.PartServiceImpl.activate(PartServiceImpl.java:742)
	at org.eclipse.e4.ui.internal.workbench.PartServiceImpl.activate(PartServiceImpl.java:680)
	at org.eclipse.e4.ui.internal.workbench.PartServiceImpl.activate(PartServiceImpl.java:675)
	at org.eclipse.e4.ui.internal.workbench.PartServiceImpl.showPart(PartServiceImpl.java:1178)
	at org.eclipse.ui.internal.WorkbenchPage.showPart(WorkbenchPage.java:1287)
	at org.eclipse.ui.internal.WorkbenchPage.busyShowView(WorkbenchPage.java:1278)
	at org.eclipse.ui.internal.WorkbenchPage$12.run(WorkbenchPage.java:4329)
	at org.eclipse.swt.custom.BusyIndicator.showWhile(BusyIndicator.java:70)
	at org.eclipse.ui.internal.WorkbenchPage.showView(WorkbenchPage.java:4325)
	at org.eclipse.ui.internal.WorkbenchPage.showView(WorkbenchPage.java:4305)
	at org.eclipse.contribution.xref.ui.tests.views.XReferenceViewTest.testShowHide(XReferenceViewTest.java:59)
	at sun.reflect.NativeMethodAccessorImpl.invoke0(Native Method)
	at sun.reflect.NativeMethodAccessorImpl.invoke(NativeMethodAccessorImpl.java:62)
	at sun.reflect.DelegatingMethodAccessorImpl.invoke(DelegatingMethodAccessorImpl.java:43)
	at java.lang.reflect.Method.invoke(Method.java:498)
	at junit.framework.TestCase.runTest(TestCase.java:176)
	at junit.framework.TestCase.runBare(TestCase.java:141)
	at junit.framework.TestResult$1.protect(TestResult.java:122)
	at junit.framework.TestResult.runProtected(TestResult.java:142)
	at junit.framework.TestResult.run(TestResult.java:125)
	at junit.framework.TestCase.run(TestCase.java:129)
	at junit.framework.TestSuite.runTest(TestSuite.java:252)
	at junit.framework.TestSuite.run(TestSuite.java:247)
	at junit.framework.TestSuite.runTest(TestSuite.java:252)
	at junit.framework.TestSuite.run(TestSuite.java:247)
	at org.junit.internal.runners.JUnit38ClassRunner.run(JUnit38ClassRunner.java:86)
	at org.apache.maven.surefire.junit4.JUnit4Provider.execute(JUnit4Provider.java:264)
	at org.apache.maven.surefire.junit4.JUnit4Provider.executeTestSet(JUnit4Provider.java:153)
	at org.apache.maven.surefire.junit4.JUnit4Provider.invoke(JUnit4Provider.java:124)
	at sun.reflect.NativeMethodAccessorImpl.invoke0(Native Method)
	at sun.reflect.NativeMethodAccessorImpl.invoke(NativeMethodAccessorImpl.java:62)
	at sun.reflect.DelegatingMethodAccessorImpl.invoke(DelegatingMethodAccessorImpl.java:43)
	at java.lang.reflect.Method.invoke(Method.java:498)
	at org.apache.maven.surefire.util.ReflectionUtils.invokeMethodWithArray2(ReflectionUtils.java:208)
	at org.apache.maven.surefire.booter.ProviderFactory$ProviderProxy.invoke(ProviderFactory.java:156)
	at org.apache.maven.surefire.booter.ProviderFactory.invokeProvider(ProviderFactory.java:82)
	at org.eclipse.tycho.surefire.osgibooter.OsgiSurefireBooter.run(OsgiSurefireBooter.java:91)
	at org.eclipse.tycho.surefire.osgibooter.AbstractUITestApplication$1.run(AbstractUITestApplication.java:35)
	at org.eclipse.swt.widgets.RunnableLock.run(RunnableLock.java:37)
	at org.eclipse.swt.widgets.Synchronizer.runAsyncMessages(Synchronizer.java:182)
	at org.eclipse.swt.widgets.Display.runAsyncMessages(Display.java:4470)
	at org.eclipse.swt.widgets.Display.readAndDispatch(Display.java:4083)
	at org.eclipse.e4.ui.internal.workbench.swt.PartRenderingEngine$4.run(PartRenderingEngine.java:1145)
	at org.eclipse.core.databinding.observable.Realm.runWithDefault(Realm.java:336)
	at org.eclipse.e4.ui.internal.workbench.swt.PartRenderingEngine.run(PartRenderingEngine.java:1034)
	at org.eclipse.e4.ui.internal.workbench.E4Workbench.createAndRunUI(E4Workbench.java:153)
	at org.eclipse.ui.internal.Workbench.lambda$3(Workbench.java:680)
	at org.eclipse.core.databinding.observable.Realm.runWithDefault(Realm.java:336)
	at org.eclipse.ui.internal.Workbench.createAndRunWorkbench(Workbench.java:594)
	at org.eclipse.ui.PlatformUI.createAndRunWorkbench(PlatformUI.java:148)
	at org.eclipse.ui.internal.ide.application.IDEApplication.start(IDEApplication.java:138)
	at org.eclipse.tycho.surefire.osgibooter.UITestApplication.runApplication(UITestApplication.java:31)
	at org.eclipse.tycho.surefire.osgibooter.AbstractUITestApplication.run(AbstractUITestApplication.java:120)
	at org.eclipse.tycho.surefire.osgibooter.UITestApplication.start(UITestApplication.java:37)
	at org.eclipse.equinox.internal.app.EclipseAppHandle.run(EclipseAppHandle.java:196)
	at org.eclipse.core.runtime.internal.adaptor.EclipseAppLauncher.runApplication(EclipseAppLauncher.java:134)
	at org.eclipse.core.runtime.internal.adaptor.EclipseAppLauncher.start(EclipseAppLauncher.java:104)
	at org.eclipse.core.runtime.adaptor.EclipseStarter.run(EclipseStarter.java:388)
	at org.eclipse.core.runtime.adaptor.EclipseStarter.run(EclipseStarter.java:243)
	at sun.reflect.NativeMethodAccessorImpl.invoke0(Native Method)
	at sun.reflect.NativeMethodAccessorImpl.invoke(NativeMethodAccessorImpl.java:62)
	at sun.reflect.DelegatingMethodAccessorImpl.invoke(DelegatingMethodAccessorImpl.java:43)
	at java.lang.reflect.Method.invoke(Method.java:498)
	at org.eclipse.equinox.launcher.Main.invokeFramework(Main.java:653)
	at org.eclipse.equinox.launcher.Main.basicRun(Main.java:590)
	at org.eclipse.equinox.launcher.Main.run(Main.java:1499)
	at org.eclipse.equinox.launcher.Main.main(Main.java:1472)
Caused by: java.lang.ClassNotFoundException: org.eclipse.contribution.xref.core.tests.UnknownProvider cannot be found by org.eclipse.contribution.xref.core.tests_2.2.4.201704242114
	at org.eclipse.osgi.internal.loader.BundleLoader.findClassInternal(BundleLoader.java:475)
	at org.eclipse.osgi.internal.loader.BundleLoader.findClass(BundleLoader.java:386)
	at org.eclipse.osgi.internal.loader.BundleLoader.findClass(BundleLoader.java:378)
	at org.eclipse.osgi.internal.loader.ModuleClassLoader.loadClass(ModuleClassLoader.java:150)
	at java.lang.ClassLoader.loadClass(ClassLoader.java:357)
	at org.eclipse.osgi.internal.framework.EquinoxBundle.loadClass(EquinoxBundle.java:564)
	at org.eclipse.core.internal.registry.osgi.RegistryStrategyOSGI.createExecutableExtension(RegistryStrategyOSGI.java:174)
	... 128 more
!SUBENTRY 1 org.eclipse.equinox.registry 4 1 2017-04-24 18:48:57.339
!MESSAGE Plug-in org.eclipse.contribution.xref.core.tests was unable to load class org.eclipse.contribution.xref.core.tests.UnknownProvider.
!STACK 0
java.lang.ClassNotFoundException: org.eclipse.contribution.xref.core.tests.UnknownProvider cannot be found by org.eclipse.contribution.xref.core.tests_2.2.4.201704242114
	at org.eclipse.osgi.internal.loader.BundleLoader.findClassInternal(BundleLoader.java:475)
	at org.eclipse.osgi.internal.loader.BundleLoader.findClass(BundleLoader.java:386)
	at org.eclipse.osgi.internal.loader.BundleLoader.findClass(BundleLoader.java:378)
	at org.eclipse.osgi.internal.loader.ModuleClassLoader.loadClass(ModuleClassLoader.java:150)
	at java.lang.ClassLoader.loadClass(ClassLoader.java:357)
	at org.eclipse.osgi.internal.framework.EquinoxBundle.loadClass(EquinoxBundle.java:564)
	at org.eclipse.core.internal.registry.osgi.RegistryStrategyOSGI.createExecutableExtension(RegistryStrategyOSGI.java:174)
	at org.eclipse.core.internal.registry.ExtensionRegistry.createExecutableExtension(ExtensionRegistry.java:905)
	at org.eclipse.core.internal.registry.ConfigurationElement.createExecutableExtension(ConfigurationElement.java:243)
	at org.eclipse.core.internal.registry.ConfigurationElementHandle.createExecutableExtension(ConfigurationElementHandle.java:55)
	at org.eclipse.contribution.xref.core.XReferenceProviderDefinition.<init>(XReferenceProviderDefinition.java:32)
	at org.eclipse.contribution.xref.core.XReferenceProviderManager.getRegisteredProviders(XReferenceProviderManager.java:95)
	at org.eclipse.contribution.xref.internal.ui.actions.XReferenceCustomFilterAction.<init>(XReferenceCustomFilterAction.java:58)
	at org.eclipse.contribution.xref.ui.views.XReferenceView.makeActions(XReferenceView.java:458)
	at org.eclipse.contribution.xref.ui.views.XReferenceView.createPartControl(XReferenceView.java:117)
	at org.eclipse.ui.internal.e4.compatibility.CompatibilityPart.createPartControl(CompatibilityPart.java:151)
	at org.eclipse.ui.internal.e4.compatibility.CompatibilityView.createPartControl(CompatibilityView.java:147)
	at org.eclipse.ui.internal.e4.compatibility.CompatibilityPart.create(CompatibilityPart.java:355)
	at sun.reflect.NativeMethodAccessorImpl.invoke0(Native Method)
	at sun.reflect.NativeMethodAccessorImpl.invoke(NativeMethodAccessorImpl.java:62)
	at sun.reflect.DelegatingMethodAccessorImpl.invoke(DelegatingMethodAccessorImpl.java:43)
	at java.lang.reflect.Method.invoke(Method.java:498)
	at org.eclipse.e4.core.internal.di.MethodRequestor.execute(MethodRequestor.java:55)
	at org.eclipse.e4.core.internal.di.InjectorImpl.processAnnotated(InjectorImpl.java:990)
	at org.eclipse.e4.core.internal.di.InjectorImpl.processAnnotated(InjectorImpl.java:955)
	at org.eclipse.e4.core.internal.di.InjectorImpl.inject(InjectorImpl.java:124)
	at org.eclipse.e4.core.internal.di.InjectorImpl.internalMake(InjectorImpl.java:399)
	at org.eclipse.e4.core.internal.di.InjectorImpl.make(InjectorImpl.java:318)
	at org.eclipse.e4.core.contexts.ContextInjectionFactory.make(ContextInjectionFactory.java:162)
	at org.eclipse.e4.ui.internal.workbench.ReflectionContributionFactory.createFromBundle(ReflectionContributionFactory.java:105)
	at org.eclipse.e4.ui.internal.workbench.ReflectionContributionFactory.doCreate(ReflectionContributionFactory.java:74)
	at org.eclipse.e4.ui.internal.workbench.ReflectionContributionFactory.create(ReflectionContributionFactory.java:56)
	at org.eclipse.e4.ui.workbench.renderers.swt.ContributedPartRenderer.createWidget(ContributedPartRenderer.java:129)
	at org.eclipse.e4.ui.internal.workbench.swt.PartRenderingEngine.createWidget(PartRenderingEngine.java:987)
	at org.eclipse.e4.ui.internal.workbench.swt.PartRenderingEngine.safeCreateGui(PartRenderingEngine.java:663)
	at org.eclipse.e4.ui.internal.workbench.swt.PartRenderingEngine$1.run(PartRenderingEngine.java:548)
	at org.eclipse.core.runtime.SafeRunner.run(SafeRunner.java:42)
	at org.eclipse.e4.ui.internal.workbench.swt.PartRenderingEngine.createGui(PartRenderingEngine.java:532)
	at org.eclipse.e4.ui.workbench.renderers.swt.ElementReferenceRenderer.createWidget(ElementReferenceRenderer.java:70)
	at org.eclipse.e4.ui.internal.workbench.swt.PartRenderingEngine.createWidget(PartRenderingEngine.java:987)
	at org.eclipse.e4.ui.internal.workbench.swt.PartRenderingEngine.safeCreateGui(PartRenderingEngine.java:663)
	at org.eclipse.e4.ui.internal.workbench.swt.PartRenderingEngine.safeCreateGui(PartRenderingEngine.java:769)
	at org.eclipse.e4.ui.internal.workbench.swt.PartRenderingEngine.access$0(PartRenderingEngine.java:740)
	at org.eclipse.e4.ui.internal.workbench.swt.PartRenderingEngine$2.run(PartRenderingEngine.java:734)
	at org.eclipse.core.runtime.SafeRunner.run(SafeRunner.java:42)
	at org.eclipse.e4.ui.internal.workbench.swt.PartRenderingEngine.createGui(PartRenderingEngine.java:718)
	at org.eclipse.e4.ui.internal.workbench.PartServiceImpl$1.handleEvent(PartServiceImpl.java:109)
	at org.eclipse.e4.ui.services.internal.events.UIEventHandler$1.run(UIEventHandler.java:40)
	at org.eclipse.swt.widgets.Synchronizer.syncExec(Synchronizer.java:233)
	at org.eclipse.ui.internal.UISynchronizer.syncExec(UISynchronizer.java:144)
	at org.eclipse.swt.widgets.Display.syncExec(Display.java:5412)
	at org.eclipse.e4.ui.internal.workbench.swt.E4Application$1.syncExec(E4Application.java:212)
	at org.eclipse.e4.ui.services.internal.events.UIEventHandler.handleEvent(UIEventHandler.java:36)
	at org.eclipse.equinox.internal.event.EventHandlerWrapper.handleEvent(EventHandlerWrapper.java:201)
	at org.eclipse.equinox.internal.event.EventHandlerTracker.dispatchEvent(EventHandlerTracker.java:197)
	at org.eclipse.equinox.internal.event.EventHandlerTracker.dispatchEvent(EventHandlerTracker.java:1)
	at org.eclipse.osgi.framework.eventmgr.EventManager.dispatchEvent(EventManager.java:230)
	at org.eclipse.osgi.framework.eventmgr.ListenerQueue.dispatchEventSynchronous(ListenerQueue.java:148)
	at org.eclipse.equinox.internal.event.EventAdminImpl.dispatchEvent(EventAdminImpl.java:135)
	at org.eclipse.equinox.internal.event.EventAdminImpl.sendEvent(EventAdminImpl.java:78)
	at org.eclipse.equinox.internal.event.EventComponent.sendEvent(EventComponent.java:39)
	at org.eclipse.e4.ui.services.internal.events.EventBroker.send(EventBroker.java:52)
	at org.eclipse.e4.ui.internal.workbench.UIEventPublisher.notifyChanged(UIEventPublisher.java:60)
	at org.eclipse.emf.common.notify.impl.BasicNotifierImpl.eNotify(BasicNotifierImpl.java:374)
	at org.eclipse.e4.ui.model.application.ui.impl.ElementContainerImpl.setSelectedElement(ElementContainerImpl.java:173)
	at org.eclipse.e4.ui.internal.workbench.ModelServiceImpl.showElementInWindow(ModelServiceImpl.java:620)
	at org.eclipse.e4.ui.internal.workbench.ModelServiceImpl.bringToTop(ModelServiceImpl.java:584)
	at org.eclipse.e4.ui.internal.workbench.PartServiceImpl.delegateBringToTop(PartServiceImpl.java:768)
	at org.eclipse.e4.ui.internal.workbench.PartServiceImpl.activate(PartServiceImpl.java:742)
	at org.eclipse.e4.ui.internal.workbench.PartServiceImpl.activate(PartServiceImpl.java:680)
	at org.eclipse.e4.ui.internal.workbench.PartServiceImpl.activate(PartServiceImpl.java:675)
	at org.eclipse.e4.ui.internal.workbench.PartServiceImpl.showPart(PartServiceImpl.java:1178)
	at org.eclipse.ui.internal.WorkbenchPage.showPart(WorkbenchPage.java:1287)
	at org.eclipse.ui.internal.WorkbenchPage.busyShowView(WorkbenchPage.java:1278)
	at org.eclipse.ui.internal.WorkbenchPage$12.run(WorkbenchPage.java:4329)
	at org.eclipse.swt.custom.BusyIndicator.showWhile(BusyIndicator.java:70)
	at org.eclipse.ui.internal.WorkbenchPage.showView(WorkbenchPage.java:4325)
	at org.eclipse.ui.internal.WorkbenchPage.showView(WorkbenchPage.java:4305)
	at org.eclipse.contribution.xref.ui.tests.views.XReferenceViewTest.testShowHide(XReferenceViewTest.java:59)
	at sun.reflect.NativeMethodAccessorImpl.invoke0(Native Method)
	at sun.reflect.NativeMethodAccessorImpl.invoke(NativeMethodAccessorImpl.java:62)
	at sun.reflect.DelegatingMethodAccessorImpl.invoke(DelegatingMethodAccessorImpl.java:43)
	at java.lang.reflect.Method.invoke(Method.java:498)
	at junit.framework.TestCase.runTest(TestCase.java:176)
	at junit.framework.TestCase.runBare(TestCase.java:141)
	at junit.framework.TestResult$1.protect(TestResult.java:122)
	at junit.framework.TestResult.runProtected(TestResult.java:142)
	at junit.framework.TestResult.run(TestResult.java:125)
	at junit.framework.TestCase.run(TestCase.java:129)
	at junit.framework.TestSuite.runTest(TestSuite.java:252)
	at junit.framework.TestSuite.run(TestSuite.java:247)
	at junit.framework.TestSuite.runTest(TestSuite.java:252)
	at junit.framework.TestSuite.run(TestSuite.java:247)
	at org.junit.internal.runners.JUnit38ClassRunner.run(JUnit38ClassRunner.java:86)
	at org.apache.maven.surefire.junit4.JUnit4Provider.execute(JUnit4Provider.java:264)
	at org.apache.maven.surefire.junit4.JUnit4Provider.executeTestSet(JUnit4Provider.java:153)
	at org.apache.maven.surefire.junit4.JUnit4Provider.invoke(JUnit4Provider.java:124)
	at sun.reflect.NativeMethodAccessorImpl.invoke0(Native Method)
	at sun.reflect.NativeMethodAccessorImpl.invoke(NativeMethodAccessorImpl.java:62)
	at sun.reflect.DelegatingMethodAccessorImpl.invoke(DelegatingMethodAccessorImpl.java:43)
	at java.lang.reflect.Method.invoke(Method.java:498)
	at org.apache.maven.surefire.util.ReflectionUtils.invokeMethodWithArray2(ReflectionUtils.java:208)
	at org.apache.maven.surefire.booter.ProviderFactory$ProviderProxy.invoke(ProviderFactory.java:156)
	at org.apache.maven.surefire.booter.ProviderFactory.invokeProvider(ProviderFactory.java:82)
	at org.eclipse.tycho.surefire.osgibooter.OsgiSurefireBooter.run(OsgiSurefireBooter.java:91)
	at org.eclipse.tycho.surefire.osgibooter.AbstractUITestApplication$1.run(AbstractUITestApplication.java:35)
	at org.eclipse.swt.widgets.RunnableLock.run(RunnableLock.java:37)
	at org.eclipse.swt.widgets.Synchronizer.runAsyncMessages(Synchronizer.java:182)
	at org.eclipse.swt.widgets.Display.runAsyncMessages(Display.java:4470)
	at org.eclipse.swt.widgets.Display.readAndDispatch(Display.java:4083)
	at org.eclipse.e4.ui.internal.workbench.swt.PartRenderingEngine$4.run(PartRenderingEngine.java:1145)
	at org.eclipse.core.databinding.observable.Realm.runWithDefault(Realm.java:336)
	at org.eclipse.e4.ui.internal.workbench.swt.PartRenderingEngine.run(PartRenderingEngine.java:1034)
	at org.eclipse.e4.ui.internal.workbench.E4Workbench.createAndRunUI(E4Workbench.java:153)
	at org.eclipse.ui.internal.Workbench.lambda$3(Workbench.java:680)
	at org.eclipse.core.databinding.observable.Realm.runWithDefault(Realm.java:336)
	at org.eclipse.ui.internal.Workbench.createAndRunWorkbench(Workbench.java:594)
	at org.eclipse.ui.PlatformUI.createAndRunWorkbench(PlatformUI.java:148)
	at org.eclipse.ui.internal.ide.application.IDEApplication.start(IDEApplication.java:138)
	at org.eclipse.tycho.surefire.osgibooter.UITestApplication.runApplication(UITestApplication.java:31)
	at org.eclipse.tycho.surefire.osgibooter.AbstractUITestApplication.run(AbstractUITestApplication.java:120)
	at org.eclipse.tycho.surefire.osgibooter.UITestApplication.start(UITestApplication.java:37)
	at org.eclipse.equinox.internal.app.EclipseAppHandle.run(EclipseAppHandle.java:196)
	at org.eclipse.core.runtime.internal.adaptor.EclipseAppLauncher.runApplication(EclipseAppLauncher.java:134)
	at org.eclipse.core.runtime.internal.adaptor.EclipseAppLauncher.start(EclipseAppLauncher.java:104)
	at org.eclipse.core.runtime.adaptor.EclipseStarter.run(EclipseStarter.java:388)
	at org.eclipse.core.runtime.adaptor.EclipseStarter.run(EclipseStarter.java:243)
	at sun.reflect.NativeMethodAccessorImpl.invoke0(Native Method)
	at sun.reflect.NativeMethodAccessorImpl.invoke(NativeMethodAccessorImpl.java:62)
	at sun.reflect.DelegatingMethodAccessorImpl.invoke(DelegatingMethodAccessorImpl.java:43)
	at java.lang.reflect.Method.invoke(Method.java:498)
	at org.eclipse.equinox.launcher.Main.invokeFramework(Main.java:653)
	at org.eclipse.equinox.launcher.Main.basicRun(Main.java:590)
	at org.eclipse.equinox.launcher.Main.run(Main.java:1499)
	at org.eclipse.equinox.launcher.Main.main(Main.java:1472)
Tests run: 6, Failures: 1, Errors: 0, Skipped: 0, Time elapsed: 2.04 sec <<< FAILURE! - in org.eclipse.contribution.xref.ui.tests.AllTests
testViewContentProvider(org.eclipse.contribution.xref.ui.tests.views.XReferenceViewTest)  Time elapsed: 0.257 sec
testTreeObject(org.eclipse.contribution.xref.ui.tests.views.XReferenceViewTest)  Time elapsed: 0 sec
testTreeParent(org.eclipse.contribution.xref.ui.tests.views.XReferenceViewTest)  Time elapsed: 0 sec
testShowHide(org.eclipse.contribution.xref.ui.tests.views.XReferenceViewTest)  Time elapsed: 1.754 sec
testViewContentProviderLive(org.eclipse.contribution.xref.ui.tests.views.XReferenceViewTest)  Time elapsed: 0.006 sec  <<< FAILURE!
junit.framework.AssertionFailedError: expected:<test associate> but was:<AdaptableString [val=test associate]>
	at junit.framework.Assert.fail(Assert.java:57)
	at junit.framework.Assert.failNotEquals(Assert.java:329)
	at junit.framework.Assert.assertEquals(Assert.java:78)
	at junit.framework.Assert.assertEquals(Assert.java:86)
	at junit.framework.TestCase.assertEquals(TestCase.java:253)
	at org.eclipse.contribution.xref.ui.tests.views.XReferenceViewTest.testViewContentProviderLive(XReferenceViewTest.java:205)

testSetCheckedFilters(org.eclipse.contribution.xref.ui.tests.AJXReferenceProviderTest)  Time elapsed: 0.001 sec

Results :

Failed tests: 
  XReferenceViewTest.testViewContentProviderLive:205 expected:<test associate> but was:<AdaptableString [val=test associate]>

Tests run: 6, Failures: 1, Errors: 0, Skipped: 0

[ERROR] There are test failures.

Please refer to /jobs/genie.ajdt/ajdt-on-eclipse-47/workspace/org.eclipse.contribution.xref.ui.tests/target/surefire-reports for the individual test results.
[INFO] 
[INFO] --- eclipse-jarsigner-plugin:1.0.4:sign (sign) @ org.eclipse.contribution.xref.ui.tests ---
[INFO] Signed org.eclipse.ajdt:org.eclipse.contribution.xref.ui.tests:eclipse-test-plugin:2.2.4-SNAPSHOT in 0 seconds.
[INFO] 
[INFO] --- tycho-p2-plugin:0.23.1:p2-metadata (p2-metadata) @ org.eclipse.contribution.xref.ui.tests ---
[INFO]                                                                         
[INFO] ------------------------------------------------------------------------
[INFO] Building org.eclipse.aspectj.feature_tests 2.2.4-SNAPSHOT
[INFO] ------------------------------------------------------------------------
[INFO] 
[INFO] --- maven-clean-plugin:2.5:clean (default-clean) @ org.eclipse.aspectj.feature_tests ---
[INFO] Deleting /jobs/genie.ajdt/ajdt-on-eclipse-47/workspace/org.eclipse.aspectj.feature_tests/target
[INFO] 
[INFO] --- tycho-packaging-plugin:0.23.1:build-qualifier-aggregator (default-build-qualifier-aggregator) @ org.eclipse.aspectj.feature_tests ---
[INFO] The project's OSGi version is 2.2.4.201704242114
[INFO] 
[INFO] --- tycho-packaging-plugin:0.23.1:validate-id (default-validate-id) @ org.eclipse.aspectj.feature_tests ---
[INFO] 
[INFO] --- tycho-packaging-plugin:0.23.1:validate-version (default-validate-version) @ org.eclipse.aspectj.feature_tests ---
[INFO] 
[INFO] --- target-platform-configuration:0.23.1:target-platform (default-target-platform) @ org.eclipse.aspectj.feature_tests ---
[INFO] 
[INFO] --- tycho-packaging-plugin:0.23.1:package-feature (default-package-feature) @ org.eclipse.aspectj.feature_tests ---
[INFO] Building jar: /jobs/genie.ajdt/ajdt-on-eclipse-47/workspace/org.eclipse.aspectj.feature_tests/target/org.eclipse.aspectj.feature_tests-2.2.4-SNAPSHOT.jar
[INFO] 
[INFO] --- tycho-p2-plugin:0.23.1:p2-metadata-default (default-p2-metadata-default) @ org.eclipse.aspectj.feature_tests ---
[INFO] 
[INFO] --- tycho-p2-plugin:0.23.1:feature-p2-metadata (default-feature-p2-metadata) @ org.eclipse.aspectj.feature_tests ---
[INFO] 
[INFO] --- eclipse-jarsigner-plugin:1.0.4:sign (sign) @ org.eclipse.aspectj.feature_tests ---
[INFO] Signed org.eclipse.ajdt:org.eclipse.aspectj.feature_tests:eclipse-feature:2.2.4-SNAPSHOT in 0 seconds.
[INFO] 
[INFO] --- tycho-p2-plugin:0.23.1:p2-metadata (p2-metadata) @ org.eclipse.aspectj.feature_tests ---
[INFO]                                                                         
[INFO] ------------------------------------------------------------------------
[INFO] Building org.eclipse.ajdt.releng 2.2.4-SNAPSHOT
[INFO] ------------------------------------------------------------------------
[INFO] 
[INFO] --- maven-clean-plugin:2.5:clean (default-clean) @ org.eclipse.ajdt.releng ---
[INFO] Deleting /jobs/genie.ajdt/ajdt-on-eclipse-47/workspace/org.eclipse.ajdt.releng/target
[INFO] 
[INFO] --- tycho-packaging-plugin:0.23.1:build-qualifier-aggregator (default-build-qualifier-aggregator) @ org.eclipse.ajdt.releng ---
[INFO] The project's OSGi version is 2.2.4.201704242114
[INFO] 
[INFO] --- maven-clean-plugin:2.5:clean (default-clean-1) @ org.eclipse.ajdt.releng ---
[INFO] 
[INFO] --- maven-resources-plugin:2.4.3:resources (default-resources) @ org.eclipse.ajdt.releng ---
[WARNING] Using platform encoding (UTF-8 actually) to copy filtered resources, i.e. build is platform dependent!
[INFO] skip non existing resourceDirectory /jobs/genie.ajdt/ajdt-on-eclipse-47/workspace/org.eclipse.ajdt.releng/src/main/resources
[INFO] 
[INFO] --- target-platform-configuration:0.23.1:target-platform (default-target-platform) @ org.eclipse.ajdt.releng ---
[INFO] 
[INFO] --- tycho-p2-publisher-plugin:0.23.1:publish-products (default-publish-products) @ org.eclipse.ajdt.releng ---
[INFO] 
[INFO] --- tycho-p2-publisher-plugin:0.23.1:publish-categories (default-publish-categories) @ org.eclipse.ajdt.releng ---
[INFO] 
[INFO] --- tycho-p2-publisher-plugin:0.23.1:attach-artifacts (default-attach-artifacts) @ org.eclipse.ajdt.releng ---
[INFO] 
[INFO] --- tycho-p2-repository-plugin:0.23.1:assemble-repository (default-assemble-repository) @ org.eclipse.ajdt.releng ---
[INFO] 
[INFO] --- tycho-p2-repository-plugin:0.23.1:archive-repository (default-archive-repository) @ org.eclipse.ajdt.releng ---
[INFO] Building zip: /jobs/genie.ajdt/ajdt-on-eclipse-47/workspace/org.eclipse.ajdt.releng/target/ajdt-e47-2.2.4.201704242114.zip
[INFO] 
[INFO] --- maven-antrun-plugin:1.7:run (default) @ org.eclipse.ajdt.releng ---
[WARNING] Parameter tasks is deprecated, use target instead
[INFO] Executing tasks

main:
[propertyfile] Creating new property file: /jobs/genie.ajdt/ajdt-on-eclipse-47/workspace/org.eclipse.ajdt.releng/target/ajdt-zip.properties
[INFO] Executed tasks
[INFO] 
[INFO] --- maven-antrun-plugin:1.7:run (update-composite-update-site) @ org.eclipse.ajdt.releng ---
[INFO] Executing tasks

main:
  [taskdef] Could not load definitions from resource net/sf/antcontrib/antcontrib.properties. It could not be found.
     [copy] Copying 1 file to /jobs/genie.ajdt/ajdt-on-eclipse-47/workspace/org.eclipse.ajdt.releng/target
     [copy] Copying 1 file to /jobs/genie.ajdt/ajdt-on-eclipse-47/workspace/org.eclipse.ajdt.releng/target
     [copy] Copying 1 file to /jobs/genie.ajdt/ajdt-on-eclipse-47/workspace/org.eclipse.ajdt.releng/target
  [replace] Replaced 1 occurrences in 1 files.
  [replace] Replaced 1 occurrences in 1 files.
  [replace] Replaced 1 occurrences in 1 files.
  [replace] Replaced 1 occurrences in 1 files.
[INFO] Executed tasks
[INFO] 
[INFO] --- eclipse-jarsigner-plugin:1.0.4:sign (sign) @ org.eclipse.ajdt.releng ---
[INFO] 
[INFO] --- tycho-p2-plugin:0.23.1:p2-metadata (p2-metadata) @ org.eclipse.ajdt.releng ---
[INFO] ------------------------------------------------------------------------
[INFO] Reactor Summary:
[INFO] 
[INFO] parent ............................................. SUCCESS [  0.243 s]
[INFO] org.aspectj.runtime ................................ SUCCESS [  2.358 s]
[INFO] org.aspectj.weaver ................................. SUCCESS [  2.870 s]
[INFO] org.aspectj.ajde ................................... SUCCESS [  6.355 s]
[INFO] org.aspectj ........................................ SUCCESS [  1.856 s]
[INFO] org.eclipse.contribution.weaving.jdt ............... SUCCESS [  5.255 s]
[INFO] org.eclipse.ajdt.core .............................. SUCCESS [  6.362 s]
[INFO] org.eclipse.ajdt.doc.user .......................... SUCCESS [  1.035 s]
[INFO] org.eclipse.ajdt.examples .......................... SUCCESS [  2.368 s]
[INFO] org.eclipse.contribution.visualiser ................ SUCCESS [  3.341 s]
[INFO] org.eclipse.contribution.xref.core ................. SUCCESS [  1.881 s]
[INFO] org.eclipse.contribution.xref.ui ................... SUCCESS [  2.061 s]
[INFO] org.eclipse.ajdt.ui ................................ SUCCESS [  7.364 s]
[INFO] org.eclipse.aspectj ................................ SUCCESS [  0.904 s]
[INFO] org.eclipse.equinox.weaving.aspectj ................ SUCCESS [  1.977 s]
[INFO] org.eclipse.equinox.weaving.sdk .................... SUCCESS [  0.856 s]
[INFO] org.eclipse.ajdt ................................... SUCCESS [  1.936 s]
[INFO] org.eclipse.contribution.weaving ................... SUCCESS [  1.611 s]
[INFO] org.eclipse.contribution.xref ...................... SUCCESS [  1.839 s]
[INFO] org.eclipse.ajdt.sdk ............................... SUCCESS [  1.003 s]
[INFO] org.eclipse.ajdt.core.tests ........................ SUCCESS [44:11 min]
[INFO] org.eclipse.contribution.visualiser.tests .......... SUCCESS [ 13.692 s]
[INFO] org.eclipse.ajdt.ui.tests .......................... SUCCESS [47:25 min]
[INFO] org.eclipse.contribution.weaving.jdt.tests ......... SUCCESS [01:50 min]
[INFO] org.eclipse.contribution.xref.core.tests ........... SUCCESS [ 10.797 s]
[INFO] org.eclipse.contribution.xref.ui.tests ............. SUCCESS [ 12.550 s]
[INFO] org.eclipse.aspectj.feature_tests .................. SUCCESS [  1.039 s]
[INFO] org.eclipse.ajdt.releng ............................ SUCCESS [  4.261 s]
[INFO] ------------------------------------------------------------------------
[INFO] BUILD SUCCESS
[INFO] ------------------------------------------------------------------------
[INFO] Total time: 01:35 h
[INFO] Finished at: 2017-04-24T18:49:06-04:00
[INFO] Final Memory: 264M/5555M
[INFO] ------------------------------------------------------------------------
[DEBUG] Closing connection to remote
[DEBUG] Waiting for process to finish
[DEBUG] Result: 0
[workspace] $ /bin/sh -xe /tmp/hudson674704290131216848.sh
+ cd org.eclipse.ajdt.releng/target
++ pwd
+ targetdir=/jobs/genie.ajdt/ajdt-on-eclipse-47/workspace/org.eclipse.ajdt.releng/target
+ zipfile=(ajdt-e47*.zip)
++ basename ajdt-e47-2.2.4.201704242114.zip .zip
+ zipname=ajdt-e47-2.2.4.201704242114
+ echo ajdt-e47-2.2.4.201704242114.zip
ajdt-e47-2.2.4.201704242114.zip
+ cp ajdt-e47-2.2.4.201704242114.zip /home/data/httpd/download.eclipse.org/tools/ajdt/47/dev/update
+ cd /home/data/httpd/download.eclipse.org/tools/ajdt/47/dev/update
+ unzip -o ajdt-e47-2.2.4.201704242114.zip -d ajdt-e47-2.2.4.201704242114
Archive:  ajdt-e47-2.2.4.201704242114.zip
   creating: ajdt-e47-2.2.4.201704242114/features/
   creating: ajdt-e47-2.2.4.201704242114/plugins/
  inflating: ajdt-e47-2.2.4.201704242114/artifacts.jar  
  inflating: ajdt-e47-2.2.4.201704242114/content.jar  
  inflating: ajdt-e47-2.2.4.201704242114/features/org.eclipse.contribution.xref_2.2.4.201704242114.jar  
  inflating: ajdt-e47-2.2.4.201704242114/features/org.eclipse.contribution.weaving.source_2.2.4.201704242114.jar  
  inflating: ajdt-e47-2.2.4.201704242114/features/org.aspectj_1.8.10.201704242114.jar  
  inflating: ajdt-e47-2.2.4.201704242114/features/org.aspectj.source_1.8.10.201704242114.jar  
  inflating: ajdt-e47-2.2.4.201704242114/features/org.eclipse.equinox.weaving.sdk_1.2.0.201704242114.jar  
  inflating: ajdt-e47-2.2.4.201704242114/features/org.eclipse.contribution.xref.source_2.2.4.201704242114.jar  
  inflating: ajdt-e47-2.2.4.201704242114/features/org.eclipse.ajdt.source_2.2.4.201704242114.jar  
  inflating: ajdt-e47-2.2.4.201704242114/features/org.eclipse.ajdt_2.2.4.201704242114.jar  
  inflating: ajdt-e47-2.2.4.201704242114/features/org.eclipse.contribution.weaving_2.2.4.201704242114.jar  
  inflating: ajdt-e47-2.2.4.201704242114/plugins/org.eclipse.contribution.visualiser_2.2.4.201704242114.jar  
  inflating: ajdt-e47-2.2.4.201704242114/plugins/org.eclipse.equinox.weaving.hook_1.2.0.v20160929-1449.jar.pack.gz  
  inflating: ajdt-e47-2.2.4.201704242114/plugins/org.eclipse.equinox.weaving.hook_1.2.0.v20160929-1449.jar  
  inflating: ajdt-e47-2.2.4.201704242114/plugins/org.aspectj.runtime.source_1.8.10.201704242114.jar  
  inflating: ajdt-e47-2.2.4.201704242114/plugins/org.eclipse.ajdt.ui_2.2.4.201704242114.jar  
  inflating: ajdt-e47-2.2.4.201704242114/plugins/org.aspectj.ajde_1.8.10.201704242114.jar  
  inflating: ajdt-e47-2.2.4.201704242114/plugins/org.aspectj.ajde.source_1.8.10.201704242114.jar  
  inflating: ajdt-e47-2.2.4.201704242114/plugins/org.aspectj.weaver.source_1.8.10.201704242114.jar  
  inflating: ajdt-e47-2.2.4.201704242114/plugins/org.eclipse.ajdt.core_2.2.4.201704242114.jar  
  inflating: ajdt-e47-2.2.4.201704242114/plugins/org.eclipse.contribution.weaving.jdt_2.2.4.201704242114.jar  
  inflating: ajdt-e47-2.2.4.201704242114/plugins/org.eclipse.ajdt.ui.source_2.2.4.201704242114.jar  
  inflating: ajdt-e47-2.2.4.201704242114/plugins/org.eclipse.equinox.weaving.aspectj_1.0.400.201704242114.jar  
  inflating: ajdt-e47-2.2.4.201704242114/plugins/org.aspectj.weaver_1.8.10.201704242114.jar  
  inflating: ajdt-e47-2.2.4.201704242114/plugins/org.eclipse.contribution.xref.ui.source_2.2.4.201704242114.jar  
  inflating: ajdt-e47-2.2.4.201704242114/plugins/org.eclipse.ajdt.doc.user_2.2.4.201704242114.jar  
  inflating: ajdt-e47-2.2.4.201704242114/plugins/org.eclipse.contribution.xref.ui_2.2.4.201704242114.jar  
  inflating: ajdt-e47-2.2.4.201704242114/plugins/org.aspectj.runtime_1.8.10.201704242114.jar  
  inflating: ajdt-e47-2.2.4.201704242114/plugins/org.eclipse.contribution.weaving.jdt.source_2.2.4.201704242114.jar  
  inflating: ajdt-e47-2.2.4.201704242114/plugins/org.eclipse.ajdt.core.source_2.2.4.201704242114.jar  
  inflating: ajdt-e47-2.2.4.201704242114/plugins/org.eclipse.aspectj_2.2.4.201704242114.jar  
  inflating: ajdt-e47-2.2.4.201704242114/plugins/org.eclipse.contribution.xref.core_2.2.4.201704242114.jar  
  inflating: ajdt-e47-2.2.4.201704242114/plugins/org.eclipse.contribution.visualiser.source_2.2.4.201704242114.jar  
  inflating: ajdt-e47-2.2.4.201704242114/plugins/org.eclipse.equinox.weaving.caching_1.1.0.v20161007-1415.jar.pack.gz  
  inflating: ajdt-e47-2.2.4.201704242114/plugins/org.eclipse.equinox.weaving.caching_1.1.0.v20161007-1415.jar  
  inflating: ajdt-e47-2.2.4.201704242114/plugins/org.eclipse.contribution.xref.core.source_2.2.4.201704242114.jar  
  inflating: ajdt-e47-2.2.4.201704242114/plugins/org.eclipse.ajdt.examples_2.2.4.201704242114.jar  
  inflating: ajdt-e47-2.2.4.201704242114/plugins/org.eclipse.ajdt.examples.source_2.2.4.201704242114.jar  
+ cp /jobs/genie.ajdt/ajdt-on-eclipse-47/workspace/org.eclipse.ajdt.releng/target/compositeArtifacts.xml .
+ cp /jobs/genie.ajdt/ajdt-on-eclipse-47/workspace/org.eclipse.ajdt.releng/target/compositeContent.xml .
+ cp /jobs/genie.ajdt/ajdt-on-eclipse-47/workspace/org.eclipse.ajdt.releng/target/p2.index .
Terminating xvnc.
Recording test results
Finished: UNSTABLE