FailedConsole Output

Skipping 38,883 KB.. Full Log
ternalGetProjectPath: attributes on org.eclipse.jdt.launching.JRE_CONTAINER are 
internalGetProjectPath: Couldn't find it on first look, so looking here: [/opt/public/common/jdk1.8.0_131.x64/jre/lib/resources.jar[CPE_LIBRARY][K_BINARY][sourcePath:/opt/public/common/jdk1.8.0_131.x64/src.zip][isExported:false][attributes:javadoc_location=https://docs.oracle.com/javase/8/docs/api/], /opt/public/common/jdk1.8.0_131.x64/jre/lib/rt.jar[CPE_LIBRARY][K_BINARY][sourcePath:/opt/public/common/jdk1.8.0_131.x64/src.zip][isExported:false][attributes:javadoc_location=https://docs.oracle.com/javase/8/docs/api/], /opt/public/common/jdk1.8.0_131.x64/jre/lib/jsse.jar[CPE_LIBRARY][K_BINARY][sourcePath:/opt/public/common/jdk1.8.0_131.x64/src.zip][isExported:false][attributes:javadoc_location=https://docs.oracle.com/javase/8/docs/api/], /opt/public/common/jdk1.8.0_131.x64/jre/lib/jce.jar[CPE_LIBRARY][K_BINARY][sourcePath:/opt/public/common/jdk1.8.0_131.x64/src.zip][isExported:false][attributes:javadoc_location=https://docs.oracle.com/javase/8/docs/api/], /opt/public/common/jdk1.8.0_131.x64/jre/lib/charsets.jar[CPE_LIBRARY][K_BINARY][sourcePath:/opt/public/common/jdk1.8.0_131.x64/src.zip][isExported:false][attributes:javadoc_location=https://docs.oracle.com/javase/8/docs/api/], /opt/public/common/jdk1.8.0_131.x64/jre/lib/jfr.jar[CPE_LIBRARY][K_BINARY][sourcePath:/opt/public/common/jdk1.8.0_131.x64/src.zip][isExported:false][attributes:javadoc_location=https://docs.oracle.com/javase/8/docs/api/], /opt/public/common/jdk1.8.0_131.x64/jre/lib/ext/dnsns.jar[CPE_LIBRARY][K_BINARY][isExported:false], /opt/public/common/jdk1.8.0_131.x64/jre/lib/ext/sunpkcs11.jar[CPE_LIBRARY][K_BINARY][isExported:false], /opt/public/common/jdk1.8.0_131.x64/jre/lib/ext/nashorn.jar[CPE_LIBRARY][K_BINARY][isExported:false], /opt/public/common/jdk1.8.0_131.x64/jre/lib/ext/cldrdata.jar[CPE_LIBRARY][K_BINARY][isExported:false], /opt/public/common/jdk1.8.0_131.x64/jre/lib/ext/zipfs.jar[CPE_LIBRARY][K_BINARY][isExported:false], /opt/public/common/jdk1.8.0_131.x64/jre/lib/ext/sunec.jar[CPE_LIBRARY][K_BINARY][isExported:false], /opt/public/common/jdk1.8.0_131.x64/jre/lib/ext/jaccess.jar[CPE_LIBRARY][K_BINARY][isExported:false], /opt/public/common/jdk1.8.0_131.x64/jre/lib/ext/sunjce_provider.jar[CPE_LIBRARY][K_BINARY][isExported:false], /opt/public/common/jdk1.8.0_131.x64/jre/lib/ext/localedata.jar[CPE_LIBRARY][K_BINARY][isExported:false], /opt/public/common/jdk1.8.0_131.x64/jre/lib/ext/jfxrt.jar[CPE_LIBRARY][K_BINARY][sourcePath:/opt/public/common/jdk1.8.0_131.x64/javafx-src.zip][isExported:false][attributes:javadoc_location=http://docs.oracle.com/javase/8/javafx/api/]]
internalGetProjectPath: attributes on org.eclipse.ajdt.core.ASPECTJRT_CONTAINER are 
internalGetProjectPath: Couldn't find it on first look, so looking here: [/jobs/genie.ajdt/ajdt-on-eclipse-47/workspace/org.aspectj.runtime/target/org.aspectj.runtime-1.8.10-SNAPSHOT.jar[CPE_LIBRARY][K_BINARY][sourcePath:/jobs/genie.ajdt/ajdt-on-eclipse-47/workspace/org.aspectj.runtime/target/org.aspectj.runtime.source-1.8.10-SNAPSHOT.jar][isExported:false]]
internalGetProjectPath: attributes on org.eclipse.jdt.junit.JUNIT_CONTAINER/3 are 
internalGetProjectPath: Couldn't find it on first look, so looking here: [/jobs/genie.ajdt/ajdt-on-eclipse-47/workspace/org.eclipse.ajdt.ui.tests/target/work/configuration/org.eclipse.osgi/43/0/.cp/junit.jar[CPE_LIBRARY][K_BINARY][isExported:false][AccessRuleSet {pattern=junit/ (ACCESSIBLE), pattern=**/* (NON ACCESSIBLE)} [classpath entry: /jobs/genie.ajdt/ajdt-on-eclipse-47/workspace/org.eclipse.ajdt.ui.tests/target/work/configuration/org.eclipse.osgi/43/0/.cp/junit.jar]][attributes:javadoc_location=http://junit.sourceforge.net/junit3.8.1/javadoc/]]
internalGetProjectPath: iterating over classpath entries, size #4
internalGetProjectPath: attributes on /PathTesting-ContainerOnAspectPath/src are 
internalGetProjectPath: attributes on org.eclipse.jdt.launching.JRE_CONTAINER are 
internalGetProjectPath: Couldn't find it on first look, so looking here: [/opt/public/common/jdk1.8.0_131.x64/jre/lib/resources.jar[CPE_LIBRARY][K_BINARY][sourcePath:/opt/public/common/jdk1.8.0_131.x64/src.zip][isExported:false][attributes:javadoc_location=https://docs.oracle.com/javase/8/docs/api/], /opt/public/common/jdk1.8.0_131.x64/jre/lib/rt.jar[CPE_LIBRARY][K_BINARY][sourcePath:/opt/public/common/jdk1.8.0_131.x64/src.zip][isExported:false][attributes:javadoc_location=https://docs.oracle.com/javase/8/docs/api/], /opt/public/common/jdk1.8.0_131.x64/jre/lib/jsse.jar[CPE_LIBRARY][K_BINARY][sourcePath:/opt/public/common/jdk1.8.0_131.x64/src.zip][isExported:false][attributes:javadoc_location=https://docs.oracle.com/javase/8/docs/api/], /opt/public/common/jdk1.8.0_131.x64/jre/lib/jce.jar[CPE_LIBRARY][K_BINARY][sourcePath:/opt/public/common/jdk1.8.0_131.x64/src.zip][isExported:false][attributes:javadoc_location=https://docs.oracle.com/javase/8/docs/api/], /opt/public/common/jdk1.8.0_131.x64/jre/lib/charsets.jar[CPE_LIBRARY][K_BINARY][sourcePath:/opt/public/common/jdk1.8.0_131.x64/src.zip][isExported:false][attributes:javadoc_location=https://docs.oracle.com/javase/8/docs/api/], /opt/public/common/jdk1.8.0_131.x64/jre/lib/jfr.jar[CPE_LIBRARY][K_BINARY][sourcePath:/opt/public/common/jdk1.8.0_131.x64/src.zip][isExported:false][attributes:javadoc_location=https://docs.oracle.com/javase/8/docs/api/], /opt/public/common/jdk1.8.0_131.x64/jre/lib/ext/dnsns.jar[CPE_LIBRARY][K_BINARY][isExported:false], /opt/public/common/jdk1.8.0_131.x64/jre/lib/ext/sunpkcs11.jar[CPE_LIBRARY][K_BINARY][isExported:false], /opt/public/common/jdk1.8.0_131.x64/jre/lib/ext/nashorn.jar[CPE_LIBRARY][K_BINARY][isExported:false], /opt/public/common/jdk1.8.0_131.x64/jre/lib/ext/cldrdata.jar[CPE_LIBRARY][K_BINARY][isExported:false], /opt/public/common/jdk1.8.0_131.x64/jre/lib/ext/zipfs.jar[CPE_LIBRARY][K_BINARY][isExported:false], /opt/public/common/jdk1.8.0_131.x64/jre/lib/ext/sunec.jar[CPE_LIBRARY][K_BINARY][isExported:false], /opt/public/common/jdk1.8.0_131.x64/jre/lib/ext/jaccess.jar[CPE_LIBRARY][K_BINARY][isExported:false], /opt/public/common/jdk1.8.0_131.x64/jre/lib/ext/sunjce_provider.jar[CPE_LIBRARY][K_BINARY][isExported:false], /opt/public/common/jdk1.8.0_131.x64/jre/lib/ext/localedata.jar[CPE_LIBRARY][K_BINARY][isExported:false], /opt/public/common/jdk1.8.0_131.x64/jre/lib/ext/jfxrt.jar[CPE_LIBRARY][K_BINARY][sourcePath:/opt/public/common/jdk1.8.0_131.x64/javafx-src.zip][isExported:false][attributes:javadoc_location=http://docs.oracle.com/javase/8/javafx/api/]]
internalGetProjectPath: attributes on org.eclipse.ajdt.core.ASPECTJRT_CONTAINER are 
internalGetProjectPath: Couldn't find it on first look, so looking here: [/jobs/genie.ajdt/ajdt-on-eclipse-47/workspace/org.aspectj.runtime/target/org.aspectj.runtime-1.8.10-SNAPSHOT.jar[CPE_LIBRARY][K_BINARY][sourcePath:/jobs/genie.ajdt/ajdt-on-eclipse-47/workspace/org.aspectj.runtime/target/org.aspectj.runtime.source-1.8.10-SNAPSHOT.jar][isExported:false]]
internalGetProjectPath: attributes on org.eclipse.jdt.junit.JUNIT_CONTAINER/3 are 
internalGetProjectPath: Couldn't find it on first look, so looking here: [/jobs/genie.ajdt/ajdt-on-eclipse-47/workspace/org.eclipse.ajdt.ui.tests/target/work/configuration/org.eclipse.osgi/43/0/.cp/junit.jar[CPE_LIBRARY][K_BINARY][isExported:false][AccessRuleSet {pattern=junit/ (ACCESSIBLE), pattern=**/* (NON ACCESSIBLE)} [classpath entry: /jobs/genie.ajdt/ajdt-on-eclipse-47/workspace/org.eclipse.ajdt.ui.tests/target/work/configuration/org.eclipse.osgi/43/0/.cp/junit.jar]][attributes:javadoc_location=http://junit.sourceforge.net/junit3.8.1/javadoc/]]
Compiler configuration for project PathTesting-ContainerOnAspectPath has been read by compiler.  Resetting.
     Configuration was [PROJECTSOURCEFILES_CHANGED, JAVAOPTIONS_CHANGED, ASPECTPATH_CHANGED, CLASSPATH_CHANGED, INPATH_CHANGED, NONSTANDARDOPTIONS_CHANGED, OUTJAR_CHANGED, PROJECTSOURCERESOURCES_CHANGED, OUTPUTDESTINATIONS_CHANGED, INJARS_CHANGED]
Resetting list of modified source files.  Was null
Preparing for build: not going to be incremental because no successful previous full build
AJC: compiling source files
Timer event: 57ms: Time to first compiled message
AJC: compiled: /jobs/genie.ajdt/ajdt-on-eclipse-47/workspace/org.eclipse.ajdt.ui.tests/target/work/data/PathTesting-ContainerOnAspectPath/src/aspectPath/ContainerAspect.aj
Timer event: 60ms: Time to first woven message
AJC: woven aspect aspectPath.ContainerAspect (from /jobs/genie.ajdt/ajdt-on-eclipse-47/workspace/org.eclipse.ajdt.ui.tests/target/work/data/PathTesting-ContainerOnAspectPath/src/aspectPath/ContainerAspect.aj)
no match for this type name: main.Main [Xlint:invalidAbsoluteTypeName]
AJC: compiled: /jobs/genie.ajdt/ajdt-on-eclipse-47/workspace/org.eclipse.ajdt.ui.tests/target/work/data/PathTesting-ContainerOnAspectPath/src/aspectPath/ContainerInpath.java
AJC: woven class aspectPath.ContainerInpath (from /jobs/genie.ajdt/ajdt-on-eclipse-47/workspace/org.eclipse.ajdt.ui.tests/target/work/data/PathTesting-ContainerOnAspectPath/src/aspectPath/ContainerInpath.java)
advice defined in aspectPath.ContainerAspect has not been applied [Xlint:adviceDidNotMatch]
AspectJ reports build successful, build was: FULL
AJDE Callback: finish. Was full build: true
Timer event: 61ms: Total time spent in AJDE
Timer event: 1ms: Refresh after build
Types affected during build = 2
>> scheduled a build
Crosscutting model sanity checked with no problems
Timer event: 0ms: Model sanity check for: PathTesting-ContainerOnAspectPath
Timer event: 65ms: Total time spent in AJBuilder.build()
Timer event: 2ms: Delete markers: PathTesting-ContainerOnAspectPath (Finished deleting markers for PathTesting-ContainerOnAspectPath)
Compiler configuration for project PathTesting-VariableOnAspectPath doesn't know previous state, so assuming EVERYTHING has changed.
===========================================================================================
Build kind = FULLBUILD
Project=PathTesting-VariableOnAspectPath, kind of build requested=Full AspectJ compilation
internalGetProjectPath: iterating over classpath entries, size #4
internalGetProjectPath: attributes on /PathTesting-VariableOnAspectPath/src are 
internalGetProjectPath: attributes on org.eclipse.jdt.launching.JRE_CONTAINER are 
internalGetProjectPath: Couldn't find it on first look, so looking here: [/opt/public/common/jdk1.8.0_131.x64/jre/lib/resources.jar[CPE_LIBRARY][K_BINARY][sourcePath:/opt/public/common/jdk1.8.0_131.x64/src.zip][isExported:false][attributes:javadoc_location=https://docs.oracle.com/javase/8/docs/api/], /opt/public/common/jdk1.8.0_131.x64/jre/lib/rt.jar[CPE_LIBRARY][K_BINARY][sourcePath:/opt/public/common/jdk1.8.0_131.x64/src.zip][isExported:false][attributes:javadoc_location=https://docs.oracle.com/javase/8/docs/api/], /opt/public/common/jdk1.8.0_131.x64/jre/lib/jsse.jar[CPE_LIBRARY][K_BINARY][sourcePath:/opt/public/common/jdk1.8.0_131.x64/src.zip][isExported:false][attributes:javadoc_location=https://docs.oracle.com/javase/8/docs/api/], /opt/public/common/jdk1.8.0_131.x64/jre/lib/jce.jar[CPE_LIBRARY][K_BINARY][sourcePath:/opt/public/common/jdk1.8.0_131.x64/src.zip][isExported:false][attributes:javadoc_location=https://docs.oracle.com/javase/8/docs/api/], /opt/public/common/jdk1.8.0_131.x64/jre/lib/charsets.jar[CPE_LIBRARY][K_BINARY][sourcePath:/opt/public/common/jdk1.8.0_131.x64/src.zip][isExported:false][attributes:javadoc_location=https://docs.oracle.com/javase/8/docs/api/], /opt/public/common/jdk1.8.0_131.x64/jre/lib/jfr.jar[CPE_LIBRARY][K_BINARY][sourcePath:/opt/public/common/jdk1.8.0_131.x64/src.zip][isExported:false][attributes:javadoc_location=https://docs.oracle.com/javase/8/docs/api/], /opt/public/common/jdk1.8.0_131.x64/jre/lib/ext/dnsns.jar[CPE_LIBRARY][K_BINARY][isExported:false], /opt/public/common/jdk1.8.0_131.x64/jre/lib/ext/sunpkcs11.jar[CPE_LIBRARY][K_BINARY][isExported:false], /opt/public/common/jdk1.8.0_131.x64/jre/lib/ext/nashorn.jar[CPE_LIBRARY][K_BINARY][isExported:false], /opt/public/common/jdk1.8.0_131.x64/jre/lib/ext/cldrdata.jar[CPE_LIBRARY][K_BINARY][isExported:false], /opt/public/common/jdk1.8.0_131.x64/jre/lib/ext/zipfs.jar[CPE_LIBRARY][K_BINARY][isExported:false], /opt/public/common/jdk1.8.0_131.x64/jre/lib/ext/sunec.jar[CPE_LIBRARY][K_BINARY][isExported:false], /opt/public/common/jdk1.8.0_131.x64/jre/lib/ext/jaccess.jar[CPE_LIBRARY][K_BINARY][isExported:false], /opt/public/common/jdk1.8.0_131.x64/jre/lib/ext/sunjce_provider.jar[CPE_LIBRARY][K_BINARY][isExported:false], /opt/public/common/jdk1.8.0_131.x64/jre/lib/ext/localedata.jar[CPE_LIBRARY][K_BINARY][isExported:false], /opt/public/common/jdk1.8.0_131.x64/jre/lib/ext/jfxrt.jar[CPE_LIBRARY][K_BINARY][sourcePath:/opt/public/common/jdk1.8.0_131.x64/javafx-src.zip][isExported:false][attributes:javadoc_location=http://docs.oracle.com/javase/8/javafx/api/]]
internalGetProjectPath: attributes on org.eclipse.ajdt.core.ASPECTJRT_CONTAINER are 
internalGetProjectPath: Couldn't find it on first look, so looking here: [/jobs/genie.ajdt/ajdt-on-eclipse-47/workspace/org.aspectj.runtime/target/org.aspectj.runtime-1.8.10-SNAPSHOT.jar[CPE_LIBRARY][K_BINARY][sourcePath:/jobs/genie.ajdt/ajdt-on-eclipse-47/workspace/org.aspectj.runtime/target/org.aspectj.runtime.source-1.8.10-SNAPSHOT.jar][isExported:false]]
internalGetProjectPath: attributes on org.eclipse.jdt.junit.JUNIT_CONTAINER/3 are 
internalGetProjectPath: Couldn't find it on first look, so looking here: [/jobs/genie.ajdt/ajdt-on-eclipse-47/workspace/org.eclipse.ajdt.ui.tests/target/work/configuration/org.eclipse.osgi/43/0/.cp/junit.jar[CPE_LIBRARY][K_BINARY][isExported:false][AccessRuleSet {pattern=junit/ (ACCESSIBLE), pattern=**/* (NON ACCESSIBLE)} [classpath entry: /jobs/genie.ajdt/ajdt-on-eclipse-47/workspace/org.eclipse.ajdt.ui.tests/target/work/configuration/org.eclipse.osgi/43/0/.cp/junit.jar]][attributes:javadoc_location=http://junit.sourceforge.net/junit3.8.1/javadoc/]]
internalGetProjectPath: iterating over classpath entries, size #4
internalGetProjectPath: attributes on /PathTesting-VariableOnAspectPath/src are 
internalGetProjectPath: attributes on org.eclipse.jdt.launching.JRE_CONTAINER are 
Timer event: 1ms: Create markers: PathTesting-ContainerOnAspectPath (Finished creating markers for PathTesting-ContainerOnAspectPath)
Created 0 markers in 2 files
>> finished a build
internalGetProjectPath: Couldn't find it on first look, so looking here: [/opt/public/common/jdk1.8.0_131.x64/jre/lib/resources.jar[CPE_LIBRARY][K_BINARY][sourcePath:/opt/public/common/jdk1.8.0_131.x64/src.zip][isExported:false][attributes:javadoc_location=https://docs.oracle.com/javase/8/docs/api/], /opt/public/common/jdk1.8.0_131.x64/jre/lib/rt.jar[CPE_LIBRARY][K_BINARY][sourcePath:/opt/public/common/jdk1.8.0_131.x64/src.zip][isExported:false][attributes:javadoc_location=https://docs.oracle.com/javase/8/docs/api/], /opt/public/common/jdk1.8.0_131.x64/jre/lib/jsse.jar[CPE_LIBRARY][K_BINARY][sourcePath:/opt/public/common/jdk1.8.0_131.x64/src.zip][isExported:false][attributes:javadoc_location=https://docs.oracle.com/javase/8/docs/api/], /opt/public/common/jdk1.8.0_131.x64/jre/lib/jce.jar[CPE_LIBRARY][K_BINARY][sourcePath:/opt/public/common/jdk1.8.0_131.x64/src.zip][isExported:false][attributes:javadoc_location=https://docs.oracle.com/javase/8/docs/api/], /opt/public/common/jdk1.8.0_131.x64/jre/lib/charsets.jar[CPE_LIBRARY][K_BINARY][sourcePath:/opt/public/common/jdk1.8.0_131.x64/src.zip][isExported:false][attributes:javadoc_location=https://docs.oracle.com/javase/8/docs/api/], /opt/public/common/jdk1.8.0_131.x64/jre/lib/jfr.jar[CPE_LIBRARY][K_BINARY][sourcePath:/opt/public/common/jdk1.8.0_131.x64/src.zip][isExported:false][attributes:javadoc_location=https://docs.oracle.com/javase/8/docs/api/], /opt/public/common/jdk1.8.0_131.x64/jre/lib/ext/dnsns.jar[CPE_LIBRARY][K_BINARY][isExported:false], /opt/public/common/jdk1.8.0_131.x64/jre/lib/ext/sunpkcs11.jar[CPE_LIBRARY][K_BINARY][isExported:false], /opt/public/common/jdk1.8.0_131.x64/jre/lib/ext/nashorn.jar[CPE_LIBRARY][K_BINARY][isExported:false], /opt/public/common/jdk1.8.0_131.x64/jre/lib/ext/cldrdata.jar[CPE_LIBRARY][K_BINARY][isExported:false], /opt/public/common/jdk1.8.0_131.x64/jre/lib/ext/zipfs.jar[CPE_LIBRARY][K_BINARY][isExported:false], /opt/public/common/jdk1.8.0_131.x64/jre/lib/ext/sunec.jar[CPE_LIBRARY][K_BINARY][isExported:false], /opt/public/common/jdk1.8.0_131.x64/jre/lib/ext/jaccess.jar[CPE_LIBRARY][K_BINARY][isExported:false], /opt/public/common/jdk1.8.0_131.x64/jre/lib/ext/sunjce_provider.jar[CPE_LIBRARY][K_BINARY][isExported:false], /opt/public/common/jdk1.8.0_131.x64/jre/lib/ext/localedata.jar[CPE_LIBRARY][K_BINARY][isExported:false], /opt/public/common/jdk1.8.0_131.x64/jre/lib/ext/jfxrt.jar[CPE_LIBRARY][K_BINARY][sourcePath:/opt/public/common/jdk1.8.0_131.x64/javafx-src.zip][isExported:false][attributes:javadoc_location=http://docs.oracle.com/javase/8/javafx/api/]]
internalGetProjectPath: attributes on org.eclipse.ajdt.core.ASPECTJRT_CONTAINER are 
internalGetProjectPath: Couldn't find it on first look, so looking here: [/jobs/genie.ajdt/ajdt-on-eclipse-47/workspace/org.aspectj.runtime/target/org.aspectj.runtime-1.8.10-SNAPSHOT.jar[CPE_LIBRARY][K_BINARY][sourcePath:/jobs/genie.ajdt/ajdt-on-eclipse-47/workspace/org.aspectj.runtime/target/org.aspectj.runtime.source-1.8.10-SNAPSHOT.jar][isExported:false]]
internalGetProjectPath: attributes on org.eclipse.jdt.junit.JUNIT_CONTAINER/3 are 
internalGetProjectPath: Couldn't find it on first look, so looking here: [/jobs/genie.ajdt/ajdt-on-eclipse-47/workspace/org.eclipse.ajdt.ui.tests/target/work/configuration/org.eclipse.osgi/43/0/.cp/junit.jar[CPE_LIBRARY][K_BINARY][isExported:false][AccessRuleSet {pattern=junit/ (ACCESSIBLE), pattern=**/* (NON ACCESSIBLE)} [classpath entry: /jobs/genie.ajdt/ajdt-on-eclipse-47/workspace/org.eclipse.ajdt.ui.tests/target/work/configuration/org.eclipse.osgi/43/0/.cp/junit.jar]][attributes:javadoc_location=http://junit.sourceforge.net/junit3.8.1/javadoc/]]
Timer event: 0ms: Flush included source file cache
Timer event: 0ms: Check delta
Builder: Tidied output folder(s), removed class files and derived resources
Classpath = /jobs/genie.ajdt/ajdt-on-eclipse-47/workspace/org.eclipse.ajdt.ui.tests/target/work/data/PathTesting-VariableOnAspectPath/bin:/opt/public/common/jdk1.8.0_131.x64/jre/lib/resources.jar:/opt/public/common/jdk1.8.0_131.x64/jre/lib/rt.jar:/opt/public/common/jdk1.8.0_131.x64/jre/lib/jsse.jar:/opt/public/common/jdk1.8.0_131.x64/jre/lib/jce.jar:/opt/public/common/jdk1.8.0_131.x64/jre/lib/charsets.jar:/opt/public/common/jdk1.8.0_131.x64/jre/lib/jfr.jar:/opt/public/common/jdk1.8.0_131.x64/jre/lib/ext/dnsns.jar:/opt/public/common/jdk1.8.0_131.x64/jre/lib/ext/sunpkcs11.jar:/opt/public/common/jdk1.8.0_131.x64/jre/lib/ext/nashorn.jar:/opt/public/common/jdk1.8.0_131.x64/jre/lib/ext/cldrdata.jar:/opt/public/common/jdk1.8.0_131.x64/jre/lib/ext/zipfs.jar:/opt/public/common/jdk1.8.0_131.x64/jre/lib/ext/sunec.jar:/opt/public/common/jdk1.8.0_131.x64/jre/lib/ext/jaccess.jar:/opt/public/common/jdk1.8.0_131.x64/jre/lib/ext/sunjce_provider.jar:/opt/public/common/jdk1.8.0_131.x64/jre/lib/ext/localedata.jar:/opt/public/common/jdk1.8.0_131.x64/jre/lib/ext/jfxrt.jar:/jobs/genie.ajdt/ajdt-on-eclipse-47/workspace/org.aspectj.runtime/target/org.aspectj.runtime-1.8.10-SNAPSHOT.jar:/jobs/genie.ajdt/ajdt-on-eclipse-47/workspace/org.eclipse.ajdt.ui.tests/target/work/configuration/org.eclipse.osgi/43/0/.cp/junit.jar:
Timer event: 2ms: Pre compile
internalGetProjectPath: iterating over classpath entries, size #4
internalGetProjectPath: attributes on /PathTesting-VariableOnAspectPath/src are 
internalGetProjectPath: attributes on org.eclipse.jdt.launching.JRE_CONTAINER are 
internalGetProjectPath: Couldn't find it on first look, so looking here: [/opt/public/common/jdk1.8.0_131.x64/jre/lib/resources.jar[CPE_LIBRARY][K_BINARY][sourcePath:/opt/public/common/jdk1.8.0_131.x64/src.zip][isExported:false][attributes:javadoc_location=https://docs.oracle.com/javase/8/docs/api/], /opt/public/common/jdk1.8.0_131.x64/jre/lib/rt.jar[CPE_LIBRARY][K_BINARY][sourcePath:/opt/public/common/jdk1.8.0_131.x64/src.zip][isExported:false][attributes:javadoc_location=https://docs.oracle.com/javase/8/docs/api/], /opt/public/common/jdk1.8.0_131.x64/jre/lib/jsse.jar[CPE_LIBRARY][K_BINARY][sourcePath:/opt/public/common/jdk1.8.0_131.x64/src.zip][isExported:false][attributes:javadoc_location=https://docs.oracle.com/javase/8/docs/api/], /opt/public/common/jdk1.8.0_131.x64/jre/lib/jce.jar[CPE_LIBRARY][K_BINARY][sourcePath:/opt/public/common/jdk1.8.0_131.x64/src.zip][isExported:false][attributes:javadoc_location=https://docs.oracle.com/javase/8/docs/api/], /opt/public/common/jdk1.8.0_131.x64/jre/lib/charsets.jar[CPE_LIBRARY][K_BINARY][sourcePath:/opt/public/common/jdk1.8.0_131.x64/src.zip][isExported:false][attributes:javadoc_location=https://docs.oracle.com/javase/8/docs/api/], /opt/public/common/jdk1.8.0_131.x64/jre/lib/jfr.jar[CPE_LIBRARY][K_BINARY][sourcePath:/opt/public/common/jdk1.8.0_131.x64/src.zip][isExported:false][attributes:javadoc_location=https://docs.oracle.com/javase/8/docs/api/], /opt/public/common/jdk1.8.0_131.x64/jre/lib/ext/dnsns.jar[CPE_LIBRARY][K_BINARY][isExported:false], /opt/public/common/jdk1.8.0_131.x64/jre/lib/ext/sunpkcs11.jar[CPE_LIBRARY][K_BINARY][isExported:false], /opt/public/common/jdk1.8.0_131.x64/jre/lib/ext/nashorn.jar[CPE_LIBRARY][K_BINARY][isExported:false], /opt/public/common/jdk1.8.0_131.x64/jre/lib/ext/cldrdata.jar[CPE_LIBRARY][K_BINARY][isExported:false], /opt/public/common/jdk1.8.0_131.x64/jre/lib/ext/zipfs.jar[CPE_LIBRARY][K_BINARY][isExported:false], /opt/public/common/jdk1.8.0_131.x64/jre/lib/ext/sunec.jar[CPE_LIBRARY][K_BINARY][isExported:false], /opt/public/common/jdk1.8.0_131.x64/jre/lib/ext/jaccess.jar[CPE_LIBRARY][K_BINARY][isExported:false], /opt/public/common/jdk1.8.0_131.x64/jre/lib/ext/sunjce_provider.jar[CPE_LIBRARY][K_BINARY][isExported:false], /opt/public/common/jdk1.8.0_131.x64/jre/lib/ext/localedata.jar[CPE_LIBRARY][K_BINARY][isExported:false], /opt/public/common/jdk1.8.0_131.x64/jre/lib/ext/jfxrt.jar[CPE_LIBRARY][K_BINARY][sourcePath:/opt/public/common/jdk1.8.0_131.x64/javafx-src.zip][isExported:false][attributes:javadoc_location=http://docs.oracle.com/javase/8/javafx/api/]]
internalGetProjectPath: attributes on org.eclipse.ajdt.core.ASPECTJRT_CONTAINER are 
internalGetProjectPath: Couldn't find it on first look, so looking here: [/jobs/genie.ajdt/ajdt-on-eclipse-47/workspace/org.aspectj.runtime/target/org.aspectj.runtime-1.8.10-SNAPSHOT.jar[CPE_LIBRARY][K_BINARY][sourcePath:/jobs/genie.ajdt/ajdt-on-eclipse-47/workspace/org.aspectj.runtime/target/org.aspectj.runtime.source-1.8.10-SNAPSHOT.jar][isExported:false]]
internalGetProjectPath: attributes on org.eclipse.jdt.junit.JUNIT_CONTAINER/3 are 
internalGetProjectPath: Couldn't find it on first look, so looking here: [/jobs/genie.ajdt/ajdt-on-eclipse-47/workspace/org.eclipse.ajdt.ui.tests/target/work/configuration/org.eclipse.osgi/43/0/.cp/junit.jar[CPE_LIBRARY][K_BINARY][isExported:false][AccessRuleSet {pattern=junit/ (ACCESSIBLE), pattern=**/* (NON ACCESSIBLE)} [classpath entry: /jobs/genie.ajdt/ajdt-on-eclipse-47/workspace/org.eclipse.ajdt.ui.tests/target/work/configuration/org.eclipse.osgi/43/0/.cp/junit.jar]][attributes:javadoc_location=http://junit.sourceforge.net/junit3.8.1/javadoc/]]
internalGetProjectPath: iterating over classpath entries, size #4
internalGetProjectPath: attributes on /PathTesting-VariableOnAspectPath/src are 
internalGetProjectPath: attributes on org.eclipse.jdt.launching.JRE_CONTAINER are 
internalGetProjectPath: Couldn't find it on first look, so looking here: [/opt/public/common/jdk1.8.0_131.x64/jre/lib/resources.jar[CPE_LIBRARY][K_BINARY][sourcePath:/opt/public/common/jdk1.8.0_131.x64/src.zip][isExported:false][attributes:javadoc_location=https://docs.oracle.com/javase/8/docs/api/], /opt/public/common/jdk1.8.0_131.x64/jre/lib/rt.jar[CPE_LIBRARY][K_BINARY][sourcePath:/opt/public/common/jdk1.8.0_131.x64/src.zip][isExported:false][attributes:javadoc_location=https://docs.oracle.com/javase/8/docs/api/], /opt/public/common/jdk1.8.0_131.x64/jre/lib/jsse.jar[CPE_LIBRARY][K_BINARY][sourcePath:/opt/public/common/jdk1.8.0_131.x64/src.zip][isExported:false][attributes:javadoc_location=https://docs.oracle.com/javase/8/docs/api/], /opt/public/common/jdk1.8.0_131.x64/jre/lib/jce.jar[CPE_LIBRARY][K_BINARY][sourcePath:/opt/public/common/jdk1.8.0_131.x64/src.zip][isExported:false][attributes:javadoc_location=https://docs.oracle.com/javase/8/docs/api/], /opt/public/common/jdk1.8.0_131.x64/jre/lib/charsets.jar[CPE_LIBRARY][K_BINARY][sourcePath:/opt/public/common/jdk1.8.0_131.x64/src.zip][isExported:false][attributes:javadoc_location=https://docs.oracle.com/javase/8/docs/api/], /opt/public/common/jdk1.8.0_131.x64/jre/lib/jfr.jar[CPE_LIBRARY][K_BINARY][sourcePath:/opt/public/common/jdk1.8.0_131.x64/src.zip][isExported:false][attributes:javadoc_location=https://docs.oracle.com/javase/8/docs/api/], /opt/public/common/jdk1.8.0_131.x64/jre/lib/ext/dnsns.jar[CPE_LIBRARY][K_BINARY][isExported:false], /opt/public/common/jdk1.8.0_131.x64/jre/lib/ext/sunpkcs11.jar[CPE_LIBRARY][K_BINARY][isExported:false], /opt/public/common/jdk1.8.0_131.x64/jre/lib/ext/nashorn.jar[CPE_LIBRARY][K_BINARY][isExported:false], /opt/public/common/jdk1.8.0_131.x64/jre/lib/ext/cldrdata.jar[CPE_LIBRARY][K_BINARY][isExported:false], /opt/public/common/jdk1.8.0_131.x64/jre/lib/ext/zipfs.jar[CPE_LIBRARY][K_BINARY][isExported:false], /opt/public/common/jdk1.8.0_131.x64/jre/lib/ext/sunec.jar[CPE_LIBRARY][K_BINARY][isExported:false], /opt/public/common/jdk1.8.0_131.x64/jre/lib/ext/jaccess.jar[CPE_LIBRARY][K_BINARY][isExported:false], /opt/public/common/jdk1.8.0_131.x64/jre/lib/ext/sunjce_provider.jar[CPE_LIBRARY][K_BINARY][isExported:false], /opt/public/common/jdk1.8.0_131.x64/jre/lib/ext/localedata.jar[CPE_LIBRARY][K_BINARY][isExported:false], /opt/public/common/jdk1.8.0_131.x64/jre/lib/ext/jfxrt.jar[CPE_LIBRARY][K_BINARY][sourcePath:/opt/public/common/jdk1.8.0_131.x64/javafx-src.zip][isExported:false][attributes:javadoc_location=http://docs.oracle.com/javase/8/javafx/api/]]
internalGetProjectPath: attributes on org.eclipse.ajdt.core.ASPECTJRT_CONTAINER are 
internalGetProjectPath: Couldn't find it on first look, so looking here: [/jobs/genie.ajdt/ajdt-on-eclipse-47/workspace/org.aspectj.runtime/target/org.aspectj.runtime-1.8.10-SNAPSHOT.jar[CPE_LIBRARY][K_BINARY][sourcePath:/jobs/genie.ajdt/ajdt-on-eclipse-47/workspace/org.aspectj.runtime/target/org.aspectj.runtime.source-1.8.10-SNAPSHOT.jar][isExported:false]]
internalGetProjectPath: attributes on org.eclipse.jdt.junit.JUNIT_CONTAINER/3 are 
internalGetProjectPath: Couldn't find it on first look, so looking here: [/jobs/genie.ajdt/ajdt-on-eclipse-47/workspace/org.eclipse.ajdt.ui.tests/target/work/configuration/org.eclipse.osgi/43/0/.cp/junit.jar[CPE_LIBRARY][K_BINARY][isExported:false][AccessRuleSet {pattern=junit/ (ACCESSIBLE), pattern=**/* (NON ACCESSIBLE)} [classpath entry: /jobs/genie.ajdt/ajdt-on-eclipse-47/workspace/org.eclipse.ajdt.ui.tests/target/work/configuration/org.eclipse.osgi/43/0/.cp/junit.jar]][attributes:javadoc_location=http://junit.sourceforge.net/junit3.8.1/javadoc/]]
Compiler configuration for project PathTesting-VariableOnAspectPath has been read by compiler.  Resetting.
     Configuration was [PROJECTSOURCEFILES_CHANGED, JAVAOPTIONS_CHANGED, ASPECTPATH_CHANGED, CLASSPATH_CHANGED, INPATH_CHANGED, NONSTANDARDOPTIONS_CHANGED, OUTJAR_CHANGED, PROJECTSOURCERESOURCES_CHANGED, OUTPUTDESTINATIONS_CHANGED, INJARS_CHANGED]
Resetting list of modified source files.  Was null
Preparing for build: not going to be incremental because no successful previous full build
AJC: compiling source files
Timer event: 63ms: Time to first compiled message
AJC: compiled: /jobs/genie.ajdt/ajdt-on-eclipse-47/workspace/org.eclipse.ajdt.ui.tests/target/work/data/PathTesting-VariableOnAspectPath/src/aspectPath/VariableAspect.java
Timer event: 64ms: Time to first woven message
AJC: woven aspect aspectPath.VariableAspect (from /jobs/genie.ajdt/ajdt-on-eclipse-47/workspace/org.eclipse.ajdt.ui.tests/target/work/data/PathTesting-VariableOnAspectPath/src/aspectPath/VariableAspect.java)
AJC: compiled: /jobs/genie.ajdt/ajdt-on-eclipse-47/workspace/org.eclipse.ajdt.ui.tests/target/work/data/PathTesting-VariableOnAspectPath/src/aspectPath/VariableInpath.java
AJC: woven class aspectPath.VariableInpath (from /jobs/genie.ajdt/ajdt-on-eclipse-47/workspace/org.eclipse.ajdt.ui.tests/target/work/data/PathTesting-VariableOnAspectPath/src/aspectPath/VariableInpath.java)
advice defined in aspectPath.VariableAspect has not been applied [Xlint:adviceDidNotMatch]
AspectJ reports build successful, build was: FULL
AJDE Callback: finish. Was full build: true
Timer event: 67ms: Total time spent in AJDE
Timer event: 0ms: Refresh after build
Types affected during build = 2
>> scheduled a build
Crosscutting model sanity checked with no problems
Timer event: 0ms: Model sanity check for: PathTesting-VariableOnAspectPath
Timer event: 69ms: Total time spent in AJBuilder.build()
Timer event: 2ms: Delete markers: PathTesting-VariableOnAspectPath (Finished deleting markers for PathTesting-VariableOnAspectPath)
Compiler configuration for project PathTesting-ProjectOnAspectPath doesn't know previous state, so assuming EVERYTHING has changed.
===========================================================================================
Build kind = FULLBUILD
Timer event: 1ms: Create markers: PathTesting-VariableOnAspectPath (Finished creating markers for PathTesting-VariableOnAspectPath)
Created 0 markers in 2 files
>> finished a build
Project=PathTesting-ProjectOnAspectPath, kind of build requested=Full AspectJ compilation
internalGetProjectPath: iterating over classpath entries, size #4
internalGetProjectPath: attributes on /PathTesting-ProjectOnAspectPath/src are 
internalGetProjectPath: attributes on org.eclipse.jdt.launching.JRE_CONTAINER are 
internalGetProjectPath: Couldn't find it on first look, so looking here: [/opt/public/common/jdk1.8.0_131.x64/jre/lib/resources.jar[CPE_LIBRARY][K_BINARY][sourcePath:/opt/public/common/jdk1.8.0_131.x64/src.zip][isExported:false][attributes:javadoc_location=https://docs.oracle.com/javase/8/docs/api/], /opt/public/common/jdk1.8.0_131.x64/jre/lib/rt.jar[CPE_LIBRARY][K_BINARY][sourcePath:/opt/public/common/jdk1.8.0_131.x64/src.zip][isExported:false][attributes:javadoc_location=https://docs.oracle.com/javase/8/docs/api/], /opt/public/common/jdk1.8.0_131.x64/jre/lib/jsse.jar[CPE_LIBRARY][K_BINARY][sourcePath:/opt/public/common/jdk1.8.0_131.x64/src.zip][isExported:false][attributes:javadoc_location=https://docs.oracle.com/javase/8/docs/api/], /opt/public/common/jdk1.8.0_131.x64/jre/lib/jce.jar[CPE_LIBRARY][K_BINARY][sourcePath:/opt/public/common/jdk1.8.0_131.x64/src.zip][isExported:false][attributes:javadoc_location=https://docs.oracle.com/javase/8/docs/api/], /opt/public/common/jdk1.8.0_131.x64/jre/lib/charsets.jar[CPE_LIBRARY][K_BINARY][sourcePath:/opt/public/common/jdk1.8.0_131.x64/src.zip][isExported:false][attributes:javadoc_location=https://docs.oracle.com/javase/8/docs/api/], /opt/public/common/jdk1.8.0_131.x64/jre/lib/jfr.jar[CPE_LIBRARY][K_BINARY][sourcePath:/opt/public/common/jdk1.8.0_131.x64/src.zip][isExported:false][attributes:javadoc_location=https://docs.oracle.com/javase/8/docs/api/], /opt/public/common/jdk1.8.0_131.x64/jre/lib/ext/dnsns.jar[CPE_LIBRARY][K_BINARY][isExported:false], /opt/public/common/jdk1.8.0_131.x64/jre/lib/ext/sunpkcs11.jar[CPE_LIBRARY][K_BINARY][isExported:false], /opt/public/common/jdk1.8.0_131.x64/jre/lib/ext/nashorn.jar[CPE_LIBRARY][K_BINARY][isExported:false], /opt/public/common/jdk1.8.0_131.x64/jre/lib/ext/cldrdata.jar[CPE_LIBRARY][K_BINARY][isExported:false], /opt/public/common/jdk1.8.0_131.x64/jre/lib/ext/zipfs.jar[CPE_LIBRARY][K_BINARY][isExported:false], /opt/public/common/jdk1.8.0_131.x64/jre/lib/ext/sunec.jar[CPE_LIBRARY][K_BINARY][isExported:false], /opt/public/common/jdk1.8.0_131.x64/jre/lib/ext/jaccess.jar[CPE_LIBRARY][K_BINARY][isExported:false], /opt/public/common/jdk1.8.0_131.x64/jre/lib/ext/sunjce_provider.jar[CPE_LIBRARY][K_BINARY][isExported:false], /opt/public/common/jdk1.8.0_131.x64/jre/lib/ext/localedata.jar[CPE_LIBRARY][K_BINARY][isExported:false], /opt/public/common/jdk1.8.0_131.x64/jre/lib/ext/jfxrt.jar[CPE_LIBRARY][K_BINARY][sourcePath:/opt/public/common/jdk1.8.0_131.x64/javafx-src.zip][isExported:false][attributes:javadoc_location=http://docs.oracle.com/javase/8/javafx/api/]]
internalGetProjectPath: attributes on org.eclipse.ajdt.core.ASPECTJRT_CONTAINER are 
internalGetProjectPath: Couldn't find it on first look, so looking here: [/jobs/genie.ajdt/ajdt-on-eclipse-47/workspace/org.aspectj.runtime/target/org.aspectj.runtime-1.8.10-SNAPSHOT.jar[CPE_LIBRARY][K_BINARY][sourcePath:/jobs/genie.ajdt/ajdt-on-eclipse-47/workspace/org.aspectj.runtime/target/org.aspectj.runtime.source-1.8.10-SNAPSHOT.jar][isExported:false]]
internalGetProjectPath: attributes on org.eclipse.jdt.junit.JUNIT_CONTAINER/3 are 
internalGetProjectPath: Couldn't find it on first look, so looking here: [/jobs/genie.ajdt/ajdt-on-eclipse-47/workspace/org.eclipse.ajdt.ui.tests/target/work/configuration/org.eclipse.osgi/43/0/.cp/junit.jar[CPE_LIBRARY][K_BINARY][isExported:false][AccessRuleSet {pattern=junit/ (ACCESSIBLE), pattern=**/* (NON ACCESSIBLE)} [classpath entry: /jobs/genie.ajdt/ajdt-on-eclipse-47/workspace/org.eclipse.ajdt.ui.tests/target/work/configuration/org.eclipse.osgi/43/0/.cp/junit.jar]][attributes:javadoc_location=http://junit.sourceforge.net/junit3.8.1/javadoc/]]
internalGetProjectPath: iterating over classpath entries, size #4
internalGetProjectPath: attributes on /PathTesting-ProjectOnAspectPath/src are 
internalGetProjectPath: attributes on org.eclipse.jdt.launching.JRE_CONTAINER are 
internalGetProjectPath: Couldn't find it on first look, so looking here: [/opt/public/common/jdk1.8.0_131.x64/jre/lib/resources.jar[CPE_LIBRARY][K_BINARY][sourcePath:/opt/public/common/jdk1.8.0_131.x64/src.zip][isExported:false][attributes:javadoc_location=https://docs.oracle.com/javase/8/docs/api/], /opt/public/common/jdk1.8.0_131.x64/jre/lib/rt.jar[CPE_LIBRARY][K_BINARY][sourcePath:/opt/public/common/jdk1.8.0_131.x64/src.zip][isExported:false][attributes:javadoc_location=https://docs.oracle.com/javase/8/docs/api/], /opt/public/common/jdk1.8.0_131.x64/jre/lib/jsse.jar[CPE_LIBRARY][K_BINARY][sourcePath:/opt/public/common/jdk1.8.0_131.x64/src.zip][isExported:false][attributes:javadoc_location=https://docs.oracle.com/javase/8/docs/api/], /opt/public/common/jdk1.8.0_131.x64/jre/lib/jce.jar[CPE_LIBRARY][K_BINARY][sourcePath:/opt/public/common/jdk1.8.0_131.x64/src.zip][isExported:false][attributes:javadoc_location=https://docs.oracle.com/javase/8/docs/api/], /opt/public/common/jdk1.8.0_131.x64/jre/lib/charsets.jar[CPE_LIBRARY][K_BINARY][sourcePath:/opt/public/common/jdk1.8.0_131.x64/src.zip][isExported:false][attributes:javadoc_location=https://docs.oracle.com/javase/8/docs/api/], /opt/public/common/jdk1.8.0_131.x64/jre/lib/jfr.jar[CPE_LIBRARY][K_BINARY][sourcePath:/opt/public/common/jdk1.8.0_131.x64/src.zip][isExported:false][attributes:javadoc_location=https://docs.oracle.com/javase/8/docs/api/], /opt/public/common/jdk1.8.0_131.x64/jre/lib/ext/dnsns.jar[CPE_LIBRARY][K_BINARY][isExported:false], /opt/public/common/jdk1.8.0_131.x64/jre/lib/ext/sunpkcs11.jar[CPE_LIBRARY][K_BINARY][isExported:false], /opt/public/common/jdk1.8.0_131.x64/jre/lib/ext/nashorn.jar[CPE_LIBRARY][K_BINARY][isExported:false], /opt/public/common/jdk1.8.0_131.x64/jre/lib/ext/cldrdata.jar[CPE_LIBRARY][K_BINARY][isExported:false], /opt/public/common/jdk1.8.0_131.x64/jre/lib/ext/zipfs.jar[CPE_LIBRARY][K_BINARY][isExported:false], /opt/public/common/jdk1.8.0_131.x64/jre/lib/ext/sunec.jar[CPE_LIBRARY][K_BINARY][isExported:false], /opt/public/common/jdk1.8.0_131.x64/jre/lib/ext/jaccess.jar[CPE_LIBRARY][K_BINARY][isExported:false], /opt/public/common/jdk1.8.0_131.x64/jre/lib/ext/sunjce_provider.jar[CPE_LIBRARY][K_BINARY][isExported:false], /opt/public/common/jdk1.8.0_131.x64/jre/lib/ext/localedata.jar[CPE_LIBRARY][K_BINARY][isExported:false], /opt/public/common/jdk1.8.0_131.x64/jre/lib/ext/jfxrt.jar[CPE_LIBRARY][K_BINARY][sourcePath:/opt/public/common/jdk1.8.0_131.x64/javafx-src.zip][isExported:false][attributes:javadoc_location=http://docs.oracle.com/javase/8/javafx/api/]]
internalGetProjectPath: attributes on org.eclipse.ajdt.core.ASPECTJRT_CONTAINER are 
internalGetProjectPath: Couldn't find it on first look, so looking here: [/jobs/genie.ajdt/ajdt-on-eclipse-47/workspace/org.aspectj.runtime/target/org.aspectj.runtime-1.8.10-SNAPSHOT.jar[CPE_LIBRARY][K_BINARY][sourcePath:/jobs/genie.ajdt/ajdt-on-eclipse-47/workspace/org.aspectj.runtime/target/org.aspectj.runtime.source-1.8.10-SNAPSHOT.jar][isExported:false]]
internalGetProjectPath: attributes on org.eclipse.jdt.junit.JUNIT_CONTAINER/3 are 
internalGetProjectPath: Couldn't find it on first look, so looking here: [/jobs/genie.ajdt/ajdt-on-eclipse-47/workspace/org.eclipse.ajdt.ui.tests/target/work/configuration/org.eclipse.osgi/43/0/.cp/junit.jar[CPE_LIBRARY][K_BINARY][isExported:false][AccessRuleSet {pattern=junit/ (ACCESSIBLE), pattern=**/* (NON ACCESSIBLE)} [classpath entry: /jobs/genie.ajdt/ajdt-on-eclipse-47/workspace/org.eclipse.ajdt.ui.tests/target/work/configuration/org.eclipse.osgi/43/0/.cp/junit.jar]][attributes:javadoc_location=http://junit.sourceforge.net/junit3.8.1/javadoc/]]
Timer event: 0ms: Flush included source file cache
Timer event: 0ms: Check delta
Builder: Tidied output folder(s), removed class files and derived resources
Classpath = /jobs/genie.ajdt/ajdt-on-eclipse-47/workspace/org.eclipse.ajdt.ui.tests/target/work/data/PathTesting-ProjectOnAspectPath/otherOutLocation:/opt/public/common/jdk1.8.0_131.x64/jre/lib/resources.jar:/opt/public/common/jdk1.8.0_131.x64/jre/lib/rt.jar:/opt/public/common/jdk1.8.0_131.x64/jre/lib/jsse.jar:/opt/public/common/jdk1.8.0_131.x64/jre/lib/jce.jar:/opt/public/common/jdk1.8.0_131.x64/jre/lib/charsets.jar:/opt/public/common/jdk1.8.0_131.x64/jre/lib/jfr.jar:/opt/public/common/jdk1.8.0_131.x64/jre/lib/ext/dnsns.jar:/opt/public/common/jdk1.8.0_131.x64/jre/lib/ext/sunpkcs11.jar:/opt/public/common/jdk1.8.0_131.x64/jre/lib/ext/nashorn.jar:/opt/public/common/jdk1.8.0_131.x64/jre/lib/ext/cldrdata.jar:/opt/public/common/jdk1.8.0_131.x64/jre/lib/ext/zipfs.jar:/opt/public/common/jdk1.8.0_131.x64/jre/lib/ext/sunec.jar:/opt/public/common/jdk1.8.0_131.x64/jre/lib/ext/jaccess.jar:/opt/public/common/jdk1.8.0_131.x64/jre/lib/ext/sunjce_provider.jar:/opt/public/common/jdk1.8.0_131.x64/jre/lib/ext/localedata.jar:/opt/public/common/jdk1.8.0_131.x64/jre/lib/ext/jfxrt.jar:/jobs/genie.ajdt/ajdt-on-eclipse-47/workspace/org.aspectj.runtime/target/org.aspectj.runtime-1.8.10-SNAPSHOT.jar:/jobs/genie.ajdt/ajdt-on-eclipse-47/workspace/org.eclipse.ajdt.ui.tests/target/work/configuration/org.eclipse.osgi/43/0/.cp/junit.jar:
Timer event: 1ms: Pre compile
internalGetProjectPath: iterating over classpath entries, size #4
internalGetProjectPath: attributes on /PathTesting-ProjectOnAspectPath/src are 
internalGetProjectPath: attributes on org.eclipse.jdt.launching.JRE_CONTAINER are 
internalGetProjectPath: Couldn't find it on first look, so looking here: [/opt/public/common/jdk1.8.0_131.x64/jre/lib/resources.jar[CPE_LIBRARY][K_BINARY][sourcePath:/opt/public/common/jdk1.8.0_131.x64/src.zip][isExported:false][attributes:javadoc_location=https://docs.oracle.com/javase/8/docs/api/], /opt/public/common/jdk1.8.0_131.x64/jre/lib/rt.jar[CPE_LIBRARY][K_BINARY][sourcePath:/opt/public/common/jdk1.8.0_131.x64/src.zip][isExported:false][attributes:javadoc_location=https://docs.oracle.com/javase/8/docs/api/], /opt/public/common/jdk1.8.0_131.x64/jre/lib/jsse.jar[CPE_LIBRARY][K_BINARY][sourcePath:/opt/public/common/jdk1.8.0_131.x64/src.zip][isExported:false][attributes:javadoc_location=https://docs.oracle.com/javase/8/docs/api/], /opt/public/common/jdk1.8.0_131.x64/jre/lib/jce.jar[CPE_LIBRARY][K_BINARY][sourcePath:/opt/public/common/jdk1.8.0_131.x64/src.zip][isExported:false][attributes:javadoc_location=https://docs.oracle.com/javase/8/docs/api/], /opt/public/common/jdk1.8.0_131.x64/jre/lib/charsets.jar[CPE_LIBRARY][K_BINARY][sourcePath:/opt/public/common/jdk1.8.0_131.x64/src.zip][isExported:false][attributes:javadoc_location=https://docs.oracle.com/javase/8/docs/api/], /opt/public/common/jdk1.8.0_131.x64/jre/lib/jfr.jar[CPE_LIBRARY][K_BINARY][sourcePath:/opt/public/common/jdk1.8.0_131.x64/src.zip][isExported:false][attributes:javadoc_location=https://docs.oracle.com/javase/8/docs/api/], /opt/public/common/jdk1.8.0_131.x64/jre/lib/ext/dnsns.jar[CPE_LIBRARY][K_BINARY][isExported:false], /opt/public/common/jdk1.8.0_131.x64/jre/lib/ext/sunpkcs11.jar[CPE_LIBRARY][K_BINARY][isExported:false], /opt/public/common/jdk1.8.0_131.x64/jre/lib/ext/nashorn.jar[CPE_LIBRARY][K_BINARY][isExported:false], /opt/public/common/jdk1.8.0_131.x64/jre/lib/ext/cldrdata.jar[CPE_LIBRARY][K_BINARY][isExported:false], /opt/public/common/jdk1.8.0_131.x64/jre/lib/ext/zipfs.jar[CPE_LIBRARY][K_BINARY][isExported:false], /opt/public/common/jdk1.8.0_131.x64/jre/lib/ext/sunec.jar[CPE_LIBRARY][K_BINARY][isExported:false], /opt/public/common/jdk1.8.0_131.x64/jre/lib/ext/jaccess.jar[CPE_LIBRARY][K_BINARY][isExported:false], /opt/public/common/jdk1.8.0_131.x64/jre/lib/ext/sunjce_provider.jar[CPE_LIBRARY][K_BINARY][isExported:false], /opt/public/common/jdk1.8.0_131.x64/jre/lib/ext/localedata.jar[CPE_LIBRARY][K_BINARY][isExported:false], /opt/public/common/jdk1.8.0_131.x64/jre/lib/ext/jfxrt.jar[CPE_LIBRARY][K_BINARY][sourcePath:/opt/public/common/jdk1.8.0_131.x64/javafx-src.zip][isExported:false][attributes:javadoc_location=http://docs.oracle.com/javase/8/javafx/api/]]
internalGetProjectPath: attributes on org.eclipse.ajdt.core.ASPECTJRT_CONTAINER are 
internalGetProjectPath: Couldn't find it on first look, so looking here: [/jobs/genie.ajdt/ajdt-on-eclipse-47/workspace/org.aspectj.runtime/target/org.aspectj.runtime-1.8.10-SNAPSHOT.jar[CPE_LIBRARY][K_BINARY][sourcePath:/jobs/genie.ajdt/ajdt-on-eclipse-47/workspace/org.aspectj.runtime/target/org.aspectj.runtime.source-1.8.10-SNAPSHOT.jar][isExported:false]]
internalGetProjectPath: attributes on org.eclipse.jdt.junit.JUNIT_CONTAINER/3 are 
internalGetProjectPath: Couldn't find it on first look, so looking here: [/jobs/genie.ajdt/ajdt-on-eclipse-47/workspace/org.eclipse.ajdt.ui.tests/target/work/configuration/org.eclipse.osgi/43/0/.cp/junit.jar[CPE_LIBRARY][K_BINARY][isExported:false][AccessRuleSet {pattern=junit/ (ACCESSIBLE), pattern=**/* (NON ACCESSIBLE)} [classpath entry: /jobs/genie.ajdt/ajdt-on-eclipse-47/workspace/org.eclipse.ajdt.ui.tests/target/work/configuration/org.eclipse.osgi/43/0/.cp/junit.jar]][attributes:javadoc_location=http://junit.sourceforge.net/junit3.8.1/javadoc/]]
internalGetProjectPath: iterating over classpath entries, size #4
internalGetProjectPath: attributes on /PathTesting-ProjectOnAspectPath/src are 
internalGetProjectPath: attributes on org.eclipse.jdt.launching.JRE_CONTAINER are 
internalGetProjectPath: Couldn't find it on first look, so looking here: [/opt/public/common/jdk1.8.0_131.x64/jre/lib/resources.jar[CPE_LIBRARY][K_BINARY][sourcePath:/opt/public/common/jdk1.8.0_131.x64/src.zip][isExported:false][attributes:javadoc_location=https://docs.oracle.com/javase/8/docs/api/], /opt/public/common/jdk1.8.0_131.x64/jre/lib/rt.jar[CPE_LIBRARY][K_BINARY][sourcePath:/opt/public/common/jdk1.8.0_131.x64/src.zip][isExported:false][attributes:javadoc_location=https://docs.oracle.com/javase/8/docs/api/], /opt/public/common/jdk1.8.0_131.x64/jre/lib/jsse.jar[CPE_LIBRARY][K_BINARY][sourcePath:/opt/public/common/jdk1.8.0_131.x64/src.zip][isExported:false][attributes:javadoc_location=https://docs.oracle.com/javase/8/docs/api/], /opt/public/common/jdk1.8.0_131.x64/jre/lib/jce.jar[CPE_LIBRARY][K_BINARY][sourcePath:/opt/public/common/jdk1.8.0_131.x64/src.zip][isExported:false][attributes:javadoc_location=https://docs.oracle.com/javase/8/docs/api/], /opt/public/common/jdk1.8.0_131.x64/jre/lib/charsets.jar[CPE_LIBRARY][K_BINARY][sourcePath:/opt/public/common/jdk1.8.0_131.x64/src.zip][isExported:false][attributes:javadoc_location=https://docs.oracle.com/javase/8/docs/api/], /opt/public/common/jdk1.8.0_131.x64/jre/lib/jfr.jar[CPE_LIBRARY][K_BINARY][sourcePath:/opt/public/common/jdk1.8.0_131.x64/src.zip][isExported:false][attributes:javadoc_location=https://docs.oracle.com/javase/8/docs/api/], /opt/public/common/jdk1.8.0_131.x64/jre/lib/ext/dnsns.jar[CPE_LIBRARY][K_BINARY][isExported:false], /opt/public/common/jdk1.8.0_131.x64/jre/lib/ext/sunpkcs11.jar[CPE_LIBRARY][K_BINARY][isExported:false], /opt/public/common/jdk1.8.0_131.x64/jre/lib/ext/nashorn.jar[CPE_LIBRARY][K_BINARY][isExported:false], /opt/public/common/jdk1.8.0_131.x64/jre/lib/ext/cldrdata.jar[CPE_LIBRARY][K_BINARY][isExported:false], /opt/public/common/jdk1.8.0_131.x64/jre/lib/ext/zipfs.jar[CPE_LIBRARY][K_BINARY][isExported:false], /opt/public/common/jdk1.8.0_131.x64/jre/lib/ext/sunec.jar[CPE_LIBRARY][K_BINARY][isExported:false], /opt/public/common/jdk1.8.0_131.x64/jre/lib/ext/jaccess.jar[CPE_LIBRARY][K_BINARY][isExported:false], /opt/public/common/jdk1.8.0_131.x64/jre/lib/ext/sunjce_provider.jar[CPE_LIBRARY][K_BINARY][isExported:false], /opt/public/common/jdk1.8.0_131.x64/jre/lib/ext/localedata.jar[CPE_LIBRARY][K_BINARY][isExported:false], /opt/public/common/jdk1.8.0_131.x64/jre/lib/ext/jfxrt.jar[CPE_LIBRARY][K_BINARY][sourcePath:/opt/public/common/jdk1.8.0_131.x64/javafx-src.zip][isExported:false][attributes:javadoc_location=http://docs.oracle.com/javase/8/javafx/api/]]
internalGetProjectPath: attributes on org.eclipse.ajdt.core.ASPECTJRT_CONTAINER are 
internalGetProjectPath: Couldn't find it on first look, so looking here: [/jobs/genie.ajdt/ajdt-on-eclipse-47/workspace/org.aspectj.runtime/target/org.aspectj.runtime-1.8.10-SNAPSHOT.jar[CPE_LIBRARY][K_BINARY][sourcePath:/jobs/genie.ajdt/ajdt-on-eclipse-47/workspace/org.aspectj.runtime/target/org.aspectj.runtime.source-1.8.10-SNAPSHOT.jar][isExported:false]]
internalGetProjectPath: attributes on org.eclipse.jdt.junit.JUNIT_CONTAINER/3 are 
internalGetProjectPath: Couldn't find it on first look, so looking here: [/jobs/genie.ajdt/ajdt-on-eclipse-47/workspace/org.eclipse.ajdt.ui.tests/target/work/configuration/org.eclipse.osgi/43/0/.cp/junit.jar[CPE_LIBRARY][K_BINARY][isExported:false][AccessRuleSet {pattern=junit/ (ACCESSIBLE), pattern=**/* (NON ACCESSIBLE)} [classpath entry: /jobs/genie.ajdt/ajdt-on-eclipse-47/workspace/org.eclipse.ajdt.ui.tests/target/work/configuration/org.eclipse.osgi/43/0/.cp/junit.jar]][attributes:javadoc_location=http://junit.sourceforge.net/junit3.8.1/javadoc/]]
Compiler configuration for project PathTesting-ProjectOnAspectPath has been read by compiler.  Resetting.
     Configuration was [PROJECTSOURCEFILES_CHANGED, JAVAOPTIONS_CHANGED, ASPECTPATH_CHANGED, CLASSPATH_CHANGED, INPATH_CHANGED, NONSTANDARDOPTIONS_CHANGED, OUTJAR_CHANGED, PROJECTSOURCERESOURCES_CHANGED, OUTPUTDESTINATIONS_CHANGED, INJARS_CHANGED]
Resetting list of modified source files.  Was null
Preparing for build: not going to be incremental because no successful previous full build
AJC: compiling source files
Timer event: 53ms: Time to first compiled message
AJC: compiled: /jobs/genie.ajdt/ajdt-on-eclipse-47/workspace/org.eclipse.ajdt.ui.tests/target/work/data/PathTesting-ProjectOnAspectPath/src/aspectPath/ProjectAspect.java
Timer event: 54ms: Time to first woven message
AJC: woven aspect aspectPath.ProjectAspect (from /jobs/genie.ajdt/ajdt-on-eclipse-47/workspace/org.eclipse.ajdt.ui.tests/target/work/data/PathTesting-ProjectOnAspectPath/src/aspectPath/ProjectAspect.java)
AJC: compiled: /jobs/genie.ajdt/ajdt-on-eclipse-47/workspace/org.eclipse.ajdt.ui.tests/target/work/data/PathTesting-ProjectOnAspectPath/src/aspectPath/ProjectInpath.java
AJC: woven class aspectPath.ProjectInpath (from /jobs/genie.ajdt/ajdt-on-eclipse-47/workspace/org.eclipse.ajdt.ui.tests/target/work/data/PathTesting-ProjectOnAspectPath/src/aspectPath/ProjectInpath.java)
advice defined in aspectPath.ProjectAspect has not been applied [Xlint:adviceDidNotMatch]
AspectJ reports build successful, build was: FULL
AJDE Callback: finish. Was full build: true
Timer event: 56ms: Total time spent in AJDE
Timer event: 0ms: Refresh after build
Types affected during build = 2
>> scheduled a build
Crosscutting model sanity checked with no problems
Timer event: 0ms: Model sanity check for: PathTesting-ProjectOnAspectPath
Timer event: 57ms: Total time spent in AJBuilder.build()
Timer event: 1ms: Delete markers: PathTesting-ProjectOnAspectPath (Finished deleting markers for PathTesting-ProjectOnAspectPath)
Compiler configuration for project PathTesting-JarOnAspectPath doesn't know previous state, so assuming EVERYTHING has changed.
===========================================================================================
Build kind = FULLBUILD
Timer event: 1ms: Create markers: PathTesting-ProjectOnAspectPath (Finished creating markers for PathTesting-ProjectOnAspectPath)
Project=PathTesting-JarOnAspectPath, kind of build requested=Full AspectJ compilation
Created 0 markers in 2 files
internalGetProjectPath: iterating over classpath entries, size #3
internalGetProjectPath: attributes on /PathTesting-JarOnAspectPath/src are 
internalGetProjectPath: attributes on org.eclipse.jdt.launching.JRE_CONTAINER are 
>> finished a build
internalGetProjectPath: Couldn't find it on first look, so looking here: [/opt/public/common/jdk1.8.0_131.x64/jre/lib/resources.jar[CPE_LIBRARY][K_BINARY][sourcePath:/opt/public/common/jdk1.8.0_131.x64/src.zip][isExported:false][attributes:javadoc_location=https://docs.oracle.com/javase/8/docs/api/], /opt/public/common/jdk1.8.0_131.x64/jre/lib/rt.jar[CPE_LIBRARY][K_BINARY][sourcePath:/opt/public/common/jdk1.8.0_131.x64/src.zip][isExported:false][attributes:javadoc_location=https://docs.oracle.com/javase/8/docs/api/], /opt/public/common/jdk1.8.0_131.x64/jre/lib/jsse.jar[CPE_LIBRARY][K_BINARY][sourcePath:/opt/public/common/jdk1.8.0_131.x64/src.zip][isExported:false][attributes:javadoc_location=https://docs.oracle.com/javase/8/docs/api/], /opt/public/common/jdk1.8.0_131.x64/jre/lib/jce.jar[CPE_LIBRARY][K_BINARY][sourcePath:/opt/public/common/jdk1.8.0_131.x64/src.zip][isExported:false][attributes:javadoc_location=https://docs.oracle.com/javase/8/docs/api/], /opt/public/common/jdk1.8.0_131.x64/jre/lib/charsets.jar[CPE_LIBRARY][K_BINARY][sourcePath:/opt/public/common/jdk1.8.0_131.x64/src.zip][isExported:false][attributes:javadoc_location=https://docs.oracle.com/javase/8/docs/api/], /opt/public/common/jdk1.8.0_131.x64/jre/lib/jfr.jar[CPE_LIBRARY][K_BINARY][sourcePath:/opt/public/common/jdk1.8.0_131.x64/src.zip][isExported:false][attributes:javadoc_location=https://docs.oracle.com/javase/8/docs/api/], /opt/public/common/jdk1.8.0_131.x64/jre/lib/ext/dnsns.jar[CPE_LIBRARY][K_BINARY][isExported:false], /opt/public/common/jdk1.8.0_131.x64/jre/lib/ext/sunpkcs11.jar[CPE_LIBRARY][K_BINARY][isExported:false], /opt/public/common/jdk1.8.0_131.x64/jre/lib/ext/nashorn.jar[CPE_LIBRARY][K_BINARY][isExported:false], /opt/public/common/jdk1.8.0_131.x64/jre/lib/ext/cldrdata.jar[CPE_LIBRARY][K_BINARY][isExported:false], /opt/public/common/jdk1.8.0_131.x64/jre/lib/ext/zipfs.jar[CPE_LIBRARY][K_BINARY][isExported:false], /opt/public/common/jdk1.8.0_131.x64/jre/lib/ext/sunec.jar[CPE_LIBRARY][K_BINARY][isExported:false], /opt/public/common/jdk1.8.0_131.x64/jre/lib/ext/jaccess.jar[CPE_LIBRARY][K_BINARY][isExported:false], /opt/public/common/jdk1.8.0_131.x64/jre/lib/ext/sunjce_provider.jar[CPE_LIBRARY][K_BINARY][isExported:false], /opt/public/common/jdk1.8.0_131.x64/jre/lib/ext/localedata.jar[CPE_LIBRARY][K_BINARY][isExported:false], /opt/public/common/jdk1.8.0_131.x64/jre/lib/ext/jfxrt.jar[CPE_LIBRARY][K_BINARY][sourcePath:/opt/public/common/jdk1.8.0_131.x64/javafx-src.zip][isExported:false][attributes:javadoc_location=http://docs.oracle.com/javase/8/javafx/api/]]
internalGetProjectPath: attributes on org.eclipse.ajdt.core.ASPECTJRT_CONTAINER are 
internalGetProjectPath: Couldn't find it on first look, so looking here: [/jobs/genie.ajdt/ajdt-on-eclipse-47/workspace/org.aspectj.runtime/target/org.aspectj.runtime-1.8.10-SNAPSHOT.jar[CPE_LIBRARY][K_BINARY][sourcePath:/jobs/genie.ajdt/ajdt-on-eclipse-47/workspace/org.aspectj.runtime/target/org.aspectj.runtime.source-1.8.10-SNAPSHOT.jar][isExported:false]]
internalGetProjectPath: iterating over classpath entries, size #3
internalGetProjectPath: attributes on /PathTesting-JarOnAspectPath/src are 
internalGetProjectPath: attributes on org.eclipse.jdt.launching.JRE_CONTAINER are 
internalGetProjectPath: Couldn't find it on first look, so looking here: [/opt/public/common/jdk1.8.0_131.x64/jre/lib/resources.jar[CPE_LIBRARY][K_BINARY][sourcePath:/opt/public/common/jdk1.8.0_131.x64/src.zip][isExported:false][attributes:javadoc_location=https://docs.oracle.com/javase/8/docs/api/], /opt/public/common/jdk1.8.0_131.x64/jre/lib/rt.jar[CPE_LIBRARY][K_BINARY][sourcePath:/opt/public/common/jdk1.8.0_131.x64/src.zip][isExported:false][attributes:javadoc_location=https://docs.oracle.com/javase/8/docs/api/], /opt/public/common/jdk1.8.0_131.x64/jre/lib/jsse.jar[CPE_LIBRARY][K_BINARY][sourcePath:/opt/public/common/jdk1.8.0_131.x64/src.zip][isExported:false][attributes:javadoc_location=https://docs.oracle.com/javase/8/docs/api/], /opt/public/common/jdk1.8.0_131.x64/jre/lib/jce.jar[CPE_LIBRARY][K_BINARY][sourcePath:/opt/public/common/jdk1.8.0_131.x64/src.zip][isExported:false][attributes:javadoc_location=https://docs.oracle.com/javase/8/docs/api/], /opt/public/common/jdk1.8.0_131.x64/jre/lib/charsets.jar[CPE_LIBRARY][K_BINARY][sourcePath:/opt/public/common/jdk1.8.0_131.x64/src.zip][isExported:false][attributes:javadoc_location=https://docs.oracle.com/javase/8/docs/api/], /opt/public/common/jdk1.8.0_131.x64/jre/lib/jfr.jar[CPE_LIBRARY][K_BINARY][sourcePath:/opt/public/common/jdk1.8.0_131.x64/src.zip][isExported:false][attributes:javadoc_location=https://docs.oracle.com/javase/8/docs/api/], /opt/public/common/jdk1.8.0_131.x64/jre/lib/ext/dnsns.jar[CPE_LIBRARY][K_BINARY][isExported:false], /opt/public/common/jdk1.8.0_131.x64/jre/lib/ext/sunpkcs11.jar[CPE_LIBRARY][K_BINARY][isExported:false], /opt/public/common/jdk1.8.0_131.x64/jre/lib/ext/nashorn.jar[CPE_LIBRARY][K_BINARY][isExported:false], /opt/public/common/jdk1.8.0_131.x64/jre/lib/ext/cldrdata.jar[CPE_LIBRARY][K_BINARY][isExported:false], /opt/public/common/jdk1.8.0_131.x64/jre/lib/ext/zipfs.jar[CPE_LIBRARY][K_BINARY][isExported:false], /opt/public/common/jdk1.8.0_131.x64/jre/lib/ext/sunec.jar[CPE_LIBRARY][K_BINARY][isExported:false], /opt/public/common/jdk1.8.0_131.x64/jre/lib/ext/jaccess.jar[CPE_LIBRARY][K_BINARY][isExported:false], /opt/public/common/jdk1.8.0_131.x64/jre/lib/ext/sunjce_provider.jar[CPE_LIBRARY][K_BINARY][isExported:false], /opt/public/common/jdk1.8.0_131.x64/jre/lib/ext/localedata.jar[CPE_LIBRARY][K_BINARY][isExported:false], /opt/public/common/jdk1.8.0_131.x64/jre/lib/ext/jfxrt.jar[CPE_LIBRARY][K_BINARY][sourcePath:/opt/public/common/jdk1.8.0_131.x64/javafx-src.zip][isExported:false][attributes:javadoc_location=http://docs.oracle.com/javase/8/javafx/api/]]
internalGetProjectPath: attributes on org.eclipse.ajdt.core.ASPECTJRT_CONTAINER are 
internalGetProjectPath: Couldn't find it on first look, so looking here: [/jobs/genie.ajdt/ajdt-on-eclipse-47/workspace/org.aspectj.runtime/target/org.aspectj.runtime-1.8.10-SNAPSHOT.jar[CPE_LIBRARY][K_BINARY][sourcePath:/jobs/genie.ajdt/ajdt-on-eclipse-47/workspace/org.aspectj.runtime/target/org.aspectj.runtime.source-1.8.10-SNAPSHOT.jar][isExported:false]]
Timer event: 0ms: Flush included source file cache
Timer event: 0ms: Check delta
Builder: Tidied output folder(s), removed class files and derived resources
Classpath = /jobs/genie.ajdt/ajdt-on-eclipse-47/workspace/org.eclipse.ajdt.ui.tests/target/work/data/PathTesting-JarOnAspectPath/bin:/opt/public/common/jdk1.8.0_131.x64/jre/lib/resources.jar:/opt/public/common/jdk1.8.0_131.x64/jre/lib/rt.jar:/opt/public/common/jdk1.8.0_131.x64/jre/lib/jsse.jar:/opt/public/common/jdk1.8.0_131.x64/jre/lib/jce.jar:/opt/public/common/jdk1.8.0_131.x64/jre/lib/charsets.jar:/opt/public/common/jdk1.8.0_131.x64/jre/lib/jfr.jar:/opt/public/common/jdk1.8.0_131.x64/jre/lib/ext/dnsns.jar:/opt/public/common/jdk1.8.0_131.x64/jre/lib/ext/sunpkcs11.jar:/opt/public/common/jdk1.8.0_131.x64/jre/lib/ext/nashorn.jar:/opt/public/common/jdk1.8.0_131.x64/jre/lib/ext/cldrdata.jar:/opt/public/common/jdk1.8.0_131.x64/jre/lib/ext/zipfs.jar:/opt/public/common/jdk1.8.0_131.x64/jre/lib/ext/sunec.jar:/opt/public/common/jdk1.8.0_131.x64/jre/lib/ext/jaccess.jar:/opt/public/common/jdk1.8.0_131.x64/jre/lib/ext/sunjce_provider.jar:/opt/public/common/jdk1.8.0_131.x64/jre/lib/ext/localedata.jar:/opt/public/common/jdk1.8.0_131.x64/jre/lib/ext/jfxrt.jar:/jobs/genie.ajdt/ajdt-on-eclipse-47/workspace/org.aspectj.runtime/target/org.aspectj.runtime-1.8.10-SNAPSHOT.jar:
Timer event: 1ms: Pre compile
internalGetProjectPath: iterating over classpath entries, size #3
internalGetProjectPath: attributes on /PathTesting-JarOnAspectPath/src are 
internalGetProjectPath: attributes on org.eclipse.jdt.launching.JRE_CONTAINER are 
internalGetProjectPath: Couldn't find it on first look, so looking here: [/opt/public/common/jdk1.8.0_131.x64/jre/lib/resources.jar[CPE_LIBRARY][K_BINARY][sourcePath:/opt/public/common/jdk1.8.0_131.x64/src.zip][isExported:false][attributes:javadoc_location=https://docs.oracle.com/javase/8/docs/api/], /opt/public/common/jdk1.8.0_131.x64/jre/lib/rt.jar[CPE_LIBRARY][K_BINARY][sourcePath:/opt/public/common/jdk1.8.0_131.x64/src.zip][isExported:false][attributes:javadoc_location=https://docs.oracle.com/javase/8/docs/api/], /opt/public/common/jdk1.8.0_131.x64/jre/lib/jsse.jar[CPE_LIBRARY][K_BINARY][sourcePath:/opt/public/common/jdk1.8.0_131.x64/src.zip][isExported:false][attributes:javadoc_location=https://docs.oracle.com/javase/8/docs/api/], /opt/public/common/jdk1.8.0_131.x64/jre/lib/jce.jar[CPE_LIBRARY][K_BINARY][sourcePath:/opt/public/common/jdk1.8.0_131.x64/src.zip][isExported:false][attributes:javadoc_location=https://docs.oracle.com/javase/8/docs/api/], /opt/public/common/jdk1.8.0_131.x64/jre/lib/charsets.jar[CPE_LIBRARY][K_BINARY][sourcePath:/opt/public/common/jdk1.8.0_131.x64/src.zip][isExported:false][attributes:javadoc_location=https://docs.oracle.com/javase/8/docs/api/], /opt/public/common/jdk1.8.0_131.x64/jre/lib/jfr.jar[CPE_LIBRARY][K_BINARY][sourcePath:/opt/public/common/jdk1.8.0_131.x64/src.zip][isExported:false][attributes:javadoc_location=https://docs.oracle.com/javase/8/docs/api/], /opt/public/common/jdk1.8.0_131.x64/jre/lib/ext/dnsns.jar[CPE_LIBRARY][K_BINARY][isExported:false], /opt/public/common/jdk1.8.0_131.x64/jre/lib/ext/sunpkcs11.jar[CPE_LIBRARY][K_BINARY][isExported:false], /opt/public/common/jdk1.8.0_131.x64/jre/lib/ext/nashorn.jar[CPE_LIBRARY][K_BINARY][isExported:false], /opt/public/common/jdk1.8.0_131.x64/jre/lib/ext/cldrdata.jar[CPE_LIBRARY][K_BINARY][isExported:false], /opt/public/common/jdk1.8.0_131.x64/jre/lib/ext/zipfs.jar[CPE_LIBRARY][K_BINARY][isExported:false], /opt/public/common/jdk1.8.0_131.x64/jre/lib/ext/sunec.jar[CPE_LIBRARY][K_BINARY][isExported:false], /opt/public/common/jdk1.8.0_131.x64/jre/lib/ext/jaccess.jar[CPE_LIBRARY][K_BINARY][isExported:false], /opt/public/common/jdk1.8.0_131.x64/jre/lib/ext/sunjce_provider.jar[CPE_LIBRARY][K_BINARY][isExported:false], /opt/public/common/jdk1.8.0_131.x64/jre/lib/ext/localedata.jar[CPE_LIBRARY][K_BINARY][isExported:false], /opt/public/common/jdk1.8.0_131.x64/jre/lib/ext/jfxrt.jar[CPE_LIBRARY][K_BINARY][sourcePath:/opt/public/common/jdk1.8.0_131.x64/javafx-src.zip][isExported:false][attributes:javadoc_location=http://docs.oracle.com/javase/8/javafx/api/]]
internalGetProjectPath: attributes on org.eclipse.ajdt.core.ASPECTJRT_CONTAINER are 
internalGetProjectPath: Couldn't find it on first look, so looking here: [/jobs/genie.ajdt/ajdt-on-eclipse-47/workspace/org.aspectj.runtime/target/org.aspectj.runtime-1.8.10-SNAPSHOT.jar[CPE_LIBRARY][K_BINARY][sourcePath:/jobs/genie.ajdt/ajdt-on-eclipse-47/workspace/org.aspectj.runtime/target/org.aspectj.runtime.source-1.8.10-SNAPSHOT.jar][isExported:false]]
internalGetProjectPath: iterating over classpath entries, size #3
internalGetProjectPath: attributes on /PathTesting-JarOnAspectPath/src are 
internalGetProjectPath: attributes on org.eclipse.jdt.launching.JRE_CONTAINER are 
internalGetProjectPath: Couldn't find it on first look, so looking here: [/opt/public/common/jdk1.8.0_131.x64/jre/lib/resources.jar[CPE_LIBRARY][K_BINARY][sourcePath:/opt/public/common/jdk1.8.0_131.x64/src.zip][isExported:false][attributes:javadoc_location=https://docs.oracle.com/javase/8/docs/api/], /opt/public/common/jdk1.8.0_131.x64/jre/lib/rt.jar[CPE_LIBRARY][K_BINARY][sourcePath:/opt/public/common/jdk1.8.0_131.x64/src.zip][isExported:false][attributes:javadoc_location=https://docs.oracle.com/javase/8/docs/api/], /opt/public/common/jdk1.8.0_131.x64/jre/lib/jsse.jar[CPE_LIBRARY][K_BINARY][sourcePath:/opt/public/common/jdk1.8.0_131.x64/src.zip][isExported:false][attributes:javadoc_location=https://docs.oracle.com/javase/8/docs/api/], /opt/public/common/jdk1.8.0_131.x64/jre/lib/jce.jar[CPE_LIBRARY][K_BINARY][sourcePath:/opt/public/common/jdk1.8.0_131.x64/src.zip][isExported:false][attributes:javadoc_location=https://docs.oracle.com/javase/8/docs/api/], /opt/public/common/jdk1.8.0_131.x64/jre/lib/charsets.jar[CPE_LIBRARY][K_BINARY][sourcePath:/opt/public/common/jdk1.8.0_131.x64/src.zip][isExported:false][attributes:javadoc_location=https://docs.oracle.com/javase/8/docs/api/], /opt/public/common/jdk1.8.0_131.x64/jre/lib/jfr.jar[CPE_LIBRARY][K_BINARY][sourcePath:/opt/public/common/jdk1.8.0_131.x64/src.zip][isExported:false][attributes:javadoc_location=https://docs.oracle.com/javase/8/docs/api/], /opt/public/common/jdk1.8.0_131.x64/jre/lib/ext/dnsns.jar[CPE_LIBRARY][K_BINARY][isExported:false], /opt/public/common/jdk1.8.0_131.x64/jre/lib/ext/sunpkcs11.jar[CPE_LIBRARY][K_BINARY][isExported:false], /opt/public/common/jdk1.8.0_131.x64/jre/lib/ext/nashorn.jar[CPE_LIBRARY][K_BINARY][isExported:false], /opt/public/common/jdk1.8.0_131.x64/jre/lib/ext/cldrdata.jar[CPE_LIBRARY][K_BINARY][isExported:false], /opt/public/common/jdk1.8.0_131.x64/jre/lib/ext/zipfs.jar[CPE_LIBRARY][K_BINARY][isExported:false], /opt/public/common/jdk1.8.0_131.x64/jre/lib/ext/sunec.jar[CPE_LIBRARY][K_BINARY][isExported:false], /opt/public/common/jdk1.8.0_131.x64/jre/lib/ext/jaccess.jar[CPE_LIBRARY][K_BINARY][isExported:false], /opt/public/common/jdk1.8.0_131.x64/jre/lib/ext/sunjce_provider.jar[CPE_LIBRARY][K_BINARY][isExported:false], /opt/public/common/jdk1.8.0_131.x64/jre/lib/ext/localedata.jar[CPE_LIBRARY][K_BINARY][isExported:false], /opt/public/common/jdk1.8.0_131.x64/jre/lib/ext/jfxrt.jar[CPE_LIBRARY][K_BINARY][sourcePath:/opt/public/common/jdk1.8.0_131.x64/javafx-src.zip][isExported:false][attributes:javadoc_location=http://docs.oracle.com/javase/8/javafx/api/]]
internalGetProjectPath: attributes on org.eclipse.ajdt.core.ASPECTJRT_CONTAINER are 
internalGetProjectPath: Couldn't find it on first look, so looking here: [/jobs/genie.ajdt/ajdt-on-eclipse-47/workspace/org.aspectj.runtime/target/org.aspectj.runtime-1.8.10-SNAPSHOT.jar[CPE_LIBRARY][K_BINARY][sourcePath:/jobs/genie.ajdt/ajdt-on-eclipse-47/workspace/org.aspectj.runtime/target/org.aspectj.runtime.source-1.8.10-SNAPSHOT.jar][isExported:false]]
Compiler configuration for project PathTesting-JarOnAspectPath has been read by compiler.  Resetting.
     Configuration was [PROJECTSOURCEFILES_CHANGED, JAVAOPTIONS_CHANGED, ASPECTPATH_CHANGED, CLASSPATH_CHANGED, INPATH_CHANGED, NONSTANDARDOPTIONS_CHANGED, OUTJAR_CHANGED, PROJECTSOURCERESOURCES_CHANGED, OUTPUTDESTINATIONS_CHANGED, INJARS_CHANGED]
Resetting list of modified source files.  Was null
Preparing for build: not going to be incremental because no successful previous full build
AJC: compiling source files
Timer event: 43ms: Time to first compiled message
AJC: compiled: /jobs/genie.ajdt/ajdt-on-eclipse-47/workspace/org.eclipse.ajdt.ui.tests/target/work/data/PathTesting-JarOnAspectPath/src/aspectPath/JarAspect.java
Timer event: 45ms: Time to first woven message
AJC: woven aspect aspectPath.JarAspect (from /jobs/genie.ajdt/ajdt-on-eclipse-47/workspace/org.eclipse.ajdt.ui.tests/target/work/data/PathTesting-JarOnAspectPath/src/aspectPath/JarAspect.java)
AJC: compiled: /jobs/genie.ajdt/ajdt-on-eclipse-47/workspace/org.eclipse.ajdt.ui.tests/target/work/data/PathTesting-JarOnAspectPath/src/aspectPath/JarInpath.java
AJC: woven class aspectPath.JarInpath (from /jobs/genie.ajdt/ajdt-on-eclipse-47/workspace/org.eclipse.ajdt.ui.tests/target/work/data/PathTesting-JarOnAspectPath/src/aspectPath/JarInpath.java)
advice defined in aspectPath.JarAspect has not been applied [Xlint:adviceDidNotMatch]
AspectJ reports build successful, build was: FULL
AJDE Callback: finish. Was full build: true
Timer event: 47ms: Total time spent in AJDE
Timer event: 0ms: Refresh after build
Types affected during build = 2
>> scheduled a build
Crosscutting model sanity checked with no problems
Timer event: 0ms: Model sanity check for: PathTesting-JarOnAspectPath
Timer event: 48ms: Total time spent in AJBuilder.build()
Timer event: 3ms: Delete markers: PathTesting-JarOnAspectPath (Finished deleting markers for PathTesting-JarOnAspectPath)
Timer event: 0ms: Create markers: PathTesting-JarOnAspectPath (Finished creating markers for PathTesting-JarOnAspectPath)
Created 0 markers in 2 files
>> finished a build
Timer event: 3ms: Update visualizer, xref, advice listeners for (separate thread): PathTesting-ContainerOnAspectPath
Timer event: 2ms: Update visualizer, xref, advice listeners for (separate thread): PathTesting-VariableOnAspectPath
Timer event: 1ms: Update visualizer, xref, advice listeners for (separate thread): PathTesting-ProjectOnAspectPath
Timer event: 1ms: Update visualizer, xref, advice listeners for (separate thread): PathTesting-JarOnAspectPath
===========================================================================================
Build kind = AUTOBUILD
Project=DefaultEmptyProject, kind of build requested=Incremental AspectJ compilation
internalGetProjectPath: iterating over classpath entries, size #4
internalGetProjectPath: attributes on /DefaultEmptyProject/src are 
internalGetProjectPath: attributes on ASPECTJRT_LIB are 
internalGetProjectPath: attributes on org.eclipse.jdt.launching.JRE_CONTAINER are 
internalGetProjectPath: Couldn't find it on first look, so looking here: [/opt/public/common/jdk1.8.0_131.x64/jre/lib/resources.jar[CPE_LIBRARY][K_BINARY][sourcePath:/opt/public/common/jdk1.8.0_131.x64/src.zip][isExported:false][attributes:javadoc_location=https://docs.oracle.com/javase/8/docs/api/], /opt/public/common/jdk1.8.0_131.x64/jre/lib/rt.jar[CPE_LIBRARY][K_BINARY][sourcePath:/opt/public/common/jdk1.8.0_131.x64/src.zip][isExported:false][attributes:javadoc_location=https://docs.oracle.com/javase/8/docs/api/], /opt/public/common/jdk1.8.0_131.x64/jre/lib/jsse.jar[CPE_LIBRARY][K_BINARY][sourcePath:/opt/public/common/jdk1.8.0_131.x64/src.zip][isExported:false][attributes:javadoc_location=https://docs.oracle.com/javase/8/docs/api/], /opt/public/common/jdk1.8.0_131.x64/jre/lib/jce.jar[CPE_LIBRARY][K_BINARY][sourcePath:/opt/public/common/jdk1.8.0_131.x64/src.zip][isExported:false][attributes:javadoc_location=https://docs.oracle.com/javase/8/docs/api/], /opt/public/common/jdk1.8.0_131.x64/jre/lib/charsets.jar[CPE_LIBRARY][K_BINARY][sourcePath:/opt/public/common/jdk1.8.0_131.x64/src.zip][isExported:false][attributes:javadoc_location=https://docs.oracle.com/javase/8/docs/api/], /opt/public/common/jdk1.8.0_131.x64/jre/lib/jfr.jar[CPE_LIBRARY][K_BINARY][sourcePath:/opt/public/common/jdk1.8.0_131.x64/src.zip][isExported:false][attributes:javadoc_location=https://docs.oracle.com/javase/8/docs/api/], /opt/public/common/jdk1.8.0_131.x64/jre/lib/ext/dnsns.jar[CPE_LIBRARY][K_BINARY][isExported:false], /opt/public/common/jdk1.8.0_131.x64/jre/lib/ext/sunpkcs11.jar[CPE_LIBRARY][K_BINARY][isExported:false], /opt/public/common/jdk1.8.0_131.x64/jre/lib/ext/nashorn.jar[CPE_LIBRARY][K_BINARY][isExported:false], /opt/public/common/jdk1.8.0_131.x64/jre/lib/ext/cldrdata.jar[CPE_LIBRARY][K_BINARY][isExported:false], /opt/public/common/jdk1.8.0_131.x64/jre/lib/ext/zipfs.jar[CPE_LIBRARY][K_BINARY][isExported:false], /opt/public/common/jdk1.8.0_131.x64/jre/lib/ext/sunec.jar[CPE_LIBRARY][K_BINARY][isExported:false], /opt/public/common/jdk1.8.0_131.x64/jre/lib/ext/jaccess.jar[CPE_LIBRARY][K_BINARY][isExported:false], /opt/public/common/jdk1.8.0_131.x64/jre/lib/ext/sunjce_provider.jar[CPE_LIBRARY][K_BINARY][isExported:false], /opt/public/common/jdk1.8.0_131.x64/jre/lib/ext/localedata.jar[CPE_LIBRARY][K_BINARY][isExported:false], /opt/public/common/jdk1.8.0_131.x64/jre/lib/ext/jfxrt.jar[CPE_LIBRARY][K_BINARY][sourcePath:/opt/public/common/jdk1.8.0_131.x64/javafx-src.zip][isExported:false][attributes:javadoc_location=http://docs.oracle.com/javase/8/javafx/api/]]
internalGetProjectPath: attributes on org.eclipse.jdt.junit.JUNIT_CONTAINER/4 are 
internalGetProjectPath: Couldn't find it on first look, so looking here: [/jobs/genie.ajdt/ajdt-on-eclipse-47/workspace/org.eclipse.ajdt.ui.tests/target/work/configuration/org.eclipse.osgi/43/0/.cp/junit.jar[CPE_LIBRARY][K_BINARY][isExported:false][attributes:javadoc_location=http://junit.org/junit4/javadoc/latest/], /jobs/genie.ajdt/ajdt-on-eclipse-47/workspace/org.eclipse.ajdt.ui.tests/target/work/configuration/org.eclipse.osgi/222/0/.cp/[CPE_LIBRARY][K_BINARY][isExported:false][attributes:javadoc_location=http://hamcrest.org/JavaHamcrest/javadoc/1.3/]]
internalGetProjectPath: iterating over classpath entries, size #4
internalGetProjectPath: attributes on /DefaultEmptyProject/src are 
internalGetProjectPath: attributes on ASPECTJRT_LIB are 
internalGetProjectPath: attributes on org.eclipse.jdt.launching.JRE_CONTAINER are 
internalGetProjectPath: Couldn't find it on first look, so looking here: [/opt/public/common/jdk1.8.0_131.x64/jre/lib/resources.jar[CPE_LIBRARY][K_BINARY][sourcePath:/opt/public/common/jdk1.8.0_131.x64/src.zip][isExported:false][attributes:javadoc_location=https://docs.oracle.com/javase/8/docs/api/], /opt/public/common/jdk1.8.0_131.x64/jre/lib/rt.jar[CPE_LIBRARY][K_BINARY][sourcePath:/opt/public/common/jdk1.8.0_131.x64/src.zip][isExported:false][attributes:javadoc_location=https://docs.oracle.com/javase/8/docs/api/], /opt/public/common/jdk1.8.0_131.x64/jre/lib/jsse.jar[CPE_LIBRARY][K_BINARY][sourcePath:/opt/public/common/jdk1.8.0_131.x64/src.zip][isExported:false][attributes:javadoc_location=https://docs.oracle.com/javase/8/docs/api/], /opt/public/common/jdk1.8.0_131.x64/jre/lib/jce.jar[CPE_LIBRARY][K_BINARY][sourcePath:/opt/public/common/jdk1.8.0_131.x64/src.zip][isExported:false][attributes:javadoc_location=https://docs.oracle.com/javase/8/docs/api/], /opt/public/common/jdk1.8.0_131.x64/jre/lib/charsets.jar[CPE_LIBRARY][K_BINARY][sourcePath:/opt/public/common/jdk1.8.0_131.x64/src.zip][isExported:false][attributes:javadoc_location=https://docs.oracle.com/javase/8/docs/api/], /opt/public/common/jdk1.8.0_131.x64/jre/lib/jfr.jar[CPE_LIBRARY][K_BINARY][sourcePath:/opt/public/common/jdk1.8.0_131.x64/src.zip][isExported:false][attributes:javadoc_location=https://docs.oracle.com/javase/8/docs/api/], /opt/public/common/jdk1.8.0_131.x64/jre/lib/ext/dnsns.jar[CPE_LIBRARY][K_BINARY][isExported:false], /opt/public/common/jdk1.8.0_131.x64/jre/lib/ext/sunpkcs11.jar[CPE_LIBRARY][K_BINARY][isExported:false], /opt/public/common/jdk1.8.0_131.x64/jre/lib/ext/nashorn.jar[CPE_LIBRARY][K_BINARY][isExported:false], /opt/public/common/jdk1.8.0_131.x64/jre/lib/ext/cldrdata.jar[CPE_LIBRARY][K_BINARY][isExported:false], /opt/public/common/jdk1.8.0_131.x64/jre/lib/ext/zipfs.jar[CPE_LIBRARY][K_BINARY][isExported:false], /opt/public/common/jdk1.8.0_131.x64/jre/lib/ext/sunec.jar[CPE_LIBRARY][K_BINARY][isExported:false], /opt/public/common/jdk1.8.0_131.x64/jre/lib/ext/jaccess.jar[CPE_LIBRARY][K_BINARY][isExported:false], /opt/public/common/jdk1.8.0_131.x64/jre/lib/ext/sunjce_provider.jar[CPE_LIBRARY][K_BINARY][isExported:false], /opt/public/common/jdk1.8.0_131.x64/jre/lib/ext/localedata.jar[CPE_LIBRARY][K_BINARY][isExported:false], /opt/public/common/jdk1.8.0_131.x64/jre/lib/ext/jfxrt.jar[CPE_LIBRARY][K_BINARY][sourcePath:/opt/public/common/jdk1.8.0_131.x64/javafx-src.zip][isExported:false][attributes:javadoc_location=http://docs.oracle.com/javase/8/javafx/api/]]
internalGetProjectPath: attributes on org.eclipse.jdt.junit.JUNIT_CONTAINER/4 are 
internalGetProjectPath: Couldn't find it on first look, so looking here: [/jobs/genie.ajdt/ajdt-on-eclipse-47/workspace/org.eclipse.ajdt.ui.tests/target/work/configuration/org.eclipse.osgi/43/0/.cp/junit.jar[CPE_LIBRARY][K_BINARY][isExported:false][attributes:javadoc_location=http://junit.org/junit4/javadoc/latest/], /jobs/genie.ajdt/ajdt-on-eclipse-47/workspace/org.eclipse.ajdt.ui.tests/target/work/configuration/org.eclipse.osgi/222/0/.cp/[CPE_LIBRARY][K_BINARY][isExported:false][attributes:javadoc_location=http://hamcrest.org/JavaHamcrest/javadoc/1.3/]]
Timer event: 0ms: Flush included source file cache
Timer event: 0ms: Check delta
CoreCompilerConfiguration for project DefaultEmptyProject registered a configuration change: [ASPECTPATH_CHANGED, CLASSPATH_CHANGED, INPATH_CHANGED, OUTPUTDESTINATIONS_CHANGED]
Timer event: 0ms: Looking for and marking configuration changes in DefaultEmptyProject
	Configuration changes found: true
Timer event: 0ms: Look for source/resource changes
internalGetProjectPath: iterating over classpath entries, size #4
internalGetProjectPath: attributes on /DefaultEmptyProject/src are 
internalGetProjectPath: attributes on org.eclipse.ajdt.core.ASPECTJRT_CONTAINER are 
internalGetProjectPath: Couldn't find it on first look, so looking here: [/jobs/genie.ajdt/ajdt-on-eclipse-47/workspace/org.aspectj.runtime/target/org.aspectj.runtime-1.8.10-SNAPSHOT.jar[CPE_LIBRARY][K_BINARY][sourcePath:/jobs/genie.ajdt/ajdt-on-eclipse-47/workspace/org.aspectj.runtime/target/org.aspectj.runtime.source-1.8.10-SNAPSHOT.jar][isExported:false]]
internalGetProjectPath: attributes on org.eclipse.jdt.launching.JRE_CONTAINER are 
internalGetProjectPath: Couldn't find it on first look, so looking here: [/opt/public/common/jdk1.8.0_131.x64/jre/lib/resources.jar[CPE_LIBRARY][K_BINARY][sourcePath:/opt/public/common/jdk1.8.0_131.x64/src.zip][isExported:false][attributes:javadoc_location=https://docs.oracle.com/javase/8/docs/api/], /opt/public/common/jdk1.8.0_131.x64/jre/lib/rt.jar[CPE_LIBRARY][K_BINARY][sourcePath:/opt/public/common/jdk1.8.0_131.x64/src.zip][isExported:false][attributes:javadoc_location=https://docs.oracle.com/javase/8/docs/api/], /opt/public/common/jdk1.8.0_131.x64/jre/lib/jsse.jar[CPE_LIBRARY][K_BINARY][sourcePath:/opt/public/common/jdk1.8.0_131.x64/src.zip][isExported:false][attributes:javadoc_location=https://docs.oracle.com/javase/8/docs/api/], /opt/public/common/jdk1.8.0_131.x64/jre/lib/jce.jar[CPE_LIBRARY][K_BINARY][sourcePath:/opt/public/common/jdk1.8.0_131.x64/src.zip][isExported:false][attributes:javadoc_location=https://docs.oracle.com/javase/8/docs/api/], /opt/public/common/jdk1.8.0_131.x64/jre/lib/charsets.jar[CPE_LIBRARY][K_BINARY][sourcePath:/opt/public/common/jdk1.8.0_131.x64/src.zip][isExported:false][attributes:javadoc_location=https://docs.oracle.com/javase/8/docs/api/], /opt/public/common/jdk1.8.0_131.x64/jre/lib/jfr.jar[CPE_LIBRARY][K_BINARY][sourcePath:/opt/public/common/jdk1.8.0_131.x64/src.zip][isExported:false][attributes:javadoc_location=https://docs.oracle.com/javase/8/docs/api/], /opt/public/common/jdk1.8.0_131.x64/jre/lib/ext/dnsns.jar[CPE_LIBRARY][K_BINARY][isExported:false], /opt/public/common/jdk1.8.0_131.x64/jre/lib/ext/sunpkcs11.jar[CPE_LIBRARY][K_BINARY][isExported:false], /opt/public/common/jdk1.8.0_131.x64/jre/lib/ext/nashorn.jar[CPE_LIBRARY][K_BINARY][isExported:false], /opt/public/common/jdk1.8.0_131.x64/jre/lib/ext/cldrdata.jar[CPE_LIBRARY][K_BINARY][isExported:false], /opt/public/common/jdk1.8.0_131.x64/jre/lib/ext/zipfs.jar[CPE_LIBRARY][K_BINARY][isExported:false], /opt/public/common/jdk1.8.0_131.x64/jre/lib/ext/sunec.jar[CPE_LIBRARY][K_BINARY][isExported:false], /opt/public/common/jdk1.8.0_131.x64/jre/lib/ext/jaccess.jar[CPE_LIBRARY][K_BINARY][isExported:false], /opt/public/common/jdk1.8.0_131.x64/jre/lib/ext/sunjce_provider.jar[CPE_LIBRARY][K_BINARY][isExported:false], /opt/public/common/jdk1.8.0_131.x64/jre/lib/ext/localedata.jar[CPE_LIBRARY][K_BINARY][isExported:false], /opt/public/common/jdk1.8.0_131.x64/jre/lib/ext/jfxrt.jar[CPE_LIBRARY][K_BINARY][sourcePath:/opt/public/common/jdk1.8.0_131.x64/javafx-src.zip][isExported:false][attributes:javadoc_location=http://docs.oracle.com/javase/8/javafx/api/]]
internalGetProjectPath: attributes on org.eclipse.jdt.junit.JUNIT_CONTAINER/4 are 
internalGetProjectPath: Couldn't find it on first look, so looking here: [/jobs/genie.ajdt/ajdt-on-eclipse-47/workspace/org.eclipse.ajdt.ui.tests/target/work/configuration/org.eclipse.osgi/43/0/.cp/junit.jar[CPE_LIBRARY][K_BINARY][isExported:false][attributes:javadoc_location=http://junit.org/junit4/javadoc/latest/], /jobs/genie.ajdt/ajdt-on-eclipse-47/workspace/org.eclipse.ajdt.ui.tests/target/work/configuration/org.eclipse.osgi/222/0/.cp/[CPE_LIBRARY][K_BINARY][isExported:false][attributes:javadoc_location=http://hamcrest.org/JavaHamcrest/javadoc/1.3/]]
Setting list of classpath elements with modified contents:
      []
Classpath = /jobs/genie.ajdt/ajdt-on-eclipse-47/workspace/org.eclipse.ajdt.ui.tests/target/work/data/DefaultEmptyProject/bin:/jobs/genie.ajdt/ajdt-on-eclipse-47/workspace/org.aspectj.runtime/target/org.aspectj.runtime-1.8.10-SNAPSHOT.jar:/opt/public/common/jdk1.8.0_131.x64/jre/lib/resources.jar:/opt/public/common/jdk1.8.0_131.x64/jre/lib/rt.jar:/opt/public/common/jdk1.8.0_131.x64/jre/lib/jsse.jar:/opt/public/common/jdk1.8.0_131.x64/jre/lib/jce.jar:/opt/public/common/jdk1.8.0_131.x64/jre/lib/charsets.jar:/opt/public/common/jdk1.8.0_131.x64/jre/lib/jfr.jar:/opt/public/common/jdk1.8.0_131.x64/jre/lib/ext/dnsns.jar:/opt/public/common/jdk1.8.0_131.x64/jre/lib/ext/sunpkcs11.jar:/opt/public/common/jdk1.8.0_131.x64/jre/lib/ext/nashorn.jar:/opt/public/common/jdk1.8.0_131.x64/jre/lib/ext/cldrdata.jar:/opt/public/common/jdk1.8.0_131.x64/jre/lib/ext/zipfs.jar:/opt/public/common/jdk1.8.0_131.x64/jre/lib/ext/sunec.jar:/opt/public/common/jdk1.8.0_131.x64/jre/lib/ext/jaccess.jar:/opt/public/common/jdk1.8.0_131.x64/jre/lib/ext/sunjce_provider.jar:/opt/public/common/jdk1.8.0_131.x64/jre/lib/ext/localedata.jar:/opt/public/common/jdk1.8.0_131.x64/jre/lib/ext/jfxrt.jar:/jobs/genie.ajdt/ajdt-on-eclipse-47/workspace/org.eclipse.ajdt.ui.tests/target/work/configuration/org.eclipse.osgi/43/0/.cp/junit.jar:/jobs/genie.ajdt/ajdt-on-eclipse-47/workspace/org.eclipse.ajdt.ui.tests/target/work/configuration/org.eclipse.osgi/222/0/.cp:
Timer event: 5ms: Pre compile
Sending the following configuration changes to the compiler: [ASPECTPATH_CHANGED, CLASSPATH_CHANGED, INPATH_CHANGED, OUTPUTDESTINATIONS_CHANGED]
internalGetProjectPath: iterating over classpath entries, size #4
internalGetProjectPath: attributes on /DefaultEmptyProject/src are 
internalGetProjectPath: attributes on org.eclipse.ajdt.core.ASPECTJRT_CONTAINER are 
internalGetProjectPath: Couldn't find it on first look, so looking here: [/jobs/genie.ajdt/ajdt-on-eclipse-47/workspace/org.aspectj.runtime/target/org.aspectj.runtime-1.8.10-SNAPSHOT.jar[CPE_LIBRARY][K_BINARY][sourcePath:/jobs/genie.ajdt/ajdt-on-eclipse-47/workspace/org.aspectj.runtime/target/org.aspectj.runtime.source-1.8.10-SNAPSHOT.jar][isExported:false]]
internalGetProjectPath: attributes on org.eclipse.jdt.launching.JRE_CONTAINER are 
internalGetProjectPath: Couldn't find it on first look, so looking here: [/opt/public/common/jdk1.8.0_131.x64/jre/lib/resources.jar[CPE_LIBRARY][K_BINARY][sourcePath:/opt/public/common/jdk1.8.0_131.x64/src.zip][isExported:false][attributes:javadoc_location=https://docs.oracle.com/javase/8/docs/api/], /opt/public/common/jdk1.8.0_131.x64/jre/lib/rt.jar[CPE_LIBRARY][K_BINARY][sourcePath:/opt/public/common/jdk1.8.0_131.x64/src.zip][isExported:false][attributes:javadoc_location=https://docs.oracle.com/javase/8/docs/api/], /opt/public/common/jdk1.8.0_131.x64/jre/lib/jsse.jar[CPE_LIBRARY][K_BINARY][sourcePath:/opt/public/common/jdk1.8.0_131.x64/src.zip][isExported:false][attributes:javadoc_location=https://docs.oracle.com/javase/8/docs/api/], /opt/public/common/jdk1.8.0_131.x64/jre/lib/jce.jar[CPE_LIBRARY][K_BINARY][sourcePath:/opt/public/common/jdk1.8.0_131.x64/src.zip][isExported:false][attributes:javadoc_location=https://docs.oracle.com/javase/8/docs/api/], /opt/public/common/jdk1.8.0_131.x64/jre/lib/charsets.jar[CPE_LIBRARY][K_BINARY][sourcePath:/opt/public/common/jdk1.8.0_131.x64/src.zip][isExported:false][attributes:javadoc_location=https://docs.oracle.com/javase/8/docs/api/], /opt/public/common/jdk1.8.0_131.x64/jre/lib/jfr.jar[CPE_LIBRARY][K_BINARY][sourcePath:/opt/public/common/jdk1.8.0_131.x64/src.zip][isExported:false][attributes:javadoc_location=https://docs.oracle.com/javase/8/docs/api/], /opt/public/common/jdk1.8.0_131.x64/jre/lib/ext/dnsns.jar[CPE_LIBRARY][K_BINARY][isExported:false], /opt/public/common/jdk1.8.0_131.x64/jre/lib/ext/sunpkcs11.jar[CPE_LIBRARY][K_BINARY][isExported:false], /opt/public/common/jdk1.8.0_131.x64/jre/lib/ext/nashorn.jar[CPE_LIBRARY][K_BINARY][isExported:false], /opt/public/common/jdk1.8.0_131.x64/jre/lib/ext/cldrdata.jar[CPE_LIBRARY][K_BINARY][isExported:false], /opt/public/common/jdk1.8.0_131.x64/jre/lib/ext/zipfs.jar[CPE_LIBRARY][K_BINARY][isExported:false], /opt/public/common/jdk1.8.0_131.x64/jre/lib/ext/sunec.jar[CPE_LIBRARY][K_BINARY][isExported:false], /opt/public/common/jdk1.8.0_131.x64/jre/lib/ext/jaccess.jar[CPE_LIBRARY][K_BINARY][isExported:false], /opt/public/common/jdk1.8.0_131.x64/jre/lib/ext/sunjce_provider.jar[CPE_LIBRARY][K_BINARY][isExported:false], /opt/public/common/jdk1.8.0_131.x64/jre/lib/ext/localedata.jar[CPE_LIBRARY][K_BINARY][isExported:false], /opt/public/common/jdk1.8.0_131.x64/jre/lib/ext/jfxrt.jar[CPE_LIBRARY][K_BINARY][sourcePath:/opt/public/common/jdk1.8.0_131.x64/javafx-src.zip][isExported:false][attributes:javadoc_location=http://docs.oracle.com/javase/8/javafx/api/]]
internalGetProjectPath: attributes on org.eclipse.jdt.junit.JUNIT_CONTAINER/4 are 
internalGetProjectPath: Couldn't find it on first look, so looking here: [/jobs/genie.ajdt/ajdt-on-eclipse-47/workspace/org.eclipse.ajdt.ui.tests/target/work/configuration/org.eclipse.osgi/43/0/.cp/junit.jar[CPE_LIBRARY][K_BINARY][isExported:false][attributes:javadoc_location=http://junit.org/junit4/javadoc/latest/], /jobs/genie.ajdt/ajdt-on-eclipse-47/workspace/org.eclipse.ajdt.ui.tests/target/work/configuration/org.eclipse.osgi/222/0/.cp/[CPE_LIBRARY][K_BINARY][isExported:false][attributes:javadoc_location=http://hamcrest.org/JavaHamcrest/javadoc/1.3/]]
internalGetProjectPath: iterating over classpath entries, size #4
internalGetProjectPath: attributes on /DefaultEmptyProject/src are 
internalGetProjectPath: attributes on org.eclipse.ajdt.core.ASPECTJRT_CONTAINER are 
internalGetProjectPath: Couldn't find it on first look, so looking here: [/jobs/genie.ajdt/ajdt-on-eclipse-47/workspace/org.aspectj.runtime/target/org.aspectj.runtime-1.8.10-SNAPSHOT.jar[CPE_LIBRARY][K_BINARY][sourcePath:/jobs/genie.ajdt/ajdt-on-eclipse-47/workspace/org.aspectj.runtime/target/org.aspectj.runtime.source-1.8.10-SNAPSHOT.jar][isExported:false]]
internalGetProjectPath: attributes on org.eclipse.jdt.launching.JRE_CONTAINER are 
internalGetProjectPath: Couldn't find it on first look, so looking here: [/opt/public/common/jdk1.8.0_131.x64/jre/lib/resources.jar[CPE_LIBRARY][K_BINARY][sourcePath:/opt/public/common/jdk1.8.0_131.x64/src.zip][isExported:false][attributes:javadoc_location=https://docs.oracle.com/javase/8/docs/api/], /opt/public/common/jdk1.8.0_131.x64/jre/lib/rt.jar[CPE_LIBRARY][K_BINARY][sourcePath:/opt/public/common/jdk1.8.0_131.x64/src.zip][isExported:false][attributes:javadoc_location=https://docs.oracle.com/javase/8/docs/api/], /opt/public/common/jdk1.8.0_131.x64/jre/lib/jsse.jar[CPE_LIBRARY][K_BINARY][sourcePath:/opt/public/common/jdk1.8.0_131.x64/src.zip][isExported:false][attributes:javadoc_location=https://docs.oracle.com/javase/8/docs/api/], /opt/public/common/jdk1.8.0_131.x64/jre/lib/jce.jar[CPE_LIBRARY][K_BINARY][sourcePath:/opt/public/common/jdk1.8.0_131.x64/src.zip][isExported:false][attributes:javadoc_location=https://docs.oracle.com/javase/8/docs/api/], /opt/public/common/jdk1.8.0_131.x64/jre/lib/charsets.jar[CPE_LIBRARY][K_BINARY][sourcePath:/opt/public/common/jdk1.8.0_131.x64/src.zip][isExported:false][attributes:javadoc_location=https://docs.oracle.com/javase/8/docs/api/], /opt/public/common/jdk1.8.0_131.x64/jre/lib/jfr.jar[CPE_LIBRARY][K_BINARY][sourcePath:/opt/public/common/jdk1.8.0_131.x64/src.zip][isExported:false][attributes:javadoc_location=https://docs.oracle.com/javase/8/docs/api/], /opt/public/common/jdk1.8.0_131.x64/jre/lib/ext/dnsns.jar[CPE_LIBRARY][K_BINARY][isExported:false], /opt/public/common/jdk1.8.0_131.x64/jre/lib/ext/sunpkcs11.jar[CPE_LIBRARY][K_BINARY][isExported:false], /opt/public/common/jdk1.8.0_131.x64/jre/lib/ext/nashorn.jar[CPE_LIBRARY][K_BINARY][isExported:false], /opt/public/common/jdk1.8.0_131.x64/jre/lib/ext/cldrdata.jar[CPE_LIBRARY][K_BINARY][isExported:false], /opt/public/common/jdk1.8.0_131.x64/jre/lib/ext/zipfs.jar[CPE_LIBRARY][K_BINARY][isExported:false], /opt/public/common/jdk1.8.0_131.x64/jre/lib/ext/sunec.jar[CPE_LIBRARY][K_BINARY][isExported:false], /opt/public/common/jdk1.8.0_131.x64/jre/lib/ext/jaccess.jar[CPE_LIBRARY][K_BINARY][isExported:false], /opt/public/common/jdk1.8.0_131.x64/jre/lib/ext/sunjce_provider.jar[CPE_LIBRARY][K_BINARY][isExported:false], /opt/public/common/jdk1.8.0_131.x64/jre/lib/ext/localedata.jar[CPE_LIBRARY][K_BINARY][isExported:false], /opt/public/common/jdk1.8.0_131.x64/jre/lib/ext/jfxrt.jar[CPE_LIBRARY][K_BINARY][sourcePath:/opt/public/common/jdk1.8.0_131.x64/javafx-src.zip][isExported:false][attributes:javadoc_location=http://docs.oracle.com/javase/8/javafx/api/]]
internalGetProjectPath: attributes on org.eclipse.jdt.junit.JUNIT_CONTAINER/4 are 
internalGetProjectPath: Couldn't find it on first look, so looking here: [/jobs/genie.ajdt/ajdt-on-eclipse-47/workspace/org.eclipse.ajdt.ui.tests/target/work/configuration/org.eclipse.osgi/43/0/.cp/junit.jar[CPE_LIBRARY][K_BINARY][isExported:false][attributes:javadoc_location=http://junit.org/junit4/javadoc/latest/], /jobs/genie.ajdt/ajdt-on-eclipse-47/workspace/org.eclipse.ajdt.ui.tests/target/work/configuration/org.eclipse.osgi/222/0/.cp/[CPE_LIBRARY][K_BINARY][isExported:false][attributes:javadoc_location=http://hamcrest.org/JavaHamcrest/javadoc/1.3/]]
Compiler configuration for project DefaultEmptyProject has been read by compiler.  Resetting.
     Configuration was [ASPECTPATH_CHANGED, CLASSPATH_CHANGED, INPATH_CHANGED, OUTPUTDESTINATIONS_CHANGED]
Resetting list of modified source files.  Was []
ClassFileChangeChecking: failed to find a state instance managing output location : /jobs/genie.ajdt/ajdt-on-eclipse-47/workspace/org.eclipse.ajdt.ui.tests/target/work/configuration/org.eclipse.osgi/222/0/.cp (could be getting managed by JDT)
Timer event: 0ms: OutputLocationManager: binary folder to declaring project map creation: P/DefaultEmptyProject
Preparing for build: planning to be an incremental build
AspectJ reports build successful, build was: INCREMENTAL
AJDE Callback: finish. Was full build: false
Timer event: 5ms: Total time spent in AJDE
Timer event: 0ms: Refresh after build
Crosscutting model sanity checked with no problems
Timer event: 0ms: Model sanity check for: DefaultEmptyProject
Timer event: 11ms: Total time spent in AJBuilder.build()
Compiler configuration for project PathTesting-HasAspectPath doesn't know previous state, so assuming EVERYTHING has changed.
===========================================================================================
Build kind = FULLBUILD
Project=PathTesting-HasAspectPath, kind of build requested=Full AspectJ compilation
internalGetProjectPath: iterating over classpath entries, size #7
internalGetProjectPath: attributes on /PathTesting-HasAspectPath/src are 
internalGetProjectPath: attributes on org.eclipse.jdt.launching.JRE_CONTAINER are 
internalGetProjectPath: Couldn't find it on first look, so looking here: [/opt/public/common/jdk1.8.0_131.x64/jre/lib/resources.jar[CPE_LIBRARY][K_BINARY][sourcePath:/opt/public/common/jdk1.8.0_131.x64/src.zip][isExported:false][attributes:javadoc_location=https://docs.oracle.com/javase/8/docs/api/], /opt/public/common/jdk1.8.0_131.x64/jre/lib/rt.jar[CPE_LIBRARY][K_BINARY][sourcePath:/opt/public/common/jdk1.8.0_131.x64/src.zip][isExported:false][attributes:javadoc_location=https://docs.oracle.com/javase/8/docs/api/], /opt/public/common/jdk1.8.0_131.x64/jre/lib/jsse.jar[CPE_LIBRARY][K_BINARY][sourcePath:/opt/public/common/jdk1.8.0_131.x64/src.zip][isExported:false][attributes:javadoc_location=https://docs.oracle.com/javase/8/docs/api/], /opt/public/common/jdk1.8.0_131.x64/jre/lib/jce.jar[CPE_LIBRARY][K_BINARY][sourcePath:/opt/public/common/jdk1.8.0_131.x64/src.zip][isExported:false][attributes:javadoc_location=https://docs.oracle.com/javase/8/docs/api/], /opt/public/common/jdk1.8.0_131.x64/jre/lib/charsets.jar[CPE_LIBRARY][K_BINARY][sourcePath:/opt/public/common/jdk1.8.0_131.x64/src.zip][isExported:false][attributes:javadoc_location=https://docs.oracle.com/javase/8/docs/api/], /opt/public/common/jdk1.8.0_131.x64/jre/lib/jfr.jar[CPE_LIBRARY][K_BINARY][sourcePath:/opt/public/common/jdk1.8.0_131.x64/src.zip][isExported:false][attributes:javadoc_location=https://docs.oracle.com/javase/8/docs/api/], /opt/public/common/jdk1.8.0_131.x64/jre/lib/ext/dnsns.jar[CPE_LIBRARY][K_BINARY][isExported:false], /opt/public/common/jdk1.8.0_131.x64/jre/lib/ext/sunpkcs11.jar[CPE_LIBRARY][K_BINARY][isExported:false], /opt/public/common/jdk1.8.0_131.x64/jre/lib/ext/nashorn.jar[CPE_LIBRARY][K_BINARY][isExported:false], /opt/public/common/jdk1.8.0_131.x64/jre/lib/ext/cldrdata.jar[CPE_LIBRARY][K_BINARY][isExported:false], /opt/public/common/jdk1.8.0_131.x64/jre/lib/ext/zipfs.jar[CPE_LIBRARY][K_BINARY][isExported:false], /opt/public/common/jdk1.8.0_131.x64/jre/lib/ext/sunec.jar[CPE_LIBRARY][K_BINARY][isExported:false], /opt/public/common/jdk1.8.0_131.x64/jre/lib/ext/jaccess.jar[CPE_LIBRARY][K_BINARY][isExported:false], /opt/public/common/jdk1.8.0_131.x64/jre/lib/ext/sunjce_provider.jar[CPE_LIBRARY][K_BINARY][isExported:false], /opt/public/common/jdk1.8.0_131.x64/jre/lib/ext/localedata.jar[CPE_LIBRARY][K_BINARY][isExported:false], /opt/public/common/jdk1.8.0_131.x64/jre/lib/ext/jfxrt.jar[CPE_LIBRARY][K_BINARY][sourcePath:/opt/public/common/jdk1.8.0_131.x64/javafx-src.zip][isExported:false][attributes:javadoc_location=http://docs.oracle.com/javase/8/javafx/api/]]
internalGetProjectPath: attributes on org.eclipse.ajdt.core.ASPECTJRT_CONTAINER are 
internalGetProjectPath: Couldn't find it on first look, so looking here: [/jobs/genie.ajdt/ajdt-on-eclipse-47/workspace/org.aspectj.runtime/target/org.aspectj.runtime-1.8.10-SNAPSHOT.jar[CPE_LIBRARY][K_BINARY][sourcePath:/jobs/genie.ajdt/ajdt-on-eclipse-47/workspace/org.aspectj.runtime/target/org.aspectj.runtime.source-1.8.10-SNAPSHOT.jar][isExported:false]]
internalGetProjectPath: attributes on Aspect_Path_Var are org.eclipse.ajdt.aspectpath=true
internalGetProjectPath: attributes on org.eclipse.jdt.USER_LIBRARY/Aspect_Path_Lib are org.eclipse.ajdt.aspectpath=true
internalGetProjectPath: Couldn't find it on first look, so looking here: []
internalGetProjectPath: attributes on /PathTesting-ProjectOnAspectPath are org.eclipse.ajdt.aspectpath=true
internalGetProjectPath: attributes on /PathTesting-JarOnAspectPath/j.jar are org.eclipse.ajdt.aspectpath=true
internalGetProjectPath: iterating over classpath entries, size #7
internalGetProjectPath: attributes on /PathTesting-HasAspectPath/src are 
internalGetProjectPath: attributes on org.eclipse.jdt.launching.JRE_CONTAINER are 
internalGetProjectPath: Couldn't find it on first look, so looking here: [/opt/public/common/jdk1.8.0_131.x64/jre/lib/resources.jar[CPE_LIBRARY][K_BINARY][sourcePath:/opt/public/common/jdk1.8.0_131.x64/src.zip][isExported:false][attributes:javadoc_location=https://docs.oracle.com/javase/8/docs/api/], /opt/public/common/jdk1.8.0_131.x64/jre/lib/rt.jar[CPE_LIBRARY][K_BINARY][sourcePath:/opt/public/common/jdk1.8.0_131.x64/src.zip][isExported:false][attributes:javadoc_location=https://docs.oracle.com/javase/8/docs/api/], /opt/public/common/jdk1.8.0_131.x64/jre/lib/jsse.jar[CPE_LIBRARY][K_BINARY][sourcePath:/opt/public/common/jdk1.8.0_131.x64/src.zip][isExported:false][attributes:javadoc_location=https://docs.oracle.com/javase/8/docs/api/], /opt/public/common/jdk1.8.0_131.x64/jre/lib/jce.jar[CPE_LIBRARY][K_BINARY][sourcePath:/opt/public/common/jdk1.8.0_131.x64/src.zip][isExported:false][attributes:javadoc_location=https://docs.oracle.com/javase/8/docs/api/], /opt/public/common/jdk1.8.0_131.x64/jre/lib/charsets.jar[CPE_LIBRARY][K_BINARY][sourcePath:/opt/public/common/jdk1.8.0_131.x64/src.zip][isExported:false][attributes:javadoc_location=https://docs.oracle.com/javase/8/docs/api/], /opt/public/common/jdk1.8.0_131.x64/jre/lib/jfr.jar[CPE_LIBRARY][K_BINARY][sourcePath:/opt/public/common/jdk1.8.0_131.x64/src.zip][isExported:false][attributes:javadoc_location=https://docs.oracle.com/javase/8/docs/api/], /opt/public/common/jdk1.8.0_131.x64/jre/lib/ext/dnsns.jar[CPE_LIBRARY][K_BINARY][isExported:false], /opt/public/common/jdk1.8.0_131.x64/jre/lib/ext/sunpkcs11.jar[CPE_LIBRARY][K_BINARY][isExported:false], /opt/public/common/jdk1.8.0_131.x64/jre/lib/ext/nashorn.jar[CPE_LIBRARY][K_BINARY][isExported:false], /opt/public/common/jdk1.8.0_131.x64/jre/lib/ext/cldrdata.jar[CPE_LIBRARY][K_BINARY][isExported:false], /opt/public/common/jdk1.8.0_131.x64/jre/lib/ext/zipfs.jar[CPE_LIBRARY][K_BINARY][isExported:false], /opt/public/common/jdk1.8.0_131.x64/jre/lib/ext/sunec.jar[CPE_LIBRARY][K_BINARY][isExported:false], /opt/public/common/jdk1.8.0_131.x64/jre/lib/ext/jaccess.jar[CPE_LIBRARY][K_BINARY][isExported:false], /opt/public/common/jdk1.8.0_131.x64/jre/lib/ext/sunjce_provider.jar[CPE_LIBRARY][K_BINARY][isExported:false], /opt/public/common/jdk1.8.0_131.x64/jre/lib/ext/localedata.jar[CPE_LIBRARY][K_BINARY][isExported:false], /opt/public/common/jdk1.8.0_131.x64/jre/lib/ext/jfxrt.jar[CPE_LIBRARY][K_BINARY][sourcePath:/opt/public/common/jdk1.8.0_131.x64/javafx-src.zip][isExported:false][attributes:javadoc_location=http://docs.oracle.com/javase/8/javafx/api/]]
internalGetProjectPath: attributes on org.eclipse.ajdt.core.ASPECTJRT_CONTAINER are 
internalGetProjectPath: Couldn't find it on first look, so looking here: [/jobs/genie.ajdt/ajdt-on-eclipse-47/workspace/org.aspectj.runtime/target/org.aspectj.runtime-1.8.10-SNAPSHOT.jar[CPE_LIBRARY][K_BINARY][sourcePath:/jobs/genie.ajdt/ajdt-on-eclipse-47/workspace/org.aspectj.runtime/target/org.aspectj.runtime.source-1.8.10-SNAPSHOT.jar][isExported:false]]
internalGetProjectPath: attributes on Aspect_Path_Var are org.eclipse.ajdt.aspectpath=true
internalGetProjectPath: attributes on org.eclipse.jdt.USER_LIBRARY/Aspect_Path_Lib are org.eclipse.ajdt.aspectpath=true
internalGetProjectPath: attributes on /PathTesting-ProjectOnAspectPath are org.eclipse.ajdt.aspectpath=true
internalGetProjectPath: attributes on /PathTesting-JarOnAspectPath/j.jar are org.eclipse.ajdt.aspectpath=true
build: Abort due to missing inpath/aspectpath/classpath entries
Timer event: 1ms: Total time spent in AJBuilder.build()
Removed problems and tasks for project PathTesting-HasAspectPath
Bug 288395---logging build path problems, found 4
  /PathTesting-HasAspectPath : Archive for required library: '/jobs/genie.ajdt/ajdt-on-eclipse-47/workspace/org.eclipse.ajdt.ui.tests/target/work/data/PathTesting-VariableOnAspectPath/variable.jar' in project 'PathTesting-HasAspectPath' cannot be read or is not a valid ZIP file
  /PathTesting-HasAspectPath : Archive for required library: '/PathTesting-JarOnAspectPath/j.jar' in project 'PathTesting-HasAspectPath' cannot be read or is not a valid ZIP file
  /PathTesting-HasInpath : Archive for required library: '/jobs/genie.ajdt/ajdt-on-eclipse-47/workspace/org.eclipse.ajdt.ui.tests/target/work/data/PathTesting-VariableOnAspectPath/variable.jar' in project 'PathTesting-HasInpath' cannot be read or is not a valid ZIP file
  /PathTesting-HasInpath : Archive for required library: '/PathTesting-JarOnAspectPath/j.jar' in project 'PathTesting-HasInpath' cannot be read or is not a valid ZIP file
Bug 288395---logging build path problems, found 6
  /PathTesting-ContainerOnAspectPath/src/aspectPath/ContainerAspect.aj : no match for this type name: main.Main [Xlint:invalidAbsoluteTypeName]
  /PathTesting-ContainerOnAspectPath/src/aspectPath/ContainerAspect.aj : advice defined in aspectPath.ContainerAspect has not been applied [Xlint:adviceDidNotMatch]
  /PathTesting-HasAspectPath : The project was not built since it depends on PathTesting-HasAspectPath, which has build path errors
  /PathTesting-JarOnAspectPath/src/aspectPath/JarAspect.java : advice defined in aspectPath.JarAspect has not been applied [Xlint:adviceDidNotMatch]
  /PathTesting-ProjectOnAspectPath/src/aspectPath/ProjectAspect.java : advice defined in aspectPath.ProjectAspect has not been applied [Xlint:adviceDidNotMatch]
  /PathTesting-VariableOnAspectPath/src/aspectPath/VariableAspect.java : advice defined in aspectPath.VariableAspect has not been applied [Xlint:adviceDidNotMatch]
build: Abort due to missing classpath/inpath/aspectpath entries
Compiler configuration for project PathTesting-HasInpath doesn't know previous state, so assuming EVERYTHING has changed.
===========================================================================================
Build kind = FULLBUILD
Project=PathTesting-HasInpath, kind of build requested=Full AspectJ compilation
internalGetProjectPath: iterating over classpath entries, size #7
internalGetProjectPath: attributes on /PathTesting-HasInpath/src are 
internalGetProjectPath: attributes on org.eclipse.jdt.launching.JRE_CONTAINER are 
internalGetProjectPath: Couldn't find it on first look, so looking here: [/opt/public/common/jdk1.8.0_131.x64/jre/lib/resources.jar[CPE_LIBRARY][K_BINARY][sourcePath:/opt/public/common/jdk1.8.0_131.x64/src.zip][isExported:false][attributes:javadoc_location=https://docs.oracle.com/javase/8/docs/api/], /opt/public/common/jdk1.8.0_131.x64/jre/lib/rt.jar[CPE_LIBRARY][K_BINARY][sourcePath:/opt/public/common/jdk1.8.0_131.x64/src.zip][isExported:false][attributes:javadoc_location=https://docs.oracle.com/javase/8/docs/api/], /opt/public/common/jdk1.8.0_131.x64/jre/lib/jsse.jar[CPE_LIBRARY][K_BINARY][sourcePath:/opt/public/common/jdk1.8.0_131.x64/src.zip][isExported:false][attributes:javadoc_location=https://docs.oracle.com/javase/8/docs/api/], /opt/public/common/jdk1.8.0_131.x64/jre/lib/jce.jar[CPE_LIBRARY][K_BINARY][sourcePath:/opt/public/common/jdk1.8.0_131.x64/src.zip][isExported:false][attributes:javadoc_location=https://docs.oracle.com/javase/8/docs/api/], /opt/public/common/jdk1.8.0_131.x64/jre/lib/charsets.jar[CPE_LIBRARY][K_BINARY][sourcePath:/opt/public/common/jdk1.8.0_131.x64/src.zip][isExported:false][attributes:javadoc_location=https://docs.oracle.com/javase/8/docs/api/], /opt/public/common/jdk1.8.0_131.x64/jre/lib/jfr.jar[CPE_LIBRARY][K_BINARY][sourcePath:/opt/public/common/jdk1.8.0_131.x64/src.zip][isExported:false][attributes:javadoc_location=https://docs.oracle.com/javase/8/docs/api/], /opt/public/common/jdk1.8.0_131.x64/jre/lib/ext/dnsns.jar[CPE_LIBRARY][K_BINARY][isExported:false], /opt/public/common/jdk1.8.0_131.x64/jre/lib/ext/sunpkcs11.jar[CPE_LIBRARY][K_BINARY][isExported:false], /opt/public/common/jdk1.8.0_131.x64/jre/lib/ext/nashorn.jar[CPE_LIBRARY][K_BINARY][isExported:false], /opt/public/common/jdk1.8.0_131.x64/jre/lib/ext/cldrdata.jar[CPE_LIBRARY][K_BINARY][isExported:false], /opt/public/common/jdk1.8.0_131.x64/jre/lib/ext/zipfs.jar[CPE_LIBRARY][K_BINARY][isExported:false], /opt/public/common/jdk1.8.0_131.x64/jre/lib/ext/sunec.jar[CPE_LIBRARY][K_BINARY][isExported:false], /opt/public/common/jdk1.8.0_131.x64/jre/lib/ext/jaccess.jar[CPE_LIBRARY][K_BINARY][isExported:false], /opt/public/common/jdk1.8.0_131.x64/jre/lib/ext/sunjce_provider.jar[CPE_LIBRARY][K_BINARY][isExported:false], /opt/public/common/jdk1.8.0_131.x64/jre/lib/ext/localedata.jar[CPE_LIBRARY][K_BINARY][isExported:false], /opt/public/common/jdk1.8.0_131.x64/jre/lib/ext/jfxrt.jar[CPE_LIBRARY][K_BINARY][sourcePath:/opt/public/common/jdk1.8.0_131.x64/javafx-src.zip][isExported:false][attributes:javadoc_location=http://docs.oracle.com/javase/8/javafx/api/]]
internalGetProjectPath: attributes on org.eclipse.ajdt.core.ASPECTJRT_CONTAINER are 
internalGetProjectPath: Couldn't find it on first look, so looking here: [/jobs/genie.ajdt/ajdt-on-eclipse-47/workspace/org.aspectj.runtime/target/org.aspectj.runtime-1.8.10-SNAPSHOT.jar[CPE_LIBRARY][K_BINARY][sourcePath:/jobs/genie.ajdt/ajdt-on-eclipse-47/workspace/org.aspectj.runtime/target/org.aspectj.runtime.source-1.8.10-SNAPSHOT.jar][isExported:false]]
internalGetProjectPath: attributes on Aspect_Path_Var are org.eclipse.ajdt.inpath=true
internalGetProjectPath: attributes on org.eclipse.jdt.USER_LIBRARY/Aspect_Path_Lib are org.eclipse.ajdt.inpath=true
internalGetProjectPath: attributes on /PathTesting-ProjectOnAspectPath are org.eclipse.ajdt.inpath=true
internalGetProjectPath: attributes on /PathTesting-JarOnAspectPath/j.jar are org.eclipse.ajdt.inpath=true
internalGetProjectPath: iterating over classpath entries, size #7
internalGetProjectPath: attributes on /PathTesting-HasInpath/src are 
internalGetProjectPath: attributes on org.eclipse.jdt.launching.JRE_CONTAINER are 
internalGetProjectPath: Couldn't find it on first look, so looking here: [/opt/public/common/jdk1.8.0_131.x64/jre/lib/resources.jar[CPE_LIBRARY][K_BINARY][sourcePath:/opt/public/common/jdk1.8.0_131.x64/src.zip][isExported:false][attributes:javadoc_location=https://docs.oracle.com/javase/8/docs/api/], /opt/public/common/jdk1.8.0_131.x64/jre/lib/rt.jar[CPE_LIBRARY][K_BINARY][sourcePath:/opt/public/common/jdk1.8.0_131.x64/src.zip][isExported:false][attributes:javadoc_location=https://docs.oracle.com/javase/8/docs/api/], /opt/public/common/jdk1.8.0_131.x64/jre/lib/jsse.jar[CPE_LIBRARY][K_BINARY][sourcePath:/opt/public/common/jdk1.8.0_131.x64/src.zip][isExported:false][attributes:javadoc_location=https://docs.oracle.com/javase/8/docs/api/], /opt/public/common/jdk1.8.0_131.x64/jre/lib/jce.jar[CPE_LIBRARY][K_BINARY][sourcePath:/opt/public/common/jdk1.8.0_131.x64/src.zip][isExported:false][attributes:javadoc_location=https://docs.oracle.com/javase/8/docs/api/], /opt/public/common/jdk1.8.0_131.x64/jre/lib/charsets.jar[CPE_LIBRARY][K_BINARY][sourcePath:/opt/public/common/jdk1.8.0_131.x64/src.zip][isExported:false][attributes:javadoc_location=https://docs.oracle.com/javase/8/docs/api/], /opt/public/common/jdk1.8.0_131.x64/jre/lib/jfr.jar[CPE_LIBRARY][K_BINARY][sourcePath:/opt/public/common/jdk1.8.0_131.x64/src.zip][isExported:false][attributes:javadoc_location=https://docs.oracle.com/javase/8/docs/api/], /opt/public/common/jdk1.8.0_131.x64/jre/lib/ext/dnsns.jar[CPE_LIBRARY][K_BINARY][isExported:false], /opt/public/common/jdk1.8.0_131.x64/jre/lib/ext/sunpkcs11.jar[CPE_LIBRARY][K_BINARY][isExported:false], /opt/public/common/jdk1.8.0_131.x64/jre/lib/ext/nashorn.jar[CPE_LIBRARY][K_BINARY][isExported:false], /opt/public/common/jdk1.8.0_131.x64/jre/lib/ext/cldrdata.jar[CPE_LIBRARY][K_BINARY][isExported:false], /opt/public/common/jdk1.8.0_131.x64/jre/lib/ext/zipfs.jar[CPE_LIBRARY][K_BINARY][isExported:false], /opt/public/common/jdk1.8.0_131.x64/jre/lib/ext/sunec.jar[CPE_LIBRARY][K_BINARY][isExported:false], /opt/public/common/jdk1.8.0_131.x64/jre/lib/ext/jaccess.jar[CPE_LIBRARY][K_BINARY][isExported:false], /opt/public/common/jdk1.8.0_131.x64/jre/lib/ext/sunjce_provider.jar[CPE_LIBRARY][K_BINARY][isExported:false], /opt/public/common/jdk1.8.0_131.x64/jre/lib/ext/localedata.jar[CPE_LIBRARY][K_BINARY][isExported:false], /opt/public/common/jdk1.8.0_131.x64/jre/lib/ext/jfxrt.jar[CPE_LIBRARY][K_BINARY][sourcePath:/opt/public/common/jdk1.8.0_131.x64/javafx-src.zip][isExported:false][attributes:javadoc_location=http://docs.oracle.com/javase/8/javafx/api/]]
internalGetProjectPath: attributes on org.eclipse.ajdt.core.ASPECTJRT_CONTAINER are 
internalGetProjectPath: Couldn't find it on first look, so looking here: [/jobs/genie.ajdt/ajdt-on-eclipse-47/workspace/org.aspectj.runtime/target/org.aspectj.runtime-1.8.10-SNAPSHOT.jar[CPE_LIBRARY][K_BINARY][sourcePath:/jobs/genie.ajdt/ajdt-on-eclipse-47/workspace/org.aspectj.runtime/target/org.aspectj.runtime.source-1.8.10-SNAPSHOT.jar][isExported:false]]
internalGetProjectPath: attributes on Aspect_Path_Var are org.eclipse.ajdt.inpath=true
internalGetProjectPath: attributes on org.eclipse.jdt.USER_LIBRARY/Aspect_Path_Lib are org.eclipse.ajdt.inpath=true
internalGetProjectPath: Couldn't find it on first look, so looking here: []
internalGetProjectPath: attributes on /PathTesting-ProjectOnAspectPath are org.eclipse.ajdt.inpath=true
internalGetProjectPath: attributes on /PathTesting-JarOnAspectPath/j.jar are org.eclipse.ajdt.inpath=true
build: Abort due to missing inpath/aspectpath/classpath entries
Timer event: 1ms: Total time spent in AJBuilder.build()
Removed problems and tasks for project PathTesting-HasInpath
Bug 288395---logging build path problems, found 4
  /PathTesting-HasAspectPath : Archive for required library: '/jobs/genie.ajdt/ajdt-on-eclipse-47/workspace/org.eclipse.ajdt.ui.tests/target/work/data/PathTesting-VariableOnAspectPath/variable.jar' in project 'PathTesting-HasAspectPath' cannot be read or is not a valid ZIP file
  /PathTesting-HasAspectPath : Archive for required library: '/PathTesting-JarOnAspectPath/j.jar' in project 'PathTesting-HasAspectPath' cannot be read or is not a valid ZIP file
  /PathTesting-HasInpath : Archive for required library: '/jobs/genie.ajdt/ajdt-on-eclipse-47/workspace/org.eclipse.ajdt.ui.tests/target/work/data/PathTesting-VariableOnAspectPath/variable.jar' in project 'PathTesting-HasInpath' cannot be read or is not a valid ZIP file
  /PathTesting-HasInpath : Archive for required library: '/PathTesting-JarOnAspectPath/j.jar' in project 'PathTesting-HasInpath' cannot be read or is not a valid ZIP file
Bug 288395---logging build path problems, found 7
  /PathTesting-ContainerOnAspectPath/src/aspectPath/ContainerAspect.aj : no match for this type name: main.Main [Xlint:invalidAbsoluteTypeName]
  /PathTesting-ContainerOnAspectPath/src/aspectPath/ContainerAspect.aj : advice defined in aspectPath.ContainerAspect has not been applied [Xlint:adviceDidNotMatch]
  /PathTesting-HasAspectPath : The project was not built since it depends on PathTesting-HasAspectPath, which has build path errors
  /PathTesting-HasInpath : The project was not built since it depends on PathTesting-HasInpath, which has build path errors
  /PathTesting-JarOnAspectPath/src/aspectPath/JarAspect.java : advice defined in aspectPath.JarAspect has not been applied [Xlint:adviceDidNotMatch]
  /PathTesting-ProjectOnAspectPath/src/aspectPath/ProjectAspect.java : advice defined in aspectPath.ProjectAspect has not been applied [Xlint:adviceDidNotMatch]
  /PathTesting-VariableOnAspectPath/src/aspectPath/VariableAspect.java : advice defined in aspectPath.VariableAspect has not been applied [Xlint:adviceDidNotMatch]
build: Abort due to missing classpath/inpath/aspectpath entries
>> finished a build
Timer event: 3ms: Update visualizer, xref, advice listeners for (separate thread): DefaultEmptyProject
>> scheduled a build
===========================================================================================
Build kind = AUTOBUILD
Project=PathTesting-HasAspectPath, kind of build requested=Incremental AspectJ compilation
internalGetProjectPath: iterating over classpath entries, size #7
internalGetProjectPath: attributes on /PathTesting-HasAspectPath/src are 
internalGetProjectPath: attributes on org.eclipse.jdt.launching.JRE_CONTAINER are 
internalGetProjectPath: Couldn't find it on first look, so looking here: [/opt/public/common/jdk1.8.0_131.x64/jre/lib/resources.jar[CPE_LIBRARY][K_BINARY][sourcePath:/opt/public/common/jdk1.8.0_131.x64/src.zip][isExported:false][attributes:javadoc_location=https://docs.oracle.com/javase/8/docs/api/], /opt/public/common/jdk1.8.0_131.x64/jre/lib/rt.jar[CPE_LIBRARY][K_BINARY][sourcePath:/opt/public/common/jdk1.8.0_131.x64/src.zip][isExported:false][attributes:javadoc_location=https://docs.oracle.com/javase/8/docs/api/], /opt/public/common/jdk1.8.0_131.x64/jre/lib/jsse.jar[CPE_LIBRARY][K_BINARY][sourcePath:/opt/public/common/jdk1.8.0_131.x64/src.zip][isExported:false][attributes:javadoc_location=https://docs.oracle.com/javase/8/docs/api/], /opt/public/common/jdk1.8.0_131.x64/jre/lib/jce.jar[CPE_LIBRARY][K_BINARY][sourcePath:/opt/public/common/jdk1.8.0_131.x64/src.zip][isExported:false][attributes:javadoc_location=https://docs.oracle.com/javase/8/docs/api/], /opt/public/common/jdk1.8.0_131.x64/jre/lib/charsets.jar[CPE_LIBRARY][K_BINARY][sourcePath:/opt/public/common/jdk1.8.0_131.x64/src.zip][isExported:false][attributes:javadoc_location=https://docs.oracle.com/javase/8/docs/api/], /opt/public/common/jdk1.8.0_131.x64/jre/lib/jfr.jar[CPE_LIBRARY][K_BINARY][sourcePath:/opt/public/common/jdk1.8.0_131.x64/src.zip][isExported:false][attributes:javadoc_location=https://docs.oracle.com/javase/8/docs/api/], /opt/public/common/jdk1.8.0_131.x64/jre/lib/ext/dnsns.jar[CPE_LIBRARY][K_BINARY][isExported:false], /opt/public/common/jdk1.8.0_131.x64/jre/lib/ext/sunpkcs11.jar[CPE_LIBRARY][K_BINARY][isExported:false], /opt/public/common/jdk1.8.0_131.x64/jre/lib/ext/nashorn.jar[CPE_LIBRARY][K_BINARY][isExported:false], /opt/public/common/jdk1.8.0_131.x64/jre/lib/ext/cldrdata.jar[CPE_LIBRARY][K_BINARY][isExported:false], /opt/public/common/jdk1.8.0_131.x64/jre/lib/ext/zipfs.jar[CPE_LIBRARY][K_BINARY][isExported:false], /opt/public/common/jdk1.8.0_131.x64/jre/lib/ext/sunec.jar[CPE_LIBRARY][K_BINARY][isExported:false], /opt/public/common/jdk1.8.0_131.x64/jre/lib/ext/jaccess.jar[CPE_LIBRARY][K_BINARY][isExported:false], /opt/public/common/jdk1.8.0_131.x64/jre/lib/ext/sunjce_provider.jar[CPE_LIBRARY][K_BINARY][isExported:false], /opt/public/common/jdk1.8.0_131.x64/jre/lib/ext/localedata.jar[CPE_LIBRARY][K_BINARY][isExported:false], /opt/public/common/jdk1.8.0_131.x64/jre/lib/ext/jfxrt.jar[CPE_LIBRARY][K_BINARY][sourcePath:/opt/public/common/jdk1.8.0_131.x64/javafx-src.zip][isExported:false][attributes:javadoc_location=http://docs.oracle.com/javase/8/javafx/api/]]
internalGetProjectPath: attributes on org.eclipse.ajdt.core.ASPECTJRT_CONTAINER are 
internalGetProjectPath: Couldn't find it on first look, so looking here: [/jobs/genie.ajdt/ajdt-on-eclipse-47/workspace/org.aspectj.runtime/target/org.aspectj.runtime-1.8.10-SNAPSHOT.jar[CPE_LIBRARY][K_BINARY][sourcePath:/jobs/genie.ajdt/ajdt-on-eclipse-47/workspace/org.aspectj.runtime/target/org.aspectj.runtime.source-1.8.10-SNAPSHOT.jar][isExported:false]]
internalGetProjectPath: attributes on Aspect_Path_Var are org.eclipse.ajdt.aspectpath=true
internalGetProjectPath: attributes on org.eclipse.jdt.USER_LIBRARY/Aspect_Path_Lib are org.eclipse.ajdt.aspectpath=true
internalGetProjectPath: Couldn't find it on first look, so looking here: [/jobs/genie.ajdt/ajdt-on-eclipse-47/workspace/org.eclipse.ajdt.ui.tests/target/work/data/PathTesting-ContainerOnAspectPath/container.jar[CPE_LIBRARY][K_BINARY][isExported:false]]
internalGetProjectPath: attributes on /PathTesting-ProjectOnAspectPath are org.eclipse.ajdt.aspectpath=true
internalGetProjectPath: attributes on /PathTesting-JarOnAspectPath/j.jar are org.eclipse.ajdt.aspectpath=true
internalGetProjectPath: iterating over classpath entries, size #7
internalGetProjectPath: attributes on /PathTesting-HasAspectPath/src are 
internalGetProjectPath: attributes on org.eclipse.jdt.launching.JRE_CONTAINER are 
internalGetProjectPath: Couldn't find it on first look, so looking here: [/opt/public/common/jdk1.8.0_131.x64/jre/lib/resources.jar[CPE_LIBRARY][K_BINARY][sourcePath:/opt/public/common/jdk1.8.0_131.x64/src.zip][isExported:false][attributes:javadoc_location=https://docs.oracle.com/javase/8/docs/api/], /opt/public/common/jdk1.8.0_131.x64/jre/lib/rt.jar[CPE_LIBRARY][K_BINARY][sourcePath:/opt/public/common/jdk1.8.0_131.x64/src.zip][isExported:false][attributes:javadoc_location=https://docs.oracle.com/javase/8/docs/api/], /opt/public/common/jdk1.8.0_131.x64/jre/lib/jsse.jar[CPE_LIBRARY][K_BINARY][sourcePath:/opt/public/common/jdk1.8.0_131.x64/src.zip][isExported:false][attributes:javadoc_location=https://docs.oracle.com/javase/8/docs/api/], /opt/public/common/jdk1.8.0_131.x64/jre/lib/jce.jar[CPE_LIBRARY][K_BINARY][sourcePath:/opt/public/common/jdk1.8.0_131.x64/src.zip][isExported:false][attributes:javadoc_location=https://docs.oracle.com/javase/8/docs/api/], /opt/public/common/jdk1.8.0_131.x64/jre/lib/charsets.jar[CPE_LIBRARY][K_BINARY][sourcePath:/opt/public/common/jdk1.8.0_131.x64/src.zip][isExported:false][attributes:javadoc_location=https://docs.oracle.com/javase/8/docs/api/], /opt/public/common/jdk1.8.0_131.x64/jre/lib/jfr.jar[CPE_LIBRARY][K_BINARY][sourcePath:/opt/public/common/jdk1.8.0_131.x64/src.zip][isExported:false][attributes:javadoc_location=https://docs.oracle.com/javase/8/docs/api/], /opt/public/common/jdk1.8.0_131.x64/jre/lib/ext/dnsns.jar[CPE_LIBRARY][K_BINARY][isExported:false], /opt/public/common/jdk1.8.0_131.x64/jre/lib/ext/sunpkcs11.jar[CPE_LIBRARY][K_BINARY][isExported:false], /opt/public/common/jdk1.8.0_131.x64/jre/lib/ext/nashorn.jar[CPE_LIBRARY][K_BINARY][isExported:false], /opt/public/common/jdk1.8.0_131.x64/jre/lib/ext/cldrdata.jar[CPE_LIBRARY][K_BINARY][isExported:false], /opt/public/common/jdk1.8.0_131.x64/jre/lib/ext/zipfs.jar[CPE_LIBRARY][K_BINARY][isExported:false], /opt/public/common/jdk1.8.0_131.x64/jre/lib/ext/sunec.jar[CPE_LIBRARY][K_BINARY][isExported:false], /opt/public/common/jdk1.8.0_131.x64/jre/lib/ext/jaccess.jar[CPE_LIBRARY][K_BINARY][isExported:false], /opt/public/common/jdk1.8.0_131.x64/jre/lib/ext/sunjce_provider.jar[CPE_LIBRARY][K_BINARY][isExported:false], /opt/public/common/jdk1.8.0_131.x64/jre/lib/ext/localedata.jar[CPE_LIBRARY][K_BINARY][isExported:false], /opt/public/common/jdk1.8.0_131.x64/jre/lib/ext/jfxrt.jar[CPE_LIBRARY][K_BINARY][sourcePath:/opt/public/common/jdk1.8.0_131.x64/javafx-src.zip][isExported:false][attributes:javadoc_location=http://docs.oracle.com/javase/8/javafx/api/]]
internalGetProjectPath: attributes on org.eclipse.ajdt.core.ASPECTJRT_CONTAINER are 
internalGetProjectPath: Couldn't find it on first look, so looking here: [/jobs/genie.ajdt/ajdt-on-eclipse-47/workspace/org.aspectj.runtime/target/org.aspectj.runtime-1.8.10-SNAPSHOT.jar[CPE_LIBRARY][K_BINARY][sourcePath:/jobs/genie.ajdt/ajdt-on-eclipse-47/workspace/org.aspectj.runtime/target/org.aspectj.runtime.source-1.8.10-SNAPSHOT.jar][isExported:false]]
internalGetProjectPath: attributes on Aspect_Path_Var are org.eclipse.ajdt.aspectpath=true
internalGetProjectPath: attributes on org.eclipse.jdt.USER_LIBRARY/Aspect_Path_Lib are org.eclipse.ajdt.aspectpath=true
internalGetProjectPath: attributes on /PathTesting-ProjectOnAspectPath are org.eclipse.ajdt.aspectpath=true
internalGetProjectPath: attributes on /PathTesting-JarOnAspectPath/j.jar are org.eclipse.ajdt.aspectpath=true
Timer event: 0ms: Flush included source file cache
Timer event: 0ms: Check delta
Timer event: 0ms: Looking for and marking configuration changes in PathTesting-HasAspectPath
	Configuration changes found: false
build: Examined delta - no source file or classpath changes for project PathTesting-HasAspectPath
Timer event: 0ms: Looking for and marking configuration changes in PathTesting-ProjectOnAspectPath
	Configuration changes found: false
Timer event: 0ms: Looking for and marking configuration changes in PathTesting-JarOnAspectPath
	Configuration changes found: false
Compiler configuration for project PathTesting-HasAspectPath has been read by compiler.  Resetting.
     Configuration was [PROJECTSOURCEFILES_CHANGED, JAVAOPTIONS_CHANGED, ASPECTPATH_CHANGED, CLASSPATH_CHANGED, INPATH_CHANGED, NONSTANDARDOPTIONS_CHANGED, OUTJAR_CHANGED, PROJECTSOURCERESOURCES_CHANGED, OUTPUTDESTINATIONS_CHANGED, INJARS_CHANGED]
Resetting list of modified source files.  Was null
Timer event: 0ms: Look for source/resource changes
No source/resource changes found, exiting build
Timer event: 1ms: Total time spent in AJBuilder.build()
===========================================================================================
Build kind = AUTOBUILD
Project=PathTesting-HasInpath, kind of build requested=Incremental AspectJ compilation
internalGetProjectPath: iterating over classpath entries, size #7
internalGetProjectPath: attributes on /PathTesting-HasInpath/src are 
internalGetProjectPath: attributes on org.eclipse.jdt.launching.JRE_CONTAINER are 
internalGetProjectPath: Couldn't find it on first look, so looking here: [/opt/public/common/jdk1.8.0_131.x64/jre/lib/resources.jar[CPE_LIBRARY][K_BINARY][sourcePath:/opt/public/common/jdk1.8.0_131.x64/src.zip][isExported:false][attributes:javadoc_location=https://docs.oracle.com/javase/8/docs/api/], /opt/public/common/jdk1.8.0_131.x64/jre/lib/rt.jar[CPE_LIBRARY][K_BINARY][sourcePath:/opt/public/common/jdk1.8.0_131.x64/src.zip][isExported:false][attributes:javadoc_location=https://docs.oracle.com/javase/8/docs/api/], /opt/public/common/jdk1.8.0_131.x64/jre/lib/jsse.jar[CPE_LIBRARY][K_BINARY][sourcePath:/opt/public/common/jdk1.8.0_131.x64/src.zip][isExported:false][attributes:javadoc_location=https://docs.oracle.com/javase/8/docs/api/], /opt/public/common/jdk1.8.0_131.x64/jre/lib/jce.jar[CPE_LIBRARY][K_BINARY][sourcePath:/opt/public/common/jdk1.8.0_131.x64/src.zip][isExported:false][attributes:javadoc_location=https://docs.oracle.com/javase/8/docs/api/], /opt/public/common/jdk1.8.0_131.x64/jre/lib/charsets.jar[CPE_LIBRARY][K_BINARY][sourcePath:/opt/public/common/jdk1.8.0_131.x64/src.zip][isExported:false][attributes:javadoc_location=https://docs.oracle.com/javase/8/docs/api/], /opt/public/common/jdk1.8.0_131.x64/jre/lib/jfr.jar[CPE_LIBRARY][K_BINARY][sourcePath:/opt/public/common/jdk1.8.0_131.x64/src.zip][isExported:false][attributes:javadoc_location=https://docs.oracle.com/javase/8/docs/api/], /opt/public/common/jdk1.8.0_131.x64/jre/lib/ext/dnsns.jar[CPE_LIBRARY][K_BINARY][isExported:false], /opt/public/common/jdk1.8.0_131.x64/jre/lib/ext/sunpkcs11.jar[CPE_LIBRARY][K_BINARY][isExported:false], /opt/public/common/jdk1.8.0_131.x64/jre/lib/ext/nashorn.jar[CPE_LIBRARY][K_BINARY][isExported:false], /opt/public/common/jdk1.8.0_131.x64/jre/lib/ext/cldrdata.jar[CPE_LIBRARY][K_BINARY][isExported:false], /opt/public/common/jdk1.8.0_131.x64/jre/lib/ext/zipfs.jar[CPE_LIBRARY][K_BINARY][isExported:false], /opt/public/common/jdk1.8.0_131.x64/jre/lib/ext/sunec.jar[CPE_LIBRARY][K_BINARY][isExported:false], /opt/public/common/jdk1.8.0_131.x64/jre/lib/ext/jaccess.jar[CPE_LIBRARY][K_BINARY][isExported:false], /opt/public/common/jdk1.8.0_131.x64/jre/lib/ext/sunjce_provider.jar[CPE_LIBRARY][K_BINARY][isExported:false], /opt/public/common/jdk1.8.0_131.x64/jre/lib/ext/localedata.jar[CPE_LIBRARY][K_BINARY][isExported:false], /opt/public/common/jdk1.8.0_131.x64/jre/lib/ext/jfxrt.jar[CPE_LIBRARY][K_BINARY][sourcePath:/opt/public/common/jdk1.8.0_131.x64/javafx-src.zip][isExported:false][attributes:javadoc_location=http://docs.oracle.com/javase/8/javafx/api/]]
internalGetProjectPath: attributes on org.eclipse.ajdt.core.ASPECTJRT_CONTAINER are 
internalGetProjectPath: Couldn't find it on first look, so looking here: [/jobs/genie.ajdt/ajdt-on-eclipse-47/workspace/org.aspectj.runtime/target/org.aspectj.runtime-1.8.10-SNAPSHOT.jar[CPE_LIBRARY][K_BINARY][sourcePath:/jobs/genie.ajdt/ajdt-on-eclipse-47/workspace/org.aspectj.runtime/target/org.aspectj.runtime.source-1.8.10-SNAPSHOT.jar][isExported:false]]
internalGetProjectPath: attributes on Aspect_Path_Var are org.eclipse.ajdt.inpath=true
internalGetProjectPath: attributes on org.eclipse.jdt.USER_LIBRARY/Aspect_Path_Lib are org.eclipse.ajdt.inpath=true
internalGetProjectPath: attributes on /PathTesting-ProjectOnAspectPath are org.eclipse.ajdt.inpath=true
internalGetProjectPath: attributes on /PathTesting-JarOnAspectPath/j.jar are org.eclipse.ajdt.inpath=true
internalGetProjectPath: iterating over classpath entries, size #7
internalGetProjectPath: attributes on /PathTesting-HasInpath/src are 
internalGetProjectPath: attributes on org.eclipse.jdt.launching.JRE_CONTAINER are 
internalGetProjectPath: Couldn't find it on first look, so looking here: [/opt/public/common/jdk1.8.0_131.x64/jre/lib/resources.jar[CPE_LIBRARY][K_BINARY][sourcePath:/opt/public/common/jdk1.8.0_131.x64/src.zip][isExported:false][attributes:javadoc_location=https://docs.oracle.com/javase/8/docs/api/], /opt/public/common/jdk1.8.0_131.x64/jre/lib/rt.jar[CPE_LIBRARY][K_BINARY][sourcePath:/opt/public/common/jdk1.8.0_131.x64/src.zip][isExported:false][attributes:javadoc_location=https://docs.oracle.com/javase/8/docs/api/], /opt/public/common/jdk1.8.0_131.x64/jre/lib/jsse.jar[CPE_LIBRARY][K_BINARY][sourcePath:/opt/public/common/jdk1.8.0_131.x64/src.zip][isExported:false][attributes:javadoc_location=https://docs.oracle.com/javase/8/docs/api/], /opt/public/common/jdk1.8.0_131.x64/jre/lib/jce.jar[CPE_LIBRARY][K_BINARY][sourcePath:/opt/public/common/jdk1.8.0_131.x64/src.zip][isExported:false][attributes:javadoc_location=https://docs.oracle.com/javase/8/docs/api/], /opt/public/common/jdk1.8.0_131.x64/jre/lib/charsets.jar[CPE_LIBRARY][K_BINARY][sourcePath:/opt/public/common/jdk1.8.0_131.x64/src.zip][isExported:false][attributes:javadoc_location=https://docs.oracle.com/javase/8/docs/api/], /opt/public/common/jdk1.8.0_131.x64/jre/lib/jfr.jar[CPE_LIBRARY][K_BINARY][sourcePath:/opt/public/common/jdk1.8.0_131.x64/src.zip][isExported:false][attributes:javadoc_location=https://docs.oracle.com/javase/8/docs/api/], /opt/public/common/jdk1.8.0_131.x64/jre/lib/ext/dnsns.jar[CPE_LIBRARY][K_BINARY][isExported:false], /opt/public/common/jdk1.8.0_131.x64/jre/lib/ext/sunpkcs11.jar[CPE_LIBRARY][K_BINARY][isExported:false], /opt/public/common/jdk1.8.0_131.x64/jre/lib/ext/nashorn.jar[CPE_LIBRARY][K_BINARY][isExported:false], /opt/public/common/jdk1.8.0_131.x64/jre/lib/ext/cldrdata.jar[CPE_LIBRARY][K_BINARY][isExported:false], /opt/public/common/jdk1.8.0_131.x64/jre/lib/ext/zipfs.jar[CPE_LIBRARY][K_BINARY][isExported:false], /opt/public/common/jdk1.8.0_131.x64/jre/lib/ext/sunec.jar[CPE_LIBRARY][K_BINARY][isExported:false], /opt/public/common/jdk1.8.0_131.x64/jre/lib/ext/jaccess.jar[CPE_LIBRARY][K_BINARY][isExported:false], /opt/public/common/jdk1.8.0_131.x64/jre/lib/ext/sunjce_provider.jar[CPE_LIBRARY][K_BINARY][isExported:false], /opt/public/common/jdk1.8.0_131.x64/jre/lib/ext/localedata.jar[CPE_LIBRARY][K_BINARY][isExported:false], /opt/public/common/jdk1.8.0_131.x64/jre/lib/ext/jfxrt.jar[CPE_LIBRARY][K_BINARY][sourcePath:/opt/public/common/jdk1.8.0_131.x64/javafx-src.zip][isExported:false][attributes:javadoc_location=http://docs.oracle.com/javase/8/javafx/api/]]
internalGetProjectPath: attributes on org.eclipse.ajdt.core.ASPECTJRT_CONTAINER are 
internalGetProjectPath: Couldn't find it on first look, so looking here: [/jobs/genie.ajdt/ajdt-on-eclipse-47/workspace/org.aspectj.runtime/target/org.aspectj.runtime-1.8.10-SNAPSHOT.jar[CPE_LIBRARY][K_BINARY][sourcePath:/jobs/genie.ajdt/ajdt-on-eclipse-47/workspace/org.aspectj.runtime/target/org.aspectj.runtime.source-1.8.10-SNAPSHOT.jar][isExported:false]]
internalGetProjectPath: attributes on Aspect_Path_Var are org.eclipse.ajdt.inpath=true
internalGetProjectPath: attributes on org.eclipse.jdt.USER_LIBRARY/Aspect_Path_Lib are org.eclipse.ajdt.inpath=true
internalGetProjectPath: Couldn't find it on first look, so looking here: [/jobs/genie.ajdt/ajdt-on-eclipse-47/workspace/org.eclipse.ajdt.ui.tests/target/work/data/PathTesting-ContainerOnAspectPath/container.jar[CPE_LIBRARY][K_BINARY][isExported:false]]
internalGetProjectPath: attributes on /PathTesting-ProjectOnAspectPath are org.eclipse.ajdt.inpath=true
internalGetProjectPath: attributes on /PathTesting-JarOnAspectPath/j.jar are org.eclipse.ajdt.inpath=true
Timer event: 0ms: Flush included source file cache
Timer event: 0ms: Check delta
Timer event: 0ms: Looking for and marking configuration changes in PathTesting-HasInpath
	Configuration changes found: false
build: Examined delta - no source file or classpath changes for project PathTesting-HasInpath
Timer event: 0ms: Looking for and marking configuration changes in PathTesting-ProjectOnAspectPath
	Configuration changes found: false
Timer event: 0ms: Looking for and marking configuration changes in PathTesting-JarOnAspectPath
	Configuration changes found: false
Compiler configuration for project PathTesting-HasInpath has been read by compiler.  Resetting.
     Configuration was [PROJECTSOURCEFILES_CHANGED, JAVAOPTIONS_CHANGED, ASPECTPATH_CHANGED, CLASSPATH_CHANGED, INPATH_CHANGED, NONSTANDARDOPTIONS_CHANGED, OUTJAR_CHANGED, PROJECTSOURCERESOURCES_CHANGED, OUTPUTDESTINATIONS_CHANGED, INJARS_CHANGED]
Resetting list of modified source files.  Was null
Timer event: 0ms: Look for source/resource changes
No source/resource changes found, exiting build
Timer event: 1ms: Total time spent in AJBuilder.build()
>> finished a build
===========================================================================================
Build kind = FULLBUILD
Project=PathTesting-HasInpath, kind of build requested=Full AspectJ compilation
internalGetProjectPath: iterating over classpath entries, size #7
internalGetProjectPath: attributes on /PathTesting-HasInpath/src are 
internalGetProjectPath: attributes on org.eclipse.jdt.launching.JRE_CONTAINER are 
internalGetProjectPath: Couldn't find it on first look, so looking here: [/opt/public/common/jdk1.8.0_131.x64/jre/lib/resources.jar[CPE_LIBRARY][K_BINARY][sourcePath:/opt/public/common/jdk1.8.0_131.x64/src.zip][isExported:false][attributes:javadoc_location=https://docs.oracle.com/javase/8/docs/api/], /opt/public/common/jdk1.8.0_131.x64/jre/lib/rt.jar[CPE_LIBRARY][K_BINARY][sourcePath:/opt/public/common/jdk1.8.0_131.x64/src.zip][isExported:false][attributes:javadoc_location=https://docs.oracle.com/javase/8/docs/api/], /opt/public/common/jdk1.8.0_131.x64/jre/lib/jsse.jar[CPE_LIBRARY][K_BINARY][sourcePath:/opt/public/common/jdk1.8.0_131.x64/src.zip][isExported:false][attributes:javadoc_location=https://docs.oracle.com/javase/8/docs/api/], /opt/public/common/jdk1.8.0_131.x64/jre/lib/jce.jar[CPE_LIBRARY][K_BINARY][sourcePath:/opt/public/common/jdk1.8.0_131.x64/src.zip][isExported:false][attributes:javadoc_location=https://docs.oracle.com/javase/8/docs/api/], /opt/public/common/jdk1.8.0_131.x64/jre/lib/charsets.jar[CPE_LIBRARY][K_BINARY][sourcePath:/opt/public/common/jdk1.8.0_131.x64/src.zip][isExported:false][attributes:javadoc_location=https://docs.oracle.com/javase/8/docs/api/], /opt/public/common/jdk1.8.0_131.x64/jre/lib/jfr.jar[CPE_LIBRARY][K_BINARY][sourcePath:/opt/public/common/jdk1.8.0_131.x64/src.zip][isExported:false][attributes:javadoc_location=https://docs.oracle.com/javase/8/docs/api/], /opt/public/common/jdk1.8.0_131.x64/jre/lib/ext/dnsns.jar[CPE_LIBRARY][K_BINARY][isExported:false], /opt/public/common/jdk1.8.0_131.x64/jre/lib/ext/sunpkcs11.jar[CPE_LIBRARY][K_BINARY][isExported:false], /opt/public/common/jdk1.8.0_131.x64/jre/lib/ext/nashorn.jar[CPE_LIBRARY][K_BINARY][isExported:false], /opt/public/common/jdk1.8.0_131.x64/jre/lib/ext/cldrdata.jar[CPE_LIBRARY][K_BINARY][isExported:false], /opt/public/common/jdk1.8.0_131.x64/jre/lib/ext/zipfs.jar[CPE_LIBRARY][K_BINARY][isExported:false], /opt/public/common/jdk1.8.0_131.x64/jre/lib/ext/sunec.jar[CPE_LIBRARY][K_BINARY][isExported:false], /opt/public/common/jdk1.8.0_131.x64/jre/lib/ext/jaccess.jar[CPE_LIBRARY][K_BINARY][isExported:false], /opt/public/common/jdk1.8.0_131.x64/jre/lib/ext/sunjce_provider.jar[CPE_LIBRARY][K_BINARY][isExported:false], /opt/public/common/jdk1.8.0_131.x64/jre/lib/ext/localedata.jar[CPE_LIBRARY][K_BINARY][isExported:false], /opt/public/common/jdk1.8.0_131.x64/jre/lib/ext/jfxrt.jar[CPE_LIBRARY][K_BINARY][sourcePath:/opt/public/common/jdk1.8.0_131.x64/javafx-src.zip][isExported:false][attributes:javadoc_location=http://docs.oracle.com/javase/8/javafx/api/]]
internalGetProjectPath: attributes on org.eclipse.ajdt.core.ASPECTJRT_CONTAINER are 
internalGetProjectPath: Couldn't find it on first look, so looking here: [/jobs/genie.ajdt/ajdt-on-eclipse-47/workspace/org.aspectj.runtime/target/org.aspectj.runtime-1.8.10-SNAPSHOT.jar[CPE_LIBRARY][K_BINARY][sourcePath:/jobs/genie.ajdt/ajdt-on-eclipse-47/workspace/org.aspectj.runtime/target/org.aspectj.runtime.source-1.8.10-SNAPSHOT.jar][isExported:false]]
internalGetProjectPath: attributes on Aspect_Path_Var are org.eclipse.ajdt.inpath=true
internalGetProjectPath: attributes on org.eclipse.jdt.USER_LIBRARY/Aspect_Path_Lib are org.eclipse.ajdt.inpath=true
internalGetProjectPath: attributes on /PathTesting-ProjectOnAspectPath are org.eclipse.ajdt.inpath=true
internalGetProjectPath: attributes on /PathTesting-JarOnAspectPath/j.jar are org.eclipse.ajdt.inpath=true
internalGetProjectPath: iterating over classpath entries, size #7
internalGetProjectPath: attributes on /PathTesting-HasInpath/src are 
internalGetProjectPath: attributes on org.eclipse.jdt.launching.JRE_CONTAINER are 
internalGetProjectPath: Couldn't find it on first look, so looking here: [/opt/public/common/jdk1.8.0_131.x64/jre/lib/resources.jar[CPE_LIBRARY][K_BINARY][sourcePath:/opt/public/common/jdk1.8.0_131.x64/src.zip][isExported:false][attributes:javadoc_location=https://docs.oracle.com/javase/8/docs/api/], /opt/public/common/jdk1.8.0_131.x64/jre/lib/rt.jar[CPE_LIBRARY][K_BINARY][sourcePath:/opt/public/common/jdk1.8.0_131.x64/src.zip][isExported:false][attributes:javadoc_location=https://docs.oracle.com/javase/8/docs/api/], /opt/public/common/jdk1.8.0_131.x64/jre/lib/jsse.jar[CPE_LIBRARY][K_BINARY][sourcePath:/opt/public/common/jdk1.8.0_131.x64/src.zip][isExported:false][attributes:javadoc_location=https://docs.oracle.com/javase/8/docs/api/], /opt/public/common/jdk1.8.0_131.x64/jre/lib/jce.jar[CPE_LIBRARY][K_BINARY][sourcePath:/opt/public/common/jdk1.8.0_131.x64/src.zip][isExported:false][attributes:javadoc_location=https://docs.oracle.com/javase/8/docs/api/], /opt/public/common/jdk1.8.0_131.x64/jre/lib/charsets.jar[CPE_LIBRARY][K_BINARY][sourcePath:/opt/public/common/jdk1.8.0_131.x64/src.zip][isExported:false][attributes:javadoc_location=https://docs.oracle.com/javase/8/docs/api/], /opt/public/common/jdk1.8.0_131.x64/jre/lib/jfr.jar[CPE_LIBRARY][K_BINARY][sourcePath:/opt/public/common/jdk1.8.0_131.x64/src.zip][isExported:false][attributes:javadoc_location=https://docs.oracle.com/javase/8/docs/api/], /opt/public/common/jdk1.8.0_131.x64/jre/lib/ext/dnsns.jar[CPE_LIBRARY][K_BINARY][isExported:false], /opt/public/common/jdk1.8.0_131.x64/jre/lib/ext/sunpkcs11.jar[CPE_LIBRARY][K_BINARY][isExported:false], /opt/public/common/jdk1.8.0_131.x64/jre/lib/ext/nashorn.jar[CPE_LIBRARY][K_BINARY][isExported:false], /opt/public/common/jdk1.8.0_131.x64/jre/lib/ext/cldrdata.jar[CPE_LIBRARY][K_BINARY][isExported:false], /opt/public/common/jdk1.8.0_131.x64/jre/lib/ext/zipfs.jar[CPE_LIBRARY][K_BINARY][isExported:false], /opt/public/common/jdk1.8.0_131.x64/jre/lib/ext/sunec.jar[CPE_LIBRARY][K_BINARY][isExported:false], /opt/public/common/jdk1.8.0_131.x64/jre/lib/ext/jaccess.jar[CPE_LIBRARY][K_BINARY][isExported:false], /opt/public/common/jdk1.8.0_131.x64/jre/lib/ext/sunjce_provider.jar[CPE_LIBRARY][K_BINARY][isExported:false], /opt/public/common/jdk1.8.0_131.x64/jre/lib/ext/localedata.jar[CPE_LIBRARY][K_BINARY][isExported:false], /opt/public/common/jdk1.8.0_131.x64/jre/lib/ext/jfxrt.jar[CPE_LIBRARY][K_BINARY][sourcePath:/opt/public/common/jdk1.8.0_131.x64/javafx-src.zip][isExported:false][attributes:javadoc_location=http://docs.oracle.com/javase/8/javafx/api/]]
internalGetProjectPath: attributes on org.eclipse.ajdt.core.ASPECTJRT_CONTAINER are 
internalGetProjectPath: Couldn't find it on first look, so looking here: [/jobs/genie.ajdt/ajdt-on-eclipse-47/workspace/org.aspectj.runtime/target/org.aspectj.runtime-1.8.10-SNAPSHOT.jar[CPE_LIBRARY][K_BINARY][sourcePath:/jobs/genie.ajdt/ajdt-on-eclipse-47/workspace/org.aspectj.runtime/target/org.aspectj.runtime.source-1.8.10-SNAPSHOT.jar][isExported:false]]
internalGetProjectPath: attributes on Aspect_Path_Var are org.eclipse.ajdt.inpath=true
internalGetProjectPath: attributes on org.eclipse.jdt.USER_LIBRARY/Aspect_Path_Lib are org.eclipse.ajdt.inpath=true
internalGetProjectPath: Couldn't find it on first look, so looking here: [/jobs/genie.ajdt/ajdt-on-eclipse-47/workspace/org.eclipse.ajdt.ui.tests/target/work/data/PathTesting-ContainerOnAspectPath/container.jar[CPE_LIBRARY][K_BINARY][isExported:false]]
internalGetProjectPath: attributes on /PathTesting-ProjectOnAspectPath are org.eclipse.ajdt.inpath=true
internalGetProjectPath: attributes on /PathTesting-JarOnAspectPath/j.jar are org.eclipse.ajdt.inpath=true
Timer event: 0ms: Flush included source file cache
Timer event: 0ms: Check delta
Builder: Tidied output folder(s), removed class files and derived resources
Classpath = /jobs/genie.ajdt/ajdt-on-eclipse-47/workspace/org.eclipse.ajdt.ui.tests/target/work/data/PathTesting-HasInpath/bin:/opt/public/common/jdk1.8.0_131.x64/jre/lib/resources.jar:/opt/public/common/jdk1.8.0_131.x64/jre/lib/rt.jar:/opt/public/common/jdk1.8.0_131.x64/jre/lib/jsse.jar:/opt/public/common/jdk1.8.0_131.x64/jre/lib/jce.jar:/opt/public/common/jdk1.8.0_131.x64/jre/lib/charsets.jar:/opt/public/common/jdk1.8.0_131.x64/jre/lib/jfr.jar:/opt/public/common/jdk1.8.0_131.x64/jre/lib/ext/dnsns.jar:/opt/public/common/jdk1.8.0_131.x64/jre/lib/ext/sunpkcs11.jar:/opt/public/common/jdk1.8.0_131.x64/jre/lib/ext/nashorn.jar:/opt/public/common/jdk1.8.0_131.x64/jre/lib/ext/cldrdata.jar:/opt/public/common/jdk1.8.0_131.x64/jre/lib/ext/zipfs.jar:/opt/public/common/jdk1.8.0_131.x64/jre/lib/ext/sunec.jar:/opt/public/common/jdk1.8.0_131.x64/jre/lib/ext/jaccess.jar:/opt/public/common/jdk1.8.0_131.x64/jre/lib/ext/sunjce_provider.jar:/opt/public/common/jdk1.8.0_131.x64/jre/lib/ext/localedata.jar:/opt/public/common/jdk1.8.0_131.x64/jre/lib/ext/jfxrt.jar:/jobs/genie.ajdt/ajdt-on-eclipse-47/workspace/org.aspectj.runtime/target/org.aspectj.runtime-1.8.10-SNAPSHOT.jar:/jobs/genie.ajdt/ajdt-on-eclipse-47/workspace/org.eclipse.ajdt.ui.tests/target/work/data/PathTesting-VariableOnAspectPath/variable.jar:/jobs/genie.ajdt/ajdt-on-eclipse-47/workspace/org.eclipse.ajdt.ui.tests/target/work/data/PathTesting-ContainerOnAspectPath/container.jar:/jobs/genie.ajdt/ajdt-on-eclipse-47/workspace/org.eclipse.ajdt.ui.tests/target/work/data/PathTesting-ProjectOnAspectPath/otherOutLocation:/jobs/genie.ajdt/ajdt-on-eclipse-47/workspace/org.eclipse.ajdt.ui.tests/target/work/configuration/org.eclipse.osgi/43/0/.cp/junit.jar:/jobs/genie.ajdt/ajdt-on-eclipse-47/workspace/org.eclipse.ajdt.ui.tests/target/work/data/PathTesting-JarOnAspectPath/j.jar:
Timer event: 3ms: Pre compile
internalGetProjectPath: iterating over classpath entries, size #7
internalGetProjectPath: attributes on /PathTesting-HasInpath/src are 
internalGetProjectPath: attributes on org.eclipse.jdt.launching.JRE_CONTAINER are 
internalGetProjectPath: Couldn't find it on first look, so looking here: [/opt/public/common/jdk1.8.0_131.x64/jre/lib/resources.jar[CPE_LIBRARY][K_BINARY][sourcePath:/opt/public/common/jdk1.8.0_131.x64/src.zip][isExported:false][attributes:javadoc_location=https://docs.oracle.com/javase/8/docs/api/], /opt/public/common/jdk1.8.0_131.x64/jre/lib/rt.jar[CPE_LIBRARY][K_BINARY][sourcePath:/opt/public/common/jdk1.8.0_131.x64/src.zip][isExported:false][attributes:javadoc_location=https://docs.oracle.com/javase/8/docs/api/], /opt/public/common/jdk1.8.0_131.x64/jre/lib/jsse.jar[CPE_LIBRARY][K_BINARY][sourcePath:/opt/public/common/jdk1.8.0_131.x64/src.zip][isExported:false][attributes:javadoc_location=https://docs.oracle.com/javase/8/docs/api/], /opt/public/common/jdk1.8.0_131.x64/jre/lib/jce.jar[CPE_LIBRARY][K_BINARY][sourcePath:/opt/public/common/jdk1.8.0_131.x64/src.zip][isExported:false][attributes:javadoc_location=https://docs.oracle.com/javase/8/docs/api/], /opt/public/common/jdk1.8.0_131.x64/jre/lib/charsets.jar[CPE_LIBRARY][K_BINARY][sourcePath:/opt/public/common/jdk1.8.0_131.x64/src.zip][isExported:false][attributes:javadoc_location=https://docs.oracle.com/javase/8/docs/api/], /opt/public/common/jdk1.8.0_131.x64/jre/lib/jfr.jar[CPE_LIBRARY][K_BINARY][sourcePath:/opt/public/common/jdk1.8.0_131.x64/src.zip][isExported:false][attributes:javadoc_location=https://docs.oracle.com/javase/8/docs/api/], /opt/public/common/jdk1.8.0_131.x64/jre/lib/ext/dnsns.jar[CPE_LIBRARY][K_BINARY][isExported:false], /opt/public/common/jdk1.8.0_131.x64/jre/lib/ext/sunpkcs11.jar[CPE_LIBRARY][K_BINARY][isExported:false], /opt/public/common/jdk1.8.0_131.x64/jre/lib/ext/nashorn.jar[CPE_LIBRARY][K_BINARY][isExported:false], /opt/public/common/jdk1.8.0_131.x64/jre/lib/ext/cldrdata.jar[CPE_LIBRARY][K_BINARY][isExported:false], /opt/public/common/jdk1.8.0_131.x64/jre/lib/ext/zipfs.jar[CPE_LIBRARY][K_BINARY][isExported:false], /opt/public/common/jdk1.8.0_131.x64/jre/lib/ext/sunec.jar[CPE_LIBRARY][K_BINARY][isExported:false], /opt/public/common/jdk1.8.0_131.x64/jre/lib/ext/jaccess.jar[CPE_LIBRARY][K_BINARY][isExported:false], /opt/public/common/jdk1.8.0_131.x64/jre/lib/ext/sunjce_provider.jar[CPE_LIBRARY][K_BINARY][isExported:false], /opt/public/common/jdk1.8.0_131.x64/jre/lib/ext/localedata.jar[CPE_LIBRARY][K_BINARY][isExported:false], /opt/public/common/jdk1.8.0_131.x64/jre/lib/ext/jfxrt.jar[CPE_LIBRARY][K_BINARY][sourcePath:/opt/public/common/jdk1.8.0_131.x64/javafx-src.zip][isExported:false][attributes:javadoc_location=http://docs.oracle.com/javase/8/javafx/api/]]
internalGetProjectPath: attributes on org.eclipse.ajdt.core.ASPECTJRT_CONTAINER are 
internalGetProjectPath: Couldn't find it on first look, so looking here: [/jobs/genie.ajdt/ajdt-on-eclipse-47/workspace/org.aspectj.runtime/target/org.aspectj.runtime-1.8.10-SNAPSHOT.jar[CPE_LIBRARY][K_BINARY][sourcePath:/jobs/genie.ajdt/ajdt-on-eclipse-47/workspace/org.aspectj.runtime/target/org.aspectj.runtime.source-1.8.10-SNAPSHOT.jar][isExported:false]]
internalGetProjectPath: attributes on Aspect_Path_Var are org.eclipse.ajdt.inpath=true
internalGetProjectPath: attributes on org.eclipse.jdt.USER_LIBRARY/Aspect_Path_Lib are org.eclipse.ajdt.inpath=true
internalGetProjectPath: attributes on /PathTesting-ProjectOnAspectPath are org.eclipse.ajdt.inpath=true
internalGetProjectPath: attributes on /PathTesting-JarOnAspectPath/j.jar are org.eclipse.ajdt.inpath=true
internalGetProjectPath: iterating over classpath entries, size #7
internalGetProjectPath: attributes on /PathTesting-HasInpath/src are 
internalGetProjectPath: attributes on org.eclipse.jdt.launching.JRE_CONTAINER are 
internalGetProjectPath: Couldn't find it on first look, so looking here: [/opt/public/common/jdk1.8.0_131.x64/jre/lib/resources.jar[CPE_LIBRARY][K_BINARY][sourcePath:/opt/public/common/jdk1.8.0_131.x64/src.zip][isExported:false][attributes:javadoc_location=https://docs.oracle.com/javase/8/docs/api/], /opt/public/common/jdk1.8.0_131.x64/jre/lib/rt.jar[CPE_LIBRARY][K_BINARY][sourcePath:/opt/public/common/jdk1.8.0_131.x64/src.zip][isExported:false][attributes:javadoc_location=https://docs.oracle.com/javase/8/docs/api/], /opt/public/common/jdk1.8.0_131.x64/jre/lib/jsse.jar[CPE_LIBRARY][K_BINARY][sourcePath:/opt/public/common/jdk1.8.0_131.x64/src.zip][isExported:false][attributes:javadoc_location=https://docs.oracle.com/javase/8/docs/api/], /opt/public/common/jdk1.8.0_131.x64/jre/lib/jce.jar[CPE_LIBRARY][K_BINARY][sourcePath:/opt/public/common/jdk1.8.0_131.x64/src.zip][isExported:false][attributes:javadoc_location=https://docs.oracle.com/javase/8/docs/api/], /opt/public/common/jdk1.8.0_131.x64/jre/lib/charsets.jar[CPE_LIBRARY][K_BINARY][sourcePath:/opt/public/common/jdk1.8.0_131.x64/src.zip][isExported:false][attributes:javadoc_location=https://docs.oracle.com/javase/8/docs/api/], /opt/public/common/jdk1.8.0_131.x64/jre/lib/jfr.jar[CPE_LIBRARY][K_BINARY][sourcePath:/opt/public/common/jdk1.8.0_131.x64/src.zip][isExported:false][attributes:javadoc_location=https://docs.oracle.com/javase/8/docs/api/], /opt/public/common/jdk1.8.0_131.x64/jre/lib/ext/dnsns.jar[CPE_LIBRARY][K_BINARY][isExported:false], /opt/public/common/jdk1.8.0_131.x64/jre/lib/ext/sunpkcs11.jar[CPE_LIBRARY][K_BINARY][isExported:false], /opt/public/common/jdk1.8.0_131.x64/jre/lib/ext/nashorn.jar[CPE_LIBRARY][K_BINARY][isExported:false], /opt/public/common/jdk1.8.0_131.x64/jre/lib/ext/cldrdata.jar[CPE_LIBRARY][K_BINARY][isExported:false], /opt/public/common/jdk1.8.0_131.x64/jre/lib/ext/zipfs.jar[CPE_LIBRARY][K_BINARY][isExported:false], /opt/public/common/jdk1.8.0_131.x64/jre/lib/ext/sunec.jar[CPE_LIBRARY][K_BINARY][isExported:false], /opt/public/common/jdk1.8.0_131.x64/jre/lib/ext/jaccess.jar[CPE_LIBRARY][K_BINARY][isExported:false], /opt/public/common/jdk1.8.0_131.x64/jre/lib/ext/sunjce_provider.jar[CPE_LIBRARY][K_BINARY][isExported:false], /opt/public/common/jdk1.8.0_131.x64/jre/lib/ext/localedata.jar[CPE_LIBRARY][K_BINARY][isExported:false], /opt/public/common/jdk1.8.0_131.x64/jre/lib/ext/jfxrt.jar[CPE_LIBRARY][K_BINARY][sourcePath:/opt/public/common/jdk1.8.0_131.x64/javafx-src.zip][isExported:false][attributes:javadoc_location=http://docs.oracle.com/javase/8/javafx/api/]]
internalGetProjectPath: attributes on org.eclipse.ajdt.core.ASPECTJRT_CONTAINER are 
internalGetProjectPath: Couldn't find it on first look, so looking here: [/jobs/genie.ajdt/ajdt-on-eclipse-47/workspace/org.aspectj.runtime/target/org.aspectj.runtime-1.8.10-SNAPSHOT.jar[CPE_LIBRARY][K_BINARY][sourcePath:/jobs/genie.ajdt/ajdt-on-eclipse-47/workspace/org.aspectj.runtime/target/org.aspectj.runtime.source-1.8.10-SNAPSHOT.jar][isExported:false]]
internalGetProjectPath: attributes on Aspect_Path_Var are org.eclipse.ajdt.inpath=true
internalGetProjectPath: attributes on org.eclipse.jdt.USER_LIBRARY/Aspect_Path_Lib are org.eclipse.ajdt.inpath=true
internalGetProjectPath: Couldn't find it on first look, so looking here: [/jobs/genie.ajdt/ajdt-on-eclipse-47/workspace/org.eclipse.ajdt.ui.tests/target/work/data/PathTesting-ContainerOnAspectPath/container.jar[CPE_LIBRARY][K_BINARY][isExported:false]]
internalGetProjectPath: attributes on /PathTesting-ProjectOnAspectPath are org.eclipse.ajdt.inpath=true
internalGetProjectPath: attributes on /PathTesting-JarOnAspectPath/j.jar are org.eclipse.ajdt.inpath=true
Compiler configuration for project PathTesting-HasInpath has been read by compiler.  Resetting.
     Configuration was []
Resetting list of modified source files.  Was []
Preparing for build: not going to be incremental because no successful previous full build
AJC: compiling source files
Timer event: 50ms: Time to first compiled message
AJC: compiled: /jobs/genie.ajdt/ajdt-on-eclipse-47/workspace/org.eclipse.ajdt.ui.tests/target/work/data/PathTesting-HasInpath/src/aspects/AdviseClassOnInpath.aj
Timer event: 53ms: Time to first woven message
AJC: woven aspect aspects.AdviseClassOnInpath (from /jobs/genie.ajdt/ajdt-on-eclipse-47/workspace/org.eclipse.ajdt.ui.tests/target/work/data/PathTesting-HasInpath/src/aspects/AdviseClassOnInpath.aj)
AJC: woven aspect aspectPath.VariableAspect (from /jobs/genie.ajdt/ajdt-on-eclipse-47/workspace/org.eclipse.ajdt.ui.tests/target/work/data/PathTesting-VariableOnAspectPath/variable.jar)
AJC: woven aspect aspectPath.ContainerAspect (from /jobs/genie.ajdt/ajdt-on-eclipse-47/workspace/org.eclipse.ajdt.ui.tests/target/work/data/PathTesting-ContainerOnAspectPath/container.jar)
AJC: woven aspect aspectPath.JarAspect (from /jobs/genie.ajdt/ajdt-on-eclipse-47/workspace/org.eclipse.ajdt.ui.tests/target/work/data/PathTesting-JarOnAspectPath/j.jar)
AJC: woven aspect aspectPath.ProjectAspect (from /jobs/genie.ajdt/ajdt-on-eclipse-47/workspace/org.eclipse.ajdt.ui.tests/target/work/data/PathTesting-ProjectOnAspectPath/otherOutLocation/aspectPath/ProjectAspect.class)
AJC: woven class aspectPath.VariableInpath (from /jobs/genie.ajdt/ajdt-on-eclipse-47/workspace/org.eclipse.ajdt.ui.tests/target/work/data/PathTesting-VariableOnAspectPath/variable.jar)
AJC: woven class aspectPath.ContainerInpath (from /jobs/genie.ajdt/ajdt-on-eclipse-47/workspace/org.eclipse.ajdt.ui.tests/target/work/data/PathTesting-ContainerOnAspectPath/container.jar)
AJC: woven class aspectPath.JarInpath (from /jobs/genie.ajdt/ajdt-on-eclipse-47/workspace/org.eclipse.ajdt.ui.tests/target/work/data/PathTesting-JarOnAspectPath/j.jar)
AJC: woven class aspectPath.ProjectInpath (from /jobs/genie.ajdt/ajdt-on-eclipse-47/workspace/org.eclipse.ajdt.ui.tests/target/work/data/PathTesting-ProjectOnAspectPath/otherOutLocation/aspectPath/ProjectInpath.class)
advice defined in aspectPath.ContainerAspect has not been applied [Xlint:adviceDidNotMatch]
advice defined in aspectPath.JarAspect has not been applied [Xlint:adviceDidNotMatch]
advice defined in aspectPath.ProjectAspect has not been applied [Xlint:adviceDidNotMatch]
advice defined in aspectPath.VariableAspect has not been applied [Xlint:adviceDidNotMatch]
AspectJ reports build successful, build was: FULL
AJDE Callback: finish. Was full build: true
Timer event: 60ms: Total time spent in AJDE
Timer event: 0ms: Refresh after build
Types affected during build = 1
>> scheduled a build
Crosscutting model sanity checked with no problems
Timer event: 0ms: Model sanity check for: PathTesting-HasInpath
Timer event: 66ms: Total time spent in AJBuilder.build()
>> scheduled a build
Timer event: 1ms: Delete markers: PathTesting-HasInpath (Finished deleting markers for PathTesting-HasInpath)
Timer event: 1ms: Create markers: PathTesting-HasInpath (Finished creating markers for PathTesting-HasInpath)
Created 0 markers in 1 files
>> finished a build
>> finished a build
Timer event: 8ms: Update visualizer, xref, advice listeners for (separate thread): PathTesting-HasInpath
Building AJ code scanner
Editor opened on AdviseClassOnInpath.aj
>> scheduled a build
>> finished a build
[ERROR] Timeout 7200 s exceeded. Process was killed.
[INFO] ------------------------------------------------------------------------
[INFO] Reactor Summary:
[INFO] 
[INFO] parent ............................................. SUCCESS [  0.208 s]
[INFO] org.aspectj.runtime ................................ SUCCESS [  2.334 s]
[INFO] org.aspectj.weaver ................................. SUCCESS [  3.938 s]
[INFO] org.aspectj.ajde ................................... SUCCESS [  6.504 s]
[INFO] org.aspectj ........................................ SUCCESS [  1.738 s]
[INFO] org.eclipse.contribution.weaving.jdt ............... SUCCESS [  5.169 s]
[INFO] org.eclipse.ajdt.core .............................. SUCCESS [  6.388 s]
[INFO] org.eclipse.ajdt.doc.user .......................... SUCCESS [  0.951 s]
[INFO] org.eclipse.ajdt.examples .......................... SUCCESS [  2.273 s]
[INFO] org.eclipse.contribution.visualiser ................ SUCCESS [  2.994 s]
[INFO] org.eclipse.contribution.xref.core ................. SUCCESS [  1.845 s]
[INFO] org.eclipse.contribution.xref.ui ................... SUCCESS [  2.368 s]
[INFO] org.eclipse.ajdt.ui ................................ SUCCESS [  7.503 s]
[INFO] org.eclipse.aspectj ................................ SUCCESS [  0.802 s]
[INFO] org.eclipse.equinox.weaving.aspectj ................ SUCCESS [  1.492 s]
[INFO] org.eclipse.equinox.weaving.sdk .................... SUCCESS [  0.715 s]
[INFO] org.eclipse.ajdt ................................... SUCCESS [  1.953 s]
[INFO] org.eclipse.contribution.weaving ................... SUCCESS [  1.510 s]
[INFO] org.eclipse.contribution.xref ...................... SUCCESS [  1.509 s]
[INFO] org.eclipse.ajdt.sdk ............................... SUCCESS [  1.081 s]
[INFO] org.eclipse.ajdt.core.tests ........................ SUCCESS [42:27 min]
[INFO] org.eclipse.contribution.visualiser.tests .......... SUCCESS [ 13.670 s]
[INFO] org.eclipse.ajdt.ui.tests .......................... FAILURE [  02:00 h]
[INFO] org.eclipse.contribution.weaving.jdt.tests ......... SKIPPED
[INFO] org.eclipse.contribution.xref.core.tests ........... SKIPPED
[INFO] org.eclipse.contribution.xref.ui.tests ............. SKIPPED
[INFO] org.eclipse.aspectj.feature_tests .................. SKIPPED
[INFO] org.eclipse.ajdt.releng ............................ SKIPPED
[INFO] ------------------------------------------------------------------------
[INFO] BUILD FAILURE
[INFO] ------------------------------------------------------------------------
[INFO] Total time: 02:44 h
[INFO] Finished at: 2017-10-02T19:11:04-04:00
[INFO] Final Memory: 201M/4154M
[INFO] ------------------------------------------------------------------------
[INFO] o.h.m.e.h.MavenExecutionResultHandler - Build failed with exception(s)
[INFO] o.h.m.e.h.MavenExecutionResultHandler - [1] org.apache.maven.lifecycle.LifecycleExecutionException: Failed to execute goal org.eclipse.tycho:tycho-surefire-plugin:0.23.1:test (default-test) on project org.eclipse.ajdt.ui.tests: An unexpected error occured while launching the test runtime (return code 143). See log for details.
[DEBUG] Closing connection to remote
[ERROR] Failed to execute goal org.eclipse.tycho:tycho-surefire-plugin:0.23.1:test (default-test) on project org.eclipse.ajdt.ui.tests: An unexpected error occured while launching the test runtime (return code 143). See log for details. -> [Help 1]
org.apache.maven.lifecycle.LifecycleExecutionException: Failed to execute goal org.eclipse.tycho:tycho-surefire-plugin:0.23.1:test (default-test) on project org.eclipse.ajdt.ui.tests: An unexpected error occured while launching the test runtime (return code 143). See log for details.
	at org.apache.maven.lifecycle.internal.MojoExecutor.execute(MojoExecutor.java:212)
	at org.apache.maven.lifecycle.internal.MojoExecutor.execute(MojoExecutor.java:153)
	at org.apache.maven.lifecycle.internal.MojoExecutor.execute(MojoExecutor.java:145)
	at org.apache.maven.lifecycle.internal.LifecycleModuleBuilder.buildProject(LifecycleModuleBuilder.java:116)
	at org.apache.maven.lifecycle.internal.LifecycleModuleBuilder.buildProject(LifecycleModuleBuilder.java:80)
	at org.apache.maven.lifecycle.internal.builder.singlethreaded.SingleThreadedBuilder.build(SingleThreadedBuilder.java:51)
	at org.apache.maven.lifecycle.internal.LifecycleStarter.execute(LifecycleStarter.java:128)
	at org.apache.maven.DefaultMaven.doExecute(DefaultMaven.java:307)
	at org.apache.maven.DefaultMaven.doExecute(DefaultMaven.java:193)
	at org.apache.maven.DefaultMaven.execute(DefaultMaven.java:106)
	at org.apache.maven.cli.MavenCli.execute(MavenCli.java:863)
	at org.apache.maven.cli.MavenCli.doMain(MavenCli.java:288)
	at org.apache.maven.cli.MavenCli.main(MavenCli.java:199)
	at sun.reflect.NativeMethodAccessorImpl.invoke0(Native Method)
	at sun.reflect.NativeMethodAccessorImpl.invoke(NativeMethodAccessorImpl.java:62)
	at sun.reflect.DelegatingMethodAccessorImpl.invoke(DelegatingMethodAccessorImpl.java:43)
	at java.lang.reflect.Method.invoke(Method.java:498)
	at org.codehaus.plexus.classworlds.launcher.Launcher.launchEnhanced(Launcher.java:289)
	at org.codehaus.plexus.classworlds.launcher.Launcher.launch(Launcher.java:229)
	at org.codehaus.plexus.classworlds.launcher.Launcher.mainWithExitCode(Launcher.java:415)
	at org.codehaus.plexus.classworlds.launcher.Launcher.main(Launcher.java:356)
Caused by: org.apache.maven.plugin.MojoFailureException: An unexpected error occured while launching the test runtime (return code 143). See log for details.
	at org.eclipse.tycho.surefire.TestMojo.runTest(TestMojo.java:950)
	at org.eclipse.tycho.surefire.TestMojo.execute(TestMojo.java:630)
	at org.apache.maven.plugin.DefaultBuildPluginManager.executeMojo(DefaultBuildPluginManager.java:134)
	at org.apache.maven.lifecycle.internal.MojoExecutor.execute(MojoExecutor.java:207)
	... 20 more
[ERROR] 
[ERROR] Re-run Maven using the -X switch to enable full debug logging.
[ERROR] 
[ERROR] For more information about the errors and possible solutions, please read the following articles:
[ERROR] [Help 1] http://cwiki.apache.org/confluence/display/MAVEN/MojoFailureException
[ERROR] 
[ERROR] After correcting the problems, you can resume the build with the command
[ERROR]   mvn <goals> -rf :org.eclipse.ajdt.ui.tests
[DEBUG] Waiting for process to finish
[DEBUG] Result: 1
Terminating xvnc.
Recording test results
Finished: FAILURE