UnstableConsole Output

Skipping 53,728 KB.. Full Log
ngineTest)  Time elapsed: 1.996 sec
testMainInNestedClassInAJFile(org.eclipse.ajdt.ui.tests.launching.AJMainMethodSearchEngineTest)  Time elapsed: 6.774 sec
testGenerateLTWConfigFile1(org.eclipse.ajdt.ui.tests.launching.LTWUtilsTest)  Time elapsed: 8.426 sec
testGenerateLTWConfigFile2(org.eclipse.ajdt.ui.tests.launching.LTWUtilsTest)  Time elapsed: 5.616 sec
testGenerateLTWConfigFile3(org.eclipse.ajdt.ui.tests.launching.LTWUtilsTest)  Time elapsed: 8.708 sec
testGenerateLTWConfigFile4(org.eclipse.ajdt.ui.tests.launching.LTWUtilsTest)  Time elapsed: 3.263 sec
testGenerateLTWConfigFile5(org.eclipse.ajdt.ui.tests.launching.LTWUtilsTest)  Time elapsed: 4.211 sec
testGenerateLTWConfigFile6(org.eclipse.ajdt.ui.tests.launching.LTWUtilsTest)  Time elapsed: 12.292 sec
testGenerateLTWConfigFile7(org.eclipse.ajdt.ui.tests.launching.LTWUtilsTest)  Time elapsed: 4.24 sec
testGetAspects(org.eclipse.ajdt.ui.tests.launching.LTWUtilsTest)  Time elapsed: 4.966 sec
testGenerateLTWConfigFile2(org.eclipse.ajdt.ui.tests.launching.LTWUtilsTest2)  Time elapsed: 5.505 sec
testGenerateLTWConfigFile3(org.eclipse.ajdt.ui.tests.launching.LTWUtilsTest2)  Time elapsed: 9.281 sec
testGenerateLTWConfigFile5(org.eclipse.ajdt.ui.tests.launching.LTWUtilsTest2)  Time elapsed: 4.286 sec
testGenerateLTWConfigFile6(org.eclipse.ajdt.ui.tests.launching.LTWUtilsTest2)  Time elapsed: 11.658 sec
testGenerateLTWConfigFile7(org.eclipse.ajdt.ui.tests.launching.LTWUtilsTest2)  Time elapsed: 4.318 sec
testGenerateLTWConfigFile8(org.eclipse.ajdt.ui.tests.launching.LTWUtilsTest2)  Time elapsed: 4.236 sec
testGetAspects(org.eclipse.ajdt.ui.tests.launching.LTWUtilsTest2)  Time elapsed: 4.893 sec
testBug158937(org.eclipse.ajdt.ui.tests.lazystart.ImageDecoratorTest)  Time elapsed: 2.997 sec
testBug159873(org.eclipse.ajdt.ui.tests.model.BinaryWeavingSupportTest)  Time elapsed: 5.259 sec
testIfAJCodeTemplatesAvailable(org.eclipse.ajdt.ui.tests.CodeTemplatesTest)  Time elapsed: 1.53 sec
testContentAssistA(org.eclipse.ajdt.ui.tests.editor.contentassist.ContentAssistTests)  Time elapsed: 10.158 sec
testContentAssistB(org.eclipse.ajdt.ui.tests.editor.contentassist.ContentAssistTests)  Time elapsed: 7.899 sec
testContentAssistC(org.eclipse.ajdt.ui.tests.editor.contentassist.ContentAssistTests)  Time elapsed: 7.649 sec
testContentAssistD(org.eclipse.ajdt.ui.tests.editor.contentassist.ContentAssistTests)  Time elapsed: 7.731 sec
testContentAssistE(org.eclipse.ajdt.ui.tests.editor.contentassist.ContentAssistTests)  Time elapsed: 11.039 sec
testContentAssistF(org.eclipse.ajdt.ui.tests.editor.contentassist.ContentAssistTests)  Time elapsed: 8.342 sec
testITDField(org.eclipse.ajdt.ui.tests.editor.contentassist.ContentAssistTests2)  Time elapsed: 7.837 sec
testITDMethod(org.eclipse.ajdt.ui.tests.editor.contentassist.ContentAssistTests2)  Time elapsed: 3.058 sec
testITDConstructor(org.eclipse.ajdt.ui.tests.editor.contentassist.ContentAssistTests2)  Time elapsed: 3.292 sec
testITDFieldInField(org.eclipse.ajdt.ui.tests.editor.contentassist.ContentAssistTests2)  Time elapsed: 2.908 sec
testITDFieldInFieldInOtherClass(org.eclipse.ajdt.ui.tests.editor.contentassist.ContentAssistTests2)  Time elapsed: 5.024 sec
testFromDeclareParent(org.eclipse.ajdt.ui.tests.editor.contentassist.ContentAssistTests2)  Time elapsed: 3.145 sec
testITDConstructorInOtherClass(org.eclipse.ajdt.ui.tests.editor.contentassist.ContentAssistTests2)  Time elapsed: 3.15 sec
testITDMethodInOtherClass(org.eclipse.ajdt.ui.tests.editor.contentassist.ContentAssistTests2)  Time elapsed: 2.985 sec
testFromITDOnDeclareParentInOtherClass(org.eclipse.ajdt.ui.tests.editor.contentassist.ContentAssistTests2)  Time elapsed: 3.034 sec
testFromDeclareParentInOtherClass(org.eclipse.ajdt.ui.tests.editor.contentassist.ContentAssistTests2)  Time elapsed: 3.228 sec
testFromITDOnDeclareParent(org.eclipse.ajdt.ui.tests.editor.contentassist.ContentAssistTests2)  Time elapsed: 3.152 sec
testITDFieldInOtherClass(org.eclipse.ajdt.ui.tests.editor.contentassist.ContentAssistTests2)  Time elapsed: 2.856 sec
testITDField(org.eclipse.ajdt.ui.tests.editor.contentassist.ContentAssistTests3)  Time elapsed: 3.321 sec
testITDMethod(org.eclipse.ajdt.ui.tests.editor.contentassist.ContentAssistTests3)  Time elapsed: 2.979 sec
testITDConstructor(org.eclipse.ajdt.ui.tests.editor.contentassist.ContentAssistTests3)  Time elapsed: 3.056 sec
testITDFieldInField(org.eclipse.ajdt.ui.tests.editor.contentassist.ContentAssistTests3)  Time elapsed: 3.226 sec
testITDFieldInFieldInOtherClass(org.eclipse.ajdt.ui.tests.editor.contentassist.ContentAssistTests3)  Time elapsed: 3.057 sec
testFromDeclareParent(org.eclipse.ajdt.ui.tests.editor.contentassist.ContentAssistTests3)  Time elapsed: 3.083 sec
testITDConstructorInOtherClass(org.eclipse.ajdt.ui.tests.editor.contentassist.ContentAssistTests3)  Time elapsed: 3.051 sec
testITDMethodInOtherClass(org.eclipse.ajdt.ui.tests.editor.contentassist.ContentAssistTests3)  Time elapsed: 3.071 sec
testFromITDOnDeclareParentInOtherClass(org.eclipse.ajdt.ui.tests.editor.contentassist.ContentAssistTests3)  Time elapsed: 3.199 sec
testFromDeclareParentInOtherClass(org.eclipse.ajdt.ui.tests.editor.contentassist.ContentAssistTests3)  Time elapsed: 3.058 sec
testFromITDOnDeclareParent(org.eclipse.ajdt.ui.tests.editor.contentassist.ContentAssistTests3)  Time elapsed: 3.056 sec
testITDFieldInOtherClass(org.eclipse.ajdt.ui.tests.editor.contentassist.ContentAssistTests3)  Time elapsed: 3.197 sec
testInITD(org.eclipse.ajdt.ui.tests.editor.contentassist.ContentAssistTests4)  Time elapsed: 3.314 sec
testInMainMethod(org.eclipse.ajdt.ui.tests.editor.contentassist.ContentAssistTests4)  Time elapsed: 2.812 sec
testInAdvice(org.eclipse.ajdt.ui.tests.editor.contentassist.ContentAssistTests4)  Time elapsed: 3.044 sec
testGenericContentAssist(org.eclipse.ajdt.ui.tests.editor.contentassist.ContentAssistTests5)  Time elapsed: 3.138 sec
testGenericContentAssist2(org.eclipse.ajdt.ui.tests.editor.contentassist.ContentAssistTests5)  Time elapsed: 3.168 sec
testGenericContentAssist3(org.eclipse.ajdt.ui.tests.editor.contentassist.ContentAssistTests5)  Time elapsed: 2.966 sec
testGenericContentAssist4(org.eclipse.ajdt.ui.tests.editor.contentassist.ContentAssistTests5)  Time elapsed: 3.121 sec
testGenericContentAssist(org.eclipse.ajdt.ui.tests.editor.contentassist.Bug273691ContentAssist)  Time elapsed: 3.194 sec
testHasAspectInClass(org.eclipse.ajdt.ui.tests.editor.contentassist.Bug280508ContentAssist)  Time elapsed: 8.308 sec
testAspectOfTypeInClass(org.eclipse.ajdt.ui.tests.editor.contentassist.Bug280508ContentAssist)  Time elapsed: 8.269 sec
testGetWithinTypeName(org.eclipse.ajdt.ui.tests.editor.contentassist.Bug280508ContentAssist)  Time elapsed: 7.939 sec
testAspectOfInClass(org.eclipse.ajdt.ui.tests.editor.contentassist.Bug280508ContentAssist)  Time elapsed: 8.148 sec
testAspectOfInAspect(org.eclipse.ajdt.ui.tests.editor.contentassist.Bug280508ContentAssist)  Time elapsed: 8.063 sec
testAspectOfTypeInAspect(org.eclipse.ajdt.ui.tests.editor.contentassist.Bug280508ContentAssist)  Time elapsed: 8.681 sec
testContentAssistInOtherType(org.eclipse.ajdt.ui.tests.editor.contentassist.ITITContentAssistTests)  Time elapsed: 9.119 sec
testContentAssistInAspect(org.eclipse.ajdt.ui.tests.editor.contentassist.ITITContentAssistTests)  Time elapsed: 8.233 sec
testContentAssistInTargetType(org.eclipse.ajdt.ui.tests.editor.contentassist.ITITContentAssistTests)  Time elapsed: 8.318 sec
testPrivateContentAssistShouldNotAppear(org.eclipse.ajdt.ui.tests.editor.contentassist.PetClinicTests)  Time elapsed: 14.682 sec
testPackageProtectedContentAssistShouldAppear(org.eclipse.ajdt.ui.tests.editor.contentassist.PetClinicTests)  Time elapsed: 7.815 sec
testPrivateContentAssistShouldAppear(org.eclipse.ajdt.ui.tests.editor.contentassist.PetClinicTests)  Time elapsed: 7.689 sec
testContentAssist(org.eclipse.ajdt.ui.tests.editor.contentassist.PetClinicTests)  Time elapsed: 7.794 sec
testPackageProtectedContentAssistShouldNotAppear(org.eclipse.ajdt.ui.tests.editor.contentassist.PetClinicTests)  Time elapsed: 7.704 sec
testPublicContentAssistShouldAppear(org.eclipse.ajdt.ui.tests.editor.contentassist.PetClinicTests)  Time elapsed: 7.984 sec
testModelCheck(org.eclipse.ajdt.ui.tests.editor.contentassist.PetClinicTests)  Time elapsed: 11.58 sec
testReconciling(org.eclipse.ajdt.ui.tests.editor.contentassist.PetClinicTests)  Time elapsed: 8.957 sec
testProjectWizardPerformFinish(org.eclipse.ajdt.ui.tests.wizards.AspectJProjectWizardTest)  Time elapsed: 7.005 sec
testProjectWizardPageAddition(org.eclipse.ajdt.ui.tests.wizards.AspectJProjectWizardTest)  Time elapsed: 1.645 sec
testHowDealingWithProjectDependencies(org.eclipse.ajdt.ui.tests.builder.ProjectDependenciesTest)  Time elapsed: 16.532 sec
testProjectDependencies1(org.eclipse.ajdt.ui.tests.builder.ProjectDependenciesTest)  Time elapsed: 25.243 sec
testProjectDependenciesWithPluginProjects(org.eclipse.ajdt.ui.tests.builder.ProjectDependenciesTest)  Time elapsed: 12.815 sec
testWithOutJarSwitch1(org.eclipse.ajdt.ui.tests.builder.ProjectDependenciesWithJarFilesTest)  Time elapsed: 27.855 sec
testWithOutJarSwitch2(org.eclipse.ajdt.ui.tests.builder.ProjectDependenciesWithJarFilesTest)  Time elapsed: 15.529 sec  <<< FAILURE!
junit.framework.AssertionFailedError: project X should have project Y's outjar on it's classpath
	at junit.framework.Assert.fail(Assert.java:57)
	at junit.framework.Assert.assertTrue(Assert.java:22)
	at junit.framework.TestCase.assertTrue(TestCase.java:192)
	at org.eclipse.ajdt.ui.tests.builder.ProjectDependenciesWithJarFilesTest.testWithOutJarSwitch2_aroundBody8(ProjectDependenciesWithJarFilesTest.java:496)
	at org.eclipse.ajdt.ui.tests.builder.ProjectDependenciesWithJarFilesTest.testWithOutJarSwitch2_aroundBody9$advice(ProjectDependenciesWithJarFilesTest.java:52)
	at org.eclipse.ajdt.ui.tests.builder.ProjectDependenciesWithJarFilesTest.testWithOutJarSwitch2(ProjectDependenciesWithJarFilesTest.java:1)

testWithOutJarSwitch3(org.eclipse.ajdt.ui.tests.builder.ProjectDependenciesWithJarFilesTest)  Time elapsed: 24.828 sec
testWithExportedJarFile(org.eclipse.ajdt.ui.tests.builder.ProjectDependenciesWithJarFilesTest)  Time elapsed: 11.171 sec
testWithExportedJarFileAndBinaryProject(org.eclipse.ajdt.ui.tests.builder.ProjectDependenciesWithJarFilesTest)  Time elapsed: 15.425 sec
testBuildTwiceWithOutJar(org.eclipse.ajdt.ui.tests.builder.ProjectDependenciesWithJarFilesTest)  Time elapsed: 18.022 sec
testWithExportedJarFileAndNoSrcEntry(org.eclipse.ajdt.ui.tests.builder.ProjectDependenciesWithJarFilesTest)  Time elapsed: 11.081 sec
testDependingProjectBuiltWhenOutjarChanges(org.eclipse.ajdt.ui.tests.builder.ProjectDependenciesWithJarFilesTest)  Time elapsed: 6.252 sec  <<< FAILURE!
junit.framework.AssertionFailedError:  P/jarCreatingProject should have P/jarDependentProject as it's list of referencing projects - if not, see JDT bug 84214 expected:<1> but was:<0>
	at junit.framework.Assert.fail(Assert.java:57)
	at junit.framework.Assert.failNotEquals(Assert.java:329)
	at junit.framework.Assert.assertEquals(Assert.java:78)
	at junit.framework.Assert.assertEquals(Assert.java:234)
	at junit.framework.TestCase.assertEquals(TestCase.java:401)
	at org.eclipse.ajdt.ui.tests.builder.ProjectDependenciesWithJarFilesTest.checkForJDTBug84214(ProjectDependenciesWithJarFilesTest.java:883)
	at org.eclipse.ajdt.ui.tests.builder.ProjectDependenciesWithJarFilesTest.testDependingProjectBuiltWhenOutjarChanges_aroundBody14(ProjectDependenciesWithJarFilesTest.java:775)
	at org.eclipse.ajdt.ui.tests.builder.ProjectDependenciesWithJarFilesTest.testDependingProjectBuiltWhenOutjarChanges_aroundBody15$advice(ProjectDependenciesWithJarFilesTest.java:52)
	at org.eclipse.ajdt.ui.tests.builder.ProjectDependenciesWithJarFilesTest.testDependingProjectBuiltWhenOutjarChanges(ProjectDependenciesWithJarFilesTest.java:1)

testMarkersAreAdded(org.eclipse.ajdt.ui.tests.builder.AdviceMarkersTest)  Time elapsed: 2.717 sec
testMarkers(org.eclipse.ajdt.ui.tests.builder.AdviceMarkersTest2)  Time elapsed: 3.183 sec
testMarkers(org.eclipse.ajdt.ui.tests.builder.AdviceMarkersTest3)  Time elapsed: 3.776 sec
testMarkers(org.eclipse.ajdt.ui.tests.builder.AdviceMarkersTest4)  Time elapsed: 2.627 sec
testMarkers(org.eclipse.ajdt.ui.tests.builder.AdviceMarkersTest5)  Time elapsed: 3.167 sec
testBug235204(org.eclipse.ajdt.ui.tests.builder.AdviceMarkersTest6)  Time elapsed: 3.924 sec
testChangeInProject(org.eclipse.ajdt.ui.tests.builder.AdviceMarkersTest7)  Time elapsed: 13.629 sec
testChangeOnAspectPath(org.eclipse.ajdt.ui.tests.builder.AdviceMarkersTest7)  Time elapsed: 9.216 sec
testDeclareErrorOnMultipleProjects(org.eclipse.ajdt.ui.tests.builder.Bug285188DecErrorTests)  Time elapsed: 5.328 sec
testBug128803(org.eclipse.ajdt.ui.tests.builder.Bug128803Test)  Time elapsed: 10.639 sec
testBug151818(org.eclipse.ajdt.ui.tests.builder.Bug151818Test)  Time elapsed: 3.033 sec
testnothing(org.eclipse.ajdt.ui.tests.builder.Bug243376Test)  Time elapsed: 2.62 sec
testCopyAndRemoveNewNonSrcFileWithNonStandardOutputDir(org.eclipse.ajdt.ui.tests.builder.BuilderTest)  Time elapsed: 11.851 sec
testCopyAndRemoveResourceWithoutSrcFolder(org.eclipse.ajdt.ui.tests.builder.BuilderTest)  Time elapsed: 5.302 sec
testCreateAndDeleteNewFolder(org.eclipse.ajdt.ui.tests.builder.BuilderTest)  Time elapsed: 9.109 sec
testIncrementalBuildWithSrcFolder(org.eclipse.ajdt.ui.tests.builder.BuilderTest)  Time elapsed: 8.12 sec
testCopyAndRemoveNewNonSrcFileWithMultipleSrcDirs(org.eclipse.ajdt.ui.tests.builder.BuilderTest)  Time elapsed: 7.046 sec
testCreateAndDeleteNewPackage(org.eclipse.ajdt.ui.tests.builder.BuilderTest)  Time elapsed: 9.166 sec
testIncrementalBuildWithoutSrcFolder(org.eclipse.ajdt.ui.tests.builder.BuilderTest)  Time elapsed: 9.694 sec
testCopyAndRemoveNewNonSrcFile(org.eclipse.ajdt.ui.tests.builder.BuilderTest)  Time elapsed: 9.573 sec
testUpdateNonSrcFile(org.eclipse.ajdt.ui.tests.builder.BuilderTest)  Time elapsed: 14.71 sec
testCreateAndRemoveNewNonSrcFileFromDefaultPackage(org.eclipse.ajdt.ui.tests.builder.BuilderTest)  Time elapsed: 13.3 sec
testAspectPath(org.eclipse.ajdt.ui.tests.builder.BuildPathTests)  Time elapsed: 27.014 sec
testInpath(org.eclipse.ajdt.ui.tests.builder.BuildPathTests)  Time elapsed: 27.132 sec
testMarkersUpdatedAfterChangedProject(org.eclipse.ajdt.ui.tests.builder.ChangingMarkersTest)  Time elapsed: 9.162 sec
testSavedMarkerPreferences(org.eclipse.ajdt.ui.tests.builder.CustomMarkersTest)  Time elapsed: 17.2 sec
testClean(org.eclipse.ajdt.ui.tests.builder.InpathOutFolderTest)  Time elapsed: 11.341 sec
testChangeInpathOutLocation(org.eclipse.ajdt.ui.tests.builder.InpathOutFolderTest)  Time elapsed: 6.855 sec
testJarOnInpath(org.eclipse.ajdt.ui.tests.builder.InpathOutFolderTest)  Time elapsed: 5.758 sec
testJarOnInpath(org.eclipse.ajdt.ui.tests.builder.InpathOutFolderTest2)  Time elapsed: 4.315 sec  <<< FAILURE!
junit.framework.AssertionFailedError: AspectJ RT should exist in the in path out folder
	at junit.framework.Assert.fail(Assert.java:57)
	at junit.framework.TestCase.fail(TestCase.java:227)
	at org.eclipse.ajdt.ui.tests.builder.InpathOutFolderTest2.testJarOnInpath_aroundBody0(InpathOutFolderTest2.java:63)
	at org.eclipse.ajdt.ui.tests.builder.InpathOutFolderTest2.testJarOnInpath_aroundBody1$advice(InpathOutFolderTest2.java:52)
	at org.eclipse.ajdt.ui.tests.builder.InpathOutFolderTest2.testJarOnInpath(InpathOutFolderTest2.java:1)

testBug121810(org.eclipse.ajdt.ui.tests.builder.ITDinSeparateProjects)  Time elapsed: 5.833 sec
testMarkerIsNotRemoved(org.eclipse.ajdt.ui.tests.builder.ProblemMarkerTest)  Time elapsed: 2.771 sec
testJavaNature(org.eclipse.ajdt.ui.tests.builder.EnsureAJBuilderTests)  Time elapsed: 3.199 sec
testAJBuilder(org.eclipse.ajdt.ui.tests.builder.EnsureAJBuilderTests)  Time elapsed: 8.595 sec
testNoRemoveJavaBuilder(org.eclipse.ajdt.ui.tests.builder.EnsureAJBuilderTests)  Time elapsed: 8.187 sec
testJavaBuilder(org.eclipse.ajdt.ui.tests.builder.EnsureAJBuilderTests)  Time elapsed: 7.976 sec
testNoBuilder(org.eclipse.ajdt.ui.tests.builder.EnsureAJBuilderTests)  Time elapsed: 7.715 sec
testBothBuilders(org.eclipse.ajdt.ui.tests.builder.EnsureAJBuilderTests)  Time elapsed: 8.084 sec
testDeletingAJCompilationUnits(org.eclipse.ajdt.ui.tests.javamodel.elements.AJCompilationUnitTest2)  Time elapsed: 9.939 sec
testWhenProjectIsConverted(org.eclipse.ajdt.ui.tests.javamodel.Bug154339Test)  Time elapsed: 6.573 sec
testWhenProjectIsDeleted(org.eclipse.ajdt.ui.tests.javamodel.Bug154339Test)  Time elapsed: 4.576 sec
testWhenProjectIsClosed(org.eclipse.ajdt.ui.tests.javamodel.Bug154339Test)  Time elapsed: 11.729 sec
testAspectInPackageDeclaration(org.eclipse.ajdt.ui.tests.reconciling.ProblemFinderTests4)  Time elapsed: 3.478 sec
testAspectFile(org.eclipse.ajdt.ui.tests.reconciling.ProblemFinderTests4)  Time elapsed: 3.056 sec
testJavaFile(org.eclipse.ajdt.ui.tests.reconciling.ProblemFinderTests4)  Time elapsed: 3.76 sec
testSwitchStatement(org.eclipse.ajdt.ui.tests.reconciling.ProblemFinderTests4)  Time elapsed: 3.472 sec
testProblemFindingAll(org.eclipse.ajdt.ui.tests.reconciling.ProblemFinderTests10)  Time elapsed: 3.939 sec
testProblemFindingErrors(org.eclipse.ajdt.ui.tests.reconciling.ProblemFinderTests10)  Time elapsed: 12.652 sec
testProblemFinding0(org.eclipse.ajdt.ui.tests.reconciling.ProblemFinderTests5)  Time elapsed: 10.713 sec
testProblemFinding1(org.eclipse.ajdt.ui.tests.reconciling.ProblemFinderTests5)  Time elapsed: 3.028 sec
testProblemFinding2(org.eclipse.ajdt.ui.tests.reconciling.ProblemFinderTests5)  Time elapsed: 2.143 sec
testProblemFinding3(org.eclipse.ajdt.ui.tests.reconciling.ProblemFinderTests5)  Time elapsed: 2.982 sec
testProblemFinding4(org.eclipse.ajdt.ui.tests.reconciling.ProblemFinderTests5)  Time elapsed: 2.232 sec
testProblemFinding5(org.eclipse.ajdt.ui.tests.reconciling.ProblemFinderTests5)  Time elapsed: 2.924 sec
testProblemFinding6(org.eclipse.ajdt.ui.tests.reconciling.ProblemFinderTests5)  Time elapsed: 3.17 sec
testProblemFinding0(org.eclipse.ajdt.ui.tests.reconciling.ProblemFinderTests6)  Time elapsed: 3.147 sec
testProblemFinding1(org.eclipse.ajdt.ui.tests.reconciling.ProblemFinderTests6)  Time elapsed: 5.699 sec
testProblemFinding2(org.eclipse.ajdt.ui.tests.reconciling.ProblemFinderTests6)  Time elapsed: 2.874 sec
testProblemFinding3(org.eclipse.ajdt.ui.tests.reconciling.ProblemFinderTests6)  Time elapsed: 3.166 sec
testProblemFinding4(org.eclipse.ajdt.ui.tests.reconciling.ProblemFinderTests6)  Time elapsed: 3.38 sec
testProblemFinding5(org.eclipse.ajdt.ui.tests.reconciling.ProblemFinderTests6)  Time elapsed: 3.103 sec
testProblemFinding0(org.eclipse.ajdt.ui.tests.reconciling.ProblemFinderTests8)  Time elapsed: 3.04 sec
testProblemFinding1(org.eclipse.ajdt.ui.tests.reconciling.ProblemFinderTests8)  Time elapsed: 7.919 sec
testProblemFinding2(org.eclipse.ajdt.ui.tests.reconciling.ProblemFinderTests8)  Time elapsed: 15.23 sec
testProblemFinding3(org.eclipse.ajdt.ui.tests.reconciling.ProblemFinderTests8)  Time elapsed: 7.886 sec
testProblemFinding4(org.eclipse.ajdt.ui.tests.reconciling.ProblemFinderTests8)  Time elapsed: 7.641 sec
testProblemFinding5(org.eclipse.ajdt.ui.tests.reconciling.ProblemFinderTests8)  Time elapsed: 7.584 sec
testProblemFinding6(org.eclipse.ajdt.ui.tests.reconciling.ProblemFinderTests8)  Time elapsed: 7.611 sec
testProblemFinding7(org.eclipse.ajdt.ui.tests.reconciling.ProblemFinderTests8)  Time elapsed: 8.134 sec
testProblemFindingAll(org.eclipse.ajdt.ui.tests.reconciling.ProblemFinderTests11)  Time elapsed: 7.323 sec
testProblemFindingErrors(org.eclipse.ajdt.ui.tests.reconciling.ProblemFinderTests11)  Time elapsed: 7.458 sec
testProblemFindingAll(org.eclipse.ajdt.ui.tests.reconciling.ProblemFinderTests12)  Time elapsed: 7.971 sec
testProblemFindingAll(org.eclipse.ajdt.ui.tests.reconciling.Bug279439Reconciling)  Time elapsed: 7.11 sec
testHyperlink(org.eclipse.ajdt.ui.tests.debug.JavaConsoleHyperlinkTest)  Time elapsed: 11.363 sec
testBreakpointInAJFile1(org.eclipse.ajdt.ui.tests.debug.DebugBreakpointsTests)  Time elapsed: 4.664 sec
testBreakpointInAJFile2(org.eclipse.ajdt.ui.tests.debug.DebugBreakpointsTests)  Time elapsed: 9.946 sec
testBreakpointInAJFile3(org.eclipse.ajdt.ui.tests.debug.DebugBreakpointsTests)  Time elapsed: 9.466 sec
testBreakpointInAJFile4(org.eclipse.ajdt.ui.tests.debug.DebugBreakpointsTests)  Time elapsed: 9.282 sec
testBreakpointInAJFile5(org.eclipse.ajdt.ui.tests.debug.DebugBreakpointsTests)  Time elapsed: 8.792 sec
testBreakpointInAJFile6(org.eclipse.ajdt.ui.tests.debug.DebugBreakpointsTests)  Time elapsed: 9.787 sec
testBreakpointInAJFile7(org.eclipse.ajdt.ui.tests.debug.DebugBreakpointsTests)  Time elapsed: 9.446 sec
testBreakpointInAJFile8(org.eclipse.ajdt.ui.tests.debug.DebugBreakpointsTests)  Time elapsed: 10.588 sec
testBreakpointInAJFile9(org.eclipse.ajdt.ui.tests.debug.DebugBreakpointsTests)  Time elapsed: 17.578 sec
testFFDC(org.eclipse.ajdt.ui.tests.ras.PluginFFDCTest)  Time elapsed: 8.012 sec
testRogueFFDC(org.eclipse.ajdt.ui.tests.ras.PluginFFDCTest)  Time elapsed: 7.296 sec
testRenamePackage(org.eclipse.ajdt.ui.tests.refactoring.RenamePackageTest)  Time elapsed: 9.084 sec
testBug106589(org.eclipse.ajdt.ui.tests.refactoring.OrganizeImportsTest)  Time elapsed: 9.437 sec
testBug188845(org.eclipse.ajdt.ui.tests.refactoring.OrganizeImportsTest)  Time elapsed: 8.913 sec
testBug236352(org.eclipse.ajdt.ui.tests.refactoring.OrganizeImportsTest)  Time elapsed: 6.775 sec
testCopyPasteAJ(org.eclipse.ajdt.ui.tests.refactoring.CopyPasteAJTest)  Time elapsed: 7.732 sec
testDeclareParents(org.eclipse.ajdt.ui.tests.refactoring.PushinRefactoringTests)  Time elapsed: 16.566 sec
testDeclareAnnotation(org.eclipse.ajdt.ui.tests.refactoring.PushinRefactoringTests)  Time elapsed: 6.311 sec
testDeclareAnnotationBig(org.eclipse.ajdt.ui.tests.refactoring.PushinRefactoringTests)  Time elapsed: 6.334 sec
testITDsWillDelete(org.eclipse.ajdt.ui.tests.refactoring.PushinRefactoringTests)  Time elapsed: 6.616 sec
testBug283657(org.eclipse.ajdt.ui.tests.refactoring.PushinRefactoringTests)  Time elapsed: 10.39 sec
testBug321065(org.eclipse.ajdt.ui.tests.refactoring.PushinRefactoringTests)  Time elapsed: 10.451 sec
testSimpleITDsNoDelete(org.eclipse.ajdt.ui.tests.refactoring.PushinRefactoringTests)  Time elapsed: 6.871 sec
testPushInRemoveFieldClassFullyQualified(org.eclipse.ajdt.ui.tests.refactoring.PushInRefactoringRemoveAnnotationTests)  Time elapsed: 5.522 sec
testPushInRemoveFieldAspectFullyQualified(org.eclipse.ajdt.ui.tests.refactoring.PushInRefactoringRemoveAnnotationTests)  Time elapsed: 6.161 sec
testPushInRemoveFieldMultiple(org.eclipse.ajdt.ui.tests.refactoring.PushInRefactoringRemoveAnnotationTests)  Time elapsed: 6.338 sec
testPushInRemoveFieldSimple(org.eclipse.ajdt.ui.tests.refactoring.PushInRefactoringRemoveAnnotationTests)  Time elapsed: 5.936 sec
testPushInRemoveFieldBothFullyQualified(org.eclipse.ajdt.ui.tests.refactoring.PushInRefactoringRemoveAnnotationTests)  Time elapsed: 5.805 sec
testPushInRemoveFieldMultiple2(org.eclipse.ajdt.ui.tests.refactoring.PushInRefactoringRemoveAnnotationTests)  Time elapsed: 6.301 sec
testPushInRemoveFieldDifferentPackages(org.eclipse.ajdt.ui.tests.refactoring.PushInRefactoringRemoveAnnotationTests)  Time elapsed: 5.891 sec
testPushInRemoveFieldClassFullyQualifiedMultiple1(org.eclipse.ajdt.ui.tests.refactoring.PushInRefactoringRemoveAnnotationTests)  Time elapsed: 6.331 sec
testPushInRemoveFieldClassFullyQualifiedMultiple2(org.eclipse.ajdt.ui.tests.refactoring.PushInRefactoringRemoveAnnotationTests)  Time elapsed: 6.371 sec
testImportRequired(org.eclipse.ajdt.ui.tests.refactoring.PushInRefactoringITITTests)  Time elapsed: 5.908 sec
testEmptyFullyQualifiedITIT(org.eclipse.ajdt.ui.tests.refactoring.PushInRefactoringITITTests)  Time elapsed: 6.031 sec
testOneFieldNoImports(org.eclipse.ajdt.ui.tests.refactoring.PushInRefactoringITITTests)  Time elapsed: 5.738 sec
testImportAlreadyThere(org.eclipse.ajdt.ui.tests.refactoring.PushInRefactoringITITTests)  Time elapsed: 6.649 sec
testEmptyITIT(org.eclipse.ajdt.ui.tests.refactoring.PushInRefactoringITITTests)  Time elapsed: 5.908 sec
testTwoITITsOneAspectDifferentTargets(org.eclipse.ajdt.ui.tests.refactoring.PushInRefactoringITITTests)  Time elapsed: 6.011 sec
testFullyQualifiedReference(org.eclipse.ajdt.ui.tests.refactoring.PushInRefactoringITITTests)  Time elapsed: 5.964 sec
testTwoITITsOneAspect(org.eclipse.ajdt.ui.tests.refactoring.PushInRefactoringITITTests)  Time elapsed: 5.77 sec
testTwoITITsOneAspectFirstOnly(org.eclipse.ajdt.ui.tests.refactoring.PushInRefactoringITITTests)  Time elapsed: 5.87 sec
testTwoFieldsNoImports(org.eclipse.ajdt.ui.tests.refactoring.PushInRefactoringITITTests)  Time elapsed: 5.798 sec
testAspectNotDeleted(org.eclipse.ajdt.ui.tests.refactoring.PushInRefactoringITITTests)  Time elapsed: 5.799 sec
testDefaultPackage1(org.eclipse.ajdt.ui.tests.refactoring.PushInRefactoringDeclareParentsTests)  Time elapsed: 6.202 sec
testDefaultPackage2(org.eclipse.ajdt.ui.tests.refactoring.PushInRefactoringDeclareParentsTests)  Time elapsed: 5.894 sec
testDefaultPackage3(org.eclipse.ajdt.ui.tests.refactoring.PushInRefactoringDeclareParentsTests)  Time elapsed: 6.713 sec
testDefaultPackage4(org.eclipse.ajdt.ui.tests.refactoring.PushInRefactoringDeclareParentsTests)  Time elapsed: 6.714 sec
testDefaultPackage5(org.eclipse.ajdt.ui.tests.refactoring.PushInRefactoringDeclareParentsTests)  Time elapsed: 6.637 sec
testDefaultPackage6(org.eclipse.ajdt.ui.tests.refactoring.PushInRefactoringDeclareParentsTests)  Time elapsed: 6.459 sec
testDefaultPackage7(org.eclipse.ajdt.ui.tests.refactoring.PushInRefactoringDeclareParentsTests)  Time elapsed: 6.41 sec
testDefaultPackage8(org.eclipse.ajdt.ui.tests.refactoring.PushInRefactoringDeclareParentsTests)  Time elapsed: 6.63 sec
testSamePackage1(org.eclipse.ajdt.ui.tests.refactoring.PushInRefactoringDeclareParentsTests)  Time elapsed: 6.272 sec
testSamePackage2(org.eclipse.ajdt.ui.tests.refactoring.PushInRefactoringDeclareParentsTests)  Time elapsed: 6.537 sec
testSamePackage3(org.eclipse.ajdt.ui.tests.refactoring.PushInRefactoringDeclareParentsTests)  Time elapsed: 6.889 sec
testGenerics1(org.eclipse.ajdt.ui.tests.refactoring.PushInRefactoringDeclareParentsTests)  Time elapsed: 6.287 sec
testOtherPackage1(org.eclipse.ajdt.ui.tests.refactoring.PushInRefactoringDeclareParentsTests)  Time elapsed: 6.879 sec
testOtherPackage2(org.eclipse.ajdt.ui.tests.refactoring.PushInRefactoringDeclareParentsTests)  Time elapsed: 7.052 sec
testPullProtected(org.eclipse.ajdt.ui.tests.refactoring.PullOutRefactoringTests)  Time elapsed: 6.653 sec
testPullSamePackage(org.eclipse.ajdt.ui.tests.refactoring.PullOutRefactoringTests)  Time elapsed: 7.009 sec
testGenericParamPrivateTypeRef(org.eclipse.ajdt.ui.tests.refactoring.PullOutRefactoringTests)  Time elapsed: 7.899 sec
testPullSameAspect(org.eclipse.ajdt.ui.tests.refactoring.PullOutRefactoringTests)  Time elapsed: 6.68 sec
testAddModifierWeirdComments(org.eclipse.ajdt.ui.tests.refactoring.PullOutRefactoringTests)  Time elapsed: 7.05 sec
testScaffolding(org.eclipse.ajdt.ui.tests.refactoring.PullOutRefactoringTests)  Time elapsed: 5.883 sec
testPullAbstractMethodWarnings(org.eclipse.ajdt.ui.tests.refactoring.PullOutRefactoringTests)  Time elapsed: 5.75 sec
testPullITDField(org.eclipse.ajdt.ui.tests.refactoring.PullOutRefactoringTests)  Time elapsed: 7.128 sec
testPullMultipleTargetsCanPrivate(org.eclipse.ajdt.ui.tests.refactoring.PullOutRefactoringTests)  Time elapsed: 6.786 sec
testPullWeirdComments(org.eclipse.ajdt.ui.tests.refactoring.PullOutRefactoringTests)  Time elapsed: 6.781 sec
testPrivateFieldReference2(org.eclipse.ajdt.ui.tests.refactoring.PullOutRefactoringTests)  Time elapsed: 6.391 sec
testPullMultipleTargetsSimple(org.eclipse.ajdt.ui.tests.refactoring.PullOutRefactoringTests)  Time elapsed: 6.837 sec
testPrivateMethodReference(org.eclipse.ajdt.ui.tests.refactoring.PullOutRefactoringTests)  Time elapsed: 6.232 sec
testPublicizeITDs(org.eclipse.ajdt.ui.tests.refactoring.PullOutRefactoringTests)  Time elapsed: 6.242 sec
testImportNameCollisionInDeclaringTypeRef(org.eclipse.ajdt.ui.tests.refactoring.PullOutRefactoringTests)  Time elapsed: 6.857 sec
testPrivateFieldReference(org.eclipse.ajdt.ui.tests.refactoring.PullOutRefactoringTests)  Time elapsed: 6.268 sec
testMakePrivilegedPrivileged(org.eclipse.ajdt.ui.tests.refactoring.PullOutRefactoringTests)  Time elapsed: 6.608 sec
testPullITDMethod(org.eclipse.ajdt.ui.tests.refactoring.PullOutRefactoringTests)  Time elapsed: 6.707 sec
testPrivilegedAspect(org.eclipse.ajdt.ui.tests.refactoring.PullOutRefactoringTests)  Time elapsed: 6.606 sec
testSimplePrivateTypeRef(org.eclipse.ajdt.ui.tests.refactoring.PullOutRefactoringTests)  Time elapsed: 5.959 sec
testPullSameCU(org.eclipse.ajdt.ui.tests.refactoring.PullOutRefactoringTests)  Time elapsed: 6.537 sec
testPullStatic(org.eclipse.ajdt.ui.tests.refactoring.PullOutRefactoringTests)  Time elapsed: 6.771 sec
testFieldPulling(org.eclipse.ajdt.ui.tests.refactoring.PullOutRefactoringTests)  Time elapsed: 6.962 sec
testPullInterfaceMethodWarning(org.eclipse.ajdt.ui.tests.refactoring.PullOutRefactoringTests)  Time elapsed: 6.161 sec
testGenericTypeParamUsed(org.eclipse.ajdt.ui.tests.refactoring.PullOutRefactoringTests)  Time elapsed: 6.211 sec
testPullITDConstructor(org.eclipse.ajdt.ui.tests.refactoring.PullOutRefactoringTests)  Time elapsed: 6.63 sec
testProtectedDropping(org.eclipse.ajdt.ui.tests.refactoring.PullOutRefactoringTests)  Time elapsed: 6.676 sec
testPullAspectMethod(org.eclipse.ajdt.ui.tests.refactoring.PullOutRefactoringTests)  Time elapsed: 6.151 sec
testPullAbstractStubMethods(org.eclipse.ajdt.ui.tests.refactoring.PullOutRefactoringTests)  Time elapsed: 6.254 sec
testPullPrivate(org.eclipse.ajdt.ui.tests.refactoring.PullOutRefactoringTests)  Time elapsed: 6.001 sec
testPullConstructorWithThisWarning(org.eclipse.ajdt.ui.tests.refactoring.PullOutRefactoringTests)  Time elapsed: 6.122 sec
testProtectedAndDefaulReference(org.eclipse.ajdt.ui.tests.refactoring.PullOutRefactoringTests)  Time elapsed: 5.699 sec
testImports(org.eclipse.ajdt.ui.tests.refactoring.PullOutRefactoringTests)  Time elapsed: 6.573 sec
testImportNameCollision(org.eclipse.ajdt.ui.tests.refactoring.PullOutRefactoringTests)  Time elapsed: 9.463 sec
testMakePrivilegedAspect(org.eclipse.ajdt.ui.tests.refactoring.PullOutRefactoringTests)  Time elapsed: 6.33 sec
testPullConstructor(org.eclipse.ajdt.ui.tests.refactoring.PullOutRefactoringTests)  Time elapsed: 6.517 sec
testSimple(org.eclipse.ajdt.ui.tests.refactoring.PullOutRefactoringTests)  Time elapsed: 6.573 sec
testArrayPrivateTypeRef(org.eclipse.ajdt.ui.tests.refactoring.PullOutRefactoringTests)  Time elapsed: 5.863 sec
testDifferentPackage(org.eclipse.ajdt.ui.tests.refactoring.PullOutRefactoringTests)  Time elapsed: 6.376 sec
testPullInterfaceVoidStubMethods(org.eclipse.ajdt.ui.tests.refactoring.PullOutRefactoringTests)  Time elapsed: 6.668 sec
testMultipleGenericTypeParamUsed(org.eclipse.ajdt.ui.tests.refactoring.PullOutRefactoringTests)  Time elapsed: 6.656 sec
testPullConstructorWithPrivateWarnings(org.eclipse.ajdt.ui.tests.refactoring.PullOutRefactoringTests)  Time elapsed: 5.965 sec
testRipple1(org.eclipse.ajdt.ui.tests.refactoring.ITDAwareRippleSearchTests)  Time elapsed: 6.163 sec
testRipple2(org.eclipse.ajdt.ui.tests.refactoring.ITDAwareRippleSearchTests)  Time elapsed: 6.088 sec
testRipple3(org.eclipse.ajdt.ui.tests.refactoring.ITDAwareRippleSearchTests)  Time elapsed: 6.202 sec
testRipple4(org.eclipse.ajdt.ui.tests.refactoring.ITDAwareRippleSearchTests)  Time elapsed: 6.388 sec
testRipple5(org.eclipse.ajdt.ui.tests.refactoring.ITDAwareRippleSearchTests)  Time elapsed: 6.037 sec
testRipple6(org.eclipse.ajdt.ui.tests.refactoring.ITDAwareRippleSearchTests)  Time elapsed: 6.409 sec
testRippleInterface1(org.eclipse.ajdt.ui.tests.refactoring.ITDAwareRippleSearchTests)  Time elapsed: 6.385 sec
testRippleInterface2(org.eclipse.ajdt.ui.tests.refactoring.ITDAwareRippleSearchTests)  Time elapsed: 6.539 sec
testRippleInterface3(org.eclipse.ajdt.ui.tests.refactoring.ITDAwareRippleSearchTests)  Time elapsed: 6.142 sec
testRippleInterface4(org.eclipse.ajdt.ui.tests.refactoring.ITDAwareRippleSearchTests)  Time elapsed: 6.528 sec
testRippleInterface5(org.eclipse.ajdt.ui.tests.refactoring.ITDAwareRippleSearchTests)  Time elapsed: 5.766 sec
testRippleInterface6(org.eclipse.ajdt.ui.tests.refactoring.ITDAwareRippleSearchTests)  Time elapsed: 7.228 sec
testPrivateRenameField1(org.eclipse.ajdt.ui.tests.refactoring.ITDRenameProcessorTests)  Time elapsed: 6.066 sec
testMethodRenameOnInterfaceWithDeclareParents1(org.eclipse.ajdt.ui.tests.refactoring.ITDRenameProcessorTests)  Time elapsed: 6.233 sec
testMethodRenameOnInterfaceWithDeclareParents2(org.eclipse.ajdt.ui.tests.refactoring.ITDRenameProcessorTests)  Time elapsed: 5.945 sec
testSimpleRenameField1(org.eclipse.ajdt.ui.tests.refactoring.ITDRenameProcessorTests)  Time elapsed: 6.13 sec
testSimpleRenameField2(org.eclipse.ajdt.ui.tests.refactoring.ITDRenameProcessorTests)  Time elapsed: 6.051 sec
testSimpleRenameField3(org.eclipse.ajdt.ui.tests.refactoring.ITDRenameProcessorTests)  Time elapsed: 5.822 sec
testRenameMethodTwoArgs1(org.eclipse.ajdt.ui.tests.refactoring.ITDRenameProcessorTests)  Time elapsed: 5.936 sec
testRenameMethodTwoArgs2(org.eclipse.ajdt.ui.tests.refactoring.ITDRenameProcessorTests)  Time elapsed: 6.521 sec
testRenameMethodTwoArgs3(org.eclipse.ajdt.ui.tests.refactoring.ITDRenameProcessorTests)  Time elapsed: 6.806 sec
testRenameMethodPrimitiveArg1(org.eclipse.ajdt.ui.tests.refactoring.ITDRenameProcessorTests)  Time elapsed: 6.592 sec
testRenameMethodPrimitiveArg2(org.eclipse.ajdt.ui.tests.refactoring.ITDRenameProcessorTests)  Time elapsed: 6.025 sec
testRenameMethodPrimitiveArg3(org.eclipse.ajdt.ui.tests.refactoring.ITDRenameProcessorTests)  Time elapsed: 7.139 sec
testRenameMethodStringArg1(org.eclipse.ajdt.ui.tests.refactoring.ITDRenameProcessorTests)  Time elapsed: 6.189 sec
testRenameMethodStringArg2(org.eclipse.ajdt.ui.tests.refactoring.ITDRenameProcessorTests)  Time elapsed: 5.955 sec
testRenameMethodStringArg3(org.eclipse.ajdt.ui.tests.refactoring.ITDRenameProcessorTests)  Time elapsed: 6.941 sec
testRenameMethodListOfStringArg1(org.eclipse.ajdt.ui.tests.refactoring.ITDRenameProcessorTests)  Time elapsed: 6.622 sec
testRenameMethodListOfStringArg2(org.eclipse.ajdt.ui.tests.refactoring.ITDRenameProcessorTests)  Time elapsed: 6.219 sec
testRenameMethodListOfStringArg3(org.eclipse.ajdt.ui.tests.refactoring.ITDRenameProcessorTests)  Time elapsed: 8.727 sec
testMultiFileRenameField1(org.eclipse.ajdt.ui.tests.refactoring.ITDRenameProcessorTests)  Time elapsed: 6.499 sec
testRenameMethodQualifiedListArg1(org.eclipse.ajdt.ui.tests.refactoring.ITDRenameProcessorTests)  Time elapsed: 6.318 sec
testRenameMethodQualifiedListArg2(org.eclipse.ajdt.ui.tests.refactoring.ITDRenameProcessorTests)  Time elapsed: 6.148 sec
testRenameMethodQualifiedListArg3(org.eclipse.ajdt.ui.tests.refactoring.ITDRenameProcessorTests)  Time elapsed: 7.419 sec
testRenameMethodNoArgs1(org.eclipse.ajdt.ui.tests.refactoring.ITDRenameProcessorTests)  Time elapsed: 6.622 sec
testRenameMethodNoArgs2(org.eclipse.ajdt.ui.tests.refactoring.ITDRenameProcessorTests)  Time elapsed: 6.297 sec
testRenameMethodNoArgs3(org.eclipse.ajdt.ui.tests.refactoring.ITDRenameProcessorTests)  Time elapsed: 6.946 sec
testExtractLocalSimple1(org.eclipse.ajdt.ui.tests.refactoring.ExtractLocalTests)  Time elapsed: 6.607 sec
testExtractLocalSimple2(org.eclipse.ajdt.ui.tests.refactoring.ExtractLocalTests)  Time elapsed: 6.198 sec
testExtractLocalAspect1(org.eclipse.ajdt.ui.tests.refactoring.ExtractLocalTests)  Time elapsed: 5.912 sec
testExtractLocalAspect2(org.eclipse.ajdt.ui.tests.refactoring.ExtractLocalTests)  Time elapsed: 5.703 sec
testExtractLocalAspect3(org.eclipse.ajdt.ui.tests.refactoring.ExtractLocalTests)  Time elapsed: 5.662 sec
testExtractLocalAspect4(org.eclipse.ajdt.ui.tests.refactoring.ExtractLocalTests)  Time elapsed: 5.679 sec
testExtractLocalAspect5(org.eclipse.ajdt.ui.tests.refactoring.ExtractLocalTests)  Time elapsed: 5.913 sec
testExtractConstantAspect1(org.eclipse.ajdt.ui.tests.refactoring.ExtractConstantTests)  Time elapsed: 5.755 sec
testExtractConstantAspect2(org.eclipse.ajdt.ui.tests.refactoring.ExtractConstantTests)  Time elapsed: 6.003 sec
testExtractConstantAspect3(org.eclipse.ajdt.ui.tests.refactoring.ExtractConstantTests)  Time elapsed: 5.689 sec
testExtractConstantAspect4(org.eclipse.ajdt.ui.tests.refactoring.ExtractConstantTests)  Time elapsed: 5.659 sec
testExtractConstantAspect5(org.eclipse.ajdt.ui.tests.refactoring.ExtractConstantTests)  Time elapsed: 5.865 sec
testExtractConstantSimple1(org.eclipse.ajdt.ui.tests.refactoring.ExtractConstantTests)  Time elapsed: 5.819 sec
testExtractConstantSimple2(org.eclipse.ajdt.ui.tests.refactoring.ExtractConstantTests)  Time elapsed: 5.791 sec
testConvertLocalToFieldSimple1(org.eclipse.ajdt.ui.tests.refactoring.ConvertLocalToFieldTests)  Time elapsed: 5.789 sec
testConvertLocalToFieldSimple2(org.eclipse.ajdt.ui.tests.refactoring.ConvertLocalToFieldTests)  Time elapsed: 5.702 sec
testConvertLocalToFieldAspect1(org.eclipse.ajdt.ui.tests.refactoring.ConvertLocalToFieldTests)  Time elapsed: 5.673 sec
testConvertLocalToFieldAspect2(org.eclipse.ajdt.ui.tests.refactoring.ConvertLocalToFieldTests)  Time elapsed: 5.881 sec
testConvertLocalToFieldAspect3(org.eclipse.ajdt.ui.tests.refactoring.ConvertLocalToFieldTests)  Time elapsed: 5.847 sec
testConvertLocalToFieldAspect4(org.eclipse.ajdt.ui.tests.refactoring.ConvertLocalToFieldTests)  Time elapsed: 5.735 sec
testConvertLocalToFieldAspect5(org.eclipse.ajdt.ui.tests.refactoring.ConvertLocalToFieldTests)  Time elapsed: 5.839 sec
testAspectWithITD1(org.eclipse.ajdt.ui.tests.refactoring.MoveTypeIntoAspectRefactoringTests)  Time elapsed: 5.821 sec
testAspectWithITD2(org.eclipse.ajdt.ui.tests.refactoring.MoveTypeIntoAspectRefactoringTests)  Time elapsed: 5.774 sec
testSimple1(org.eclipse.ajdt.ui.tests.refactoring.MoveTypeIntoAspectRefactoringTests)  Time elapsed: 5.752 sec
testSimple2(org.eclipse.ajdt.ui.tests.refactoring.MoveTypeIntoAspectRefactoringTests)  Time elapsed: 6.514 sec
testSimple3(org.eclipse.ajdt.ui.tests.refactoring.MoveTypeIntoAspectRefactoringTests)  Time elapsed: 5.825 sec
testSimple4(org.eclipse.ajdt.ui.tests.refactoring.MoveTypeIntoAspectRefactoringTests)  Time elapsed: 6.105 sec
testSuperTypeHierarchyOfNonFocusType(org.eclipse.ajdt.ui.tests.hierarchy.ITDAwareHierarchyTests)  Time elapsed: 8.462 sec
testSuperTypeHierarchyOfFocusType(org.eclipse.ajdt.ui.tests.hierarchy.ITDAwareHierarchyTests)  Time elapsed: 3.031 sec
testSubTypeHierarchy(org.eclipse.ajdt.ui.tests.hierarchy.ITDAwareHierarchyTests)  Time elapsed: 3.091 sec
testAbstractAspectWithDeclare(org.eclipse.ajdt.ui.tests.hierarchy.ITDAwareHierarchyTests2)  Time elapsed: 3.575 sec
testAbstractGenericAspectWithDeclare(org.eclipse.ajdt.ui.tests.hierarchy.ITDAwareHierarchyTests2)  Time elapsed: 6.388 sec
testDisabled(org.eclipse.ajdt.ui.tests.ErrorLogTest)  Time elapsed: 8.57 sec
testViewsAreValid(org.eclipse.ajdt.ui.tests.VerificationTest)  Time elapsed: 7.743 sec
testAbsentNavigatorView(org.eclipse.ajdt.ui.tests.VerificationTest)  Time elapsed: 10.466 sec
testAbsentStructureModelView(org.eclipse.ajdt.ui.tests.VerificationTest)  Time elapsed: 7.475 sec
testBug106813(org.eclipse.ajdt.ui.tests.Bug106813Test)  Time elapsed: 8.389 sec
testPredefinedProjectsTool(org.eclipse.ajdt.ui.tests.testutils.TestForPredefinedProjectsTool)  Time elapsed: 7.482 sec
testProjectsToolWithClosedProjects(org.eclipse.ajdt.ui.tests.testutils.TestForPredefinedProjectsTool)  Time elapsed: 4.085 sec
testBug93532(org.eclipse.ajdt.ui.tests.utils.AJDTUtilsTest)  Time elapsed: 3.452 sec
testCaseInsensitiveNoSrcFolder(org.eclipse.ajdt.ui.tests.utils.AJDTUtilsTest)  Time elapsed: 6.216 sec
testCaseInsensitive(org.eclipse.ajdt.ui.tests.utils.AJDTUtilsTest)  Time elapsed: 3.126 sec
testAddAndRemoveAjrtToBuildPath(org.eclipse.ajdt.ui.tests.utils.AJDTUtilsTest)  Time elapsed: 4.424 sec
testAddAndRemoveWithExcludes(org.eclipse.ajdt.ui.tests.utils.AJDTUtilsTest)  Time elapsed: 3.156 sec
testAddAndRemoveAspectJNature(org.eclipse.ajdt.ui.tests.utils.AJDTUtilsTest)  Time elapsed: 3.065 sec
testCaseInsensitiveDriveLetters(org.eclipse.ajdt.ui.tests.utils.AJDTUtilsTest)  Time elapsed: 2.268 sec
testAddAndRemoveWithExcludes2(org.eclipse.ajdt.ui.tests.utils.AJDTUtilsTest)  Time elapsed: 3.144 sec
testAddAndRemoveAspectJNatureWithBundleProject(org.eclipse.ajdt.ui.tests.utils.AJDTUtilsTest)  Time elapsed: 7.592 sec

Results :

Failed tests: 
  ProjectDependenciesWithJarFilesTest.testWithOutJarSwitch2:1->testWithOutJarSwitch2_aroundBody9$advice:52->testWithOutJarSwitch2_aroundBody8:496 project X should have project Y's outjar on it's classpath
  ProjectDependenciesWithJarFilesTest.testDependingProjectBuiltWhenOutjarChanges:1->testDependingProjectBuiltWhenOutjarChanges_aroundBody15$advice:52->testDependingProjectBuiltWhenOutjarChanges_aroundBody14:775->checkForJDTBug84214:883  P/jarCreatingProject should have P/jarDependentProject as it's list of referencing projects - if not, see JDT bug 84214 expected:<1> but was:<0>
  InpathOutFolderTest2.testJarOnInpath:1->testJarOnInpath_aroundBody1$advice:52->testJarOnInpath_aroundBody0:63 AspectJ RT should exist in the in path out folder

Tests run: 438, Failures: 3, Errors: 0, Skipped: 0

Timer event: 1ms: Update visualizer, xref, advice listeners for (separate thread): DefaultEmptyProject
>> scheduled a build

!ENTRY org.eclipse.core.resources 2 10035 2017-04-21 14:50:03.142
!MESSAGE The workspace will exit with unsaved changes in this session.
>> finished a build
[ERROR] There are test failures.

Please refer to /jobs/genie.ajdt/ajdt-on-eclipse-47/workspace/org.eclipse.ajdt.ui.tests/target/surefire-reports for the individual test results.
[INFO] 
[INFO] --- eclipse-jarsigner-plugin:1.0.4:sign (sign) @ org.eclipse.ajdt.ui.tests ---
[INFO] Signed org.eclipse.ajdt:org.eclipse.ajdt.ui.tests:eclipse-test-plugin:2.2.4-SNAPSHOT in 2 seconds.
[INFO] Signed org.eclipse.ajdt:org.eclipse.ajdt.ui.tests:java-source:sources:2.2.4-SNAPSHOT in 0 seconds.
[INFO] 
[INFO] --- tycho-p2-plugin:0.23.1:p2-metadata (p2-metadata) @ org.eclipse.ajdt.ui.tests ---
[INFO]                                                                         
[INFO] ------------------------------------------------------------------------
[INFO] Building org.eclipse.contribution.weaving.jdt.tests 2.2.4-SNAPSHOT
[INFO] ------------------------------------------------------------------------
[INFO] 
[INFO] --- maven-clean-plugin:2.5:clean (default-clean) @ org.eclipse.contribution.weaving.jdt.tests ---
[INFO] 
[INFO] --- tycho-packaging-plugin:0.23.1:build-qualifier (default-build-qualifier) @ org.eclipse.contribution.weaving.jdt.tests ---
[INFO] The project's OSGi version is 2.2.4.201704211714
[INFO] 
[INFO] --- tycho-packaging-plugin:0.23.1:validate-id (default-validate-id) @ org.eclipse.contribution.weaving.jdt.tests ---
[INFO] 
[INFO] --- tycho-packaging-plugin:0.23.1:validate-version (default-validate-version) @ org.eclipse.contribution.weaving.jdt.tests ---
[INFO] 
[INFO] --- maven-resources-plugin:2.4.3:resources (default-resources) @ org.eclipse.contribution.weaving.jdt.tests ---
[WARNING] Using platform encoding (UTF-8 actually) to copy filtered resources, i.e. build is platform dependent!
[INFO] skip non existing resourceDirectory /jobs/genie.ajdt/ajdt-on-eclipse-47/workspace/org.eclipse.contribution.weaving.jdt.tests/src/main/resources
[INFO] 
[INFO] --- tycho-compiler-plugin:0.23.1:compile (default-compile) @ org.eclipse.contribution.weaving.jdt.tests ---
[INFO] Compiling 20 source files to /jobs/genie.ajdt/ajdt-on-eclipse-47/workspace/org.eclipse.contribution.weaving.jdt.tests/target/classes
[INFO] 
[INFO] --- maven-resources-plugin:2.4.3:testResources (default-testResources) @ org.eclipse.contribution.weaving.jdt.tests ---
[WARNING] Using platform encoding (UTF-8 actually) to copy filtered resources, i.e. build is platform dependent!
[INFO] skip non existing resourceDirectory /jobs/genie.ajdt/ajdt-on-eclipse-47/workspace/org.eclipse.contribution.weaving.jdt.tests/src/test/resources
[INFO] 
[INFO] --- target-platform-configuration:0.23.1:target-platform (default-target-platform) @ org.eclipse.contribution.weaving.jdt.tests ---
[INFO] 
[INFO] --- tycho-packaging-plugin:0.23.1:package-plugin (default-package-plugin) @ org.eclipse.contribution.weaving.jdt.tests ---
[INFO] Building jar: /jobs/genie.ajdt/ajdt-on-eclipse-47/workspace/org.eclipse.contribution.weaving.jdt.tests/jdtweavingtests.jar
[INFO] Building jar: /jobs/genie.ajdt/ajdt-on-eclipse-47/workspace/org.eclipse.contribution.weaving.jdt.tests/target/org.eclipse.contribution.weaving.jdt.tests-2.2.4-SNAPSHOT.jar
[INFO] 
[INFO] --- tycho-p2-plugin:0.23.1:p2-metadata-default (default-p2-metadata-default) @ org.eclipse.contribution.weaving.jdt.tests ---
[INFO] 
[INFO] --- tycho-surefire-plugin:0.23.1:test (default-test) @ org.eclipse.contribution.weaving.jdt.tests ---
[INFO] Expected eclipse log file: /jobs/genie.ajdt/ajdt-on-eclipse-47/workspace/org.eclipse.contribution.weaving.jdt.tests/target/work/data/.metadata/.log
[INFO] Command line:
	[/opt/public/common/jdk1.8.0_121.x64/jre/bin/java, -Dosgi.noShutdown=false, -Dosgi.os=linux, -Dosgi.ws=gtk, -Dosgi.arch=x86_64, -Xmx1024m, -XX:MaxPermSize=256m, -Dosgi.clean=true, -jar, /jobs/genie.ajdt/ajdt-on-eclipse-47/workspace/.maven/repo/p2/osgi/bundle/org.eclipse.equinox.launcher/1.4.0.v20161219-1356/org.eclipse.equinox.launcher-1.4.0.v20161219-1356.jar, -debug, -consolelog, -data, /jobs/genie.ajdt/ajdt-on-eclipse-47/workspace/org.eclipse.contribution.weaving.jdt.tests/target/work/data, -install, /jobs/genie.ajdt/ajdt-on-eclipse-47/workspace/org.eclipse.contribution.weaving.jdt.tests/target/work, -configuration, /jobs/genie.ajdt/ajdt-on-eclipse-47/workspace/org.eclipse.contribution.weaving.jdt.tests/target/work/configuration, -application, org.eclipse.tycho.surefire.osgibooter.uitest, -testproperties, /jobs/genie.ajdt/ajdt-on-eclipse-47/workspace/org.eclipse.contribution.weaving.jdt.tests/target/surefire.properties]
Java HotSpot(TM) 64-Bit Server VM warning: ignoring option MaxPermSize=256m; support was removed in 8.0
Configuration location:
    file:/jobs/genie.ajdt/ajdt-on-eclipse-47/workspace/org.eclipse.contribution.weaving.jdt.tests/target/work/configuration/
Configuration file:
    file:/jobs/genie.ajdt/ajdt-on-eclipse-47/workspace/org.eclipse.contribution.weaving.jdt.tests/target/work/configuration/config.ini loaded
Install location:
    file:/jobs/genie.ajdt/ajdt-on-eclipse-47/workspace/org.eclipse.contribution.weaving.jdt.tests/target/work/
Framework located:
    file:/jobs/genie.ajdt/ajdt-on-eclipse-47/workspace/org.eclipse.contribution.weaving.jdt.tests/target/work/plugins/org.eclipse.osgi-3.12.0.v20170302-2050.jar
Loading extension: org.eclipse.equinox.weaving.hook
	eclipse.properties not found
Framework classpath:
    file:/jobs/genie.ajdt/ajdt-on-eclipse-47/workspace/org.eclipse.contribution.weaving.jdt.tests/target/work/plugins/org.eclipse.osgi-3.12.0.v20170302-2050.jar
    file:/jobs/genie.ajdt/ajdt-on-eclipse-47/workspace/org.eclipse.contribution.weaving.jdt.tests/target/work/plugins/
    file:/jobs/genie.ajdt/ajdt-on-eclipse-47/workspace/org.eclipse.contribution.weaving.jdt.tests/target/work/plugins/org.eclipse.equinox.weaving.hook_1.2.0.v20160929-1449/
Debug options:
    file:/jobs/genie.ajdt/ajdt-on-eclipse-47/workspace/org.eclipse.contribution.weaving.jdt.tests/.options not found
Time to load bundles: 753
!SESSION 2017-04-21 14:50:08.526 -----------------------------------------------
eclipse.buildId=unknown
java.version=1.8.0_121
java.vendor=Oracle Corporation
BootLoader constants: OS=linux, ARCH=x86_64, WS=gtk, NL=en_US
Framework arguments:  -application org.eclipse.tycho.surefire.osgibooter.uitest -testproperties /jobs/genie.ajdt/ajdt-on-eclipse-47/workspace/org.eclipse.contribution.weaving.jdt.tests/target/surefire.properties
Command-line arguments:  -debug -consolelog -data /jobs/genie.ajdt/ajdt-on-eclipse-47/workspace/org.eclipse.contribution.weaving.jdt.tests/target/work/data -application org.eclipse.tycho.surefire.osgibooter.uitest -testproperties /jobs/genie.ajdt/ajdt-on-eclipse-47/workspace/org.eclipse.contribution.weaving.jdt.tests/target/surefire.properties

!ENTRY org.eclipse.jdt.launching.macosx 4 0 2017-04-21 14:50:10.095
!MESSAGE FrameworkEvent ERROR
!STACK 0
org.osgi.framework.BundleException: Could not resolve module: org.eclipse.jdt.launching.macosx [217]
  Unresolved requirement: Require-Capability: eclipse.platform; filter:="(osgi.os=macosx)"

	at org.eclipse.osgi.container.Module.start(Module.java:444)
	at org.eclipse.osgi.container.ModuleContainer$ContainerStartLevel.incStartLevel(ModuleContainer.java:1628)
	at org.eclipse.osgi.container.ModuleContainer$ContainerStartLevel.incStartLevel(ModuleContainer.java:1607)
	at org.eclipse.osgi.container.ModuleContainer$ContainerStartLevel.doContainerStartLevel(ModuleContainer.java:1579)
	at org.eclipse.osgi.container.ModuleContainer$ContainerStartLevel.dispatchEvent(ModuleContainer.java:1522)
	at org.eclipse.osgi.container.ModuleContainer$ContainerStartLevel.dispatchEvent(ModuleContainer.java:1)
	at org.eclipse.osgi.framework.eventmgr.EventManager.dispatchEvent(EventManager.java:230)
	at org.eclipse.osgi.framework.eventmgr.EventManager$EventThread.run(EventManager.java:340)

!ENTRY org.eclipse.jdt.launching.ui.macosx 4 0 2017-04-21 14:50:10.097
!MESSAGE FrameworkEvent ERROR
!STACK 0
org.osgi.framework.BundleException: Could not resolve module: org.eclipse.jdt.launching.ui.macosx [218]
  Unresolved requirement: Require-Capability: eclipse.platform; filter:="(osgi.os=macosx)"

	at org.eclipse.osgi.container.Module.start(Module.java:444)
	at org.eclipse.osgi.container.ModuleContainer$ContainerStartLevel.incStartLevel(ModuleContainer.java:1628)
	at org.eclipse.osgi.container.ModuleContainer$ContainerStartLevel.incStartLevel(ModuleContainer.java:1607)
	at org.eclipse.osgi.container.ModuleContainer$ContainerStartLevel.doContainerStartLevel(ModuleContainer.java:1579)
	at org.eclipse.osgi.container.ModuleContainer$ContainerStartLevel.dispatchEvent(ModuleContainer.java:1522)
	at org.eclipse.osgi.container.ModuleContainer$ContainerStartLevel.dispatchEvent(ModuleContainer.java:1)
	at org.eclipse.osgi.framework.eventmgr.EventManager.dispatchEvent(EventManager.java:230)
	at org.eclipse.osgi.framework.eventmgr.EventManager$EventThread.run(EventManager.java:340)
Starting application: 2120
Application Started: 4253

-------------------------------------------------------
 T E S T S
-------------------------------------------------------
Running org.eclipse.contribution.weaving.jdt.tests.AllWeavingTests
# !SESSION 2017-04-21 14:51:14.573
# version: 1.1
# verbose: true
# The following option strings are specified for this debug session:
| main | 2017-04-21 14:51:14.573 | org.eclipse.e4.ui.workbench | /debug | org.eclipse.e4.ui.internal.workbench.WorkbenchLogger | trace | 158 | Ignored attempt to set focus during set focus for: org.eclipse.ui.internal.e4.compatibility.CompatibilityEditor@b699e87 |
Tests run: 34, Failures: 0, Errors: 0, Skipped: 0, Time elapsed: 105.524 sec - in org.eclipse.contribution.weaving.jdt.tests.AllWeavingTests
testCreateCompilationUnit(org.eclipse.contribution.weaving.jdt.tests.cuprovider.CompilationUnitProviderTests)  Time elapsed: 2.784 sec
testSourceMapping(org.eclipse.contribution.weaving.jdt.tests.sourceprovider.SourceTransformerTests)  Time elapsed: 0.001 sec
testFormatCleanUp(org.eclipse.contribution.weaving.jdt.tests.sourceprovider.SourceTransformerTests)  Time elapsed: 3.808 sec
testTransformCompilationUnit(org.eclipse.contribution.weaving.jdt.tests.sourceprovider.SourceTransformerTests)  Time elapsed: 0.607 sec
testSourceIndexerRequestor(org.eclipse.contribution.weaving.jdt.tests.sourceprovider.SourceTransformerTests)  Time elapsed: 28.645 sec
testImageSelectDebugger(org.eclipse.contribution.weaving.jdt.tests.imagedescriptor.ImageDescriptorSelectorTests)  Time elapsed: 8.126 sec
testImageSelectComputeImage(org.eclipse.contribution.weaving.jdt.tests.imagedescriptor.ImageDescriptorSelectorTests)  Time elapsed: 0.158 sec
testImageSelectDialog(org.eclipse.contribution.weaving.jdt.tests.imagedescriptor.ImageDescriptorSelectorTests)  Time elapsed: 1.092 sec
testImageSelectHierarchy(org.eclipse.contribution.weaving.jdt.tests.imagedescriptor.ImageDescriptorSelectorTests)  Time elapsed: 1.085 sec
testAddHook(org.eclipse.contribution.weaving.jdt.tests.preferences.WeavingStateTests)  Time elapsed: 0.001 sec
testRemoveHookAtMiddle(org.eclipse.contribution.weaving.jdt.tests.preferences.WeavingStateTests)  Time elapsed: 0 sec
testRemoveHookWithSecondHookAtEnd(org.eclipse.contribution.weaving.jdt.tests.preferences.WeavingStateTests)  Time elapsed: 0 sec
testAddHookWithSecondHookAtEnd(org.eclipse.contribution.weaving.jdt.tests.preferences.WeavingStateTests)  Time elapsed: 0 sec
testRemoveHookAtStart(org.eclipse.contribution.weaving.jdt.tests.preferences.WeavingStateTests)  Time elapsed: 0.001 sec
testRemoveHookWithSecondHookAtStart(org.eclipse.contribution.weaving.jdt.tests.preferences.WeavingStateTests)  Time elapsed: 0 sec
testAddHookWithSecondHookAtMiddle(org.eclipse.contribution.weaving.jdt.tests.preferences.WeavingStateTests)  Time elapsed: 0 sec
testRemoveHookAtEnd(org.eclipse.contribution.weaving.jdt.tests.preferences.WeavingStateTests)  Time elapsed: 0 sec
testRemoveHookWithSecondHookAtMiddle(org.eclipse.contribution.weaving.jdt.tests.preferences.WeavingStateTests)  Time elapsed: 0.001 sec
testAddHookWithSecondHookAtStart(org.eclipse.contribution.weaving.jdt.tests.preferences.WeavingStateTests)  Time elapsed: 0 sec
testAskToEnableWeaving(org.eclipse.contribution.weaving.jdt.tests.preferences.WeavingServiceEnablementTests)  Time elapsed: 2.59 sec
testFindProblemsInMockProject(org.eclipse.contribution.weaving.jdt.tests.itdawareness.ITDAwarenessTests)  Time elapsed: 1.553 sec
testCodeSelectInJavaProject(org.eclipse.contribution.weaving.jdt.tests.itdawareness.ITDAwarenessTests)  Time elapsed: 2.102 sec
testCodeSelectInMockProject(org.eclipse.contribution.weaving.jdt.tests.itdawareness.ITDAwarenessTests)  Time elapsed: 1.996 sec
testContentAssistInJavaProject(org.eclipse.contribution.weaving.jdt.tests.itdawareness.ITDAwarenessTests)  Time elapsed: 3.079 sec
testContentAssistInMockProject(org.eclipse.contribution.weaving.jdt.tests.itdawareness.ITDAwarenessTests)  Time elapsed: 2.071 sec
testFindProblemsInJavaProject(org.eclipse.contribution.weaving.jdt.tests.itdawareness.ITDAwarenessTests)  Time elapsed: 2.513 sec
testExtractConstantInJava(org.eclipse.contribution.weaving.jdt.tests.refactoring.RefactoringHooksTests)  Time elapsed: 7.143 sec
testExtractConstantInMock(org.eclipse.contribution.weaving.jdt.tests.refactoring.RefactoringHooksTests)  Time elapsed: 6.058 sec
testCreateSourceConvertedAST1(org.eclipse.contribution.weaving.jdt.tests.refactoring.RefactoringHooksTests)  Time elapsed: 2.038 sec
testCreateSourceConvertedAST2(org.eclipse.contribution.weaving.jdt.tests.refactoring.RefactoringHooksTests)  Time elapsed: 2.239 sec
testExtractLocalVariableInJava(org.eclipse.contribution.weaving.jdt.tests.refactoring.RefactoringHooksTests)  Time elapsed: 6.015 sec
testExtractLocalVariableInMock(org.eclipse.contribution.weaving.jdt.tests.refactoring.RefactoringHooksTests)  Time elapsed: 5.472 sec
testConvertLocalInJava(org.eclipse.contribution.weaving.jdt.tests.refactoring.RefactoringHooksTests)  Time elapsed: 5.469 sec
testConvertLocalInMock(org.eclipse.contribution.weaving.jdt.tests.refactoring.RefactoringHooksTests)  Time elapsed: 5.404 sec

Results :

Tests run: 34, Failures: 0, Errors: 0, Skipped: 0


!ENTRY org.eclipse.core.resources 2 10035 2017-04-21 14:51:59.642
!MESSAGE The workspace will exit with unsaved changes in this session.
[INFO] All tests passed!
[INFO] 
[INFO] --- eclipse-jarsigner-plugin:1.0.4:sign (sign) @ org.eclipse.contribution.weaving.jdt.tests ---
[INFO] Signed org.eclipse.ajdt:org.eclipse.contribution.weaving.jdt.tests:eclipse-test-plugin:2.2.4-SNAPSHOT in 0 seconds.
[INFO] 
[INFO] --- tycho-p2-plugin:0.23.1:p2-metadata (p2-metadata) @ org.eclipse.contribution.weaving.jdt.tests ---
[INFO]                                                                         
[INFO] ------------------------------------------------------------------------
[INFO] Building org.eclipse.contribution.xref.core.tests 2.2.4-SNAPSHOT
[INFO] ------------------------------------------------------------------------
[INFO] 
[INFO] --- maven-clean-plugin:2.5:clean (default-clean) @ org.eclipse.contribution.xref.core.tests ---
[INFO] 
[INFO] --- tycho-packaging-plugin:0.23.1:build-qualifier (default-build-qualifier) @ org.eclipse.contribution.xref.core.tests ---
[INFO] The project's OSGi version is 2.2.4.201704211714
[INFO] 
[INFO] --- tycho-packaging-plugin:0.23.1:validate-id (default-validate-id) @ org.eclipse.contribution.xref.core.tests ---
[INFO] 
[INFO] --- tycho-packaging-plugin:0.23.1:validate-version (default-validate-version) @ org.eclipse.contribution.xref.core.tests ---
[INFO] 
[INFO] --- maven-resources-plugin:2.4.3:resources (default-resources) @ org.eclipse.contribution.xref.core.tests ---
[WARNING] Using platform encoding (UTF-8 actually) to copy filtered resources, i.e. build is platform dependent!
[INFO] skip non existing resourceDirectory /jobs/genie.ajdt/ajdt-on-eclipse-47/workspace/org.eclipse.contribution.xref.core.tests/src/main/resources
[INFO] 
[INFO] --- tycho-compiler-plugin:0.23.1:compile (default-compile) @ org.eclipse.contribution.xref.core.tests ---
[INFO] Compiling 10 source files to /jobs/genie.ajdt/ajdt-on-eclipse-47/workspace/org.eclipse.contribution.xref.core.tests/target/classes
[INFO] 
[INFO] --- maven-resources-plugin:2.4.3:testResources (default-testResources) @ org.eclipse.contribution.xref.core.tests ---
[WARNING] Using platform encoding (UTF-8 actually) to copy filtered resources, i.e. build is platform dependent!
[INFO] skip non existing resourceDirectory /jobs/genie.ajdt/ajdt-on-eclipse-47/workspace/org.eclipse.contribution.xref.core.tests/src/test/resources
[INFO] 
[INFO] --- target-platform-configuration:0.23.1:target-platform (default-target-platform) @ org.eclipse.contribution.xref.core.tests ---
[INFO] 
[INFO] --- tycho-packaging-plugin:0.23.1:package-plugin (default-package-plugin) @ org.eclipse.contribution.xref.core.tests ---
[INFO] Building jar: /jobs/genie.ajdt/ajdt-on-eclipse-47/workspace/org.eclipse.contribution.xref.core.tests/xrefcoretests.jar
[INFO] Building jar: /jobs/genie.ajdt/ajdt-on-eclipse-47/workspace/org.eclipse.contribution.xref.core.tests/target/org.eclipse.contribution.xref.core.tests-2.2.4-SNAPSHOT.jar
[INFO] 
[INFO] --- tycho-p2-plugin:0.23.1:p2-metadata-default (default-p2-metadata-default) @ org.eclipse.contribution.xref.core.tests ---
[INFO] 
[INFO] --- tycho-surefire-plugin:0.23.1:test (default-test) @ org.eclipse.contribution.xref.core.tests ---
[INFO] Expected eclipse log file: /jobs/genie.ajdt/ajdt-on-eclipse-47/workspace/org.eclipse.contribution.xref.core.tests/target/work/data/.metadata/.log
[INFO] Command line:
	[/opt/public/common/jdk1.8.0_121.x64/jre/bin/java, -Dosgi.noShutdown=false, -Dosgi.os=linux, -Dosgi.ws=gtk, -Dosgi.arch=x86_64, -Xmx1024m, -XX:MaxPermSize=256m, -Dosgi.clean=true, -jar, /jobs/genie.ajdt/ajdt-on-eclipse-47/workspace/.maven/repo/p2/osgi/bundle/org.eclipse.equinox.launcher/1.4.0.v20161219-1356/org.eclipse.equinox.launcher-1.4.0.v20161219-1356.jar, -debug, -consolelog, -data, /jobs/genie.ajdt/ajdt-on-eclipse-47/workspace/org.eclipse.contribution.xref.core.tests/target/work/data, -install, /jobs/genie.ajdt/ajdt-on-eclipse-47/workspace/org.eclipse.contribution.xref.core.tests/target/work, -configuration, /jobs/genie.ajdt/ajdt-on-eclipse-47/workspace/org.eclipse.contribution.xref.core.tests/target/work/configuration, -application, org.eclipse.tycho.surefire.osgibooter.uitest, -testproperties, /jobs/genie.ajdt/ajdt-on-eclipse-47/workspace/org.eclipse.contribution.xref.core.tests/target/surefire.properties]
Java HotSpot(TM) 64-Bit Server VM warning: ignoring option MaxPermSize=256m; support was removed in 8.0
Configuration location:
    file:/jobs/genie.ajdt/ajdt-on-eclipse-47/workspace/org.eclipse.contribution.xref.core.tests/target/work/configuration/
Configuration file:
    file:/jobs/genie.ajdt/ajdt-on-eclipse-47/workspace/org.eclipse.contribution.xref.core.tests/target/work/configuration/config.ini loaded
Install location:
    file:/jobs/genie.ajdt/ajdt-on-eclipse-47/workspace/org.eclipse.contribution.xref.core.tests/target/work/
Framework located:
    file:/home/hudson/genie.ajdt/.hudson/jobs/ajdt-on-eclipse-47/workspace/.maven/repo/p2/osgi/bundle/org.eclipse.osgi/3.12.0.v20170302-2050/org.eclipse.osgi-3.12.0.v20170302-2050.jar
Framework classpath:
    file:/home/hudson/genie.ajdt/.hudson/jobs/ajdt-on-eclipse-47/workspace/.maven/repo/p2/osgi/bundle/org.eclipse.osgi/3.12.0.v20170302-2050/org.eclipse.osgi-3.12.0.v20170302-2050.jar
Debug options:
    file:/jobs/genie.ajdt/ajdt-on-eclipse-47/workspace/org.eclipse.contribution.xref.core.tests/.options not found
Time to load bundles: 737
!SESSION 2017-04-21 14:52:02.622 -----------------------------------------------
eclipse.buildId=unknown
java.version=1.8.0_121
java.vendor=Oracle Corporation
BootLoader constants: OS=linux, ARCH=x86_64, WS=gtk, NL=en_US
Framework arguments:  -application org.eclipse.tycho.surefire.osgibooter.uitest -testproperties /jobs/genie.ajdt/ajdt-on-eclipse-47/workspace/org.eclipse.contribution.xref.core.tests/target/surefire.properties
Command-line arguments:  -debug -consolelog -data /jobs/genie.ajdt/ajdt-on-eclipse-47/workspace/org.eclipse.contribution.xref.core.tests/target/work/data -application org.eclipse.tycho.surefire.osgibooter.uitest -testproperties /jobs/genie.ajdt/ajdt-on-eclipse-47/workspace/org.eclipse.contribution.xref.core.tests/target/surefire.properties

!ENTRY org.eclipse.jdt.launching.macosx 4 0 2017-04-21 14:52:04.090
!MESSAGE FrameworkEvent ERROR
!STACK 0
org.osgi.framework.BundleException: Could not resolve module: org.eclipse.jdt.launching.macosx [217]
  Unresolved requirement: Require-Capability: eclipse.platform; filter:="(osgi.os=macosx)"

	at org.eclipse.osgi.container.Module.start(Module.java:444)
	at org.eclipse.osgi.container.ModuleContainer$ContainerStartLevel.incStartLevel(ModuleContainer.java:1628)
	at org.eclipse.osgi.container.ModuleContainer$ContainerStartLevel.incStartLevel(ModuleContainer.java:1607)
	at org.eclipse.osgi.container.ModuleContainer$ContainerStartLevel.doContainerStartLevel(ModuleContainer.java:1579)
	at org.eclipse.osgi.container.ModuleContainer$ContainerStartLevel.dispatchEvent(ModuleContainer.java:1522)
	at org.eclipse.osgi.container.ModuleContainer$ContainerStartLevel.dispatchEvent(ModuleContainer.java:1)
	at org.eclipse.osgi.framework.eventmgr.EventManager.dispatchEvent(EventManager.java:230)
	at org.eclipse.osgi.framework.eventmgr.EventManager$EventThread.run(EventManager.java:340)

!ENTRY org.eclipse.jdt.launching.ui.macosx 4 0 2017-04-21 14:52:04.092
!MESSAGE FrameworkEvent ERROR
!STACK 0
org.osgi.framework.BundleException: Could not resolve module: org.eclipse.jdt.launching.ui.macosx [218]
  Unresolved requirement: Require-Capability: eclipse.platform; filter:="(osgi.os=macosx)"

	at org.eclipse.osgi.container.Module.start(Module.java:444)
	at org.eclipse.osgi.container.ModuleContainer$ContainerStartLevel.incStartLevel(ModuleContainer.java:1628)
	at org.eclipse.osgi.container.ModuleContainer$ContainerStartLevel.incStartLevel(ModuleContainer.java:1607)
	at org.eclipse.osgi.container.ModuleContainer$ContainerStartLevel.doContainerStartLevel(ModuleContainer.java:1579)
	at org.eclipse.osgi.container.ModuleContainer$ContainerStartLevel.dispatchEvent(ModuleContainer.java:1522)
	at org.eclipse.osgi.container.ModuleContainer$ContainerStartLevel.dispatchEvent(ModuleContainer.java:1)
	at org.eclipse.osgi.framework.eventmgr.EventManager.dispatchEvent(EventManager.java:230)
	at org.eclipse.osgi.framework.eventmgr.EventManager$EventThread.run(EventManager.java:340)
Starting application: 2056
Application Started: 4140

-------------------------------------------------------
 T E S T S
-------------------------------------------------------
Running org.eclipse.contribution.xref.core.tests.AllTests

!ENTRY org.eclipse.contribution.xref.core.tests 4 1 2017-04-21 14:52:06.986
!MESSAGE Testcase generated exception as expected
!STACK 0
java.lang.Throwable
	at org.eclipse.contribution.xref.core.tests.XReferencePluginTest.testLog(XReferencePluginTest.java:45)
	at sun.reflect.NativeMethodAccessorImpl.invoke0(Native Method)
	at sun.reflect.NativeMethodAccessorImpl.invoke(NativeMethodAccessorImpl.java:62)
	at sun.reflect.DelegatingMethodAccessorImpl.invoke(DelegatingMethodAccessorImpl.java:43)
	at java.lang.reflect.Method.invoke(Method.java:498)
	at junit.framework.TestCase.runTest(TestCase.java:176)
	at junit.framework.TestCase.runBare(TestCase.java:141)
	at junit.framework.TestResult$1.protect(TestResult.java:122)
	at junit.framework.TestResult.runProtected(TestResult.java:142)
	at junit.framework.TestResult.run(TestResult.java:125)
	at junit.framework.TestCase.run(TestCase.java:129)
	at junit.framework.TestSuite.runTest(TestSuite.java:252)
	at junit.framework.TestSuite.run(TestSuite.java:247)
	at junit.framework.TestSuite.runTest(TestSuite.java:252)
	at junit.framework.TestSuite.run(TestSuite.java:247)
	at org.junit.internal.runners.JUnit38ClassRunner.run(JUnit38ClassRunner.java:86)
	at org.apache.maven.surefire.junit4.JUnit4Provider.execute(JUnit4Provider.java:264)
	at org.apache.maven.surefire.junit4.JUnit4Provider.executeTestSet(JUnit4Provider.java:153)
	at org.apache.maven.surefire.junit4.JUnit4Provider.invoke(JUnit4Provider.java:124)
	at sun.reflect.NativeMethodAccessorImpl.invoke0(Native Method)
	at sun.reflect.NativeMethodAccessorImpl.invoke(NativeMethodAccessorImpl.java:62)
	at sun.reflect.DelegatingMethodAccessorImpl.invoke(DelegatingMethodAccessorImpl.java:43)
	at java.lang.reflect.Method.invoke(Method.java:498)
	at org.apache.maven.surefire.util.ReflectionUtils.invokeMethodWithArray2(ReflectionUtils.java:208)
	at org.apache.maven.surefire.booter.ProviderFactory$ProviderProxy.invoke(ProviderFactory.java:156)
	at org.apache.maven.surefire.booter.ProviderFactory.invokeProvider(ProviderFactory.java:82)
	at org.eclipse.tycho.surefire.osgibooter.OsgiSurefireBooter.run(OsgiSurefireBooter.java:91)
	at org.eclipse.tycho.surefire.osgibooter.AbstractUITestApplication$1.run(AbstractUITestApplication.java:35)
	at org.eclipse.swt.widgets.RunnableLock.run(RunnableLock.java:37)
	at org.eclipse.swt.widgets.Synchronizer.runAsyncMessages(Synchronizer.java:182)
	at org.eclipse.swt.widgets.Display.runAsyncMessages(Display.java:4470)
	at org.eclipse.swt.widgets.Display.readAndDispatch(Display.java:4083)
	at org.eclipse.e4.ui.internal.workbench.swt.PartRenderingEngine$4.run(PartRenderingEngine.java:1145)
	at org.eclipse.core.databinding.observable.Realm.runWithDefault(Realm.java:336)
	at org.eclipse.e4.ui.internal.workbench.swt.PartRenderingEngine.run(PartRenderingEngine.java:1034)
	at org.eclipse.e4.ui.internal.workbench.E4Workbench.createAndRunUI(E4Workbench.java:153)
	at org.eclipse.ui.internal.Workbench.lambda$3(Workbench.java:680)
	at org.eclipse.core.databinding.observable.Realm.runWithDefault(Realm.java:336)
	at org.eclipse.ui.internal.Workbench.createAndRunWorkbench(Workbench.java:594)
	at org.eclipse.ui.PlatformUI.createAndRunWorkbench(PlatformUI.java:148)
	at org.eclipse.ui.internal.ide.application.IDEApplication.start(IDEApplication.java:138)
	at org.eclipse.tycho.surefire.osgibooter.UITestApplication.runApplication(UITestApplication.java:31)
	at org.eclipse.tycho.surefire.osgibooter.AbstractUITestApplication.run(AbstractUITestApplication.java:120)
	at org.eclipse.tycho.surefire.osgibooter.UITestApplication.start(UITestApplication.java:37)
	at org.eclipse.equinox.internal.app.EclipseAppHandle.run(EclipseAppHandle.java:196)
	at org.eclipse.core.runtime.internal.adaptor.EclipseAppLauncher.runApplication(EclipseAppLauncher.java:134)
	at org.eclipse.core.runtime.internal.adaptor.EclipseAppLauncher.start(EclipseAppLauncher.java:104)
	at org.eclipse.core.runtime.adaptor.EclipseStarter.run(EclipseStarter.java:388)
	at org.eclipse.core.runtime.adaptor.EclipseStarter.run(EclipseStarter.java:243)
	at sun.reflect.NativeMethodAccessorImpl.invoke0(Native Method)
	at sun.reflect.NativeMethodAccessorImpl.invoke(NativeMethodAccessorImpl.java:62)
	at sun.reflect.DelegatingMethodAccessorImpl.invoke(DelegatingMethodAccessorImpl.java:43)
	at java.lang.reflect.Method.invoke(Method.java:498)
	at org.eclipse.equinox.launcher.Main.invokeFramework(Main.java:653)
	at org.eclipse.equinox.launcher.Main.basicRun(Main.java:590)
	at org.eclipse.equinox.launcher.Main.run(Main.java:1499)
	at org.eclipse.equinox.launcher.Main.main(Main.java:1472)

!ENTRY org.eclipse.contribution.xref.core 2 1 2017-04-21 14:52:07.571
!MESSAGE Could not load provider org.eclipse.contribution.xref.core.tests.unknownProvider
!STACK 1
org.eclipse.core.runtime.CoreException: Plug-in org.eclipse.contribution.xref.core.tests was unable to load class org.eclipse.contribution.xref.core.tests.UnknownProvider.
	at org.eclipse.core.internal.registry.osgi.RegistryStrategyOSGI.throwException(RegistryStrategyOSGI.java:194)
	at org.eclipse.core.internal.registry.osgi.RegistryStrategyOSGI.createExecutableExtension(RegistryStrategyOSGI.java:176)
	at org.eclipse.core.internal.registry.ExtensionRegistry.createExecutableExtension(ExtensionRegistry.java:905)
	at org.eclipse.core.internal.registry.ConfigurationElement.createExecutableExtension(ConfigurationElement.java:243)
	at org.eclipse.core.internal.registry.ConfigurationElementHandle.createExecutableExtension(ConfigurationElementHandle.java:55)
	at org.eclipse.contribution.xref.core.XReferenceProviderDefinition.<init>(XReferenceProviderDefinition.java:32)
	at org.eclipse.contribution.xref.core.XReferenceProviderManager.getRegisteredProviders(XReferenceProviderManager.java:95)
	at org.eclipse.contribution.xref.core.XReferenceProviderManager.getProvidersFor(XReferenceProviderManager.java:70)
	at org.eclipse.contribution.xref.core.XReferenceAdapter.getXReferences(XReferenceAdapter.java:67)
	at org.eclipse.contribution.xref.core.tests.XReferenceAdapterTest.testGetXReferences(XReferenceAdapterTest.java:41)
	at sun.reflect.NativeMethodAccessorImpl.invoke0(Native Method)
	at sun.reflect.NativeMethodAccessorImpl.invoke(NativeMethodAccessorImpl.java:62)
	at sun.reflect.DelegatingMethodAccessorImpl.invoke(DelegatingMethodAccessorImpl.java:43)
	at java.lang.reflect.Method.invoke(Method.java:498)
	at junit.framework.TestCase.runTest(TestCase.java:176)
	at junit.framework.TestCase.runBare(TestCase.java:141)
	at junit.framework.TestResult$1.protect(TestResult.java:122)
	at junit.framework.TestResult.runProtected(TestResult.java:142)
	at junit.framework.TestResult.run(TestResult.java:125)
	at junit.framework.TestCase.run(TestCase.java:129)
	at junit.framework.TestSuite.runTest(TestSuite.java:252)
	at junit.framework.TestSuite.run(TestSuite.java:247)
	at junit.framework.TestSuite.runTest(TestSuite.java:252)
	at junit.framework.TestSuite.run(TestSuite.java:247)
	at org.junit.internal.runners.JUnit38ClassRunner.run(JUnit38ClassRunner.java:86)
	at org.apache.maven.surefire.junit4.JUnit4Provider.execute(JUnit4Provider.java:264)
	at org.apache.maven.surefire.junit4.JUnit4Provider.executeTestSet(JUnit4Provider.java:153)
	at org.apache.maven.surefire.junit4.JUnit4Provider.invoke(JUnit4Provider.java:124)
	at sun.reflect.NativeMethodAccessorImpl.invoke0(Native Method)
	at sun.reflect.NativeMethodAccessorImpl.invoke(NativeMethodAccessorImpl.java:62)
	at sun.reflect.DelegatingMethodAccessorImpl.invoke(DelegatingMethodAccessorImpl.java:43)
	at java.lang.reflect.Method.invoke(Method.java:498)
	at org.apache.maven.surefire.util.ReflectionUtils.invokeMethodWithArray2(ReflectionUtils.java:208)
	at org.apache.maven.surefire.booter.ProviderFactory$ProviderProxy.invoke(ProviderFactory.java:156)
	at org.apache.maven.surefire.booter.ProviderFactory.invokeProvider(ProviderFactory.java:82)
	at org.eclipse.tycho.surefire.osgibooter.OsgiSurefireBooter.run(OsgiSurefireBooter.java:91)
	at org.eclipse.tycho.surefire.osgibooter.AbstractUITestApplication$1.run(AbstractUITestApplication.java:35)
	at org.eclipse.swt.widgets.RunnableLock.run(RunnableLock.java:37)
	at org.eclipse.swt.widgets.Synchronizer.runAsyncMessages(Synchronizer.java:182)
	at org.eclipse.swt.widgets.Display.runAsyncMessages(Display.java:4470)
	at org.eclipse.swt.widgets.Display.readAndDispatch(Display.java:4083)
	at org.eclipse.e4.ui.internal.workbench.swt.PartRenderingEngine$4.run(PartRenderingEngine.java:1145)
	at org.eclipse.core.databinding.observable.Realm.runWithDefault(Realm.java:336)
	at org.eclipse.e4.ui.internal.workbench.swt.PartRenderingEngine.run(PartRenderingEngine.java:1034)
	at org.eclipse.e4.ui.internal.workbench.E4Workbench.createAndRunUI(E4Workbench.java:153)
	at org.eclipse.ui.internal.Workbench.lambda$3(Workbench.java:680)
	at org.eclipse.core.databinding.observable.Realm.runWithDefault(Realm.java:336)
	at org.eclipse.ui.internal.Workbench.createAndRunWorkbench(Workbench.java:594)
	at org.eclipse.ui.PlatformUI.createAndRunWorkbench(PlatformUI.java:148)
	at org.eclipse.ui.internal.ide.application.IDEApplication.start(IDEApplication.java:138)
	at org.eclipse.tycho.surefire.osgibooter.UITestApplication.runApplication(UITestApplication.java:31)
	at org.eclipse.tycho.surefire.osgibooter.AbstractUITestApplication.run(AbstractUITestApplication.java:120)
	at org.eclipse.tycho.surefire.osgibooter.UITestApplication.start(UITestApplication.java:37)
	at org.eclipse.equinox.internal.app.EclipseAppHandle.run(EclipseAppHandle.java:196)
	at org.eclipse.core.runtime.internal.adaptor.EclipseAppLauncher.runApplication(EclipseAppLauncher.java:134)
	at org.eclipse.core.runtime.internal.adaptor.EclipseAppLauncher.start(EclipseAppLauncher.java:104)
	at org.eclipse.core.runtime.adaptor.EclipseStarter.run(EclipseStarter.java:388)
	at org.eclipse.core.runtime.adaptor.EclipseStarter.run(EclipseStarter.java:243)
	at sun.reflect.NativeMethodAccessorImpl.invoke0(Native Method)
	at sun.reflect.NativeMethodAccessorImpl.invoke(NativeMethodAccessorImpl.java:62)
	at sun.reflect.DelegatingMethodAccessorImpl.invoke(DelegatingMethodAccessorImpl.java:43)
	at java.lang.reflect.Method.invoke(Method.java:498)
	at org.eclipse.equinox.launcher.Main.invokeFramework(Main.java:653)
	at org.eclipse.equinox.launcher.Main.basicRun(Main.java:590)
	at org.eclipse.equinox.launcher.Main.run(Main.java:1499)
	at org.eclipse.equinox.launcher.Main.main(Main.java:1472)
Caused by: java.lang.ClassNotFoundException: org.eclipse.contribution.xref.core.tests.UnknownProvider cannot be found by org.eclipse.contribution.xref.core.tests_2.2.4.qualifier
	at org.eclipse.osgi.internal.loader.BundleLoader.findClassInternal(BundleLoader.java:475)
	at org.eclipse.osgi.internal.loader.BundleLoader.findClass(BundleLoader.java:386)
	at org.eclipse.osgi.internal.loader.BundleLoader.findClass(BundleLoader.java:378)
	at org.eclipse.osgi.internal.loader.ModuleClassLoader.loadClass(ModuleClassLoader.java:150)
	at java.lang.ClassLoader.loadClass(ClassLoader.java:357)
	at org.eclipse.osgi.internal.framework.EquinoxBundle.loadClass(EquinoxBundle.java:564)
	at org.eclipse.core.internal.registry.osgi.RegistryStrategyOSGI.createExecutableExtension(RegistryStrategyOSGI.java:174)
	... 64 more
!SUBENTRY 1 org.eclipse.equinox.registry 4 1 2017-04-21 14:52:07.573
!MESSAGE Plug-in org.eclipse.contribution.xref.core.tests was unable to load class org.eclipse.contribution.xref.core.tests.UnknownProvider.
!STACK 0
java.lang.ClassNotFoundException: org.eclipse.contribution.xref.core.tests.UnknownProvider cannot be found by org.eclipse.contribution.xref.core.tests_2.2.4.qualifier
	at org.eclipse.osgi.internal.loader.BundleLoader.findClassInternal(BundleLoader.java:475)
	at org.eclipse.osgi.internal.loader.BundleLoader.findClass(BundleLoader.java:386)
	at org.eclipse.osgi.internal.loader.BundleLoader.findClass(BundleLoader.java:378)
	at org.eclipse.osgi.internal.loader.ModuleClassLoader.loadClass(ModuleClassLoader.java:150)
	at java.lang.ClassLoader.loadClass(ClassLoader.java:357)
	at org.eclipse.osgi.internal.framework.EquinoxBundle.loadClass(EquinoxBundle.java:564)
	at org.eclipse.core.internal.registry.osgi.RegistryStrategyOSGI.createExecutableExtension(RegistryStrategyOSGI.java:174)
	at org.eclipse.core.internal.registry.ExtensionRegistry.createExecutableExtension(ExtensionRegistry.java:905)
	at org.eclipse.core.internal.registry.ConfigurationElement.createExecutableExtension(ConfigurationElement.java:243)
	at org.eclipse.core.internal.registry.ConfigurationElementHandle.createExecutableExtension(ConfigurationElementHandle.java:55)
	at org.eclipse.contribution.xref.core.XReferenceProviderDefinition.<init>(XReferenceProviderDefinition.java:32)
	at org.eclipse.contribution.xref.core.XReferenceProviderManager.getRegisteredProviders(XReferenceProviderManager.java:95)
	at org.eclipse.contribution.xref.core.XReferenceProviderManager.getProvidersFor(XReferenceProviderManager.java:70)
	at org.eclipse.contribution.xref.core.XReferenceAdapter.getXReferences(XReferenceAdapter.java:67)
	at org.eclipse.contribution.xref.core.tests.XReferenceAdapterTest.testGetXReferences(XReferenceAdapterTest.java:41)
	at sun.reflect.NativeMethodAccessorImpl.invoke0(Native Method)
	at sun.reflect.NativeMethodAccessorImpl.invoke(NativeMethodAccessorImpl.java:62)
	at sun.reflect.DelegatingMethodAccessorImpl.invoke(DelegatingMethodAccessorImpl.java:43)
	at java.lang.reflect.Method.invoke(Method.java:498)
	at junit.framework.TestCase.runTest(TestCase.java:176)
	at junit.framework.TestCase.runBare(TestCase.java:141)
	at junit.framework.TestResult$1.protect(TestResult.java:122)
	at junit.framework.TestResult.runProtected(TestResult.java:142)
	at junit.framework.TestResult.run(TestResult.java:125)
	at junit.framework.TestCase.run(TestCase.java:129)
	at junit.framework.TestSuite.runTest(TestSuite.java:252)
	at junit.framework.TestSuite.run(TestSuite.java:247)
	at junit.framework.TestSuite.runTest(TestSuite.java:252)
	at junit.framework.TestSuite.run(TestSuite.java:247)
	at org.junit.internal.runners.JUnit38ClassRunner.run(JUnit38ClassRunner.java:86)
	at org.apache.maven.surefire.junit4.JUnit4Provider.execute(JUnit4Provider.java:264)
	at org.apache.maven.surefire.junit4.JUnit4Provider.executeTestSet(JUnit4Provider.java:153)
	at org.apache.maven.surefire.junit4.JUnit4Provider.invoke(JUnit4Provider.java:124)
	at sun.reflect.NativeMethodAccessorImpl.invoke0(Native Method)
	at sun.reflect.NativeMethodAccessorImpl.invoke(NativeMethodAccessorImpl.java:62)
	at sun.reflect.DelegatingMethodAccessorImpl.invoke(DelegatingMethodAccessorImpl.java:43)
	at java.lang.reflect.Method.invoke(Method.java:498)
	at org.apache.maven.surefire.util.ReflectionUtils.invokeMethodWithArray2(ReflectionUtils.java:208)
	at org.apache.maven.surefire.booter.ProviderFactory$ProviderProxy.invoke(ProviderFactory.java:156)
	at org.apache.maven.surefire.booter.ProviderFactory.invokeProvider(ProviderFactory.java:82)
	at org.eclipse.tycho.surefire.osgibooter.OsgiSurefireBooter.run(OsgiSurefireBooter.java:91)
	at org.eclipse.tycho.surefire.osgibooter.AbstractUITestApplication$1.run(AbstractUITestApplication.java:35)
	at org.eclipse.swt.widgets.RunnableLock.run(RunnableLock.java:37)
	at org.eclipse.swt.widgets.Synchronizer.runAsyncMessages(Synchronizer.java:182)
	at org.eclipse.swt.widgets.Display.runAsyncMessages(Display.java:4470)
	at org.eclipse.swt.widgets.Display.readAndDispatch(Display.java:4083)
	at org.eclipse.e4.ui.internal.workbench.swt.PartRenderingEngine$4.run(PartRenderingEngine.java:1145)
	at org.eclipse.core.databinding.observable.Realm.runWithDefault(Realm.java:336)
	at org.eclipse.e4.ui.internal.workbench.swt.PartRenderingEngine.run(PartRenderingEngine.java:1034)
	at org.eclipse.e4.ui.internal.workbench.E4Workbench.createAndRunUI(E4Workbench.java:153)
	at org.eclipse.ui.internal.Workbench.lambda$3(Workbench.java:680)
	at org.eclipse.core.databinding.observable.Realm.runWithDefault(Realm.java:336)
	at org.eclipse.ui.internal.Workbench.createAndRunWorkbench(Workbench.java:594)
	at org.eclipse.ui.PlatformUI.createAndRunWorkbench(PlatformUI.java:148)
	at org.eclipse.ui.internal.ide.application.IDEApplication.start(IDEApplication.java:138)
	at org.eclipse.tycho.surefire.osgibooter.UITestApplication.runApplication(UITestApplication.java:31)
	at org.eclipse.tycho.surefire.osgibooter.AbstractUITestApplication.run(AbstractUITestApplication.java:120)
	at org.eclipse.tycho.surefire.osgibooter.UITestApplication.start(UITestApplication.java:37)
	at org.eclipse.equinox.internal.app.EclipseAppHandle.run(EclipseAppHandle.java:196)
	at org.eclipse.core.runtime.internal.adaptor.EclipseAppLauncher.runApplication(EclipseAppLauncher.java:134)
	at org.eclipse.core.runtime.internal.adaptor.EclipseAppLauncher.start(EclipseAppLauncher.java:104)
	at org.eclipse.core.runtime.adaptor.EclipseStarter.run(EclipseStarter.java:388)
	at org.eclipse.core.runtime.adaptor.EclipseStarter.run(EclipseStarter.java:243)
	at sun.reflect.NativeMethodAccessorImpl.invoke0(Native Method)
	at sun.reflect.NativeMethodAccessorImpl.invoke(NativeMethodAccessorImpl.java:62)
	at sun.reflect.DelegatingMethodAccessorImpl.invoke(DelegatingMethodAccessorImpl.java:43)
	at java.lang.reflect.Method.invoke(Method.java:498)
	at org.eclipse.equinox.launcher.Main.invokeFramework(Main.java:653)
	at org.eclipse.equinox.launcher.Main.basicRun(Main.java:590)
	at org.eclipse.equinox.launcher.Main.run(Main.java:1499)
	at org.eclipse.equinox.launcher.Main.main(Main.java:1472)

!ENTRY org.eclipse.contribution.xref.core 4 2 2017-04-21 14:52:07.588
!MESSAGE Problems occurred when invoking code from plug-in: "org.eclipse.contribution.xref.core".
!STACK 0
java.lang.RuntimeException: You should never trust a provider you know...
	at org.eclipse.contribution.xref.core.tests.TestProvider.getProviderDescription(TestProvider.java:81)
	at org.eclipse.contribution.xref.core.XReferenceProviderDefinition.getProviderDescription_aroundBody0(XReferenceProviderDefinition.java:75)
	at org.eclipse.contribution.xref.core.XReferenceProviderDefinition$AjcClosure1.run(XReferenceProviderDefinition.java:1)
	at org.eclipse.contribution.xref.core.IXReferenceProvider$SafeExecution.ajc$around$org_eclipse_contribution_xref_core_IXReferenceProvider$SafeExecution$1$b538bdbdproceed(IXReferenceProvider.aj:133)
	at org.eclipse.contribution.xref.core.IXReferenceProvider$SafeExecution$1.run(IXReferenceProvider.aj:140)
	at org.eclipse.core.runtime.SafeRunner.run(SafeRunner.java:42)
	at org.eclipse.contribution.xref.core.IXReferenceProvider$SafeExecution.ajc$around$org_eclipse_contribution_xref_core_IXReferenceProvider$SafeExecution$1$b538bdbd(IXReferenceProvider.aj:146)
	at org.eclipse.contribution.xref.core.XReferenceProviderDefinition.getDescription(XReferenceProviderDefinition.java:75)
	at org.eclipse.contribution.xref.core.tests.XReferenceProviderDefinitionTest.testSafeExecution(XReferenceProviderDefinitionTest.java:78)
	at sun.reflect.NativeMethodAccessorImpl.invoke0(Native Method)
	at sun.reflect.NativeMethodAccessorImpl.invoke(NativeMethodAccessorImpl.java:62)
	at sun.reflect.DelegatingMethodAccessorImpl.invoke(DelegatingMethodAccessorImpl.java:43)
	at java.lang.reflect.Method.invoke(Method.java:498)
	at junit.framework.TestCase.runTest(TestCase.java:176)
	at junit.framework.TestCase.runBare(TestCase.java:141)
	at junit.framework.TestResult$1.protect(TestResult.java:122)
	at junit.framework.TestResult.runProtected(TestResult.java:142)
	at junit.framework.TestResult.run(TestResult.java:125)
	at junit.framework.TestCase.run(TestCase.java:129)
	at junit.framework.TestSuite.runTest(TestSuite.java:252)
	at junit.framework.TestSuite.run(TestSuite.java:247)
	at junit.framework.TestSuite.runTest(TestSuite.java:252)
	at junit.framework.TestSuite.run(TestSuite.java:247)
	at org.junit.internal.runners.JUnit38ClassRunner.run(JUnit38ClassRunner.java:86)
	at org.apache.maven.surefire.junit4.JUnit4Provider.execute(JUnit4Provider.java:264)
	at org.apache.maven.surefire.junit4.JUnit4Provider.executeTestSet(JUnit4Provider.java:153)
	at org.apache.maven.surefire.junit4.JUnit4Provider.invoke(JUnit4Provider.java:124)
	at sun.reflect.NativeMethodAccessorImpl.invoke0(Native Method)
	at sun.reflect.NativeMethodAccessorImpl.invoke(NativeMethodAccessorImpl.java:62)
	at sun.reflect.DelegatingMethodAccessorImpl.invoke(DelegatingMethodAccessorImpl.java:43)
	at java.lang.reflect.Method.invoke(Method.java:498)
	at org.apache.maven.surefire.util.ReflectionUtils.invokeMethodWithArray2(ReflectionUtils.java:208)
	at org.apache.maven.surefire.booter.ProviderFactory$ProviderProxy.invoke(ProviderFactory.java:156)
	at org.apache.maven.surefire.booter.ProviderFactory.invokeProvider(ProviderFactory.java:82)
	at org.eclipse.tycho.surefire.osgibooter.OsgiSurefireBooter.run(OsgiSurefireBooter.java:91)
	at org.eclipse.tycho.surefire.osgibooter.AbstractUITestApplication$1.run(AbstractUITestApplication.java:35)
	at org.eclipse.swt.widgets.RunnableLock.run(RunnableLock.java:37)
	at org.eclipse.swt.widgets.Synchronizer.runAsyncMessages(Synchronizer.java:182)
	at org.eclipse.swt.widgets.Display.runAsyncMessages(Display.java:4470)
	at org.eclipse.swt.widgets.Display.readAndDispatch(Display.java:4083)
	at org.eclipse.e4.ui.internal.workbench.swt.PartRenderingEngine$4.run(PartRenderingEngine.java:1145)
	at org.eclipse.core.databinding.observable.Realm.runWithDefault(Realm.java:336)
	at org.eclipse.e4.ui.internal.workbench.swt.PartRenderingEngine.run(PartRenderingEngine.java:1034)
	at org.eclipse.e4.ui.internal.workbench.E4Workbench.createAndRunUI(E4Workbench.java:153)
	at org.eclipse.ui.internal.Workbench.lambda$3(Workbench.java:680)
	at org.eclipse.core.databinding.observable.Realm.runWithDefault(Realm.java:336)
	at org.eclipse.ui.internal.Workbench.createAndRunWorkbench(Workbench.java:594)
	at org.eclipse.ui.PlatformUI.createAndRunWorkbench(PlatformUI.java:148)
	at org.eclipse.ui.internal.ide.application.IDEApplication.start(IDEApplication.java:138)
	at org.eclipse.tycho.surefire.osgibooter.UITestApplication.runApplication(UITestApplication.java:31)
	at org.eclipse.tycho.surefire.osgibooter.AbstractUITestApplication.run(AbstractUITestApplication.java:120)
	at org.eclipse.tycho.surefire.osgibooter.UITestApplication.start(UITestApplication.java:37)
	at org.eclipse.equinox.internal.app.EclipseAppHandle.run(EclipseAppHandle.java:196)
	at org.eclipse.core.runtime.internal.adaptor.EclipseAppLauncher.runApplication(EclipseAppLauncher.java:134)
	at org.eclipse.core.runtime.internal.adaptor.EclipseAppLauncher.start(EclipseAppLauncher.java:104)
	at org.eclipse.core.runtime.adaptor.EclipseStarter.run(EclipseStarter.java:388)
	at org.eclipse.core.runtime.adaptor.EclipseStarter.run(EclipseStarter.java:243)
	at sun.reflect.NativeMethodAccessorImpl.invoke0(Native Method)
	at sun.reflect.NativeMethodAccessorImpl.invoke(NativeMethodAccessorImpl.java:62)
	at sun.reflect.DelegatingMethodAccessorImpl.invoke(DelegatingMethodAccessorImpl.java:43)
	at java.lang.reflect.Method.invoke(Method.java:498)
	at org.eclipse.equinox.launcher.Main.invokeFramework(Main.java:653)
	at org.eclipse.equinox.launcher.Main.basicRun(Main.java:590)
	at org.eclipse.equinox.launcher.Main.run(Main.java:1499)
	at org.eclipse.equinox.launcher.Main.main(Main.java:1472)
Tests run: 23, Failures: 4, Errors: 0, Skipped: 0, Time elapsed: 0.629 sec <<< FAILURE! - in org.eclipse.contribution.xref.core.tests.AllTests
testLog(org.eclipse.contribution.xref.core.tests.XReferencePluginTest)  Time elapsed: 0.015 sec
testPluginID(org.eclipse.contribution.xref.core.tests.XReferencePluginTest)  Time elapsed: 0 sec
testGetDefault(org.eclipse.contribution.xref.core.tests.XReferencePluginTest)  Time elapsed: 0 sec
testAddAssociate(org.eclipse.contribution.xref.core.tests.XReferenceTest)  Time elapsed: 0.001 sec
testRemoveAssociate(org.eclipse.contribution.xref.core.tests.XReferenceTest)  Time elapsed: 0 sec
testXReferenceString(org.eclipse.contribution.xref.core.tests.XReferenceTest)  Time elapsed: 0 sec
testXReferenceStringSet(org.eclipse.contribution.xref.core.tests.XReferenceTest)  Time elapsed: 0 sec
testGetAdapterList(org.eclipse.contribution.xref.core.tests.XReferenceAdapterFactoryTest)  Time elapsed: 0.001 sec
testGetWrongAdapter(org.eclipse.contribution.xref.core.tests.XReferenceAdapterFactoryTest)  Time elapsed: 0 sec
testGetAdapter(org.eclipse.contribution.xref.core.tests.XReferenceAdapterFactoryTest)  Time elapsed: 0.002 sec  <<< FAILURE!
junit.framework.AssertionFailedError: null
	at junit.framework.Assert.fail(Assert.java:55)
	at junit.framework.Assert.assertTrue(Assert.java:22)
	at junit.framework.Assert.assertNotNull(Assert.java:256)
	at junit.framework.Assert.assertNotNull(Assert.java:248)
	at junit.framework.TestCase.assertNotNull(TestCase.java:417)
	at org.eclipse.contribution.xref.core.tests.XReferenceAdapterFactoryTest.testGetAdapter(XReferenceAdapterFactoryTest.java:50)

testGetReferenceSource(org.eclipse.contribution.xref.core.tests.XReferenceAdapterTest)  Time elapsed: 0.001 sec
testGetXReferences(org.eclipse.contribution.xref.core.tests.XReferenceAdapterTest)  Time elapsed: 0.57 sec  <<< FAILURE!
junit.framework.AssertionFailedError: expected:<1> but was:<0>
	at junit.framework.Assert.fail(Assert.java:57)
	at junit.framework.Assert.failNotEquals(Assert.java:329)
	at junit.framework.Assert.assertEquals(Assert.java:78)
	at junit.framework.Assert.assertEquals(Assert.java:234)
	at junit.framework.Assert.assertEquals(Assert.java:241)
	at junit.framework.TestCase.assertEquals(TestCase.java:409)
	at org.eclipse.contribution.xref.core.tests.XReferenceAdapterTest.testGetXReferences(XReferenceAdapterTest.java:45)

testSettingOfIsInplace(org.eclipse.contribution.xref.core.tests.XReferenceProviderManagerTest)  Time elapsed: 0 sec
testGetRegisteredProviders(org.eclipse.contribution.xref.core.tests.XReferenceProviderManagerTest)  Time elapsed: 0.001 sec  <<< FAILURE!
junit.framework.AssertionFailedError: null
	at junit.framework.Assert.fail(Assert.java:55)
	at junit.framework.Assert.assertTrue(Assert.java:22)
	at junit.framework.Assert.assertTrue(Assert.java:31)
	at junit.framework.TestCase.assertTrue(TestCase.java:201)
	at org.eclipse.contribution.xref.core.tests.XReferenceProviderManagerTest.testGetRegisteredProviders(XReferenceProviderManagerTest.java:73)

testGetProvidersFor(org.eclipse.contribution.xref.core.tests.XReferenceProviderManagerTest)  Time elapsed: 0.001 sec  <<< FAILURE!
junit.framework.AssertionFailedError: expected:<1> but was:<0>
	at junit.framework.Assert.fail(Assert.java:57)
	at junit.framework.Assert.failNotEquals(Assert.java:329)
	at junit.framework.Assert.assertEquals(Assert.java:78)
	at junit.framework.Assert.assertEquals(Assert.java:234)
	at junit.framework.Assert.assertEquals(Assert.java:241)
	at junit.framework.TestCase.assertEquals(TestCase.java:409)
	at org.eclipse.contribution.xref.core.tests.XReferenceProviderManagerTest.testGetProvidersFor(XReferenceProviderManagerTest.java:58)

testGetManager(org.eclipse.contribution.xref.core.tests.XReferenceProviderManagerTest)  Time elapsed: 0 sec
testGetLabel(org.eclipse.contribution.xref.core.tests.XReferenceProviderDefinitionTest)  Time elapsed: 0.004 sec
testGetID(org.eclipse.contribution.xref.core.tests.XReferenceProviderDefinitionTest)  Time elapsed: 0 sec
testSetCheckedInplaceFilters(org.eclipse.contribution.xref.core.tests.XReferenceProviderDefinitionTest)  Time elapsed: 0 sec
testIsAndSetEnabled(org.eclipse.contribution.xref.core.tests.XReferenceProviderDefinitionTest)  Time elapsed: 0 sec
testGetDescription(org.eclipse.contribution.xref.core.tests.XReferenceProviderDefinitionTest)  Time elapsed: 0.001 sec
testSetCheckedFilters(org.eclipse.contribution.xref.core.tests.XReferenceProviderDefinitionTest)  Time elapsed: 0 sec
testSafeExecution(org.eclipse.contribution.xref.core.tests.XReferenceProviderDefinitionTest)  Time elapsed: 0.003 sec

Results :

Failed tests: 
  XReferenceAdapterFactoryTest.testGetAdapter:50 null
  XReferenceAdapterTest.testGetXReferences:45 expected:<1> but was:<0>
  XReferenceProviderManagerTest.testGetRegisteredProviders:73 null
  XReferenceProviderManagerTest.testGetProvidersFor:58 expected:<1> but was:<0>

Tests run: 23, Failures: 4, Errors: 0, Skipped: 0

[ERROR] There are test failures.

Please refer to /jobs/genie.ajdt/ajdt-on-eclipse-47/workspace/org.eclipse.contribution.xref.core.tests/target/surefire-reports for the individual test results.
[INFO] 
[INFO] --- eclipse-jarsigner-plugin:1.0.4:sign (sign) @ org.eclipse.contribution.xref.core.tests ---
[INFO] Signed org.eclipse.ajdt:org.eclipse.contribution.xref.core.tests:eclipse-test-plugin:2.2.4-SNAPSHOT in 0 seconds.
[INFO] 
[INFO] --- tycho-p2-plugin:0.23.1:p2-metadata (p2-metadata) @ org.eclipse.contribution.xref.core.tests ---
[INFO]                                                                         
[INFO] ------------------------------------------------------------------------
[INFO] Building org.eclipse.contribution.xref.ui.tests 2.2.4-SNAPSHOT
[INFO] ------------------------------------------------------------------------
[INFO] 
[INFO] --- maven-clean-plugin:2.5:clean (default-clean) @ org.eclipse.contribution.xref.ui.tests ---
[INFO] 
[INFO] --- tycho-packaging-plugin:0.23.1:build-qualifier (default-build-qualifier) @ org.eclipse.contribution.xref.ui.tests ---
[INFO] The project's OSGi version is 2.2.4.201704211714
[INFO] 
[INFO] --- tycho-packaging-plugin:0.23.1:validate-id (default-validate-id) @ org.eclipse.contribution.xref.ui.tests ---
[INFO] 
[INFO] --- tycho-packaging-plugin:0.23.1:validate-version (default-validate-version) @ org.eclipse.contribution.xref.ui.tests ---
[INFO] 
[INFO] --- maven-resources-plugin:2.4.3:resources (default-resources) @ org.eclipse.contribution.xref.ui.tests ---
[WARNING] Using platform encoding (UTF-8 actually) to copy filtered resources, i.e. build is platform dependent!
[INFO] skip non existing resourceDirectory /jobs/genie.ajdt/ajdt-on-eclipse-47/workspace/org.eclipse.contribution.xref.ui.tests/src/main/resources
[INFO] 
[INFO] --- tycho-compiler-plugin:0.23.1:compile (default-compile) @ org.eclipse.contribution.xref.ui.tests ---
[INFO] Compiling 7 source files to /jobs/genie.ajdt/ajdt-on-eclipse-47/workspace/org.eclipse.contribution.xref.ui.tests/target/classes
[INFO] 
[INFO] --- maven-resources-plugin:2.4.3:testResources (default-testResources) @ org.eclipse.contribution.xref.ui.tests ---
[WARNING] Using platform encoding (UTF-8 actually) to copy filtered resources, i.e. build is platform dependent!
[INFO] skip non existing resourceDirectory /jobs/genie.ajdt/ajdt-on-eclipse-47/workspace/org.eclipse.contribution.xref.ui.tests/src/test/resources
[INFO] 
[INFO] --- target-platform-configuration:0.23.1:target-platform (default-target-platform) @ org.eclipse.contribution.xref.ui.tests ---
[INFO] 
[INFO] --- tycho-packaging-plugin:0.23.1:package-plugin (default-package-plugin) @ org.eclipse.contribution.xref.ui.tests ---
[INFO] Building jar: /jobs/genie.ajdt/ajdt-on-eclipse-47/workspace/org.eclipse.contribution.xref.ui.tests/xrefuitests.jar
[INFO] Building jar: /jobs/genie.ajdt/ajdt-on-eclipse-47/workspace/org.eclipse.contribution.xref.ui.tests/target/org.eclipse.contribution.xref.ui.tests-2.2.4-SNAPSHOT.jar
[INFO] 
[INFO] --- tycho-p2-plugin:0.23.1:p2-metadata-default (default-p2-metadata-default) @ org.eclipse.contribution.xref.ui.tests ---
[INFO] 
[INFO] --- tycho-surefire-plugin:0.23.1:test (default-test) @ org.eclipse.contribution.xref.ui.tests ---
[INFO] Expected eclipse log file: /jobs/genie.ajdt/ajdt-on-eclipse-47/workspace/org.eclipse.contribution.xref.ui.tests/target/work/data/.metadata/.log
[INFO] Command line:
	[/opt/public/common/jdk1.8.0_121.x64/jre/bin/java, -Dosgi.noShutdown=false, -Dosgi.os=linux, -Dosgi.ws=gtk, -Dosgi.arch=x86_64, -Xmx1024m, -XX:MaxPermSize=256m, -Dosgi.clean=true, -jar, /jobs/genie.ajdt/ajdt-on-eclipse-47/workspace/.maven/repo/p2/osgi/bundle/org.eclipse.equinox.launcher/1.4.0.v20161219-1356/org.eclipse.equinox.launcher-1.4.0.v20161219-1356.jar, -debug, -consolelog, -data, /jobs/genie.ajdt/ajdt-on-eclipse-47/workspace/org.eclipse.contribution.xref.ui.tests/target/work/data, -install, /jobs/genie.ajdt/ajdt-on-eclipse-47/workspace/org.eclipse.contribution.xref.ui.tests/target/work, -configuration, /jobs/genie.ajdt/ajdt-on-eclipse-47/workspace/org.eclipse.contribution.xref.ui.tests/target/work/configuration, -application, org.eclipse.tycho.surefire.osgibooter.uitest, -testproperties, /jobs/genie.ajdt/ajdt-on-eclipse-47/workspace/org.eclipse.contribution.xref.ui.tests/target/surefire.properties]
Java HotSpot(TM) 64-Bit Server VM warning: ignoring option MaxPermSize=256m; support was removed in 8.0
Configuration location:
    file:/jobs/genie.ajdt/ajdt-on-eclipse-47/workspace/org.eclipse.contribution.xref.ui.tests/target/work/configuration/
Configuration file:
    file:/jobs/genie.ajdt/ajdt-on-eclipse-47/workspace/org.eclipse.contribution.xref.ui.tests/target/work/configuration/config.ini loaded
Install location:
    file:/jobs/genie.ajdt/ajdt-on-eclipse-47/workspace/org.eclipse.contribution.xref.ui.tests/target/work/
Framework located:
    file:/home/hudson/genie.ajdt/.hudson/jobs/ajdt-on-eclipse-47/workspace/.maven/repo/p2/osgi/bundle/org.eclipse.osgi/3.12.0.v20170302-2050/org.eclipse.osgi-3.12.0.v20170302-2050.jar
Framework classpath:
    file:/home/hudson/genie.ajdt/.hudson/jobs/ajdt-on-eclipse-47/workspace/.maven/repo/p2/osgi/bundle/org.eclipse.osgi/3.12.0.v20170302-2050/org.eclipse.osgi-3.12.0.v20170302-2050.jar
Debug options:
    file:/jobs/genie.ajdt/ajdt-on-eclipse-47/workspace/org.eclipse.contribution.xref.ui.tests/.options not found
Time to load bundles: 756
!SESSION 2017-04-21 14:52:12.712 -----------------------------------------------
eclipse.buildId=unknown
java.version=1.8.0_121
java.vendor=Oracle Corporation
BootLoader constants: OS=linux, ARCH=x86_64, WS=gtk, NL=en_US
Framework arguments:  -application org.eclipse.tycho.surefire.osgibooter.uitest -testproperties /jobs/genie.ajdt/ajdt-on-eclipse-47/workspace/org.eclipse.contribution.xref.ui.tests/target/surefire.properties
Command-line arguments:  -debug -consolelog -data /jobs/genie.ajdt/ajdt-on-eclipse-47/workspace/org.eclipse.contribution.xref.ui.tests/target/work/data -application org.eclipse.tycho.surefire.osgibooter.uitest -testproperties /jobs/genie.ajdt/ajdt-on-eclipse-47/workspace/org.eclipse.contribution.xref.ui.tests/target/surefire.properties

!ENTRY org.eclipse.jdt.launching.macosx 4 0 2017-04-21 14:52:14.239
!MESSAGE FrameworkEvent ERROR
!STACK 0
org.osgi.framework.BundleException: Could not resolve module: org.eclipse.jdt.launching.macosx [218]
  Unresolved requirement: Require-Capability: eclipse.platform; filter:="(osgi.os=macosx)"

	at org.eclipse.osgi.container.Module.start(Module.java:444)
	at org.eclipse.osgi.container.ModuleContainer$ContainerStartLevel.incStartLevel(ModuleContainer.java:1628)
	at org.eclipse.osgi.container.ModuleContainer$ContainerStartLevel.incStartLevel(ModuleContainer.java:1607)
	at org.eclipse.osgi.container.ModuleContainer$ContainerStartLevel.doContainerStartLevel(ModuleContainer.java:1579)
	at org.eclipse.osgi.container.ModuleContainer$ContainerStartLevel.dispatchEvent(ModuleContainer.java:1522)
	at org.eclipse.osgi.container.ModuleContainer$ContainerStartLevel.dispatchEvent(ModuleContainer.java:1)
	at org.eclipse.osgi.framework.eventmgr.EventManager.dispatchEvent(EventManager.java:230)
	at org.eclipse.osgi.framework.eventmgr.EventManager$EventThread.run(EventManager.java:340)

!ENTRY org.eclipse.jdt.launching.ui.macosx 4 0 2017-04-21 14:52:14.242
!MESSAGE FrameworkEvent ERROR
!STACK 0
org.osgi.framework.BundleException: Could not resolve module: org.eclipse.jdt.launching.ui.macosx [219]
  Unresolved requirement: Require-Capability: eclipse.platform; filter:="(osgi.os=macosx)"

	at org.eclipse.osgi.container.Module.start(Module.java:444)
	at org.eclipse.osgi.container.ModuleContainer$ContainerStartLevel.incStartLevel(ModuleContainer.java:1628)
	at org.eclipse.osgi.container.ModuleContainer$ContainerStartLevel.incStartLevel(ModuleContainer.java:1607)
	at org.eclipse.osgi.container.ModuleContainer$ContainerStartLevel.doContainerStartLevel(ModuleContainer.java:1579)
	at org.eclipse.osgi.container.ModuleContainer$ContainerStartLevel.dispatchEvent(ModuleContainer.java:1522)
	at org.eclipse.osgi.container.ModuleContainer$ContainerStartLevel.dispatchEvent(ModuleContainer.java:1)
	at org.eclipse.osgi.framework.eventmgr.EventManager.dispatchEvent(EventManager.java:230)
	at org.eclipse.osgi.framework.eventmgr.EventManager$EventThread.run(EventManager.java:340)
Starting application: 2085
Application Started: 4164

-------------------------------------------------------
 T E S T S
-------------------------------------------------------
Running org.eclipse.contribution.xref.ui.tests.AllTests

!ENTRY org.eclipse.contribution.xref.core 2 1 2017-04-21 14:52:18.925
!MESSAGE Could not load provider org.eclipse.contribution.xref.core.tests.unknownProvider
!STACK 1
org.eclipse.core.runtime.CoreException: Plug-in org.eclipse.contribution.xref.core.tests was unable to load class org.eclipse.contribution.xref.core.tests.UnknownProvider.
	at org.eclipse.core.internal.registry.osgi.RegistryStrategyOSGI.throwException(RegistryStrategyOSGI.java:194)
	at org.eclipse.core.internal.registry.osgi.RegistryStrategyOSGI.createExecutableExtension(RegistryStrategyOSGI.java:176)
	at org.eclipse.core.internal.registry.ExtensionRegistry.createExecutableExtension(ExtensionRegistry.java:905)
	at org.eclipse.core.internal.registry.ConfigurationElement.createExecutableExtension(ConfigurationElement.java:243)
	at org.eclipse.core.internal.registry.ConfigurationElementHandle.createExecutableExtension(ConfigurationElementHandle.java:55)
	at org.eclipse.contribution.xref.core.XReferenceProviderDefinition.<init>(XReferenceProviderDefinition.java:32)
	at org.eclipse.contribution.xref.core.XReferenceProviderManager.getRegisteredProviders(XReferenceProviderManager.java:95)
	at org.eclipse.contribution.xref.internal.ui.actions.XReferenceCustomFilterAction.<init>(XReferenceCustomFilterAction.java:58)
	at org.eclipse.contribution.xref.ui.views.XReferenceView.makeActions(XReferenceView.java:458)
	at org.eclipse.contribution.xref.ui.views.XReferenceView.createPartControl(XReferenceView.java:117)
	at org.eclipse.ui.internal.e4.compatibility.CompatibilityPart.createPartControl(CompatibilityPart.java:151)
	at org.eclipse.ui.internal.e4.compatibility.CompatibilityView.createPartControl(CompatibilityView.java:147)
	at org.eclipse.ui.internal.e4.compatibility.CompatibilityPart.create(CompatibilityPart.java:355)
	at sun.reflect.NativeMethodAccessorImpl.invoke0(Native Method)
	at sun.reflect.NativeMethodAccessorImpl.invoke(NativeMethodAccessorImpl.java:62)
	at sun.reflect.DelegatingMethodAccessorImpl.invoke(DelegatingMethodAccessorImpl.java:43)
	at java.lang.reflect.Method.invoke(Method.java:498)
	at org.eclipse.e4.core.internal.di.MethodRequestor.execute(MethodRequestor.java:55)
	at org.eclipse.e4.core.internal.di.InjectorImpl.processAnnotated(InjectorImpl.java:990)
	at org.eclipse.e4.core.internal.di.InjectorImpl.processAnnotated(InjectorImpl.java:955)
	at org.eclipse.e4.core.internal.di.InjectorImpl.inject(InjectorImpl.java:124)
	at org.eclipse.e4.core.internal.di.InjectorImpl.internalMake(InjectorImpl.java:399)
	at org.eclipse.e4.core.internal.di.InjectorImpl.make(InjectorImpl.java:318)
	at org.eclipse.e4.core.contexts.ContextInjectionFactory.make(ContextInjectionFactory.java:162)
	at org.eclipse.e4.ui.internal.workbench.ReflectionContributionFactory.createFromBundle(ReflectionContributionFactory.java:105)
	at org.eclipse.e4.ui.internal.workbench.ReflectionContributionFactory.doCreate(ReflectionContributionFactory.java:74)
	at org.eclipse.e4.ui.internal.workbench.ReflectionContributionFactory.create(ReflectionContributionFactory.java:56)
	at org.eclipse.e4.ui.workbench.renderers.swt.ContributedPartRenderer.createWidget(ContributedPartRenderer.java:129)
	at org.eclipse.e4.ui.internal.workbench.swt.PartRenderingEngine.createWidget(PartRenderingEngine.java:987)
	at org.eclipse.e4.ui.internal.workbench.swt.PartRenderingEngine.safeCreateGui(PartRenderingEngine.java:663)
	at org.eclipse.e4.ui.internal.workbench.swt.PartRenderingEngine$1.run(PartRenderingEngine.java:548)
	at org.eclipse.core.runtime.SafeRunner.run(SafeRunner.java:42)
	at org.eclipse.e4.ui.internal.workbench.swt.PartRenderingEngine.createGui(PartRenderingEngine.java:532)
	at org.eclipse.e4.ui.workbench.renderers.swt.ElementReferenceRenderer.createWidget(ElementReferenceRenderer.java:70)
	at org.eclipse.e4.ui.internal.workbench.swt.PartRenderingEngine.createWidget(PartRenderingEngine.java:987)
	at org.eclipse.e4.ui.internal.workbench.swt.PartRenderingEngine.safeCreateGui(PartRenderingEngine.java:663)
	at org.eclipse.e4.ui.internal.workbench.swt.PartRenderingEngine.safeCreateGui(PartRenderingEngine.java:769)
	at org.eclipse.e4.ui.internal.workbench.swt.PartRenderingEngine.access$0(PartRenderingEngine.java:740)
	at org.eclipse.e4.ui.internal.workbench.swt.PartRenderingEngine$2.run(PartRenderingEngine.java:734)
	at org.eclipse.core.runtime.SafeRunner.run(SafeRunner.java:42)
	at org.eclipse.e4.ui.internal.workbench.swt.PartRenderingEngine.createGui(PartRenderingEngine.java:718)
	at org.eclipse.e4.ui.internal.workbench.PartServiceImpl$1.handleEvent(PartServiceImpl.java:109)
	at org.eclipse.e4.ui.services.internal.events.UIEventHandler$1.run(UIEventHandler.java:40)
	at org.eclipse.swt.widgets.Synchronizer.syncExec(Synchronizer.java:233)
	at org.eclipse.ui.internal.UISynchronizer.syncExec(UISynchronizer.java:144)
	at org.eclipse.swt.widgets.Display.syncExec(Display.java:5412)
	at org.eclipse.e4.ui.internal.workbench.swt.E4Application$1.syncExec(E4Application.java:212)
	at org.eclipse.e4.ui.services.internal.events.UIEventHandler.handleEvent(UIEventHandler.java:36)
	at org.eclipse.equinox.internal.event.EventHandlerWrapper.handleEvent(EventHandlerWrapper.java:201)
	at org.eclipse.equinox.internal.event.EventHandlerTracker.dispatchEvent(EventHandlerTracker.java:197)
	at org.eclipse.equinox.internal.event.EventHandlerTracker.dispatchEvent(EventHandlerTracker.java:1)
	at org.eclipse.osgi.framework.eventmgr.EventManager.dispatchEvent(EventManager.java:230)
	at org.eclipse.osgi.framework.eventmgr.ListenerQueue.dispatchEventSynchronous(ListenerQueue.java:148)
	at org.eclipse.equinox.internal.event.EventAdminImpl.dispatchEvent(EventAdminImpl.java:135)
	at org.eclipse.equinox.internal.event.EventAdminImpl.sendEvent(EventAdminImpl.java:78)
	at org.eclipse.equinox.internal.event.EventComponent.sendEvent(EventComponent.java:39)
	at org.eclipse.e4.ui.services.internal.events.EventBroker.send(EventBroker.java:52)
	at org.eclipse.e4.ui.internal.workbench.UIEventPublisher.notifyChanged(UIEventPublisher.java:60)
	at org.eclipse.emf.common.notify.impl.BasicNotifierImpl.eNotify(BasicNotifierImpl.java:374)
	at org.eclipse.e4.ui.model.application.ui.impl.ElementContainerImpl.setSelectedElement(ElementContainerImpl.java:173)
	at org.eclipse.e4.ui.internal.workbench.ModelServiceImpl.showElementInWindow(ModelServiceImpl.java:620)
	at org.eclipse.e4.ui.internal.workbench.ModelServiceImpl.bringToTop(ModelServiceImpl.java:584)
	at org.eclipse.e4.ui.internal.workbench.PartServiceImpl.delegateBringToTop(PartServiceImpl.java:768)
	at org.eclipse.e4.ui.internal.workbench.PartServiceImpl.activate(PartServiceImpl.java:742)
	at org.eclipse.e4.ui.internal.workbench.PartServiceImpl.activate(PartServiceImpl.java:680)
	at org.eclipse.e4.ui.internal.workbench.PartServiceImpl.activate(PartServiceImpl.java:675)
	at org.eclipse.e4.ui.internal.workbench.PartServiceImpl.showPart(PartServiceImpl.java:1178)
	at org.eclipse.ui.internal.WorkbenchPage.showPart(WorkbenchPage.java:1287)
	at org.eclipse.ui.internal.WorkbenchPage.busyShowView(WorkbenchPage.java:1278)
	at org.eclipse.ui.internal.WorkbenchPage$12.run(WorkbenchPage.java:4329)
	at org.eclipse.swt.custom.BusyIndicator.showWhile(BusyIndicator.java:70)
	at org.eclipse.ui.internal.WorkbenchPage.showView(WorkbenchPage.java:4325)
	at org.eclipse.ui.internal.WorkbenchPage.showView(WorkbenchPage.java:4305)
	at org.eclipse.contribution.xref.ui.tests.views.XReferenceViewTest.testShowHide(XReferenceViewTest.java:59)
	at sun.reflect.NativeMethodAccessorImpl.invoke0(Native Method)
	at sun.reflect.NativeMethodAccessorImpl.invoke(NativeMethodAccessorImpl.java:62)
	at sun.reflect.DelegatingMethodAccessorImpl.invoke(DelegatingMethodAccessorImpl.java:43)
	at java.lang.reflect.Method.invoke(Method.java:498)
	at junit.framework.TestCase.runTest(TestCase.java:176)
	at junit.framework.TestCase.runBare(TestCase.java:141)
	at junit.framework.TestResult$1.protect(TestResult.java:122)
	at junit.framework.TestResult.runProtected(TestResult.java:142)
	at junit.framework.TestResult.run(TestResult.java:125)
	at junit.framework.TestCase.run(TestCase.java:129)
	at junit.framework.TestSuite.runTest(TestSuite.java:252)
	at junit.framework.TestSuite.run(TestSuite.java:247)
	at junit.framework.TestSuite.runTest(TestSuite.java:252)
	at junit.framework.TestSuite.run(TestSuite.java:247)
	at org.junit.internal.runners.JUnit38ClassRunner.run(JUnit38ClassRunner.java:86)
	at org.apache.maven.surefire.junit4.JUnit4Provider.execute(JUnit4Provider.java:264)
	at org.apache.maven.surefire.junit4.JUnit4Provider.executeTestSet(JUnit4Provider.java:153)
	at org.apache.maven.surefire.junit4.JUnit4Provider.invoke(JUnit4Provider.java:124)
	at sun.reflect.NativeMethodAccessorImpl.invoke0(Native Method)
	at sun.reflect.NativeMethodAccessorImpl.invoke(NativeMethodAccessorImpl.java:62)
	at sun.reflect.DelegatingMethodAccessorImpl.invoke(DelegatingMethodAccessorImpl.java:43)
	at java.lang.reflect.Method.invoke(Method.java:498)
	at org.apache.maven.surefire.util.ReflectionUtils.invokeMethodWithArray2(ReflectionUtils.java:208)
	at org.apache.maven.surefire.booter.ProviderFactory$ProviderProxy.invoke(ProviderFactory.java:156)
	at org.apache.maven.surefire.booter.ProviderFactory.invokeProvider(ProviderFactory.java:82)
	at org.eclipse.tycho.surefire.osgibooter.OsgiSurefireBooter.run(OsgiSurefireBooter.java:91)
	at org.eclipse.tycho.surefire.osgibooter.AbstractUITestApplication$1.run(AbstractUITestApplication.java:35)
	at org.eclipse.swt.widgets.RunnableLock.run(RunnableLock.java:37)
	at org.eclipse.swt.widgets.Synchronizer.runAsyncMessages(Synchronizer.java:182)
	at org.eclipse.swt.widgets.Display.runAsyncMessages(Display.java:4470)
	at org.eclipse.swt.widgets.Display.readAndDispatch(Display.java:4083)
	at org.eclipse.e4.ui.internal.workbench.swt.PartRenderingEngine$4.run(PartRenderingEngine.java:1145)
	at org.eclipse.core.databinding.observable.Realm.runWithDefault(Realm.java:336)
	at org.eclipse.e4.ui.internal.workbench.swt.PartRenderingEngine.run(PartRenderingEngine.java:1034)
	at org.eclipse.e4.ui.internal.workbench.E4Workbench.createAndRunUI(E4Workbench.java:153)
	at org.eclipse.ui.internal.Workbench.lambda$3(Workbench.java:680)
	at org.eclipse.core.databinding.observable.Realm.runWithDefault(Realm.java:336)
	at org.eclipse.ui.internal.Workbench.createAndRunWorkbench(Workbench.java:594)
	at org.eclipse.ui.PlatformUI.createAndRunWorkbench(PlatformUI.java:148)
	at org.eclipse.ui.internal.ide.application.IDEApplication.start(IDEApplication.java:138)
	at org.eclipse.tycho.surefire.osgibooter.UITestApplication.runApplication(UITestApplication.java:31)
	at org.eclipse.tycho.surefire.osgibooter.AbstractUITestApplication.run(AbstractUITestApplication.java:120)
	at org.eclipse.tycho.surefire.osgibooter.UITestApplication.start(UITestApplication.java:37)
	at org.eclipse.equinox.internal.app.EclipseAppHandle.run(EclipseAppHandle.java:196)
	at org.eclipse.core.runtime.internal.adaptor.EclipseAppLauncher.runApplication(EclipseAppLauncher.java:134)
	at org.eclipse.core.runtime.internal.adaptor.EclipseAppLauncher.start(EclipseAppLauncher.java:104)
	at org.eclipse.core.runtime.adaptor.EclipseStarter.run(EclipseStarter.java:388)
	at org.eclipse.core.runtime.adaptor.EclipseStarter.run(EclipseStarter.java:243)
	at sun.reflect.NativeMethodAccessorImpl.invoke0(Native Method)
	at sun.reflect.NativeMethodAccessorImpl.invoke(NativeMethodAccessorImpl.java:62)
	at sun.reflect.DelegatingMethodAccessorImpl.invoke(DelegatingMethodAccessorImpl.java:43)
	at java.lang.reflect.Method.invoke(Method.java:498)
	at org.eclipse.equinox.launcher.Main.invokeFramework(Main.java:653)
	at org.eclipse.equinox.launcher.Main.basicRun(Main.java:590)
	at org.eclipse.equinox.launcher.Main.run(Main.java:1499)
	at org.eclipse.equinox.launcher.Main.main(Main.java:1472)
Caused by: java.lang.ClassNotFoundException: org.eclipse.contribution.xref.core.tests.UnknownProvider cannot be found by org.eclipse.contribution.xref.core.tests_2.2.4.201704211714
	at org.eclipse.osgi.internal.loader.BundleLoader.findClassInternal(BundleLoader.java:475)
	at org.eclipse.osgi.internal.loader.BundleLoader.findClass(BundleLoader.java:386)
	at org.eclipse.osgi.internal.loader.BundleLoader.findClass(BundleLoader.java:378)
	at org.eclipse.osgi.internal.loader.ModuleClassLoader.loadClass(ModuleClassLoader.java:150)
	at java.lang.ClassLoader.loadClass(ClassLoader.java:357)
	at org.eclipse.osgi.internal.framework.EquinoxBundle.loadClass(EquinoxBundle.java:564)
	at org.eclipse.core.internal.registry.osgi.RegistryStrategyOSGI.createExecutableExtension(RegistryStrategyOSGI.java:174)
	... 128 more
!SUBENTRY 1 org.eclipse.equinox.registry 4 1 2017-04-21 14:52:18.928
!MESSAGE Plug-in org.eclipse.contribution.xref.core.tests was unable to load class org.eclipse.contribution.xref.core.tests.UnknownProvider.
!STACK 0
java.lang.ClassNotFoundException: org.eclipse.contribution.xref.core.tests.UnknownProvider cannot be found by org.eclipse.contribution.xref.core.tests_2.2.4.201704211714
	at org.eclipse.osgi.internal.loader.BundleLoader.findClassInternal(BundleLoader.java:475)
	at org.eclipse.osgi.internal.loader.BundleLoader.findClass(BundleLoader.java:386)
	at org.eclipse.osgi.internal.loader.BundleLoader.findClass(BundleLoader.java:378)
	at org.eclipse.osgi.internal.loader.ModuleClassLoader.loadClass(ModuleClassLoader.java:150)
	at java.lang.ClassLoader.loadClass(ClassLoader.java:357)
	at org.eclipse.osgi.internal.framework.EquinoxBundle.loadClass(EquinoxBundle.java:564)
	at org.eclipse.core.internal.registry.osgi.RegistryStrategyOSGI.createExecutableExtension(RegistryStrategyOSGI.java:174)
	at org.eclipse.core.internal.registry.ExtensionRegistry.createExecutableExtension(ExtensionRegistry.java:905)
	at org.eclipse.core.internal.registry.ConfigurationElement.createExecutableExtension(ConfigurationElement.java:243)
	at org.eclipse.core.internal.registry.ConfigurationElementHandle.createExecutableExtension(ConfigurationElementHandle.java:55)
	at org.eclipse.contribution.xref.core.XReferenceProviderDefinition.<init>(XReferenceProviderDefinition.java:32)
	at org.eclipse.contribution.xref.core.XReferenceProviderManager.getRegisteredProviders(XReferenceProviderManager.java:95)
	at org.eclipse.contribution.xref.internal.ui.actions.XReferenceCustomFilterAction.<init>(XReferenceCustomFilterAction.java:58)
	at org.eclipse.contribution.xref.ui.views.XReferenceView.makeActions(XReferenceView.java:458)
	at org.eclipse.contribution.xref.ui.views.XReferenceView.createPartControl(XReferenceView.java:117)
	at org.eclipse.ui.internal.e4.compatibility.CompatibilityPart.createPartControl(CompatibilityPart.java:151)
	at org.eclipse.ui.internal.e4.compatibility.CompatibilityView.createPartControl(CompatibilityView.java:147)
	at org.eclipse.ui.internal.e4.compatibility.CompatibilityPart.create(CompatibilityPart.java:355)
	at sun.reflect.NativeMethodAccessorImpl.invoke0(Native Method)
	at sun.reflect.NativeMethodAccessorImpl.invoke(NativeMethodAccessorImpl.java:62)
	at sun.reflect.DelegatingMethodAccessorImpl.invoke(DelegatingMethodAccessorImpl.java:43)
	at java.lang.reflect.Method.invoke(Method.java:498)
	at org.eclipse.e4.core.internal.di.MethodRequestor.execute(MethodRequestor.java:55)
	at org.eclipse.e4.core.internal.di.InjectorImpl.processAnnotated(InjectorImpl.java:990)
	at org.eclipse.e4.core.internal.di.InjectorImpl.processAnnotated(InjectorImpl.java:955)
	at org.eclipse.e4.core.internal.di.InjectorImpl.inject(InjectorImpl.java:124)
	at org.eclipse.e4.core.internal.di.InjectorImpl.internalMake(InjectorImpl.java:399)
	at org.eclipse.e4.core.internal.di.InjectorImpl.make(InjectorImpl.java:318)
	at org.eclipse.e4.core.contexts.ContextInjectionFactory.make(ContextInjectionFactory.java:162)
	at org.eclipse.e4.ui.internal.workbench.ReflectionContributionFactory.createFromBundle(ReflectionContributionFactory.java:105)
	at org.eclipse.e4.ui.internal.workbench.ReflectionContributionFactory.doCreate(ReflectionContributionFactory.java:74)
	at org.eclipse.e4.ui.internal.workbench.ReflectionContributionFactory.create(ReflectionContributionFactory.java:56)
	at org.eclipse.e4.ui.workbench.renderers.swt.ContributedPartRenderer.createWidget(ContributedPartRenderer.java:129)
	at org.eclipse.e4.ui.internal.workbench.swt.PartRenderingEngine.createWidget(PartRenderingEngine.java:987)
	at org.eclipse.e4.ui.internal.workbench.swt.PartRenderingEngine.safeCreateGui(PartRenderingEngine.java:663)
	at org.eclipse.e4.ui.internal.workbench.swt.PartRenderingEngine$1.run(PartRenderingEngine.java:548)
	at org.eclipse.core.runtime.SafeRunner.run(SafeRunner.java:42)
	at org.eclipse.e4.ui.internal.workbench.swt.PartRenderingEngine.createGui(PartRenderingEngine.java:532)
	at org.eclipse.e4.ui.workbench.renderers.swt.ElementReferenceRenderer.createWidget(ElementReferenceRenderer.java:70)
	at org.eclipse.e4.ui.internal.workbench.swt.PartRenderingEngine.createWidget(PartRenderingEngine.java:987)
	at org.eclipse.e4.ui.internal.workbench.swt.PartRenderingEngine.safeCreateGui(PartRenderingEngine.java:663)
	at org.eclipse.e4.ui.internal.workbench.swt.PartRenderingEngine.safeCreateGui(PartRenderingEngine.java:769)
	at org.eclipse.e4.ui.internal.workbench.swt.PartRenderingEngine.access$0(PartRenderingEngine.java:740)
	at org.eclipse.e4.ui.internal.workbench.swt.PartRenderingEngine$2.run(PartRenderingEngine.java:734)
	at org.eclipse.core.runtime.SafeRunner.run(SafeRunner.java:42)
	at org.eclipse.e4.ui.internal.workbench.swt.PartRenderingEngine.createGui(PartRenderingEngine.java:718)
	at org.eclipse.e4.ui.internal.workbench.PartServiceImpl$1.handleEvent(PartServiceImpl.java:109)
	at org.eclipse.e4.ui.services.internal.events.UIEventHandler$1.run(UIEventHandler.java:40)
	at org.eclipse.swt.widgets.Synchronizer.syncExec(Synchronizer.java:233)
	at org.eclipse.ui.internal.UISynchronizer.syncExec(UISynchronizer.java:144)
	at org.eclipse.swt.widgets.Display.syncExec(Display.java:5412)
	at org.eclipse.e4.ui.internal.workbench.swt.E4Application$1.syncExec(E4Application.java:212)
	at org.eclipse.e4.ui.services.internal.events.UIEventHandler.handleEvent(UIEventHandler.java:36)
	at org.eclipse.equinox.internal.event.EventHandlerWrapper.handleEvent(EventHandlerWrapper.java:201)
	at org.eclipse.equinox.internal.event.EventHandlerTracker.dispatchEvent(EventHandlerTracker.java:197)
	at org.eclipse.equinox.internal.event.EventHandlerTracker.dispatchEvent(EventHandlerTracker.java:1)
	at org.eclipse.osgi.framework.eventmgr.EventManager.dispatchEvent(EventManager.java:230)
	at org.eclipse.osgi.framework.eventmgr.ListenerQueue.dispatchEventSynchronous(ListenerQueue.java:148)
	at org.eclipse.equinox.internal.event.EventAdminImpl.dispatchEvent(EventAdminImpl.java:135)
	at org.eclipse.equinox.internal.event.EventAdminImpl.sendEvent(EventAdminImpl.java:78)
	at org.eclipse.equinox.internal.event.EventComponent.sendEvent(EventComponent.java:39)
	at org.eclipse.e4.ui.services.internal.events.EventBroker.send(EventBroker.java:52)
	at org.eclipse.e4.ui.internal.workbench.UIEventPublisher.notifyChanged(UIEventPublisher.java:60)
	at org.eclipse.emf.common.notify.impl.BasicNotifierImpl.eNotify(BasicNotifierImpl.java:374)
	at org.eclipse.e4.ui.model.application.ui.impl.ElementContainerImpl.setSelectedElement(ElementContainerImpl.java:173)
	at org.eclipse.e4.ui.internal.workbench.ModelServiceImpl.showElementInWindow(ModelServiceImpl.java:620)
	at org.eclipse.e4.ui.internal.workbench.ModelServiceImpl.bringToTop(ModelServiceImpl.java:584)
	at org.eclipse.e4.ui.internal.workbench.PartServiceImpl.delegateBringToTop(PartServiceImpl.java:768)
	at org.eclipse.e4.ui.internal.workbench.PartServiceImpl.activate(PartServiceImpl.java:742)
	at org.eclipse.e4.ui.internal.workbench.PartServiceImpl.activate(PartServiceImpl.java:680)
	at org.eclipse.e4.ui.internal.workbench.PartServiceImpl.activate(PartServiceImpl.java:675)
	at org.eclipse.e4.ui.internal.workbench.PartServiceImpl.showPart(PartServiceImpl.java:1178)
	at org.eclipse.ui.internal.WorkbenchPage.showPart(WorkbenchPage.java:1287)
	at org.eclipse.ui.internal.WorkbenchPage.busyShowView(WorkbenchPage.java:1278)
	at org.eclipse.ui.internal.WorkbenchPage$12.run(WorkbenchPage.java:4329)
	at org.eclipse.swt.custom.BusyIndicator.showWhile(BusyIndicator.java:70)
	at org.eclipse.ui.internal.WorkbenchPage.showView(WorkbenchPage.java:4325)
	at org.eclipse.ui.internal.WorkbenchPage.showView(WorkbenchPage.java:4305)
	at org.eclipse.contribution.xref.ui.tests.views.XReferenceViewTest.testShowHide(XReferenceViewTest.java:59)
	at sun.reflect.NativeMethodAccessorImpl.invoke0(Native Method)
	at sun.reflect.NativeMethodAccessorImpl.invoke(NativeMethodAccessorImpl.java:62)
	at sun.reflect.DelegatingMethodAccessorImpl.invoke(DelegatingMethodAccessorImpl.java:43)
	at java.lang.reflect.Method.invoke(Method.java:498)
	at junit.framework.TestCase.runTest(TestCase.java:176)
	at junit.framework.TestCase.runBare(TestCase.java:141)
	at junit.framework.TestResult$1.protect(TestResult.java:122)
	at junit.framework.TestResult.runProtected(TestResult.java:142)
	at junit.framework.TestResult.run(TestResult.java:125)
	at junit.framework.TestCase.run(TestCase.java:129)
	at junit.framework.TestSuite.runTest(TestSuite.java:252)
	at junit.framework.TestSuite.run(TestSuite.java:247)
	at junit.framework.TestSuite.runTest(TestSuite.java:252)
	at junit.framework.TestSuite.run(TestSuite.java:247)
	at org.junit.internal.runners.JUnit38ClassRunner.run(JUnit38ClassRunner.java:86)
	at org.apache.maven.surefire.junit4.JUnit4Provider.execute(JUnit4Provider.java:264)
	at org.apache.maven.surefire.junit4.JUnit4Provider.executeTestSet(JUnit4Provider.java:153)
	at org.apache.maven.surefire.junit4.JUnit4Provider.invoke(JUnit4Provider.java:124)
	at sun.reflect.NativeMethodAccessorImpl.invoke0(Native Method)
	at sun.reflect.NativeMethodAccessorImpl.invoke(NativeMethodAccessorImpl.java:62)
	at sun.reflect.DelegatingMethodAccessorImpl.invoke(DelegatingMethodAccessorImpl.java:43)
	at java.lang.reflect.Method.invoke(Method.java:498)
	at org.apache.maven.surefire.util.ReflectionUtils.invokeMethodWithArray2(ReflectionUtils.java:208)
	at org.apache.maven.surefire.booter.ProviderFactory$ProviderProxy.invoke(ProviderFactory.java:156)
	at org.apache.maven.surefire.booter.ProviderFactory.invokeProvider(ProviderFactory.java:82)
	at org.eclipse.tycho.surefire.osgibooter.OsgiSurefireBooter.run(OsgiSurefireBooter.java:91)
	at org.eclipse.tycho.surefire.osgibooter.AbstractUITestApplication$1.run(AbstractUITestApplication.java:35)
	at org.eclipse.swt.widgets.RunnableLock.run(RunnableLock.java:37)
	at org.eclipse.swt.widgets.Synchronizer.runAsyncMessages(Synchronizer.java:182)
	at org.eclipse.swt.widgets.Display.runAsyncMessages(Display.java:4470)
	at org.eclipse.swt.widgets.Display.readAndDispatch(Display.java:4083)
	at org.eclipse.e4.ui.internal.workbench.swt.PartRenderingEngine$4.run(PartRenderingEngine.java:1145)
	at org.eclipse.core.databinding.observable.Realm.runWithDefault(Realm.java:336)
	at org.eclipse.e4.ui.internal.workbench.swt.PartRenderingEngine.run(PartRenderingEngine.java:1034)
	at org.eclipse.e4.ui.internal.workbench.E4Workbench.createAndRunUI(E4Workbench.java:153)
	at org.eclipse.ui.internal.Workbench.lambda$3(Workbench.java:680)
	at org.eclipse.core.databinding.observable.Realm.runWithDefault(Realm.java:336)
	at org.eclipse.ui.internal.Workbench.createAndRunWorkbench(Workbench.java:594)
	at org.eclipse.ui.PlatformUI.createAndRunWorkbench(PlatformUI.java:148)
	at org.eclipse.ui.internal.ide.application.IDEApplication.start(IDEApplication.java:138)
	at org.eclipse.tycho.surefire.osgibooter.UITestApplication.runApplication(UITestApplication.java:31)
	at org.eclipse.tycho.surefire.osgibooter.AbstractUITestApplication.run(AbstractUITestApplication.java:120)
	at org.eclipse.tycho.surefire.osgibooter.UITestApplication.start(UITestApplication.java:37)
	at org.eclipse.equinox.internal.app.EclipseAppHandle.run(EclipseAppHandle.java:196)
	at org.eclipse.core.runtime.internal.adaptor.EclipseAppLauncher.runApplication(EclipseAppLauncher.java:134)
	at org.eclipse.core.runtime.internal.adaptor.EclipseAppLauncher.start(EclipseAppLauncher.java:104)
	at org.eclipse.core.runtime.adaptor.EclipseStarter.run(EclipseStarter.java:388)
	at org.eclipse.core.runtime.adaptor.EclipseStarter.run(EclipseStarter.java:243)
	at sun.reflect.NativeMethodAccessorImpl.invoke0(Native Method)
	at sun.reflect.NativeMethodAccessorImpl.invoke(NativeMethodAccessorImpl.java:62)
	at sun.reflect.DelegatingMethodAccessorImpl.invoke(DelegatingMethodAccessorImpl.java:43)
	at java.lang.reflect.Method.invoke(Method.java:498)
	at org.eclipse.equinox.launcher.Main.invokeFramework(Main.java:653)
	at org.eclipse.equinox.launcher.Main.basicRun(Main.java:590)
	at org.eclipse.equinox.launcher.Main.run(Main.java:1499)
	at org.eclipse.equinox.launcher.Main.main(Main.java:1472)
Tests run: 6, Failures: 1, Errors: 0, Skipped: 0, Time elapsed: 1.991 sec <<< FAILURE! - in org.eclipse.contribution.xref.ui.tests.AllTests
testViewContentProvider(org.eclipse.contribution.xref.ui.tests.views.XReferenceViewTest)  Time elapsed: 0.294 sec
testTreeObject(org.eclipse.contribution.xref.ui.tests.views.XReferenceViewTest)  Time elapsed: 0 sec
testTreeParent(org.eclipse.contribution.xref.ui.tests.views.XReferenceViewTest)  Time elapsed: 0 sec
testShowHide(org.eclipse.contribution.xref.ui.tests.views.XReferenceViewTest)  Time elapsed: 1.67 sec
testViewContentProviderLive(org.eclipse.contribution.xref.ui.tests.views.XReferenceViewTest)  Time elapsed: 0.005 sec  <<< FAILURE!
junit.framework.AssertionFailedError: expected:<test associate> but was:<AdaptableString [val=test associate]>
	at junit.framework.Assert.fail(Assert.java:57)
	at junit.framework.Assert.failNotEquals(Assert.java:329)
	at junit.framework.Assert.assertEquals(Assert.java:78)
	at junit.framework.Assert.assertEquals(Assert.java:86)
	at junit.framework.TestCase.assertEquals(TestCase.java:253)
	at org.eclipse.contribution.xref.ui.tests.views.XReferenceViewTest.testViewContentProviderLive(XReferenceViewTest.java:205)

testSetCheckedFilters(org.eclipse.contribution.xref.ui.tests.AJXReferenceProviderTest)  Time elapsed: 0.001 sec

Results :

Failed tests: 
  XReferenceViewTest.testViewContentProviderLive:205 expected:<test associate> but was:<AdaptableString [val=test associate]>

Tests run: 6, Failures: 1, Errors: 0, Skipped: 0

[ERROR] There are test failures.

Please refer to /jobs/genie.ajdt/ajdt-on-eclipse-47/workspace/org.eclipse.contribution.xref.ui.tests/target/surefire-reports for the individual test results.
[INFO] 
[INFO] --- eclipse-jarsigner-plugin:1.0.4:sign (sign) @ org.eclipse.contribution.xref.ui.tests ---
[INFO] Signed org.eclipse.ajdt:org.eclipse.contribution.xref.ui.tests:eclipse-test-plugin:2.2.4-SNAPSHOT in 0 seconds.
[INFO] 
[INFO] --- tycho-p2-plugin:0.23.1:p2-metadata (p2-metadata) @ org.eclipse.contribution.xref.ui.tests ---
[INFO]                                                                         
[INFO] ------------------------------------------------------------------------
[INFO] Building org.eclipse.aspectj.feature_tests 2.2.4-SNAPSHOT
[INFO] ------------------------------------------------------------------------
[INFO] 
[INFO] --- maven-clean-plugin:2.5:clean (default-clean) @ org.eclipse.aspectj.feature_tests ---
[INFO] 
[INFO] --- tycho-packaging-plugin:0.23.1:build-qualifier-aggregator (default-build-qualifier-aggregator) @ org.eclipse.aspectj.feature_tests ---
[INFO] The project's OSGi version is 2.2.4.201704211714
[INFO] 
[INFO] --- tycho-packaging-plugin:0.23.1:validate-id (default-validate-id) @ org.eclipse.aspectj.feature_tests ---
[INFO] 
[INFO] --- tycho-packaging-plugin:0.23.1:validate-version (default-validate-version) @ org.eclipse.aspectj.feature_tests ---
[INFO] 
[INFO] --- target-platform-configuration:0.23.1:target-platform (default-target-platform) @ org.eclipse.aspectj.feature_tests ---
[INFO] 
[INFO] --- tycho-packaging-plugin:0.23.1:package-feature (default-package-feature) @ org.eclipse.aspectj.feature_tests ---
[INFO] Building jar: /jobs/genie.ajdt/ajdt-on-eclipse-47/workspace/org.eclipse.aspectj.feature_tests/target/org.eclipse.aspectj.feature_tests-2.2.4-SNAPSHOT.jar
[INFO] 
[INFO] --- tycho-p2-plugin:0.23.1:p2-metadata-default (default-p2-metadata-default) @ org.eclipse.aspectj.feature_tests ---
[INFO] 
[INFO] --- tycho-p2-plugin:0.23.1:feature-p2-metadata (default-feature-p2-metadata) @ org.eclipse.aspectj.feature_tests ---
[INFO] 
[INFO] --- eclipse-jarsigner-plugin:1.0.4:sign (sign) @ org.eclipse.aspectj.feature_tests ---
[INFO] Signed org.eclipse.ajdt:org.eclipse.aspectj.feature_tests:eclipse-feature:2.2.4-SNAPSHOT in 0 seconds.
[INFO] 
[INFO] --- tycho-p2-plugin:0.23.1:p2-metadata (p2-metadata) @ org.eclipse.aspectj.feature_tests ---
[INFO]                                                                         
[INFO] ------------------------------------------------------------------------
[INFO] Building org.eclipse.ajdt.releng 2.2.4-SNAPSHOT
[INFO] ------------------------------------------------------------------------
[INFO] 
[INFO] --- maven-clean-plugin:2.5:clean (default-clean) @ org.eclipse.ajdt.releng ---
[INFO] 
[INFO] --- tycho-packaging-plugin:0.23.1:build-qualifier-aggregator (default-build-qualifier-aggregator) @ org.eclipse.ajdt.releng ---
[INFO] The project's OSGi version is 2.2.4.201704211714
[INFO] 
[INFO] --- maven-clean-plugin:2.5:clean (default-clean-1) @ org.eclipse.ajdt.releng ---
[INFO] 
[INFO] --- maven-resources-plugin:2.4.3:resources (default-resources) @ org.eclipse.ajdt.releng ---
[WARNING] Using platform encoding (UTF-8 actually) to copy filtered resources, i.e. build is platform dependent!
[INFO] skip non existing resourceDirectory /jobs/genie.ajdt/ajdt-on-eclipse-47/workspace/org.eclipse.ajdt.releng/src/main/resources
[INFO] 
[INFO] --- target-platform-configuration:0.23.1:target-platform (default-target-platform) @ org.eclipse.ajdt.releng ---
[INFO] 
[INFO] --- tycho-p2-publisher-plugin:0.23.1:publish-products (default-publish-products) @ org.eclipse.ajdt.releng ---
[INFO] 
[INFO] --- tycho-p2-publisher-plugin:0.23.1:publish-categories (default-publish-categories) @ org.eclipse.ajdt.releng ---
[INFO] 
[INFO] --- tycho-p2-publisher-plugin:0.23.1:attach-artifacts (default-attach-artifacts) @ org.eclipse.ajdt.releng ---
[INFO] 
[INFO] --- tycho-p2-repository-plugin:0.23.1:assemble-repository (default-assemble-repository) @ org.eclipse.ajdt.releng ---
[INFO] 
[INFO] --- tycho-p2-repository-plugin:0.23.1:archive-repository (default-archive-repository) @ org.eclipse.ajdt.releng ---
[INFO] Building zip: /jobs/genie.ajdt/ajdt-on-eclipse-47/workspace/org.eclipse.ajdt.releng/target/ajdt-e47-2.2.4.201704211714.zip
[INFO] 
[INFO] --- maven-antrun-plugin:1.7:run (default) @ org.eclipse.ajdt.releng ---
Downloading: https://repo.eclipse.org/content/repositories/cbi-releases/org/apache/maven/maven-plugin-api/2.0.11/maven-plugin-api-2.0.11.pom
Downloading: https://repo.eclipse.org/content/repositories/maven_central/org/apache/maven/maven-plugin-api/2.0.11/maven-plugin-api-2.0.11.pom
Downloaded: https://repo.eclipse.org/content/repositories/maven_central/org/apache/maven/maven-plugin-api/2.0.11/maven-plugin-api-2.0.11.pom (2 KB at 64.9 KB/sec)
Downloading: https://repo.eclipse.org/content/repositories/cbi-releases/org/apache/maven/maven/2.0.11/maven-2.0.11.pom
Downloading: https://repo.eclipse.org/content/repositories/maven_central/org/apache/maven/maven/2.0.11/maven-2.0.11.pom
Downloaded: https://repo.eclipse.org/content/repositories/maven_central/org/apache/maven/maven/2.0.11/maven-2.0.11.pom (22 KB at 1066.2 KB/sec)
Downloading: https://repo.eclipse.org/content/repositories/cbi-releases/org/apache/maven/maven-parent/12/maven-parent-12.pom
Downloading: https://repo.eclipse.org/content/repositories/maven_central/org/apache/maven/maven-parent/12/maven-parent-12.pom
Downloaded: https://repo.eclipse.org/content/repositories/maven_central/org/apache/maven/maven-parent/12/maven-parent-12.pom (22 KB at 1011.0 KB/sec)
Downloading: https://repo.eclipse.org/content/repositories/cbi-releases/org/apache/maven/maven-project/2.0.11/maven-project-2.0.11.pom
Downloading: https://repo.eclipse.org/content/repositories/maven_central/org/apache/maven/maven-project/2.0.11/maven-project-2.0.11.pom
Downloaded: https://repo.eclipse.org/content/repositories/maven_central/org/apache/maven/maven-project/2.0.11/maven-project-2.0.11.pom (3 KB at 135.6 KB/sec)
Downloading: https://repo.eclipse.org/content/repositories/cbi-releases/org/apache/maven/maven-settings/2.0.11/maven-settings-2.0.11.pom
Downloading: https://repo.eclipse.org/content/repositories/maven_central/org/apache/maven/maven-settings/2.0.11/maven-settings-2.0.11.pom
Downloaded: https://repo.eclipse.org/content/repositories/maven_central/org/apache/maven/maven-settings/2.0.11/maven-settings-2.0.11.pom (3 KB at 112.2 KB/sec)
Downloading: https://repo.eclipse.org/content/repositories/cbi-releases/org/apache/maven/maven-model/2.0.11/maven-model-2.0.11.pom
Downloading: https://repo.eclipse.org/content/repositories/maven_central/org/apache/maven/maven-model/2.0.11/maven-model-2.0.11.pom
Downloaded: https://repo.eclipse.org/content/repositories/maven_central/org/apache/maven/maven-model/2.0.11/maven-model-2.0.11.pom (4 KB at 166.7 KB/sec)
Downloading: https://repo.eclipse.org/content/repositories/cbi-releases/org/codehaus/plexus/plexus-utils/1.5.6/plexus-utils-1.5.6.pom
Downloading: https://repo.eclipse.org/content/repositories/maven_central/org/codehaus/plexus/plexus-utils/1.5.6/plexus-utils-1.5.6.pom
Downloaded: https://repo.eclipse.org/content/repositories/maven_central/org/codehaus/plexus/plexus-utils/1.5.6/plexus-utils-1.5.6.pom (6 KB at 215.7 KB/sec)
Downloading: https://repo.eclipse.org/content/repositories/cbi-releases/org/codehaus/plexus/plexus/1.0.12/plexus-1.0.12.pom
Downloading: https://repo.eclipse.org/content/repositories/maven_central/org/codehaus/plexus/plexus/1.0.12/plexus-1.0.12.pom
Downloaded: https://repo.eclipse.org/content/repositories/maven_central/org/codehaus/plexus/plexus/1.0.12/plexus-1.0.12.pom (10 KB at 503.7 KB/sec)
Downloading: https://repo.eclipse.org/content/repositories/cbi-releases/org/apache/maven/maven-profile/2.0.11/maven-profile-2.0.11.pom
Downloading: https://repo.eclipse.org/content/repositories/maven_central/org/apache/maven/maven-profile/2.0.11/maven-profile-2.0.11.pom
Downloaded: https://repo.eclipse.org/content/repositories/maven_central/org/apache/maven/maven-profile/2.0.11/maven-profile-2.0.11.pom (2 KB at 90.7 KB/sec)
Downloading: https://repo.eclipse.org/content/repositories/cbi-releases/org/apache/maven/maven-artifact-manager/2.0.11/maven-artifact-manager-2.0.11.pom
Downloading: https://repo.eclipse.org/content/repositories/maven_central/org/apache/maven/maven-artifact-manager/2.0.11/maven-artifact-manager-2.0.11.pom
Downloaded: https://repo.eclipse.org/content/repositories/maven_central/org/apache/maven/maven-artifact-manager/2.0.11/maven-artifact-manager-2.0.11.pom (3 KB at 135.2 KB/sec)
Downloading: https://repo.eclipse.org/content/repositories/cbi-releases/org/apache/maven/maven-repository-metadata/2.0.11/maven-repository-metadata-2.0.11.pom
Downloading: https://repo.eclipse.org/content/repositories/maven_central/org/apache/maven/maven-repository-metadata/2.0.11/maven-repository-metadata-2.0.11.pom
Downloaded: https://repo.eclipse.org/content/repositories/maven_central/org/apache/maven/maven-repository-metadata/2.0.11/maven-repository-metadata-2.0.11.pom (3 KB at 110.3 KB/sec)
Downloading: https://repo.eclipse.org/content/repositories/cbi-releases/org/apache/maven/maven-artifact/2.0.11/maven-artifact-2.0.11.pom
Downloading: https://repo.eclipse.org/content/repositories/maven_central/org/apache/maven/maven-artifact/2.0.11/maven-artifact-2.0.11.pom
Downloaded: https://repo.eclipse.org/content/repositories/maven_central/org/apache/maven/maven-artifact/2.0.11/maven-artifact-2.0.11.pom (2 KB at 67.3 KB/sec)
Downloading: https://repo.eclipse.org/content/repositories/cbi-releases/org/apache/maven/maven-plugin-registry/2.0.11/maven-plugin-registry-2.0.11.pom
Downloading: https://repo.eclipse.org/content/repositories/maven_central/org/apache/maven/maven-plugin-registry/2.0.11/maven-plugin-registry-2.0.11.pom
Downloaded: https://repo.eclipse.org/content/repositories/maven_central/org/apache/maven/maven-plugin-registry/2.0.11/maven-plugin-registry-2.0.11.pom (2 KB at 99.2 KB/sec)
Downloading: https://repo.eclipse.org/content/repositories/cbi-releases/org/apache/ant/ant/1.8.2/ant-1.8.2.pom
Downloading: https://repo.eclipse.org/content/repositories/maven_central/org/apache/ant/ant/1.8.2/ant-1.8.2.pom
Downloaded: https://repo.eclipse.org/content/repositories/maven_central/org/apache/ant/ant/1.8.2/ant-1.8.2.pom (10 KB at 507.6 KB/sec)
Downloading: https://repo.eclipse.org/content/repositories/cbi-releases/org/apache/ant/ant-parent/1.8.2/ant-parent-1.8.2.pom
Downloading: https://repo.eclipse.org/content/repositories/maven_central/org/apache/ant/ant-parent/1.8.2/ant-parent-1.8.2.pom
Downloaded: https://repo.eclipse.org/content/repositories/maven_central/org/apache/ant/ant-parent/1.8.2/ant-parent-1.8.2.pom (5 KB at 241.0 KB/sec)
Downloading: https://repo.eclipse.org/content/repositories/cbi-releases/org/apache/ant/ant-launcher/1.8.2/ant-launcher-1.8.2.pom
Downloading: https://repo.eclipse.org/content/repositories/maven_central/org/apache/ant/ant-launcher/1.8.2/ant-launcher-1.8.2.pom
Downloaded: https://repo.eclipse.org/content/repositories/maven_central/org/apache/ant/ant-launcher/1.8.2/ant-launcher-1.8.2.pom (3 KB at 124.3 KB/sec)
Downloading: https://repo.eclipse.org/content/repositories/cbi-releases/org/apache/maven/maven-plugin-api/2.0.11/maven-plugin-api-2.0.11.jar
Downloading: https://repo.eclipse.org/content/repositories/cbi-releases/org/apache/maven/maven-project/2.0.11/maven-project-2.0.11.jar
Downloading: https://repo.eclipse.org/content/repositories/cbi-releases/org/apache/maven/maven-settings/2.0.11/maven-settings-2.0.11.jar
Downloading: https://repo.eclipse.org/content/repositories/cbi-releases/org/apache/maven/maven-profile/2.0.11/maven-profile-2.0.11.jar
Downloading: https://repo.eclipse.org/content/repositories/cbi-releases/org/apache/maven/maven-model/2.0.11/maven-model-2.0.11.jar
Downloading: https://repo.eclipse.org/content/repositories/cbi-releases/org/apache/maven/maven-artifact-manager/2.0.11/maven-artifact-manager-2.0.11.jar
Downloading: https://repo.eclipse.org/content/repositories/cbi-releases/org/apache/maven/maven-repository-metadata/2.0.11/maven-repository-metadata-2.0.11.jar
Downloading: https://repo.eclipse.org/content/repositories/cbi-releases/org/apache/maven/maven-plugin-registry/2.0.11/maven-plugin-registry-2.0.11.jar
Downloading: https://repo.eclipse.org/content/repositories/cbi-releases/org/codehaus/plexus/plexus-interpolation/1.1/plexus-interpolation-1.1.jar
Downloading: https://repo.eclipse.org/content/repositories/cbi-releases/org/apache/maven/maven-artifact/2.0.11/maven-artifact-2.0.11.jar
Downloading: https://repo.eclipse.org/content/repositories/cbi-releases/org/apache/ant/ant/1.8.2/ant-1.8.2.jar
Downloading: https://repo.eclipse.org/content/repositories/cbi-releases/org/apache/ant/ant-launcher/1.8.2/ant-launcher-1.8.2.jar
Downloading: https://repo.eclipse.org/content/repositories/maven_central/org/apache/maven/maven-plugin-api/2.0.11/maven-plugin-api-2.0.11.jar
Downloading: https://repo.eclipse.org/content/repositories/maven_central/org/apache/maven/maven-project/2.0.11/maven-project-2.0.11.jar
Downloading: https://repo.eclipse.org/content/repositories/maven_central/org/apache/maven/maven-settings/2.0.11/maven-settings-2.0.11.jar
Downloading: https://repo.eclipse.org/content/repositories/maven_central/org/apache/maven/maven-profile/2.0.11/maven-profile-2.0.11.jar
Downloading: https://repo.eclipse.org/content/repositories/maven_central/org/apache/maven/maven-model/2.0.11/maven-model-2.0.11.jar
Downloaded: https://repo.eclipse.org/content/repositories/maven_central/org/apache/maven/maven-plugin-api/2.0.11/maven-plugin-api-2.0.11.jar (13 KB at 580.5 KB/sec)
Downloading: https://repo.eclipse.org/content/repositories/maven_central/org/apache/maven/maven-artifact-manager/2.0.11/maven-artifact-manager-2.0.11.jar
Downloaded: https://repo.eclipse.org/content/repositories/maven_central/org/apache/maven/maven-profile/2.0.11/maven-profile-2.0.11.jar (37 KB at 1452.0 KB/sec)
Downloading: https://repo.eclipse.org/content/repositories/maven_central/org/apache/maven/maven-repository-metadata/2.0.11/maven-repository-metadata-2.0.11.jar
Downloaded: https://repo.eclipse.org/content/repositories/maven_central/org/apache/maven/maven-project/2.0.11/maven-project-2.0.11.jar (121 KB at 4465.7 KB/sec)
Downloading: https://repo.eclipse.org/content/repositories/maven_central/org/apache/maven/maven-plugin-registry/2.0.11/maven-plugin-registry-2.0.11.jar
Downloaded: https://repo.eclipse.org/content/repositories/maven_central/org/apache/maven/maven-model/2.0.11/maven-model-2.0.11.jar (95 KB at 3373.2 KB/sec)
Downloading: https://repo.eclipse.org/content/repositories/maven_central/org/codehaus/plexus/plexus-interpolation/1.1/plexus-interpolation-1.1.jar
Downloaded: https://repo.eclipse.org/content/repositories/maven_central/org/apache/maven/maven-settings/2.0.11/maven-settings-2.0.11.jar (51 KB at 1619.0 KB/sec)
Downloading: https://repo.eclipse.org/content/repositories/maven_central/org/apache/maven/maven-artifact/2.0.11/maven-artifact-2.0.11.jar
Downloaded: https://repo.eclipse.org/content/repositories/maven_central/org/apache/maven/maven-repository-metadata/2.0.11/maven-repository-metadata-2.0.11.jar (26 KB at 674.8 KB/sec)
Downloading: https://repo.eclipse.org/content/repositories/maven_central/org/apache/ant/ant/1.8.2/ant-1.8.2.jar
Downloaded: https://repo.eclipse.org/content/repositories/maven_central/org/apache/maven/maven-plugin-registry/2.0.11/maven-plugin-registry-2.0.11.jar (30 KB at 650.5 KB/sec)
Downloading: https://repo.eclipse.org/content/repositories/maven_central/org/apache/ant/ant-launcher/1.8.2/ant-launcher-1.8.2.jar
Downloaded: https://repo.eclipse.org/content/repositories/maven_central/org/apache/maven/maven-artifact-manager/2.0.11/maven-artifact-manager-2.0.11.jar (58 KB at 1190.1 KB/sec)
Downloaded: https://repo.eclipse.org/content/repositories/maven_central/org/apache/maven/maven-artifact/2.0.11/maven-artifact-2.0.11.jar (88 KB at 1681.5 KB/sec)
Downloaded: https://repo.eclipse.org/content/repositories/maven_central/org/codehaus/plexus/plexus-interpolation/1.1/plexus-interpolation-1.1.jar (35 KB at 653.8 KB/sec)
Downloaded: https://repo.eclipse.org/content/repositories/maven_central/org/apache/ant/ant-launcher/1.8.2/ant-launcher-1.8.2.jar (13 KB at 188.0 KB/sec)
Downloaded: https://repo.eclipse.org/content/repositories/maven_central/org/apache/ant/ant/1.8.2/ant-1.8.2.jar (1889 KB at 19671.1 KB/sec)
[WARNING] Parameter tasks is deprecated, use target instead
[INFO] Executing tasks

main:
[propertyfile] Creating new property file: /jobs/genie.ajdt/ajdt-on-eclipse-47/workspace/org.eclipse.ajdt.releng/target/ajdt-zip.properties
[INFO] Executed tasks
[INFO] 
[INFO] --- maven-antrun-plugin:1.7:run (update-composite-update-site) @ org.eclipse.ajdt.releng ---
[INFO] Executing tasks

main:
  [taskdef] Could not load definitions from resource net/sf/antcontrib/antcontrib.properties. It could not be found.
     [copy] Copying 1 file to /jobs/genie.ajdt/ajdt-on-eclipse-47/workspace/org.eclipse.ajdt.releng/target
     [copy] Copying 1 file to /jobs/genie.ajdt/ajdt-on-eclipse-47/workspace/org.eclipse.ajdt.releng/target
     [copy] Copying 1 file to /jobs/genie.ajdt/ajdt-on-eclipse-47/workspace/org.eclipse.ajdt.releng/target
  [replace] Replaced 1 occurrences in 1 files.
  [replace] Replaced 1 occurrences in 1 files.
  [replace] Replaced 1 occurrences in 1 files.
  [replace] Replaced 1 occurrences in 1 files.
[INFO] Executed tasks
[INFO] 
[INFO] --- eclipse-jarsigner-plugin:1.0.4:sign (sign) @ org.eclipse.ajdt.releng ---
[INFO] 
[INFO] --- tycho-p2-plugin:0.23.1:p2-metadata (p2-metadata) @ org.eclipse.ajdt.releng ---
[INFO] ------------------------------------------------------------------------
[INFO] Reactor Summary:
[INFO] 
[INFO] parent ............................................. SUCCESS [  1.977 s]
[INFO] org.aspectj.runtime ................................ SUCCESS [  5.586 s]
[INFO] org.aspectj.weaver ................................. SUCCESS [  5.565 s]
[INFO] org.aspectj.ajde ................................... SUCCESS [ 16.039 s]
[INFO] org.aspectj ........................................ SUCCESS [  1.795 s]
[INFO] org.eclipse.contribution.weaving.jdt ............... SUCCESS [ 11.103 s]
[INFO] org.eclipse.ajdt.core .............................. SUCCESS [  7.254 s]
[INFO] org.eclipse.ajdt.doc.user .......................... SUCCESS [  1.371 s]
[INFO] org.eclipse.ajdt.examples .......................... SUCCESS [  2.506 s]
[INFO] org.eclipse.contribution.visualiser ................ SUCCESS [  5.965 s]
[INFO] org.eclipse.contribution.xref.core ................. SUCCESS [  2.093 s]
[INFO] org.eclipse.contribution.xref.ui ................... SUCCESS [  2.322 s]
[INFO] org.eclipse.ajdt.ui ................................ SUCCESS [ 10.399 s]
[INFO] org.eclipse.aspectj ................................ SUCCESS [  1.456 s]
[INFO] org.eclipse.equinox.weaving.aspectj ................ SUCCESS [  1.981 s]
[INFO] org.eclipse.equinox.weaving.sdk .................... SUCCESS [  0.876 s]
[INFO] org.eclipse.ajdt ................................... SUCCESS [  3.246 s]
[INFO] org.eclipse.contribution.weaving ................... SUCCESS [  1.622 s]
[INFO] org.eclipse.contribution.xref ...................... SUCCESS [  1.668 s]
[INFO] org.eclipse.ajdt.sdk ............................... SUCCESS [  1.166 s]
[INFO] org.eclipse.ajdt.core.tests ........................ SUCCESS [44:13 min]
[INFO] org.eclipse.contribution.visualiser.tests .......... SUCCESS [ 17.646 s]
[INFO] org.eclipse.ajdt.ui.tests .......................... SUCCESS [49:21 min]
[INFO] org.eclipse.contribution.weaving.jdt.tests ......... SUCCESS [01:54 min]
[INFO] org.eclipse.contribution.xref.core.tests ........... SUCCESS [  9.932 s]
[INFO] org.eclipse.contribution.xref.ui.tests ............. SUCCESS [ 10.511 s]
[INFO] org.eclipse.aspectj.feature_tests .................. SUCCESS [  1.057 s]
[INFO] org.eclipse.ajdt.releng ............................ SUCCESS [  4.288 s]
[INFO] ------------------------------------------------------------------------
[INFO] BUILD SUCCESS
[INFO] ------------------------------------------------------------------------
[INFO] Total time: 01:38 h
[INFO] Finished at: 2017-04-21T14:52:27-04:00
[INFO] Final Memory: 257M/4726M
[INFO] ------------------------------------------------------------------------
[DEBUG] Closing connection to remote
[DEBUG] Waiting for process to finish
[DEBUG] Result: 0
[workspace] $ /bin/sh -xe /tmp/hudson5664706767707742616.sh
+ cd org.eclipse.ajdt.releng/target
++ pwd
+ targetdir=/jobs/genie.ajdt/ajdt-on-eclipse-47/workspace/org.eclipse.ajdt.releng/target
+ zipfile=(ajdt-e47*.zip)
++ basename ajdt-e47-2.2.4.201704211714.zip .zip
+ zipname=ajdt-e47-2.2.4.201704211714
+ echo ajdt-e47-2.2.4.201704211714.zip
ajdt-e47-2.2.4.201704211714.zip
+ cp ajdt-e47-2.2.4.201704211714.zip /home/data/httpd/download.eclipse.org/tools/ajdt/47/dev/update
+ cd /home/data/httpd/download.eclipse.org/tools/ajdt/47/dev/update
+ unzip -o ajdt-e47-2.2.4.201704211714.zip -d ajdt-e47-2.2.4.201704211714
Archive:  ajdt-e47-2.2.4.201704211714.zip
   creating: ajdt-e47-2.2.4.201704211714/plugins/
   creating: ajdt-e47-2.2.4.201704211714/features/
  inflating: ajdt-e47-2.2.4.201704211714/artifacts.jar  
  inflating: ajdt-e47-2.2.4.201704211714/content.jar  
  inflating: ajdt-e47-2.2.4.201704211714/plugins/org.eclipse.equinox.weaving.hook_1.2.0.v20160929-1449.jar.pack.gz  
  inflating: ajdt-e47-2.2.4.201704211714/plugins/org.eclipse.equinox.weaving.hook_1.2.0.v20160929-1449.jar  
  inflating: ajdt-e47-2.2.4.201704211714/plugins/org.eclipse.equinox.weaving.aspectj_1.0.400.201704211714.jar  
  inflating: ajdt-e47-2.2.4.201704211714/plugins/org.aspectj.ajde.source_1.8.10.201704211714.jar  
  inflating: ajdt-e47-2.2.4.201704211714/plugins/org.eclipse.contribution.visualiser_2.2.4.201704211714.jar  
  inflating: ajdt-e47-2.2.4.201704211714/plugins/org.eclipse.aspectj_2.2.4.201704211714.jar  
  inflating: ajdt-e47-2.2.4.201704211714/plugins/org.eclipse.contribution.weaving.jdt.source_2.2.4.201704211714.jar  
  inflating: ajdt-e47-2.2.4.201704211714/plugins/org.aspectj.runtime.source_1.8.10.201704211714.jar  
  inflating: ajdt-e47-2.2.4.201704211714/plugins/org.eclipse.ajdt.ui_2.2.4.201704211714.jar  
  inflating: ajdt-e47-2.2.4.201704211714/plugins/org.eclipse.contribution.visualiser.source_2.2.4.201704211714.jar  
  inflating: ajdt-e47-2.2.4.201704211714/plugins/org.aspectj.weaver.source_1.8.10.201704211714.jar  
  inflating: ajdt-e47-2.2.4.201704211714/plugins/org.eclipse.ajdt.core.source_2.2.4.201704211714.jar  
  inflating: ajdt-e47-2.2.4.201704211714/plugins/org.eclipse.ajdt.doc.user_2.2.4.201704211714.jar  
  inflating: ajdt-e47-2.2.4.201704211714/plugins/org.eclipse.contribution.xref.core.source_2.2.4.201704211714.jar  
  inflating: ajdt-e47-2.2.4.201704211714/plugins/org.aspectj.weaver_1.8.10.201704211714.jar  
  inflating: ajdt-e47-2.2.4.201704211714/plugins/org.eclipse.contribution.xref.ui.source_2.2.4.201704211714.jar  
  inflating: ajdt-e47-2.2.4.201704211714/plugins/org.aspectj.runtime_1.8.10.201704211714.jar  
  inflating: ajdt-e47-2.2.4.201704211714/plugins/org.eclipse.ajdt.ui.source_2.2.4.201704211714.jar  
  inflating: ajdt-e47-2.2.4.201704211714/plugins/org.eclipse.contribution.xref.core_2.2.4.201704211714.jar  
  inflating: ajdt-e47-2.2.4.201704211714/plugins/org.eclipse.contribution.xref.ui_2.2.4.201704211714.jar  
  inflating: ajdt-e47-2.2.4.201704211714/plugins/org.eclipse.ajdt.examples_2.2.4.201704211714.jar  
  inflating: ajdt-e47-2.2.4.201704211714/plugins/org.aspectj.ajde_1.8.10.201704211714.jar  
  inflating: ajdt-e47-2.2.4.201704211714/plugins/org.eclipse.contribution.weaving.jdt_2.2.4.201704211714.jar  
  inflating: ajdt-e47-2.2.4.201704211714/plugins/org.eclipse.equinox.weaving.caching_1.1.0.v20161007-1415.jar.pack.gz  
  inflating: ajdt-e47-2.2.4.201704211714/plugins/org.eclipse.equinox.weaving.caching_1.1.0.v20161007-1415.jar  
  inflating: ajdt-e47-2.2.4.201704211714/plugins/org.eclipse.ajdt.examples.source_2.2.4.201704211714.jar  
  inflating: ajdt-e47-2.2.4.201704211714/plugins/org.eclipse.ajdt.core_2.2.4.201704211714.jar  
  inflating: ajdt-e47-2.2.4.201704211714/features/org.aspectj.source_1.8.10.201704211714.jar  
  inflating: ajdt-e47-2.2.4.201704211714/features/org.eclipse.contribution.xref_2.2.4.201704211714.jar  
  inflating: ajdt-e47-2.2.4.201704211714/features/org.eclipse.equinox.weaving.sdk_1.2.0.201704211714.jar  
  inflating: ajdt-e47-2.2.4.201704211714/features/org.aspectj_1.8.10.201704211714.jar  
  inflating: ajdt-e47-2.2.4.201704211714/features/org.eclipse.ajdt_2.2.4.201704211714.jar  
  inflating: ajdt-e47-2.2.4.201704211714/features/org.eclipse.contribution.weaving.source_2.2.4.201704211714.jar  
  inflating: ajdt-e47-2.2.4.201704211714/features/org.eclipse.contribution.xref.source_2.2.4.201704211714.jar  
  inflating: ajdt-e47-2.2.4.201704211714/features/org.eclipse.ajdt.source_2.2.4.201704211714.jar  
  inflating: ajdt-e47-2.2.4.201704211714/features/org.eclipse.contribution.weaving_2.2.4.201704211714.jar  
+ cp /jobs/genie.ajdt/ajdt-on-eclipse-47/workspace/org.eclipse.ajdt.releng/target/compositeArtifacts.xml .
+ cp /jobs/genie.ajdt/ajdt-on-eclipse-47/workspace/org.eclipse.ajdt.releng/target/compositeContent.xml .
+ cp /jobs/genie.ajdt/ajdt-on-eclipse-47/workspace/org.eclipse.ajdt.releng/target/p2.index .
Terminating xvnc.
Recording test results
Finished: UNSTABLE