FailedConsole Output

Skipping 54,029 KB.. Full Log
quals(TestCase.java:401)
	at org.eclipse.ajdt.ui.tests.editor.contentassist.PetClinicTests.testContentAssist_aroundBody2(PetClinicTests.java:125)
	at org.eclipse.ajdt.ui.tests.editor.contentassist.PetClinicTests.testContentAssist_aroundBody3$advice(PetClinicTests.java:52)
	at org.eclipse.ajdt.ui.tests.editor.contentassist.PetClinicTests.testContentAssist(PetClinicTests.java:1)

testPackageProtectedContentAssistShouldNotAppear(org.eclipse.ajdt.ui.tests.editor.contentassist.PetClinicTests)  Time elapsed: 2.815 sec
testPublicContentAssistShouldAppear(org.eclipse.ajdt.ui.tests.editor.contentassist.PetClinicTests)  Time elapsed: 2.73 sec  <<< FAILURE!
junit.framework.AssertionFailedError: Should have found the 'getAddress' proposal because it is public
	at junit.framework.Assert.fail(Assert.java:57)
	at junit.framework.Assert.assertTrue(Assert.java:22)
	at junit.framework.Assert.assertNotNull(Assert.java:256)
	at junit.framework.TestCase.assertNotNull(TestCase.java:426)
	at org.eclipse.ajdt.ui.tests.editor.contentassist.PetClinicTests.testPublicContentAssistShouldAppear_aroundBody14(PetClinicTests.java:228)
	at org.eclipse.ajdt.ui.tests.editor.contentassist.PetClinicTests.testPublicContentAssistShouldAppear_aroundBody15$advice(PetClinicTests.java:52)
	at org.eclipse.ajdt.ui.tests.editor.contentassist.PetClinicTests.testPublicContentAssistShouldAppear(PetClinicTests.java:1)

testModelCheck(org.eclipse.ajdt.ui.tests.editor.contentassist.PetClinicTests)  Time elapsed: 2.696 sec
testReconciling(org.eclipse.ajdt.ui.tests.editor.contentassist.PetClinicTests)  Time elapsed: 3.37 sec  <<< FAILURE!
junit.framework.AssertionFailedError: Should not have any problems in [Working copy] Owner.java [in com.springsource.petclinic.domain [in src/main/java [in petclinic2]]]
  package com.springsource.petclinic.domain
  import org.springframework.roo.addon.entity.ref.RooEntity
  import org.springframework.roo.addon.jpa.ref.RooJpa
  import javax.persistence.Entity
  import java.util.Set
  import java.util.HashSet
  import javax.persistence.OneToMany
  import javax.persistence.CascadeType
  class Owner
    Set<Pet> pets
    void test() but found:
[
	org.eclipse.jdt.core.problem --> 
		Pb(100) The method getAddress() is undefined for the type Owner
]


	at junit.framework.Assert.fail(Assert.java:57)
	at junit.framework.TestCase.fail(TestCase.java:227)
	at org.eclipse.ajdt.ui.tests.editor.contentassist.PetClinicTests.testReconciling_aroundBody4(PetClinicTests.java:142)
	at org.eclipse.ajdt.ui.tests.editor.contentassist.PetClinicTests.testReconciling_aroundBody5$advice(PetClinicTests.java:52)
	at org.eclipse.ajdt.ui.tests.editor.contentassist.PetClinicTests.testReconciling(PetClinicTests.java:1)

testProjectWizardPerformFinish(org.eclipse.ajdt.ui.tests.wizards.AspectJProjectWizardTest)  Time elapsed: 7.178 sec
testProjectWizardPageAddition(org.eclipse.ajdt.ui.tests.wizards.AspectJProjectWizardTest)  Time elapsed: 1.476 sec
testHowDealingWithProjectDependencies(org.eclipse.ajdt.ui.tests.builder.ProjectDependenciesTest)  Time elapsed: 15.64 sec
testProjectDependencies1(org.eclipse.ajdt.ui.tests.builder.ProjectDependenciesTest)  Time elapsed: 25.385 sec
testProjectDependenciesWithPluginProjects(org.eclipse.ajdt.ui.tests.builder.ProjectDependenciesTest)  Time elapsed: 12.157 sec
testWithOutJarSwitch1(org.eclipse.ajdt.ui.tests.builder.ProjectDependenciesWithJarFilesTest)  Time elapsed: 26.433 sec
testWithOutJarSwitch2(org.eclipse.ajdt.ui.tests.builder.ProjectDependenciesWithJarFilesTest)  Time elapsed: 16.029 sec  <<< FAILURE!
junit.framework.AssertionFailedError: project X should have project Y's outjar on it's classpath
	at junit.framework.Assert.fail(Assert.java:57)
	at junit.framework.Assert.assertTrue(Assert.java:22)
	at junit.framework.TestCase.assertTrue(TestCase.java:192)
	at org.eclipse.ajdt.ui.tests.builder.ProjectDependenciesWithJarFilesTest.testWithOutJarSwitch2_aroundBody8(ProjectDependenciesWithJarFilesTest.java:496)
	at org.eclipse.ajdt.ui.tests.builder.ProjectDependenciesWithJarFilesTest.testWithOutJarSwitch2_aroundBody9$advice(ProjectDependenciesWithJarFilesTest.java:52)
	at org.eclipse.ajdt.ui.tests.builder.ProjectDependenciesWithJarFilesTest.testWithOutJarSwitch2(ProjectDependenciesWithJarFilesTest.java:1)

testWithOutJarSwitch3(org.eclipse.ajdt.ui.tests.builder.ProjectDependenciesWithJarFilesTest)  Time elapsed: 23.921 sec
testWithExportedJarFile(org.eclipse.ajdt.ui.tests.builder.ProjectDependenciesWithJarFilesTest)  Time elapsed: 12.3 sec
testWithExportedJarFileAndBinaryProject(org.eclipse.ajdt.ui.tests.builder.ProjectDependenciesWithJarFilesTest)  Time elapsed: 14.134 sec
testBuildTwiceWithOutJar(org.eclipse.ajdt.ui.tests.builder.ProjectDependenciesWithJarFilesTest)  Time elapsed: 16.427 sec
testWithExportedJarFileAndNoSrcEntry(org.eclipse.ajdt.ui.tests.builder.ProjectDependenciesWithJarFilesTest)  Time elapsed: 10.49 sec
testDependingProjectBuiltWhenOutjarChanges(org.eclipse.ajdt.ui.tests.builder.ProjectDependenciesWithJarFilesTest)  Time elapsed: 5.678 sec  <<< FAILURE!
junit.framework.AssertionFailedError:  P/jarCreatingProject should have P/jarDependentProject as it's list of referencing projects - if not, see JDT bug 84214 expected:<1> but was:<0>
	at junit.framework.Assert.fail(Assert.java:57)
	at junit.framework.Assert.failNotEquals(Assert.java:329)
	at junit.framework.Assert.assertEquals(Assert.java:78)
	at junit.framework.Assert.assertEquals(Assert.java:234)
	at junit.framework.TestCase.assertEquals(TestCase.java:401)
	at org.eclipse.ajdt.ui.tests.builder.ProjectDependenciesWithJarFilesTest.checkForJDTBug84214(ProjectDependenciesWithJarFilesTest.java:883)
	at org.eclipse.ajdt.ui.tests.builder.ProjectDependenciesWithJarFilesTest.testDependingProjectBuiltWhenOutjarChanges_aroundBody14(ProjectDependenciesWithJarFilesTest.java:775)
	at org.eclipse.ajdt.ui.tests.builder.ProjectDependenciesWithJarFilesTest.testDependingProjectBuiltWhenOutjarChanges_aroundBody15$advice(ProjectDependenciesWithJarFilesTest.java:52)
	at org.eclipse.ajdt.ui.tests.builder.ProjectDependenciesWithJarFilesTest.testDependingProjectBuiltWhenOutjarChanges(ProjectDependenciesWithJarFilesTest.java:1)

testMarkersAreAdded(org.eclipse.ajdt.ui.tests.builder.AdviceMarkersTest)  Time elapsed: 2.378 sec
testMarkers(org.eclipse.ajdt.ui.tests.builder.AdviceMarkersTest2)  Time elapsed: 2.115 sec
testMarkers(org.eclipse.ajdt.ui.tests.builder.AdviceMarkersTest3)  Time elapsed: 2.214 sec
testMarkers(org.eclipse.ajdt.ui.tests.builder.AdviceMarkersTest4)  Time elapsed: 2.116 sec
testMarkers(org.eclipse.ajdt.ui.tests.builder.AdviceMarkersTest5)  Time elapsed: 1.964 sec
testBug235204(org.eclipse.ajdt.ui.tests.builder.AdviceMarkersTest6)  Time elapsed: 3.513 sec
testChangeInProject(org.eclipse.ajdt.ui.tests.builder.AdviceMarkersTest7)  Time elapsed: 12.941 sec
testChangeOnAspectPath(org.eclipse.ajdt.ui.tests.builder.AdviceMarkersTest7)  Time elapsed: 6.864 sec
testDeclareErrorOnMultipleProjects(org.eclipse.ajdt.ui.tests.builder.Bug285188DecErrorTests)  Time elapsed: 5.181 sec
testBug128803(org.eclipse.ajdt.ui.tests.builder.Bug128803Test)  Time elapsed: 9.514 sec
testBug151818(org.eclipse.ajdt.ui.tests.builder.Bug151818Test)  Time elapsed: 3.028 sec
testnothing(org.eclipse.ajdt.ui.tests.builder.Bug243376Test)  Time elapsed: 1.638 sec
testCopyAndRemoveNewNonSrcFileWithNonStandardOutputDir(org.eclipse.ajdt.ui.tests.builder.BuilderTest)  Time elapsed: 11.576 sec
testCopyAndRemoveResourceWithoutSrcFolder(org.eclipse.ajdt.ui.tests.builder.BuilderTest)  Time elapsed: 5.221 sec
testCreateAndDeleteNewFolder(org.eclipse.ajdt.ui.tests.builder.BuilderTest)  Time elapsed: 8.726 sec
testIncrementalBuildWithSrcFolder(org.eclipse.ajdt.ui.tests.builder.BuilderTest)  Time elapsed: 7.081 sec
testCopyAndRemoveNewNonSrcFileWithMultipleSrcDirs(org.eclipse.ajdt.ui.tests.builder.BuilderTest)  Time elapsed: 6.981 sec
testCreateAndDeleteNewPackage(org.eclipse.ajdt.ui.tests.builder.BuilderTest)  Time elapsed: 8.625 sec
testIncrementalBuildWithoutSrcFolder(org.eclipse.ajdt.ui.tests.builder.BuilderTest)  Time elapsed: 7.545 sec
testCopyAndRemoveNewNonSrcFile(org.eclipse.ajdt.ui.tests.builder.BuilderTest)  Time elapsed: 9.594 sec
testUpdateNonSrcFile(org.eclipse.ajdt.ui.tests.builder.BuilderTest)  Time elapsed: 13.303 sec
testCreateAndRemoveNewNonSrcFileFromDefaultPackage(org.eclipse.ajdt.ui.tests.builder.BuilderTest)  Time elapsed: 11.712 sec
testAspectPath(org.eclipse.ajdt.ui.tests.builder.BuildPathTests)  Time elapsed: 21.28 sec
testInpath(org.eclipse.ajdt.ui.tests.builder.BuildPathTests)  Time elapsed: 20.569 sec
testMarkersUpdatedAfterChangedProject(org.eclipse.ajdt.ui.tests.builder.ChangingMarkersTest)  Time elapsed: 8.623 sec
testSavedMarkerPreferences(org.eclipse.ajdt.ui.tests.builder.CustomMarkersTest)  Time elapsed: 6.815 sec
testClean(org.eclipse.ajdt.ui.tests.builder.InpathOutFolderTest)  Time elapsed: 8.744 sec
testChangeInpathOutLocation(org.eclipse.ajdt.ui.tests.builder.InpathOutFolderTest)  Time elapsed: 5.722 sec
testJarOnInpath(org.eclipse.ajdt.ui.tests.builder.InpathOutFolderTest)  Time elapsed: 6.422 sec
testJarOnInpath(org.eclipse.ajdt.ui.tests.builder.InpathOutFolderTest2)  Time elapsed: 4.002 sec  <<< FAILURE!
junit.framework.AssertionFailedError: AspectJ RT should exist in the in path out folder
	at junit.framework.Assert.fail(Assert.java:57)
	at junit.framework.TestCase.fail(TestCase.java:227)
	at org.eclipse.ajdt.ui.tests.builder.InpathOutFolderTest2.testJarOnInpath_aroundBody0(InpathOutFolderTest2.java:63)
	at org.eclipse.ajdt.ui.tests.builder.InpathOutFolderTest2.testJarOnInpath_aroundBody1$advice(InpathOutFolderTest2.java:52)
	at org.eclipse.ajdt.ui.tests.builder.InpathOutFolderTest2.testJarOnInpath(InpathOutFolderTest2.java:1)

testBug121810(org.eclipse.ajdt.ui.tests.builder.ITDinSeparateProjects)  Time elapsed: 4.672 sec
testMarkerIsNotRemoved(org.eclipse.ajdt.ui.tests.builder.ProblemMarkerTest)  Time elapsed: 2.344 sec
testJavaNature(org.eclipse.ajdt.ui.tests.builder.EnsureAJBuilderTests)  Time elapsed: 3.043 sec
testAJBuilder(org.eclipse.ajdt.ui.tests.builder.EnsureAJBuilderTests)  Time elapsed: 6.448 sec
testNoRemoveJavaBuilder(org.eclipse.ajdt.ui.tests.builder.EnsureAJBuilderTests)  Time elapsed: 6.074 sec
testJavaBuilder(org.eclipse.ajdt.ui.tests.builder.EnsureAJBuilderTests)  Time elapsed: 6.114 sec
testNoBuilder(org.eclipse.ajdt.ui.tests.builder.EnsureAJBuilderTests)  Time elapsed: 6.557 sec
testBothBuilders(org.eclipse.ajdt.ui.tests.builder.EnsureAJBuilderTests)  Time elapsed: 5.833 sec
testDeletingAJCompilationUnits(org.eclipse.ajdt.ui.tests.javamodel.elements.AJCompilationUnitTest2)  Time elapsed: 9.211 sec
testWhenProjectIsConverted(org.eclipse.ajdt.ui.tests.javamodel.Bug154339Test)  Time elapsed: 5.251 sec
testWhenProjectIsDeleted(org.eclipse.ajdt.ui.tests.javamodel.Bug154339Test)  Time elapsed: 3.668 sec
testWhenProjectIsClosed(org.eclipse.ajdt.ui.tests.javamodel.Bug154339Test)  Time elapsed: 9.824 sec
testAspectInPackageDeclaration(org.eclipse.ajdt.ui.tests.reconciling.ProblemFinderTests4)  Time elapsed: 3.424 sec
testAspectFile(org.eclipse.ajdt.ui.tests.reconciling.ProblemFinderTests4)  Time elapsed: 3.524 sec
testJavaFile(org.eclipse.ajdt.ui.tests.reconciling.ProblemFinderTests4)  Time elapsed: 3.025 sec
testSwitchStatement(org.eclipse.ajdt.ui.tests.reconciling.ProblemFinderTests4)  Time elapsed: 3.142 sec
testProblemFindingAll(org.eclipse.ajdt.ui.tests.reconciling.ProblemFinderTests10)  Time elapsed: 4.041 sec
testProblemFindingErrors(org.eclipse.ajdt.ui.tests.reconciling.ProblemFinderTests10)  Time elapsed: 7.319 sec
testProblemFinding0(org.eclipse.ajdt.ui.tests.reconciling.ProblemFinderTests5)  Time elapsed: 6.2 sec
testProblemFinding1(org.eclipse.ajdt.ui.tests.reconciling.ProblemFinderTests5)  Time elapsed: 1.973 sec
testProblemFinding2(org.eclipse.ajdt.ui.tests.reconciling.ProblemFinderTests5)  Time elapsed: 1.974 sec
testProblemFinding3(org.eclipse.ajdt.ui.tests.reconciling.ProblemFinderTests5)  Time elapsed: 3.019 sec
testProblemFinding4(org.eclipse.ajdt.ui.tests.reconciling.ProblemFinderTests5)  Time elapsed: 3.042 sec
testProblemFinding5(org.eclipse.ajdt.ui.tests.reconciling.ProblemFinderTests5)  Time elapsed: 3.096 sec
testProblemFinding6(org.eclipse.ajdt.ui.tests.reconciling.ProblemFinderTests5)  Time elapsed: 2.107 sec
testProblemFinding0(org.eclipse.ajdt.ui.tests.reconciling.ProblemFinderTests6)  Time elapsed: 2.983 sec
testProblemFinding1(org.eclipse.ajdt.ui.tests.reconciling.ProblemFinderTests6)  Time elapsed: 3.205 sec
testProblemFinding2(org.eclipse.ajdt.ui.tests.reconciling.ProblemFinderTests6)  Time elapsed: 2.999 sec
testProblemFinding3(org.eclipse.ajdt.ui.tests.reconciling.ProblemFinderTests6)  Time elapsed: 3.115 sec
testProblemFinding4(org.eclipse.ajdt.ui.tests.reconciling.ProblemFinderTests6)  Time elapsed: 3.129 sec
testProblemFinding5(org.eclipse.ajdt.ui.tests.reconciling.ProblemFinderTests6)  Time elapsed: 3.04 sec
testProblemFinding0(org.eclipse.ajdt.ui.tests.reconciling.ProblemFinderTests8)  Time elapsed: 2.976 sec
testProblemFinding1(org.eclipse.ajdt.ui.tests.reconciling.ProblemFinderTests8)  Time elapsed: 6.858 sec
testProblemFinding2(org.eclipse.ajdt.ui.tests.reconciling.ProblemFinderTests8)  Time elapsed: 7.053 sec
testProblemFinding3(org.eclipse.ajdt.ui.tests.reconciling.ProblemFinderTests8)  Time elapsed: 6.508 sec
testProblemFinding4(org.eclipse.ajdt.ui.tests.reconciling.ProblemFinderTests8)  Time elapsed: 6.871 sec
testProblemFinding5(org.eclipse.ajdt.ui.tests.reconciling.ProblemFinderTests8)  Time elapsed: 6.62 sec
testProblemFinding6(org.eclipse.ajdt.ui.tests.reconciling.ProblemFinderTests8)  Time elapsed: 6.455 sec
testProblemFinding7(org.eclipse.ajdt.ui.tests.reconciling.ProblemFinderTests8)  Time elapsed: 6.173 sec
testProblemFindingAll(org.eclipse.ajdt.ui.tests.reconciling.ProblemFinderTests11)  Time elapsed: 6.339 sec
testProblemFindingErrors(org.eclipse.ajdt.ui.tests.reconciling.ProblemFinderTests11)  Time elapsed: 6.235 sec
testProblemFindingAll(org.eclipse.ajdt.ui.tests.reconciling.ProblemFinderTests12)  Time elapsed: 6.422 sec  <<< FAILURE!
junit.framework.AssertionFailedError: Should not have any problems in App.java [in be.cronos.aop [in src/main/java [in Bug265986-ITDMissingType]]]
  package be.cronos.aop
  class App
    static void main(String[]) but found:
[
	org.eclipse.jdt.core.problem --> 
		Pb(100) The method foo() is undefined for the type App
		Pb(100) The method getLogger(null) is undefined for the type App
]


	at junit.framework.Assert.fail(Assert.java:57)
	at junit.framework.TestCase.fail(TestCase.java:227)
	at org.eclipse.ajdt.ui.tests.reconciling.ProblemFinderTests12.testProblemFindingAll(ProblemFinderTests12.java:86)

testProblemFindingAll(org.eclipse.ajdt.ui.tests.reconciling.Bug279439Reconciling)  Time elapsed: 6.171 sec  <<< FAILURE!
junit.framework.AssertionFailedError: Should not have any problems in Qux.java [in foo.bar [in src [in Bug279439]]]
  package foo.bar
  class Qux
    static void main(String[]) but found:
[
	org.eclipse.jdt.core.problem --> 
		Pb(70) hi cannot be resolved or is not a field
]


	at junit.framework.Assert.fail(Assert.java:57)
	at junit.framework.TestCase.fail(TestCase.java:227)
	at org.eclipse.ajdt.ui.tests.reconciling.Bug279439Reconciling.testProblemFindingAll(Bug279439Reconciling.java:83)

testHyperlink(org.eclipse.ajdt.ui.tests.debug.JavaConsoleHyperlinkTest)  Time elapsed: 9.848 sec
testBreakpointInAJFile1(org.eclipse.ajdt.ui.tests.debug.DebugBreakpointsTests)  Time elapsed: 4.769 sec
testBreakpointInAJFile2(org.eclipse.ajdt.ui.tests.debug.DebugBreakpointsTests)  Time elapsed: 8.54 sec
testBreakpointInAJFile3(org.eclipse.ajdt.ui.tests.debug.DebugBreakpointsTests)  Time elapsed: 7.555 sec
testBreakpointInAJFile4(org.eclipse.ajdt.ui.tests.debug.DebugBreakpointsTests)  Time elapsed: 7.931 sec
testBreakpointInAJFile5(org.eclipse.ajdt.ui.tests.debug.DebugBreakpointsTests)  Time elapsed: 7.357 sec
testBreakpointInAJFile6(org.eclipse.ajdt.ui.tests.debug.DebugBreakpointsTests)  Time elapsed: 8.768 sec
testBreakpointInAJFile7(org.eclipse.ajdt.ui.tests.debug.DebugBreakpointsTests)  Time elapsed: 8.2 sec
testBreakpointInAJFile8(org.eclipse.ajdt.ui.tests.debug.DebugBreakpointsTests)  Time elapsed: 8.68 sec
testBreakpointInAJFile9(org.eclipse.ajdt.ui.tests.debug.DebugBreakpointsTests)  Time elapsed: 9.063 sec
testFFDC(org.eclipse.ajdt.ui.tests.ras.PluginFFDCTest)  Time elapsed: 7.226 sec
testRogueFFDC(org.eclipse.ajdt.ui.tests.ras.PluginFFDCTest)  Time elapsed: 7.164 sec
testRenamePackage(org.eclipse.ajdt.ui.tests.refactoring.RenamePackageTest)  Time elapsed: 9.11 sec
testBug106589(org.eclipse.ajdt.ui.tests.refactoring.OrganizeImportsTest)  Time elapsed: 8.417 sec
testBug188845(org.eclipse.ajdt.ui.tests.refactoring.OrganizeImportsTest)  Time elapsed: 7.73 sec
testBug236352(org.eclipse.ajdt.ui.tests.refactoring.OrganizeImportsTest)  Time elapsed: 9.274 sec
testCopyPasteAJ(org.eclipse.ajdt.ui.tests.refactoring.CopyPasteAJTest)  Time elapsed: 7.179 sec
testDeclareParents(org.eclipse.ajdt.ui.tests.refactoring.PushinRefactoringTests)  Time elapsed: 10.492 sec
testDeclareAnnotation(org.eclipse.ajdt.ui.tests.refactoring.PushinRefactoringTests)  Time elapsed: 5.072 sec
testDeclareAnnotationBig(org.eclipse.ajdt.ui.tests.refactoring.PushinRefactoringTests)  Time elapsed: 4.978 sec
testITDsWillDelete(org.eclipse.ajdt.ui.tests.refactoring.PushinRefactoringTests)  Time elapsed: 5.841 sec
testBug283657(org.eclipse.ajdt.ui.tests.refactoring.PushinRefactoringTests)  Time elapsed: 5.883 sec
testBug321065(org.eclipse.ajdt.ui.tests.refactoring.PushinRefactoringTests)  Time elapsed: 10.396 sec
testSimpleITDsNoDelete(org.eclipse.ajdt.ui.tests.refactoring.PushinRefactoringTests)  Time elapsed: 5.1 sec
testPushInRemoveFieldClassFullyQualified(org.eclipse.ajdt.ui.tests.refactoring.PushInRefactoringRemoveAnnotationTests)  Time elapsed: 4.528 sec
testPushInRemoveFieldAspectFullyQualified(org.eclipse.ajdt.ui.tests.refactoring.PushInRefactoringRemoveAnnotationTests)  Time elapsed: 5.537 sec
testPushInRemoveFieldMultiple(org.eclipse.ajdt.ui.tests.refactoring.PushInRefactoringRemoveAnnotationTests)  Time elapsed: 5.694 sec
testPushInRemoveFieldSimple(org.eclipse.ajdt.ui.tests.refactoring.PushInRefactoringRemoveAnnotationTests)  Time elapsed: 5.536 sec
testPushInRemoveFieldBothFullyQualified(org.eclipse.ajdt.ui.tests.refactoring.PushInRefactoringRemoveAnnotationTests)  Time elapsed: 5.673 sec
testPushInRemoveFieldMultiple2(org.eclipse.ajdt.ui.tests.refactoring.PushInRefactoringRemoveAnnotationTests)  Time elapsed: 5.747 sec
testPushInRemoveFieldDifferentPackages(org.eclipse.ajdt.ui.tests.refactoring.PushInRefactoringRemoveAnnotationTests)  Time elapsed: 5.751 sec
testPushInRemoveFieldClassFullyQualifiedMultiple1(org.eclipse.ajdt.ui.tests.refactoring.PushInRefactoringRemoveAnnotationTests)  Time elapsed: 5.635 sec
testPushInRemoveFieldClassFullyQualifiedMultiple2(org.eclipse.ajdt.ui.tests.refactoring.PushInRefactoringRemoveAnnotationTests)  Time elapsed: 5.878 sec
testImportRequired(org.eclipse.ajdt.ui.tests.refactoring.PushInRefactoringITITTests)  Time elapsed: 6.3 sec
testEmptyFullyQualifiedITIT(org.eclipse.ajdt.ui.tests.refactoring.PushInRefactoringITITTests)  Time elapsed: 6.048 sec
testOneFieldNoImports(org.eclipse.ajdt.ui.tests.refactoring.PushInRefactoringITITTests)  Time elapsed: 5.613 sec
testImportAlreadyThere(org.eclipse.ajdt.ui.tests.refactoring.PushInRefactoringITITTests)  Time elapsed: 5.896 sec
testEmptyITIT(org.eclipse.ajdt.ui.tests.refactoring.PushInRefactoringITITTests)  Time elapsed: 6.19 sec
testTwoITITsOneAspectDifferentTargets(org.eclipse.ajdt.ui.tests.refactoring.PushInRefactoringITITTests)  Time elapsed: 6.188 sec
testFullyQualifiedReference(org.eclipse.ajdt.ui.tests.refactoring.PushInRefactoringITITTests)  Time elapsed: 5.861 sec
testTwoITITsOneAspect(org.eclipse.ajdt.ui.tests.refactoring.PushInRefactoringITITTests)  Time elapsed: 5.938 sec
testTwoITITsOneAspectFirstOnly(org.eclipse.ajdt.ui.tests.refactoring.PushInRefactoringITITTests)  Time elapsed: 6.432 sec
testTwoFieldsNoImports(org.eclipse.ajdt.ui.tests.refactoring.PushInRefactoringITITTests)  Time elapsed: 5.626 sec
testAspectNotDeleted(org.eclipse.ajdt.ui.tests.refactoring.PushInRefactoringITITTests)  Time elapsed: 5.876 sec
testDefaultPackage1(org.eclipse.ajdt.ui.tests.refactoring.PushInRefactoringDeclareParentsTests)  Time elapsed: 5.937 sec
testDefaultPackage2(org.eclipse.ajdt.ui.tests.refactoring.PushInRefactoringDeclareParentsTests)  Time elapsed: 5.679 sec
testDefaultPackage3(org.eclipse.ajdt.ui.tests.refactoring.PushInRefactoringDeclareParentsTests)  Time elapsed: 5.722 sec
testDefaultPackage4(org.eclipse.ajdt.ui.tests.refactoring.PushInRefactoringDeclareParentsTests)  Time elapsed: 5.674 sec
testDefaultPackage5(org.eclipse.ajdt.ui.tests.refactoring.PushInRefactoringDeclareParentsTests)  Time elapsed: 5.718 sec
testDefaultPackage6(org.eclipse.ajdt.ui.tests.refactoring.PushInRefactoringDeclareParentsTests)  Time elapsed: 5.593 sec
testDefaultPackage7(org.eclipse.ajdt.ui.tests.refactoring.PushInRefactoringDeclareParentsTests)  Time elapsed: 5.548 sec
testDefaultPackage8(org.eclipse.ajdt.ui.tests.refactoring.PushInRefactoringDeclareParentsTests)  Time elapsed: 5.522 sec
testSamePackage1(org.eclipse.ajdt.ui.tests.refactoring.PushInRefactoringDeclareParentsTests)  Time elapsed: 6.071 sec
testSamePackage2(org.eclipse.ajdt.ui.tests.refactoring.PushInRefactoringDeclareParentsTests)  Time elapsed: 5.981 sec
testSamePackage3(org.eclipse.ajdt.ui.tests.refactoring.PushInRefactoringDeclareParentsTests)  Time elapsed: 6.007 sec
testGenerics1(org.eclipse.ajdt.ui.tests.refactoring.PushInRefactoringDeclareParentsTests)  Time elapsed: 5.841 sec
testOtherPackage1(org.eclipse.ajdt.ui.tests.refactoring.PushInRefactoringDeclareParentsTests)  Time elapsed: 5.833 sec
testOtherPackage2(org.eclipse.ajdt.ui.tests.refactoring.PushInRefactoringDeclareParentsTests)  Time elapsed: 6.928 sec
testPullProtected(org.eclipse.ajdt.ui.tests.refactoring.PullOutRefactoringTests)  Time elapsed: 5.913 sec
testPullSamePackage(org.eclipse.ajdt.ui.tests.refactoring.PullOutRefactoringTests)  Time elapsed: 6.897 sec
testGenericParamPrivateTypeRef(org.eclipse.ajdt.ui.tests.refactoring.PullOutRefactoringTests)  Time elapsed: 5.842 sec
testPullSameAspect(org.eclipse.ajdt.ui.tests.refactoring.PullOutRefactoringTests)  Time elapsed: 6.462 sec
testAddModifierWeirdComments(org.eclipse.ajdt.ui.tests.refactoring.PullOutRefactoringTests)  Time elapsed: 6.627 sec
testScaffolding(org.eclipse.ajdt.ui.tests.refactoring.PullOutRefactoringTests)  Time elapsed: 5.539 sec
testPullAbstractMethodWarnings(org.eclipse.ajdt.ui.tests.refactoring.PullOutRefactoringTests)  Time elapsed: 6.053 sec
testPullITDField(org.eclipse.ajdt.ui.tests.refactoring.PullOutRefactoringTests)  Time elapsed: 6.553 sec
testPullMultipleTargetsCanPrivate(org.eclipse.ajdt.ui.tests.refactoring.PullOutRefactoringTests)  Time elapsed: 6.562 sec
testPullWeirdComments(org.eclipse.ajdt.ui.tests.refactoring.PullOutRefactoringTests)  Time elapsed: 6.759 sec
testPrivateFieldReference2(org.eclipse.ajdt.ui.tests.refactoring.PullOutRefactoringTests)  Time elapsed: 5.995 sec
testPullMultipleTargetsSimple(org.eclipse.ajdt.ui.tests.refactoring.PullOutRefactoringTests)  Time elapsed: 6.747 sec
testPrivateMethodReference(org.eclipse.ajdt.ui.tests.refactoring.PullOutRefactoringTests)  Time elapsed: 5.567 sec
testPublicizeITDs(org.eclipse.ajdt.ui.tests.refactoring.PullOutRefactoringTests)  Time elapsed: 6.254 sec
testImportNameCollisionInDeclaringTypeRef(org.eclipse.ajdt.ui.tests.refactoring.PullOutRefactoringTests)  Time elapsed: 6.645 sec
testPrivateFieldReference(org.eclipse.ajdt.ui.tests.refactoring.PullOutRefactoringTests)  Time elapsed: 6.129 sec
testMakePrivilegedPrivileged(org.eclipse.ajdt.ui.tests.refactoring.PullOutRefactoringTests)  Time elapsed: 6.528 sec
testPullITDMethod(org.eclipse.ajdt.ui.tests.refactoring.PullOutRefactoringTests)  Time elapsed: 6.388 sec
testPrivilegedAspect(org.eclipse.ajdt.ui.tests.refactoring.PullOutRefactoringTests)  Time elapsed: 6.197 sec
testSimplePrivateTypeRef(org.eclipse.ajdt.ui.tests.refactoring.PullOutRefactoringTests)  Time elapsed: 5.524 sec
testPullSameCU(org.eclipse.ajdt.ui.tests.refactoring.PullOutRefactoringTests)  Time elapsed: 6.063 sec
testPullStatic(org.eclipse.ajdt.ui.tests.refactoring.PullOutRefactoringTests)  Time elapsed: 6.295 sec
testFieldPulling(org.eclipse.ajdt.ui.tests.refactoring.PullOutRefactoringTests)  Time elapsed: 6.884 sec
testPullInterfaceMethodWarning(org.eclipse.ajdt.ui.tests.refactoring.PullOutRefactoringTests)  Time elapsed: 6.078 sec
testGenericTypeParamUsed(org.eclipse.ajdt.ui.tests.refactoring.PullOutRefactoringTests)  Time elapsed: 6.27 sec
testPullITDConstructor(org.eclipse.ajdt.ui.tests.refactoring.PullOutRefactoringTests)  Time elapsed: 6.255 sec
testProtectedDropping(org.eclipse.ajdt.ui.tests.refactoring.PullOutRefactoringTests)  Time elapsed: 6.396 sec
testPullAspectMethod(org.eclipse.ajdt.ui.tests.refactoring.PullOutRefactoringTests)  Time elapsed: 6.26 sec
testPullAbstractStubMethods(org.eclipse.ajdt.ui.tests.refactoring.PullOutRefactoringTests)  Time elapsed: 6.232 sec
testPullPrivate(org.eclipse.ajdt.ui.tests.refactoring.PullOutRefactoringTests)  Time elapsed: 5.499 sec
testPullConstructorWithThisWarning(org.eclipse.ajdt.ui.tests.refactoring.PullOutRefactoringTests)  Time elapsed: 5.761 sec
testProtectedAndDefaulReference(org.eclipse.ajdt.ui.tests.refactoring.PullOutRefactoringTests)  Time elapsed: 6.051 sec
testImports(org.eclipse.ajdt.ui.tests.refactoring.PullOutRefactoringTests)  Time elapsed: 6.551 sec
testImportNameCollision(org.eclipse.ajdt.ui.tests.refactoring.PullOutRefactoringTests)  Time elapsed: 9.28 sec
testMakePrivilegedAspect(org.eclipse.ajdt.ui.tests.refactoring.PullOutRefactoringTests)  Time elapsed: 6.453 sec
testPullConstructor(org.eclipse.ajdt.ui.tests.refactoring.PullOutRefactoringTests)  Time elapsed: 6.313 sec
testSimple(org.eclipse.ajdt.ui.tests.refactoring.PullOutRefactoringTests)  Time elapsed: 6.375 sec
testArrayPrivateTypeRef(org.eclipse.ajdt.ui.tests.refactoring.PullOutRefactoringTests)  Time elapsed: 6.105 sec
testDifferentPackage(org.eclipse.ajdt.ui.tests.refactoring.PullOutRefactoringTests)  Time elapsed: 6.521 sec
testPullInterfaceVoidStubMethods(org.eclipse.ajdt.ui.tests.refactoring.PullOutRefactoringTests)  Time elapsed: 6.267 sec
testMultipleGenericTypeParamUsed(org.eclipse.ajdt.ui.tests.refactoring.PullOutRefactoringTests)  Time elapsed: 6.309 sec
testPullConstructorWithPrivateWarnings(org.eclipse.ajdt.ui.tests.refactoring.PullOutRefactoringTests)  Time elapsed: 5.735 sec
testRipple1(org.eclipse.ajdt.ui.tests.refactoring.ITDAwareRippleSearchTests)  Time elapsed: 6.337 sec
testRipple2(org.eclipse.ajdt.ui.tests.refactoring.ITDAwareRippleSearchTests)  Time elapsed: 6.053 sec
testRipple3(org.eclipse.ajdt.ui.tests.refactoring.ITDAwareRippleSearchTests)  Time elapsed: 6.155 sec
testRipple4(org.eclipse.ajdt.ui.tests.refactoring.ITDAwareRippleSearchTests)  Time elapsed: 5.883 sec
testRipple5(org.eclipse.ajdt.ui.tests.refactoring.ITDAwareRippleSearchTests)  Time elapsed: 5.89 sec
testRipple6(org.eclipse.ajdt.ui.tests.refactoring.ITDAwareRippleSearchTests)  Time elapsed: 5.695 sec
testRippleInterface1(org.eclipse.ajdt.ui.tests.refactoring.ITDAwareRippleSearchTests)  Time elapsed: 5.544 sec
testRippleInterface2(org.eclipse.ajdt.ui.tests.refactoring.ITDAwareRippleSearchTests)  Time elapsed: 6.007 sec
testRippleInterface3(org.eclipse.ajdt.ui.tests.refactoring.ITDAwareRippleSearchTests)  Time elapsed: 6.168 sec
testRippleInterface4(org.eclipse.ajdt.ui.tests.refactoring.ITDAwareRippleSearchTests)  Time elapsed: 5.865 sec
testRippleInterface5(org.eclipse.ajdt.ui.tests.refactoring.ITDAwareRippleSearchTests)  Time elapsed: 5.602 sec
testRippleInterface6(org.eclipse.ajdt.ui.tests.refactoring.ITDAwareRippleSearchTests)  Time elapsed: 6.5 sec
testPrivateRenameField1(org.eclipse.ajdt.ui.tests.refactoring.ITDRenameProcessorTests)  Time elapsed: 6.787 sec
testMethodRenameOnInterfaceWithDeclareParents1(org.eclipse.ajdt.ui.tests.refactoring.ITDRenameProcessorTests)  Time elapsed: 6.036 sec
testMethodRenameOnInterfaceWithDeclareParents2(org.eclipse.ajdt.ui.tests.refactoring.ITDRenameProcessorTests)  Time elapsed: 6.152 sec
testSimpleRenameField1(org.eclipse.ajdt.ui.tests.refactoring.ITDRenameProcessorTests)  Time elapsed: 6.158 sec
testSimpleRenameField2(org.eclipse.ajdt.ui.tests.refactoring.ITDRenameProcessorTests)  Time elapsed: 5.833 sec
testSimpleRenameField3(org.eclipse.ajdt.ui.tests.refactoring.ITDRenameProcessorTests)  Time elapsed: 6.264 sec
testRenameMethodTwoArgs1(org.eclipse.ajdt.ui.tests.refactoring.ITDRenameProcessorTests)  Time elapsed: 6.135 sec
testRenameMethodTwoArgs2(org.eclipse.ajdt.ui.tests.refactoring.ITDRenameProcessorTests)  Time elapsed: 6.282 sec
testRenameMethodTwoArgs3(org.eclipse.ajdt.ui.tests.refactoring.ITDRenameProcessorTests)  Time elapsed: 7.462 sec
testRenameMethodPrimitiveArg1(org.eclipse.ajdt.ui.tests.refactoring.ITDRenameProcessorTests)  Time elapsed: 6.33 sec
testRenameMethodPrimitiveArg2(org.eclipse.ajdt.ui.tests.refactoring.ITDRenameProcessorTests)  Time elapsed: 6.81 sec
testRenameMethodPrimitiveArg3(org.eclipse.ajdt.ui.tests.refactoring.ITDRenameProcessorTests)  Time elapsed: 7.04 sec
testRenameMethodStringArg1(org.eclipse.ajdt.ui.tests.refactoring.ITDRenameProcessorTests)  Time elapsed: 6.278 sec
testRenameMethodStringArg2(org.eclipse.ajdt.ui.tests.refactoring.ITDRenameProcessorTests)  Time elapsed: 6.166 sec
testRenameMethodStringArg3(org.eclipse.ajdt.ui.tests.refactoring.ITDRenameProcessorTests)  Time elapsed: 7.173 sec
testRenameMethodListOfStringArg1(org.eclipse.ajdt.ui.tests.refactoring.ITDRenameProcessorTests)  Time elapsed: 8.305 sec
testRenameMethodListOfStringArg2(org.eclipse.ajdt.ui.tests.refactoring.ITDRenameProcessorTests)  Time elapsed: 5.922 sec
testRenameMethodListOfStringArg3(org.eclipse.ajdt.ui.tests.refactoring.ITDRenameProcessorTests)  Time elapsed: 7.028 sec
testMultiFileRenameField1(org.eclipse.ajdt.ui.tests.refactoring.ITDRenameProcessorTests)  Time elapsed: 6.009 sec
testRenameMethodQualifiedListArg1(org.eclipse.ajdt.ui.tests.refactoring.ITDRenameProcessorTests)  Time elapsed: 5.671 sec
testRenameMethodQualifiedListArg2(org.eclipse.ajdt.ui.tests.refactoring.ITDRenameProcessorTests)  Time elapsed: 6.04 sec
testRenameMethodQualifiedListArg3(org.eclipse.ajdt.ui.tests.refactoring.ITDRenameProcessorTests)  Time elapsed: 7.995 sec
testRenameMethodNoArgs1(org.eclipse.ajdt.ui.tests.refactoring.ITDRenameProcessorTests)  Time elapsed: 5.872 sec
testRenameMethodNoArgs2(org.eclipse.ajdt.ui.tests.refactoring.ITDRenameProcessorTests)  Time elapsed: 5.886 sec
testRenameMethodNoArgs3(org.eclipse.ajdt.ui.tests.refactoring.ITDRenameProcessorTests)  Time elapsed: 7.028 sec
testExtractLocalSimple1(org.eclipse.ajdt.ui.tests.refactoring.ExtractLocalTests)  Time elapsed: 5.876 sec
testExtractLocalSimple2(org.eclipse.ajdt.ui.tests.refactoring.ExtractLocalTests)  Time elapsed: 6.407 sec
testExtractLocalAspect1(org.eclipse.ajdt.ui.tests.refactoring.ExtractLocalTests)  Time elapsed: 5.971 sec
testExtractLocalAspect2(org.eclipse.ajdt.ui.tests.refactoring.ExtractLocalTests)  Time elapsed: 5.803 sec
testExtractLocalAspect3(org.eclipse.ajdt.ui.tests.refactoring.ExtractLocalTests)  Time elapsed: 5.487 sec
testExtractLocalAspect4(org.eclipse.ajdt.ui.tests.refactoring.ExtractLocalTests)  Time elapsed: 5.558 sec
testExtractLocalAspect5(org.eclipse.ajdt.ui.tests.refactoring.ExtractLocalTests)  Time elapsed: 6.172 sec
testExtractConstantAspect1(org.eclipse.ajdt.ui.tests.refactoring.ExtractConstantTests)  Time elapsed: 6.018 sec
testExtractConstantAspect2(org.eclipse.ajdt.ui.tests.refactoring.ExtractConstantTests)  Time elapsed: 5.975 sec
testExtractConstantAspect3(org.eclipse.ajdt.ui.tests.refactoring.ExtractConstantTests)  Time elapsed: 5.772 sec
testExtractConstantAspect4(org.eclipse.ajdt.ui.tests.refactoring.ExtractConstantTests)  Time elapsed: 5.739 sec
testExtractConstantAspect5(org.eclipse.ajdt.ui.tests.refactoring.ExtractConstantTests)  Time elapsed: 5.428 sec
testExtractConstantSimple1(org.eclipse.ajdt.ui.tests.refactoring.ExtractConstantTests)  Time elapsed: 5.67 sec
testExtractConstantSimple2(org.eclipse.ajdt.ui.tests.refactoring.ExtractConstantTests)  Time elapsed: 5.629 sec
testConvertLocalToFieldSimple1(org.eclipse.ajdt.ui.tests.refactoring.ConvertLocalToFieldTests)  Time elapsed: 5.635 sec
testConvertLocalToFieldSimple2(org.eclipse.ajdt.ui.tests.refactoring.ConvertLocalToFieldTests)  Time elapsed: 5.819 sec
testConvertLocalToFieldAspect1(org.eclipse.ajdt.ui.tests.refactoring.ConvertLocalToFieldTests)  Time elapsed: 6.027 sec
testConvertLocalToFieldAspect2(org.eclipse.ajdt.ui.tests.refactoring.ConvertLocalToFieldTests)  Time elapsed: 5.824 sec
testConvertLocalToFieldAspect3(org.eclipse.ajdt.ui.tests.refactoring.ConvertLocalToFieldTests)  Time elapsed: 5.941 sec
testConvertLocalToFieldAspect4(org.eclipse.ajdt.ui.tests.refactoring.ConvertLocalToFieldTests)  Time elapsed: 6.402 sec
testConvertLocalToFieldAspect5(org.eclipse.ajdt.ui.tests.refactoring.ConvertLocalToFieldTests)  Time elapsed: 6.176 sec
testAspectWithITD1(org.eclipse.ajdt.ui.tests.refactoring.MoveTypeIntoAspectRefactoringTests)  Time elapsed: 6.19 sec
testAspectWithITD2(org.eclipse.ajdt.ui.tests.refactoring.MoveTypeIntoAspectRefactoringTests)  Time elapsed: 6.198 sec
testSimple1(org.eclipse.ajdt.ui.tests.refactoring.MoveTypeIntoAspectRefactoringTests)  Time elapsed: 5.6 sec
testSimple2(org.eclipse.ajdt.ui.tests.refactoring.MoveTypeIntoAspectRefactoringTests)  Time elapsed: 5.441 sec
testSimple3(org.eclipse.ajdt.ui.tests.refactoring.MoveTypeIntoAspectRefactoringTests)  Time elapsed: 5.469 sec
testSimple4(org.eclipse.ajdt.ui.tests.refactoring.MoveTypeIntoAspectRefactoringTests)  Time elapsed: 5.557 sec
testSuperTypeHierarchyOfNonFocusType(org.eclipse.ajdt.ui.tests.hierarchy.ITDAwareHierarchyTests)  Time elapsed: 6.673 sec  <<< FAILURE!
junit.framework.AssertionFailedError: expected:<4> but was:<3>
	at junit.framework.Assert.fail(Assert.java:57)
	at junit.framework.Assert.failNotEquals(Assert.java:329)
	at junit.framework.Assert.assertEquals(Assert.java:78)
	at junit.framework.Assert.assertEquals(Assert.java:234)
	at junit.framework.Assert.assertEquals(Assert.java:241)
	at junit.framework.TestCase.assertEquals(TestCase.java:409)
	at org.eclipse.ajdt.ui.tests.hierarchy.ITDAwareHierarchyTests.testSuperTypeHierarchyOfNonFocusType_aroundBody2(ITDAwareHierarchyTests.java:100)
	at org.eclipse.ajdt.ui.tests.hierarchy.ITDAwareHierarchyTests.testSuperTypeHierarchyOfNonFocusType_aroundBody3$advice(ITDAwareHierarchyTests.java:52)
	at org.eclipse.ajdt.ui.tests.hierarchy.ITDAwareHierarchyTests.testSuperTypeHierarchyOfNonFocusType(ITDAwareHierarchyTests.java:1)

testSuperTypeHierarchyOfFocusType(org.eclipse.ajdt.ui.tests.hierarchy.ITDAwareHierarchyTests)  Time elapsed: 3.014 sec
testSubTypeHierarchy(org.eclipse.ajdt.ui.tests.hierarchy.ITDAwareHierarchyTests)  Time elapsed: 2.219 sec
testAbstractAspectWithDeclare(org.eclipse.ajdt.ui.tests.hierarchy.ITDAwareHierarchyTests2)  Time elapsed: 3.468 sec
testAbstractGenericAspectWithDeclare(org.eclipse.ajdt.ui.tests.hierarchy.ITDAwareHierarchyTests2)  Time elapsed: 6.323 sec
testDisabled(org.eclipse.ajdt.ui.tests.ErrorLogTest)  Time elapsed: 5.951 sec
testViewsAreValid(org.eclipse.ajdt.ui.tests.VerificationTest)  Time elapsed: 6.893 sec
testAbsentNavigatorView(org.eclipse.ajdt.ui.tests.VerificationTest)  Time elapsed: 5.791 sec
testAbsentStructureModelView(org.eclipse.ajdt.ui.tests.VerificationTest)  Time elapsed: 5.875 sec
testBug106813(org.eclipse.ajdt.ui.tests.Bug106813Test)  Time elapsed: 7.045 sec
testPredefinedProjectsTool(org.eclipse.ajdt.ui.tests.testutils.TestForPredefinedProjectsTool)  Time elapsed: 6.361 sec
testProjectsToolWithClosedProjects(org.eclipse.ajdt.ui.tests.testutils.TestForPredefinedProjectsTool)  Time elapsed: 3.279 sec
testBug93532(org.eclipse.ajdt.ui.tests.utils.AJDTUtilsTest)  Time elapsed: 3.017 sec
testCaseInsensitiveNoSrcFolder(org.eclipse.ajdt.ui.tests.utils.AJDTUtilsTest)  Time elapsed: 2.185 sec
testCaseInsensitive(org.eclipse.ajdt.ui.tests.utils.AJDTUtilsTest)  Time elapsed: 1.951 sec
testAddAndRemoveAjrtToBuildPath(org.eclipse.ajdt.ui.tests.utils.AJDTUtilsTest)  Time elapsed: 4.346 sec
testAddAndRemoveWithExcludes(org.eclipse.ajdt.ui.tests.utils.AJDTUtilsTest)  Time elapsed: 3.273 sec
testAddAndRemoveAspectJNature(org.eclipse.ajdt.ui.tests.utils.AJDTUtilsTest)  Time elapsed: 3.002 sec
testCaseInsensitiveDriveLetters(org.eclipse.ajdt.ui.tests.utils.AJDTUtilsTest)  Time elapsed: 2.099 sec
testAddAndRemoveWithExcludes2(org.eclipse.ajdt.ui.tests.utils.AJDTUtilsTest)  Time elapsed: 3.096 sec
testAddAndRemoveAspectJNatureWithBundleProject(org.eclipse.ajdt.ui.tests.utils.AJDTUtilsTest)  Time elapsed: 7.025 sec

Results :

Failed tests: 
  ContentAssistTests2.testITDFieldInFieldInOtherClass:1->testITDFieldInFieldInOtherClass_aroundBody15$advice:52->testITDFieldInFieldInOtherClass_aroundBody14:141 Should have 2 proposals, but found:
Accepted completion proposals:
	<none>
 expected:<2> but was:<0>
  ContentAssistTests2.testITDMethodInOtherClass:1->testITDMethodInOtherClass_aroundBody17$advice:52->testITDMethodInOtherClass_aroundBody16:153 Should have 1 proposal, but found:
Accepted completion proposals:
	<none>
 expected:<1> but was:<0>
  ContentAssistTests2.testFromITDOnDeclareParentInOtherClass:1->testFromITDOnDeclareParentInOtherClass_aroundBody23$advice:52->testFromITDOnDeclareParentInOtherClass_aroundBody22:189 Should have 1 proposal, but found:
Accepted completion proposals:
	<none>
 expected:<1> but was:<0>
  ContentAssistTests2.testFromDeclareParentInOtherClass:1->testFromDeclareParentInOtherClass_aroundBody21$advice:52->testFromDeclareParentInOtherClass_aroundBody20:178 Should have 1 proposal, but found:
Accepted completion proposals:
	<none>
 expected:<1> but was:<0>
  ContentAssistTests2.testFromITDOnDeclareParent:1->testFromITDOnDeclareParent_aroundBody11$advice:52->testFromITDOnDeclareParent_aroundBody10:117 Should have 1 proposal, but found:
Accepted completion proposals:
	<none>
 expected:<1> but was:<0>
  ContentAssistTests2.testITDFieldInOtherClass:1->testITDFieldInOtherClass_aroundBody13$advice:52->testITDFieldInOtherClass_aroundBody12:131 Should have 1 proposal, but found:
Accepted completion proposals:
	<none>
 expected:<1> but was:<0>
  ContentAssistTests3.testITDFieldInFieldInOtherClass:1->testITDFieldInFieldInOtherClass_aroundBody15$advice:52->testITDFieldInFieldInOtherClass_aroundBody14:150 Should have 2 proposals, but found:
Accepted completion proposals:
	<none>
 expected:<2> but was:<0>
  ContentAssistTests3.testITDMethodInOtherClass:1->testITDMethodInOtherClass_aroundBody17$advice:52->testITDMethodInOtherClass_aroundBody16:162 Should have 1 proposal, but found:
Accepted completion proposals:
	<none>
 expected:<1> but was:<0>
  ContentAssistTests3.testFromITDOnDeclareParentInOtherClass:1->testFromITDOnDeclareParentInOtherClass_aroundBody23$advice:52->testFromITDOnDeclareParentInOtherClass_aroundBody22:198 Should have 1 proposal, but found:
Accepted completion proposals:
	<none>
 expected:<1> but was:<0>
  ContentAssistTests3.testFromDeclareParentInOtherClass:1->testFromDeclareParentInOtherClass_aroundBody21$advice:52->testFromDeclareParentInOtherClass_aroundBody20:187 Should have 1 proposal, but found:
Accepted completion proposals:
	<none>
 expected:<1> but was:<0>
  ContentAssistTests3.testFromITDOnDeclareParent:1->testFromITDOnDeclareParent_aroundBody11$advice:52->testFromITDOnDeclareParent_aroundBody10:126 Should have 1 proposal, but found:
Accepted completion proposals:
	<none>
 expected:<1> but was:<0>
  ContentAssistTests3.testITDFieldInOtherClass:1->testITDFieldInOtherClass_aroundBody13$advice:52->testITDFieldInOtherClass_aroundBody12:140 Should have 1 proposal, but found:
Accepted completion proposals:
	<none>
 expected:<1> but was:<0>
  Bug280508ContentAssist.testHasAspectInClass:1->testHasAspectInClass_aroundBody9$advice:52->testHasAspectInClass_aroundBody8:118 Should have 1 proposal, but found:
Accepted completion proposals:
	<none>
 expected:<1> but was:<0>
  Bug280508ContentAssist.testAspectOfTypeInClass:1->testAspectOfTypeInClass_aroundBody3$advice:52->testAspectOfTypeInClass_aroundBody2:75 Should have 1 proposal, but found:
Accepted completion proposals:
	<none>
 expected:<1> but was:<0>
  Bug280508ContentAssist.testGetWithinTypeName:1->testGetWithinTypeName_aroundBody11$advice:52->testGetWithinTypeName_aroundBody10:131 Should have 2 proposal, but found:
Accepted completion proposals:
	<none>
 expected:<2> but was:<0>
  Bug280508ContentAssist.testAspectOfInClass:1->testAspectOfInClass_aroundBody1$advice:52->testAspectOfInClass_aroundBody0:61 Should have 1 proposal, but found:
Accepted completion proposals:
	<none>
 expected:<1> but was:<0>
  Bug280508ContentAssist.testAspectOfInAspect:1->testAspectOfInAspect_aroundBody5$advice:52->testAspectOfInAspect_aroundBody4:91 Should have 1 proposal, but found:
Accepted completion proposals:
	<none>
 expected:<1> but was:<0>
  Bug280508ContentAssist.testAspectOfTypeInAspect:1->testAspectOfTypeInAspect_aroundBody7$advice:52->testAspectOfTypeInAspect_aroundBody6:105 Should have 1 proposal, but found:
Accepted completion proposals:
	<none>
 expected:<1> but was:<0>
  ITITContentAssistTests.testContentAssistInOtherType:1->testContentAssistInOtherType_aroundBody1$advice:52->testContentAssistInOtherType_aroundBody0:73->assertContentAssist:189->assertContentAssist:177 Wrong number of proposals found, all proposals:
Accepted completion proposals:
	<none>
 expected:<1> but was:<0>
  ITITContentAssistTests.testContentAssistInAspect:1->testContentAssistInAspect_aroundBody3$advice:52->testContentAssistInAspect_aroundBody2:117->assertContentAssist:189->assertContentAssist:177 Wrong number of proposals found, all proposals:
Accepted completion proposals:
	<none>
 expected:<1> but was:<0>
  PetClinicTests.testPackageProtectedContentAssistShouldAppear:1->testPackageProtectedContentAssistShouldAppear_aroundBody11$advice:52->testPackageProtectedContentAssistShouldAppear_aroundBody10:197 Should have found the 'entityManager' proposal because it is package protected
  PetClinicTests.testPrivateContentAssistShouldAppear:1->testPrivateContentAssistShouldAppear_aroundBody7$advice:52->testPrivateContentAssistShouldAppear_aroundBody6:164 Should have found the 'id' proposal because it is private, but declared in this aspect
  PetClinicTests.testContentAssist:1->testContentAssist_aroundBody3$advice:52->testContentAssist_aroundBody2:125 Should have 1 proposal, but found:
Accepted completion proposals:
	<none>
 expected:<1> but was:<0>
  PetClinicTests.testPublicContentAssistShouldAppear:1->testPublicContentAssistShouldAppear_aroundBody15$advice:52->testPublicContentAssistShouldAppear_aroundBody14:228 Should have found the 'getAddress' proposal because it is public
  PetClinicTests.testReconciling:1->testReconciling_aroundBody5$advice:52->testReconciling_aroundBody4:142 Should not have any problems in [Working copy] Owner.java [in com.springsource.petclinic.domain [in src/main/java [in petclinic2]]]
  package com.springsource.petclinic.domain
  import org.springframework.roo.addon.entity.ref.RooEntity
  import org.springframework.roo.addon.jpa.ref.RooJpa
  import javax.persistence.Entity
  import java.util.Set
  import java.util.HashSet
  import javax.persistence.OneToMany
  import javax.persistence.CascadeType
  class Owner
    Set<Pet> pets
    void test() but found:
[
	org.eclipse.jdt.core.problem --> 
		Pb(100) The method getAddress() is undefined for the type Owner
]


  ProjectDependenciesWithJarFilesTest.testWithOutJarSwitch2:1->testWithOutJarSwitch2_aroundBody9$advice:52->testWithOutJarSwitch2_aroundBody8:496 project X should have project Y's outjar on it's classpath
  ProjectDependenciesWithJarFilesTest.testDependingProjectBuiltWhenOutjarChanges:1->testDependingProjectBuiltWhenOutjarChanges_aroundBody15$advice:52->testDependingProjectBuiltWhenOutjarChanges_aroundBody14:775->checkForJDTBug84214:883  P/jarCreatingProject should have P/jarDependentProject as it's list of referencing projects - if not, see JDT bug 84214 expected:<1> but was:<0>
  InpathOutFolderTest2.testJarOnInpath:1->testJarOnInpath_aroundBody1$advice:52->testJarOnInpath_aroundBody0:63 AspectJ RT should exist in the in path out folder
  ProblemFinderTests12.testProblemFindingAll:86 Should not have any problems in App.java [in be.cronos.aop [in src/main/java [in Bug265986-ITDMissingType]]]
  package be.cronos.aop
  class App
    static void main(String[]) but found:
[
	org.eclipse.jdt.core.problem --> 
		Pb(100) The method foo() is undefined for the type App
		Pb(100) The method getLogger(null) is undefined for the type App
]


  Bug279439Reconciling.testProblemFindingAll:83 Should not have any problems in Qux.java [in foo.bar [in src [in Bug279439]]]
  package foo.bar
  class Qux
    static void main(String[]) but found:
[
	org.eclipse.jdt.core.problem --> 
		Pb(70) hi cannot be resolved or is not a field
]


  ITDAwareHierarchyTests.testSuperTypeHierarchyOfNonFocusType:1->testSuperTypeHierarchyOfNonFocusType_aroundBody3$advice:52->testSuperTypeHierarchyOfNonFocusType_aroundBody2:100 expected:<4> but was:<3>

Tests run: 438, Failures: 31, Errors: 0, Skipped: 0

Timer event: 1ms: Update visualizer, xref, advice listeners for (separate thread): DefaultEmptyProject
>> scheduled a build

!ENTRY org.eclipse.core.resources 2 10035 2017-10-26 20:22:36.860
!MESSAGE The workspace will exit with unsaved changes in this session.
>> finished a build
[ERROR] There are test failures.

Please refer to /jobs/genie.ajdt/ajdt-on-eclipse-47-aj9/workspace/org.eclipse.ajdt.ui.tests/target/surefire-reports for the individual test results.
[INFO] 
[INFO] --- eclipse-jarsigner-plugin:1.0.4:sign (sign) @ org.eclipse.ajdt.ui.tests ---
[INFO] Signed org.eclipse.ajdt:org.eclipse.ajdt.ui.tests:eclipse-test-plugin:2.2.4-SNAPSHOT in 1 seconds.
[INFO] Signed org.eclipse.ajdt:org.eclipse.ajdt.ui.tests:java-source:sources:2.2.4-SNAPSHOT in 1 seconds.
[INFO] 
[INFO] --- tycho-p2-plugin:0.23.1:p2-metadata (p2-metadata) @ org.eclipse.ajdt.ui.tests ---
[INFO]                                                                         
[INFO] ------------------------------------------------------------------------
[INFO] Building org.eclipse.contribution.weaving.jdt.tests 2.2.4-SNAPSHOT
[INFO] ------------------------------------------------------------------------
[INFO] 
[INFO] --- maven-clean-plugin:2.5:clean (default-clean) @ org.eclipse.contribution.weaving.jdt.tests ---
[INFO] 
[INFO] --- tycho-packaging-plugin:0.23.1:build-qualifier (default-build-qualifier) @ org.eclipse.contribution.weaving.jdt.tests ---
[INFO] The project's OSGi version is 2.2.4.201710262257
[INFO] 
[INFO] --- tycho-packaging-plugin:0.23.1:validate-id (default-validate-id) @ org.eclipse.contribution.weaving.jdt.tests ---
[INFO] 
[INFO] --- tycho-packaging-plugin:0.23.1:validate-version (default-validate-version) @ org.eclipse.contribution.weaving.jdt.tests ---
[INFO] 
[INFO] --- maven-resources-plugin:2.4.3:resources (default-resources) @ org.eclipse.contribution.weaving.jdt.tests ---
[WARNING] Using platform encoding (UTF-8 actually) to copy filtered resources, i.e. build is platform dependent!
[INFO] skip non existing resourceDirectory /jobs/genie.ajdt/ajdt-on-eclipse-47-aj9/workspace/org.eclipse.contribution.weaving.jdt.tests/src/main/resources
[INFO] 
[INFO] --- tycho-compiler-plugin:0.23.1:compile (default-compile) @ org.eclipse.contribution.weaving.jdt.tests ---
[INFO] Compiling 20 source files to /jobs/genie.ajdt/ajdt-on-eclipse-47-aj9/workspace/org.eclipse.contribution.weaving.jdt.tests/target/classes
[INFO] 
[INFO] --- maven-resources-plugin:2.4.3:testResources (default-testResources) @ org.eclipse.contribution.weaving.jdt.tests ---
[WARNING] Using platform encoding (UTF-8 actually) to copy filtered resources, i.e. build is platform dependent!
[INFO] skip non existing resourceDirectory /jobs/genie.ajdt/ajdt-on-eclipse-47-aj9/workspace/org.eclipse.contribution.weaving.jdt.tests/src/test/resources
[INFO] 
[INFO] --- target-platform-configuration:0.23.1:target-platform (default-target-platform) @ org.eclipse.contribution.weaving.jdt.tests ---
[INFO] 
[INFO] --- tycho-packaging-plugin:0.23.1:package-plugin (default-package-plugin) @ org.eclipse.contribution.weaving.jdt.tests ---
[INFO] Building jar: /jobs/genie.ajdt/ajdt-on-eclipse-47-aj9/workspace/org.eclipse.contribution.weaving.jdt.tests/jdtweavingtests.jar
[INFO] Building jar: /jobs/genie.ajdt/ajdt-on-eclipse-47-aj9/workspace/org.eclipse.contribution.weaving.jdt.tests/target/org.eclipse.contribution.weaving.jdt.tests-2.2.4-SNAPSHOT.jar
[INFO] 
[INFO] --- tycho-p2-plugin:0.23.1:p2-metadata-default (default-p2-metadata-default) @ org.eclipse.contribution.weaving.jdt.tests ---
[INFO] 
[INFO] --- tycho-surefire-plugin:0.23.1:test (default-test) @ org.eclipse.contribution.weaving.jdt.tests ---
[INFO] Expected eclipse log file: /jobs/genie.ajdt/ajdt-on-eclipse-47-aj9/workspace/org.eclipse.contribution.weaving.jdt.tests/target/work/data/.metadata/.log
[INFO] Command line:
	[/opt/public/common/jdk1.8.0_131.x64/jre/bin/java, -Dosgi.noShutdown=false, -Dosgi.os=linux, -Dosgi.ws=gtk, -Dosgi.arch=x86_64, -Xmx1024m, -XX:MaxPermSize=256m, -Dosgi.clean=true, -jar, /jobs/genie.ajdt/ajdt-on-eclipse-47-aj9/workspace/.maven/repo/p2/osgi/bundle/org.eclipse.equinox.launcher/1.4.0.v20161219-1356/org.eclipse.equinox.launcher-1.4.0.v20161219-1356.jar, -debug, -consolelog, -data, /jobs/genie.ajdt/ajdt-on-eclipse-47-aj9/workspace/org.eclipse.contribution.weaving.jdt.tests/target/work/data, -install, /jobs/genie.ajdt/ajdt-on-eclipse-47-aj9/workspace/org.eclipse.contribution.weaving.jdt.tests/target/work, -configuration, /jobs/genie.ajdt/ajdt-on-eclipse-47-aj9/workspace/org.eclipse.contribution.weaving.jdt.tests/target/work/configuration, -application, org.eclipse.tycho.surefire.osgibooter.uitest, -testproperties, /jobs/genie.ajdt/ajdt-on-eclipse-47-aj9/workspace/org.eclipse.contribution.weaving.jdt.tests/target/surefire.properties]
Java HotSpot(TM) 64-Bit Server VM warning: ignoring option MaxPermSize=256m; support was removed in 8.0
Configuration location:
    file:/jobs/genie.ajdt/ajdt-on-eclipse-47-aj9/workspace/org.eclipse.contribution.weaving.jdt.tests/target/work/configuration/
Configuration file:
    file:/jobs/genie.ajdt/ajdt-on-eclipse-47-aj9/workspace/org.eclipse.contribution.weaving.jdt.tests/target/work/configuration/config.ini loaded
Install location:
    file:/jobs/genie.ajdt/ajdt-on-eclipse-47-aj9/workspace/org.eclipse.contribution.weaving.jdt.tests/target/work/
Framework located:
    file:/jobs/genie.ajdt/ajdt-on-eclipse-47-aj9/workspace/org.eclipse.contribution.weaving.jdt.tests/target/work/plugins/org.eclipse.osgi-3.12.50.v20170928-1321.jar
Loading extension: org.eclipse.equinox.weaving.hook
	eclipse.properties not found
Framework classpath:
    file:/jobs/genie.ajdt/ajdt-on-eclipse-47-aj9/workspace/org.eclipse.contribution.weaving.jdt.tests/target/work/plugins/org.eclipse.osgi-3.12.50.v20170928-1321.jar
    file:/jobs/genie.ajdt/ajdt-on-eclipse-47-aj9/workspace/org.eclipse.contribution.weaving.jdt.tests/target/work/plugins/
    file:/jobs/genie.ajdt/ajdt-on-eclipse-47-aj9/workspace/org.eclipse.contribution.weaving.jdt.tests/target/work/plugins/org.eclipse.equinox.weaving.hook_1.2.0.v20160929-1449/
Debug options:
    file:/jobs/genie.ajdt/ajdt-on-eclipse-47-aj9/workspace/org.eclipse.contribution.weaving.jdt.tests/.options not found
Time to load bundles: 915
!SESSION 2017-10-26 20:22:43.117 -----------------------------------------------
eclipse.buildId=unknown
java.version=1.8.0_131
java.vendor=Oracle Corporation
BootLoader constants: OS=linux, ARCH=x86_64, WS=gtk, NL=en_US
Framework arguments:  -application org.eclipse.tycho.surefire.osgibooter.uitest -testproperties /jobs/genie.ajdt/ajdt-on-eclipse-47-aj9/workspace/org.eclipse.contribution.weaving.jdt.tests/target/surefire.properties
Command-line arguments:  -debug -consolelog -data /jobs/genie.ajdt/ajdt-on-eclipse-47-aj9/workspace/org.eclipse.contribution.weaving.jdt.tests/target/work/data -application org.eclipse.tycho.surefire.osgibooter.uitest -testproperties /jobs/genie.ajdt/ajdt-on-eclipse-47-aj9/workspace/org.eclipse.contribution.weaving.jdt.tests/target/surefire.properties

!ENTRY org.eclipse.jdt.launching.macosx 4 0 2017-10-26 20:22:44.857
!MESSAGE FrameworkEvent ERROR
!STACK 0
org.osgi.framework.BundleException: Could not resolve module: org.eclipse.jdt.launching.macosx [217]
  Unresolved requirement: Require-Capability: eclipse.platform; filter:="(osgi.os=macosx)"

	at org.eclipse.osgi.container.Module.start(Module.java:444)
	at org.eclipse.osgi.container.ModuleContainer$ContainerStartLevel.incStartLevel(ModuleContainer.java:1634)
	at org.eclipse.osgi.container.ModuleContainer$ContainerStartLevel.incStartLevel(ModuleContainer.java:1613)
	at org.eclipse.osgi.container.ModuleContainer$ContainerStartLevel.doContainerStartLevel(ModuleContainer.java:1585)
	at org.eclipse.osgi.container.ModuleContainer$ContainerStartLevel.dispatchEvent(ModuleContainer.java:1528)
	at org.eclipse.osgi.container.ModuleContainer$ContainerStartLevel.dispatchEvent(ModuleContainer.java:1)
	at org.eclipse.osgi.framework.eventmgr.EventManager.dispatchEvent(EventManager.java:230)
	at org.eclipse.osgi.framework.eventmgr.EventManager$EventThread.run(EventManager.java:340)

!ENTRY org.eclipse.jdt.launching.ui.macosx 4 0 2017-10-26 20:22:44.858
!MESSAGE FrameworkEvent ERROR
!STACK 0
org.osgi.framework.BundleException: Could not resolve module: org.eclipse.jdt.launching.ui.macosx [218]
  Unresolved requirement: Require-Capability: eclipse.platform; filter:="(osgi.os=macosx)"

	at org.eclipse.osgi.container.Module.start(Module.java:444)
	at org.eclipse.osgi.container.ModuleContainer$ContainerStartLevel.incStartLevel(ModuleContainer.java:1634)
	at org.eclipse.osgi.container.ModuleContainer$ContainerStartLevel.incStartLevel(ModuleContainer.java:1613)
	at org.eclipse.osgi.container.ModuleContainer$ContainerStartLevel.doContainerStartLevel(ModuleContainer.java:1585)
	at org.eclipse.osgi.container.ModuleContainer$ContainerStartLevel.dispatchEvent(ModuleContainer.java:1528)
	at org.eclipse.osgi.container.ModuleContainer$ContainerStartLevel.dispatchEvent(ModuleContainer.java:1)
	at org.eclipse.osgi.framework.eventmgr.EventManager.dispatchEvent(EventManager.java:230)
	at org.eclipse.osgi.framework.eventmgr.EventManager$EventThread.run(EventManager.java:340)
Starting application: 2321
Application Started: 4675

-------------------------------------------------------
 T E S T S
-------------------------------------------------------
Running org.eclipse.contribution.weaving.jdt.tests.AllWeavingTests
# !SESSION 2017-10-26 20:23:31.456
# version: 1.1
# verbose: true
# The following option strings are specified for this debug session:
| main | 2017-10-26 20:23:31.456 | org.eclipse.e4.ui.workbench | /debug | org.eclipse.e4.ui.internal.workbench.WorkbenchLogger | trace | 158 | Ignored attempt to set focus during set focus for: org.eclipse.ui.internal.e4.compatibility.CompatibilityEditor@2d3259ae |
Tests run: 34, Failures: 0, Errors: 0, Skipped: 0, Time elapsed: 86.466 sec - in org.eclipse.contribution.weaving.jdt.tests.AllWeavingTests
testCreateCompilationUnit(org.eclipse.contribution.weaving.jdt.tests.cuprovider.CompilationUnitProviderTests)  Time elapsed: 2.989 sec
testSourceMapping(org.eclipse.contribution.weaving.jdt.tests.sourceprovider.SourceTransformerTests)  Time elapsed: 0.001 sec
testFormatCleanUp(org.eclipse.contribution.weaving.jdt.tests.sourceprovider.SourceTransformerTests)  Time elapsed: 3.204 sec
testTransformCompilationUnit(org.eclipse.contribution.weaving.jdt.tests.sourceprovider.SourceTransformerTests)  Time elapsed: 2.118 sec
testSourceIndexerRequestor(org.eclipse.contribution.weaving.jdt.tests.sourceprovider.SourceTransformerTests)  Time elapsed: 6.832 sec
testImageSelectDebugger(org.eclipse.contribution.weaving.jdt.tests.imagedescriptor.ImageDescriptorSelectorTests)  Time elapsed: 6.49 sec
testImageSelectComputeImage(org.eclipse.contribution.weaving.jdt.tests.imagedescriptor.ImageDescriptorSelectorTests)  Time elapsed: 0.162 sec
testImageSelectDialog(org.eclipse.contribution.weaving.jdt.tests.imagedescriptor.ImageDescriptorSelectorTests)  Time elapsed: 1.09 sec
testImageSelectHierarchy(org.eclipse.contribution.weaving.jdt.tests.imagedescriptor.ImageDescriptorSelectorTests)  Time elapsed: 1.066 sec
testAddHook(org.eclipse.contribution.weaving.jdt.tests.preferences.WeavingStateTests)  Time elapsed: 0.001 sec
testRemoveHookAtMiddle(org.eclipse.contribution.weaving.jdt.tests.preferences.WeavingStateTests)  Time elapsed: 0.001 sec
testRemoveHookWithSecondHookAtEnd(org.eclipse.contribution.weaving.jdt.tests.preferences.WeavingStateTests)  Time elapsed: 0 sec
testAddHookWithSecondHookAtEnd(org.eclipse.contribution.weaving.jdt.tests.preferences.WeavingStateTests)  Time elapsed: 0 sec
testRemoveHookAtStart(org.eclipse.contribution.weaving.jdt.tests.preferences.WeavingStateTests)  Time elapsed: 0.001 sec
testRemoveHookWithSecondHookAtStart(org.eclipse.contribution.weaving.jdt.tests.preferences.WeavingStateTests)  Time elapsed: 0 sec
testAddHookWithSecondHookAtMiddle(org.eclipse.contribution.weaving.jdt.tests.preferences.WeavingStateTests)  Time elapsed: 0 sec
testRemoveHookAtEnd(org.eclipse.contribution.weaving.jdt.tests.preferences.WeavingStateTests)  Time elapsed: 0.001 sec
testRemoveHookWithSecondHookAtMiddle(org.eclipse.contribution.weaving.jdt.tests.preferences.WeavingStateTests)  Time elapsed: 0 sec
testAddHookWithSecondHookAtStart(org.eclipse.contribution.weaving.jdt.tests.preferences.WeavingStateTests)  Time elapsed: 0 sec
testAskToEnableWeaving(org.eclipse.contribution.weaving.jdt.tests.preferences.WeavingServiceEnablementTests)  Time elapsed: 2.006 sec
testFindProblemsInMockProject(org.eclipse.contribution.weaving.jdt.tests.itdawareness.ITDAwarenessTests)  Time elapsed: 4.545 sec
testCodeSelectInJavaProject(org.eclipse.contribution.weaving.jdt.tests.itdawareness.ITDAwarenessTests)  Time elapsed: 2.011 sec
testCodeSelectInMockProject(org.eclipse.contribution.weaving.jdt.tests.itdawareness.ITDAwarenessTests)  Time elapsed: 2.203 sec
testContentAssistInJavaProject(org.eclipse.contribution.weaving.jdt.tests.itdawareness.ITDAwarenessTests)  Time elapsed: 4.603 sec
testContentAssistInMockProject(org.eclipse.contribution.weaving.jdt.tests.itdawareness.ITDAwarenessTests)  Time elapsed: 2.043 sec
testFindProblemsInJavaProject(org.eclipse.contribution.weaving.jdt.tests.itdawareness.ITDAwarenessTests)  Time elapsed: 2.417 sec
testExtractConstantInJava(org.eclipse.contribution.weaving.jdt.tests.refactoring.RefactoringHooksTests)  Time elapsed: 6.365 sec
testExtractConstantInMock(org.eclipse.contribution.weaving.jdt.tests.refactoring.RefactoringHooksTests)  Time elapsed: 5.907 sec
testCreateSourceConvertedAST1(org.eclipse.contribution.weaving.jdt.tests.refactoring.RefactoringHooksTests)  Time elapsed: 2.271 sec
testCreateSourceConvertedAST2(org.eclipse.contribution.weaving.jdt.tests.refactoring.RefactoringHooksTests)  Time elapsed: 1.944 sec
testExtractLocalVariableInJava(org.eclipse.contribution.weaving.jdt.tests.refactoring.RefactoringHooksTests)  Time elapsed: 5.991 sec
testExtractLocalVariableInMock(org.eclipse.contribution.weaving.jdt.tests.refactoring.RefactoringHooksTests)  Time elapsed: 5.586 sec
testConvertLocalInJava(org.eclipse.contribution.weaving.jdt.tests.refactoring.RefactoringHooksTests)  Time elapsed: 5.531 sec
testConvertLocalInMock(org.eclipse.contribution.weaving.jdt.tests.refactoring.RefactoringHooksTests)  Time elapsed: 5.417 sec

Results :

Tests run: 34, Failures: 0, Errors: 0, Skipped: 0


!ENTRY org.eclipse.core.resources 2 10035 2017-10-26 20:24:15.555
!MESSAGE The workspace will exit with unsaved changes in this session.
[INFO] All tests passed!
[INFO] 
[INFO] --- eclipse-jarsigner-plugin:1.0.4:sign (sign) @ org.eclipse.contribution.weaving.jdt.tests ---
[INFO] Signed org.eclipse.ajdt:org.eclipse.contribution.weaving.jdt.tests:eclipse-test-plugin:2.2.4-SNAPSHOT in 0 seconds.
[INFO] 
[INFO] --- tycho-p2-plugin:0.23.1:p2-metadata (p2-metadata) @ org.eclipse.contribution.weaving.jdt.tests ---
[INFO]                                                                         
[INFO] ------------------------------------------------------------------------
[INFO] Building org.eclipse.contribution.xref.core.tests 2.2.4-SNAPSHOT
[INFO] ------------------------------------------------------------------------
[INFO] 
[INFO] --- maven-clean-plugin:2.5:clean (default-clean) @ org.eclipse.contribution.xref.core.tests ---
[INFO] 
[INFO] --- tycho-packaging-plugin:0.23.1:build-qualifier (default-build-qualifier) @ org.eclipse.contribution.xref.core.tests ---
[INFO] The project's OSGi version is 2.2.4.201710262257
[INFO] 
[INFO] --- tycho-packaging-plugin:0.23.1:validate-id (default-validate-id) @ org.eclipse.contribution.xref.core.tests ---
[INFO] 
[INFO] --- tycho-packaging-plugin:0.23.1:validate-version (default-validate-version) @ org.eclipse.contribution.xref.core.tests ---
[INFO] 
[INFO] --- maven-resources-plugin:2.4.3:resources (default-resources) @ org.eclipse.contribution.xref.core.tests ---
[WARNING] Using platform encoding (UTF-8 actually) to copy filtered resources, i.e. build is platform dependent!
[INFO] skip non existing resourceDirectory /jobs/genie.ajdt/ajdt-on-eclipse-47-aj9/workspace/org.eclipse.contribution.xref.core.tests/src/main/resources
[INFO] 
[INFO] --- tycho-compiler-plugin:0.23.1:compile (default-compile) @ org.eclipse.contribution.xref.core.tests ---
[INFO] Compiling 10 source files to /jobs/genie.ajdt/ajdt-on-eclipse-47-aj9/workspace/org.eclipse.contribution.xref.core.tests/target/classes
[INFO] 
[INFO] --- maven-resources-plugin:2.4.3:testResources (default-testResources) @ org.eclipse.contribution.xref.core.tests ---
[WARNING] Using platform encoding (UTF-8 actually) to copy filtered resources, i.e. build is platform dependent!
[INFO] skip non existing resourceDirectory /jobs/genie.ajdt/ajdt-on-eclipse-47-aj9/workspace/org.eclipse.contribution.xref.core.tests/src/test/resources
[INFO] 
[INFO] --- target-platform-configuration:0.23.1:target-platform (default-target-platform) @ org.eclipse.contribution.xref.core.tests ---
[INFO] 
[INFO] --- tycho-packaging-plugin:0.23.1:package-plugin (default-package-plugin) @ org.eclipse.contribution.xref.core.tests ---
[INFO] Building jar: /jobs/genie.ajdt/ajdt-on-eclipse-47-aj9/workspace/org.eclipse.contribution.xref.core.tests/xrefcoretests.jar
[INFO] Building jar: /jobs/genie.ajdt/ajdt-on-eclipse-47-aj9/workspace/org.eclipse.contribution.xref.core.tests/target/org.eclipse.contribution.xref.core.tests-2.2.4-SNAPSHOT.jar
[INFO] 
[INFO] --- tycho-p2-plugin:0.23.1:p2-metadata-default (default-p2-metadata-default) @ org.eclipse.contribution.xref.core.tests ---
[INFO] 
[INFO] --- tycho-surefire-plugin:0.23.1:test (default-test) @ org.eclipse.contribution.xref.core.tests ---
[INFO] Expected eclipse log file: /jobs/genie.ajdt/ajdt-on-eclipse-47-aj9/workspace/org.eclipse.contribution.xref.core.tests/target/work/data/.metadata/.log
[INFO] Command line:
	[/opt/public/common/jdk1.8.0_131.x64/jre/bin/java, -Dosgi.noShutdown=false, -Dosgi.os=linux, -Dosgi.ws=gtk, -Dosgi.arch=x86_64, -Xmx1024m, -XX:MaxPermSize=256m, -Dosgi.clean=true, -jar, /jobs/genie.ajdt/ajdt-on-eclipse-47-aj9/workspace/.maven/repo/p2/osgi/bundle/org.eclipse.equinox.launcher/1.4.0.v20161219-1356/org.eclipse.equinox.launcher-1.4.0.v20161219-1356.jar, -debug, -consolelog, -data, /jobs/genie.ajdt/ajdt-on-eclipse-47-aj9/workspace/org.eclipse.contribution.xref.core.tests/target/work/data, -install, /jobs/genie.ajdt/ajdt-on-eclipse-47-aj9/workspace/org.eclipse.contribution.xref.core.tests/target/work, -configuration, /jobs/genie.ajdt/ajdt-on-eclipse-47-aj9/workspace/org.eclipse.contribution.xref.core.tests/target/work/configuration, -application, org.eclipse.tycho.surefire.osgibooter.uitest, -testproperties, /jobs/genie.ajdt/ajdt-on-eclipse-47-aj9/workspace/org.eclipse.contribution.xref.core.tests/target/surefire.properties]
Java HotSpot(TM) 64-Bit Server VM warning: ignoring option MaxPermSize=256m; support was removed in 8.0
Configuration location:
    file:/jobs/genie.ajdt/ajdt-on-eclipse-47-aj9/workspace/org.eclipse.contribution.xref.core.tests/target/work/configuration/
Configuration file:
    file:/jobs/genie.ajdt/ajdt-on-eclipse-47-aj9/workspace/org.eclipse.contribution.xref.core.tests/target/work/configuration/config.ini loaded
Install location:
    file:/jobs/genie.ajdt/ajdt-on-eclipse-47-aj9/workspace/org.eclipse.contribution.xref.core.tests/target/work/
Framework located:
    file:/home/hudson/genie.ajdt/.hudson/jobs/ajdt-on-eclipse-47-aj9/workspace/.maven/repo/p2/osgi/bundle/org.eclipse.osgi/3.12.50.v20170928-1321/org.eclipse.osgi-3.12.50.v20170928-1321.jar
Framework classpath:
    file:/home/hudson/genie.ajdt/.hudson/jobs/ajdt-on-eclipse-47-aj9/workspace/.maven/repo/p2/osgi/bundle/org.eclipse.osgi/3.12.50.v20170928-1321/org.eclipse.osgi-3.12.50.v20170928-1321.jar
Debug options:
    file:/jobs/genie.ajdt/ajdt-on-eclipse-47-aj9/workspace/org.eclipse.contribution.xref.core.tests/.options not found
Time to load bundles: 769
!SESSION 2017-10-26 20:24:18.064 -----------------------------------------------
eclipse.buildId=unknown
java.version=1.8.0_131
java.vendor=Oracle Corporation
BootLoader constants: OS=linux, ARCH=x86_64, WS=gtk, NL=en_US
Framework arguments:  -application org.eclipse.tycho.surefire.osgibooter.uitest -testproperties /jobs/genie.ajdt/ajdt-on-eclipse-47-aj9/workspace/org.eclipse.contribution.xref.core.tests/target/surefire.properties
Command-line arguments:  -debug -consolelog -data /jobs/genie.ajdt/ajdt-on-eclipse-47-aj9/workspace/org.eclipse.contribution.xref.core.tests/target/work/data -application org.eclipse.tycho.surefire.osgibooter.uitest -testproperties /jobs/genie.ajdt/ajdt-on-eclipse-47-aj9/workspace/org.eclipse.contribution.xref.core.tests/target/surefire.properties

!ENTRY org.eclipse.jdt.launching.macosx 4 0 2017-10-26 20:24:19.563
!MESSAGE FrameworkEvent ERROR
!STACK 0
org.osgi.framework.BundleException: Could not resolve module: org.eclipse.jdt.launching.macosx [216]
  Unresolved requirement: Require-Capability: eclipse.platform; filter:="(osgi.os=macosx)"

	at org.eclipse.osgi.container.Module.start(Module.java:444)
	at org.eclipse.osgi.container.ModuleContainer$ContainerStartLevel.incStartLevel(ModuleContainer.java:1634)
	at org.eclipse.osgi.container.ModuleContainer$ContainerStartLevel.incStartLevel(ModuleContainer.java:1613)
	at org.eclipse.osgi.container.ModuleContainer$ContainerStartLevel.doContainerStartLevel(ModuleContainer.java:1585)
	at org.eclipse.osgi.container.ModuleContainer$ContainerStartLevel.dispatchEvent(ModuleContainer.java:1528)
	at org.eclipse.osgi.container.ModuleContainer$ContainerStartLevel.dispatchEvent(ModuleContainer.java:1)
	at org.eclipse.osgi.framework.eventmgr.EventManager.dispatchEvent(EventManager.java:230)
	at org.eclipse.osgi.framework.eventmgr.EventManager$EventThread.run(EventManager.java:340)

!ENTRY org.eclipse.jdt.launching.ui.macosx 4 0 2017-10-26 20:24:19.565
!MESSAGE FrameworkEvent ERROR
!STACK 0
org.osgi.framework.BundleException: Could not resolve module: org.eclipse.jdt.launching.ui.macosx [217]
  Unresolved requirement: Require-Capability: eclipse.platform; filter:="(osgi.os=macosx)"

	at org.eclipse.osgi.container.Module.start(Module.java:444)
	at org.eclipse.osgi.container.ModuleContainer$ContainerStartLevel.incStartLevel(ModuleContainer.java:1634)
	at org.eclipse.osgi.container.ModuleContainer$ContainerStartLevel.incStartLevel(ModuleContainer.java:1613)
	at org.eclipse.osgi.container.ModuleContainer$ContainerStartLevel.doContainerStartLevel(ModuleContainer.java:1585)
	at org.eclipse.osgi.container.ModuleContainer$ContainerStartLevel.dispatchEvent(ModuleContainer.java:1528)
	at org.eclipse.osgi.container.ModuleContainer$ContainerStartLevel.dispatchEvent(ModuleContainer.java:1)
	at org.eclipse.osgi.framework.eventmgr.EventManager.dispatchEvent(EventManager.java:230)
	at org.eclipse.osgi.framework.eventmgr.EventManager$EventThread.run(EventManager.java:340)
Starting application: 2080
Application Started: 4307

-------------------------------------------------------
 T E S T S
-------------------------------------------------------
Running org.eclipse.contribution.xref.core.tests.AllTests

!ENTRY org.eclipse.contribution.xref.core.tests 4 1 2017-10-26 20:24:22.568
!MESSAGE Testcase generated exception as expected
!STACK 0
java.lang.Throwable
	at org.eclipse.contribution.xref.core.tests.XReferencePluginTest.testLog(XReferencePluginTest.java:45)
	at sun.reflect.NativeMethodAccessorImpl.invoke0(Native Method)
	at sun.reflect.NativeMethodAccessorImpl.invoke(NativeMethodAccessorImpl.java:62)
	at sun.reflect.DelegatingMethodAccessorImpl.invoke(DelegatingMethodAccessorImpl.java:43)
	at java.lang.reflect.Method.invoke(Method.java:498)
	at junit.framework.TestCase.runTest(TestCase.java:176)
	at junit.framework.TestCase.runBare(TestCase.java:141)
	at junit.framework.TestResult$1.protect(TestResult.java:122)
	at junit.framework.TestResult.runProtected(TestResult.java:142)
	at junit.framework.TestResult.run(TestResult.java:125)
	at junit.framework.TestCase.run(TestCase.java:129)
	at junit.framework.TestSuite.runTest(TestSuite.java:252)
	at junit.framework.TestSuite.run(TestSuite.java:247)
	at junit.framework.TestSuite.runTest(TestSuite.java:252)
	at junit.framework.TestSuite.run(TestSuite.java:247)
	at org.junit.internal.runners.JUnit38ClassRunner.run(JUnit38ClassRunner.java:86)
	at org.apache.maven.surefire.junit4.JUnit4Provider.execute(JUnit4Provider.java:264)
	at org.apache.maven.surefire.junit4.JUnit4Provider.executeTestSet(JUnit4Provider.java:153)
	at org.apache.maven.surefire.junit4.JUnit4Provider.invoke(JUnit4Provider.java:124)
	at sun.reflect.NativeMethodAccessorImpl.invoke0(Native Method)
	at sun.reflect.NativeMethodAccessorImpl.invoke(NativeMethodAccessorImpl.java:62)
	at sun.reflect.DelegatingMethodAccessorImpl.invoke(DelegatingMethodAccessorImpl.java:43)
	at java.lang.reflect.Method.invoke(Method.java:498)
	at org.apache.maven.surefire.util.ReflectionUtils.invokeMethodWithArray2(ReflectionUtils.java:208)
	at org.apache.maven.surefire.booter.ProviderFactory$ProviderProxy.invoke(ProviderFactory.java:156)
	at org.apache.maven.surefire.booter.ProviderFactory.invokeProvider(ProviderFactory.java:82)
	at org.eclipse.tycho.surefire.osgibooter.OsgiSurefireBooter.run(OsgiSurefireBooter.java:91)
	at org.eclipse.tycho.surefire.osgibooter.AbstractUITestApplication$1.run(AbstractUITestApplication.java:35)
	at org.eclipse.swt.widgets.RunnableLock.run(RunnableLock.java:37)
	at org.eclipse.swt.widgets.Synchronizer.runAsyncMessages(Synchronizer.java:182)
	at org.eclipse.swt.widgets.Display.runAsyncMessages(Display.java:4497)
	at org.eclipse.swt.widgets.Display.readAndDispatch(Display.java:4110)
	at org.eclipse.e4.ui.internal.workbench.swt.PartRenderingEngine$5.run(PartRenderingEngine.java:1150)
	at org.eclipse.core.databinding.observable.Realm.runWithDefault(Realm.java:336)
	at org.eclipse.e4.ui.internal.workbench.swt.PartRenderingEngine.run(PartRenderingEngine.java:1039)
	at org.eclipse.e4.ui.internal.workbench.E4Workbench.createAndRunUI(E4Workbench.java:153)
	at org.eclipse.ui.internal.Workbench.lambda$3(Workbench.java:680)
	at org.eclipse.core.databinding.observable.Realm.runWithDefault(Realm.java:336)
	at org.eclipse.ui.internal.Workbench.createAndRunWorkbench(Workbench.java:594)
	at org.eclipse.ui.PlatformUI.createAndRunWorkbench(PlatformUI.java:148)
	at org.eclipse.ui.internal.ide.application.IDEApplication.start(IDEApplication.java:151)
	at org.eclipse.tycho.surefire.osgibooter.UITestApplication.runApplication(UITestApplication.java:31)
	at org.eclipse.tycho.surefire.osgibooter.AbstractUITestApplication.run(AbstractUITestApplication.java:120)
	at org.eclipse.tycho.surefire.osgibooter.UITestApplication.start(UITestApplication.java:37)
	at org.eclipse.equinox.internal.app.EclipseAppHandle.run(EclipseAppHandle.java:196)
	at org.eclipse.core.runtime.internal.adaptor.EclipseAppLauncher.runApplication(EclipseAppLauncher.java:134)
	at org.eclipse.core.runtime.internal.adaptor.EclipseAppLauncher.start(EclipseAppLauncher.java:104)
	at org.eclipse.core.runtime.adaptor.EclipseStarter.run(EclipseStarter.java:388)
	at org.eclipse.core.runtime.adaptor.EclipseStarter.run(EclipseStarter.java:243)
	at sun.reflect.NativeMethodAccessorImpl.invoke0(Native Method)
	at sun.reflect.NativeMethodAccessorImpl.invoke(NativeMethodAccessorImpl.java:62)
	at sun.reflect.DelegatingMethodAccessorImpl.invoke(DelegatingMethodAccessorImpl.java:43)
	at java.lang.reflect.Method.invoke(Method.java:498)
	at org.eclipse.equinox.launcher.Main.invokeFramework(Main.java:653)
	at org.eclipse.equinox.launcher.Main.basicRun(Main.java:590)
	at org.eclipse.equinox.launcher.Main.run(Main.java:1499)
	at org.eclipse.equinox.launcher.Main.main(Main.java:1472)

!ENTRY org.eclipse.contribution.xref.core 2 1 2017-10-26 20:24:23.172
!MESSAGE Could not load provider org.eclipse.contribution.xref.core.tests.unknownProvider
!STACK 1
org.eclipse.core.runtime.CoreException: Plug-in org.eclipse.contribution.xref.core.tests was unable to load class org.eclipse.contribution.xref.core.tests.UnknownProvider.
	at org.eclipse.core.internal.registry.osgi.RegistryStrategyOSGI.throwException(RegistryStrategyOSGI.java:194)
	at org.eclipse.core.internal.registry.osgi.RegistryStrategyOSGI.createExecutableExtension(RegistryStrategyOSGI.java:176)
	at org.eclipse.core.internal.registry.ExtensionRegistry.createExecutableExtension(ExtensionRegistry.java:905)
	at org.eclipse.core.internal.registry.ConfigurationElement.createExecutableExtension(ConfigurationElement.java:243)
	at org.eclipse.core.internal.registry.ConfigurationElementHandle.createExecutableExtension(ConfigurationElementHandle.java:55)
	at org.eclipse.contribution.xref.core.XReferenceProviderDefinition.<init>(XReferenceProviderDefinition.java:32)
	at org.eclipse.contribution.xref.core.XReferenceProviderManager.getRegisteredProviders(XReferenceProviderManager.java:95)
	at org.eclipse.contribution.xref.core.XReferenceProviderManager.getProvidersFor(XReferenceProviderManager.java:70)
	at org.eclipse.contribution.xref.core.XReferenceAdapter.getXReferences(XReferenceAdapter.java:67)
	at org.eclipse.contribution.xref.core.tests.XReferenceAdapterTest.testGetXReferences(XReferenceAdapterTest.java:41)
	at sun.reflect.NativeMethodAccessorImpl.invoke0(Native Method)
	at sun.reflect.NativeMethodAccessorImpl.invoke(NativeMethodAccessorImpl.java:62)
	at sun.reflect.DelegatingMethodAccessorImpl.invoke(DelegatingMethodAccessorImpl.java:43)
	at java.lang.reflect.Method.invoke(Method.java:498)
	at junit.framework.TestCase.runTest(TestCase.java:176)
	at junit.framework.TestCase.runBare(TestCase.java:141)
	at junit.framework.TestResult$1.protect(TestResult.java:122)
	at junit.framework.TestResult.runProtected(TestResult.java:142)
	at junit.framework.TestResult.run(TestResult.java:125)
	at junit.framework.TestCase.run(TestCase.java:129)
	at junit.framework.TestSuite.runTest(TestSuite.java:252)
	at junit.framework.TestSuite.run(TestSuite.java:247)
	at junit.framework.TestSuite.runTest(TestSuite.java:252)
	at junit.framework.TestSuite.run(TestSuite.java:247)
	at org.junit.internal.runners.JUnit38ClassRunner.run(JUnit38ClassRunner.java:86)
	at org.apache.maven.surefire.junit4.JUnit4Provider.execute(JUnit4Provider.java:264)
	at org.apache.maven.surefire.junit4.JUnit4Provider.executeTestSet(JUnit4Provider.java:153)
	at org.apache.maven.surefire.junit4.JUnit4Provider.invoke(JUnit4Provider.java:124)
	at sun.reflect.NativeMethodAccessorImpl.invoke0(Native Method)
	at sun.reflect.NativeMethodAccessorImpl.invoke(NativeMethodAccessorImpl.java:62)
	at sun.reflect.DelegatingMethodAccessorImpl.invoke(DelegatingMethodAccessorImpl.java:43)
	at java.lang.reflect.Method.invoke(Method.java:498)
	at org.apache.maven.surefire.util.ReflectionUtils.invokeMethodWithArray2(ReflectionUtils.java:208)
	at org.apache.maven.surefire.booter.ProviderFactory$ProviderProxy.invoke(ProviderFactory.java:156)
	at org.apache.maven.surefire.booter.ProviderFactory.invokeProvider(ProviderFactory.java:82)
	at org.eclipse.tycho.surefire.osgibooter.OsgiSurefireBooter.run(OsgiSurefireBooter.java:91)
	at org.eclipse.tycho.surefire.osgibooter.AbstractUITestApplication$1.run(AbstractUITestApplication.java:35)
	at org.eclipse.swt.widgets.RunnableLock.run(RunnableLock.java:37)
	at org.eclipse.swt.widgets.Synchronizer.runAsyncMessages(Synchronizer.java:182)
	at org.eclipse.swt.widgets.Display.runAsyncMessages(Display.java:4497)
	at org.eclipse.swt.widgets.Display.readAndDispatch(Display.java:4110)
	at org.eclipse.e4.ui.internal.workbench.swt.PartRenderingEngine$5.run(PartRenderingEngine.java:1150)
	at org.eclipse.core.databinding.observable.Realm.runWithDefault(Realm.java:336)
	at org.eclipse.e4.ui.internal.workbench.swt.PartRenderingEngine.run(PartRenderingEngine.java:1039)
	at org.eclipse.e4.ui.internal.workbench.E4Workbench.createAndRunUI(E4Workbench.java:153)
	at org.eclipse.ui.internal.Workbench.lambda$3(Workbench.java:680)
	at org.eclipse.core.databinding.observable.Realm.runWithDefault(Realm.java:336)
	at org.eclipse.ui.internal.Workbench.createAndRunWorkbench(Workbench.java:594)
	at org.eclipse.ui.PlatformUI.createAndRunWorkbench(PlatformUI.java:148)
	at org.eclipse.ui.internal.ide.application.IDEApplication.start(IDEApplication.java:151)
	at org.eclipse.tycho.surefire.osgibooter.UITestApplication.runApplication(UITestApplication.java:31)
	at org.eclipse.tycho.surefire.osgibooter.AbstractUITestApplication.run(AbstractUITestApplication.java:120)
	at org.eclipse.tycho.surefire.osgibooter.UITestApplication.start(UITestApplication.java:37)
	at org.eclipse.equinox.internal.app.EclipseAppHandle.run(EclipseAppHandle.java:196)
	at org.eclipse.core.runtime.internal.adaptor.EclipseAppLauncher.runApplication(EclipseAppLauncher.java:134)
	at org.eclipse.core.runtime.internal.adaptor.EclipseAppLauncher.start(EclipseAppLauncher.java:104)
	at org.eclipse.core.runtime.adaptor.EclipseStarter.run(EclipseStarter.java:388)
	at org.eclipse.core.runtime.adaptor.EclipseStarter.run(EclipseStarter.java:243)
	at sun.reflect.NativeMethodAccessorImpl.invoke0(Native Method)
	at sun.reflect.NativeMethodAccessorImpl.invoke(NativeMethodAccessorImpl.java:62)
	at sun.reflect.DelegatingMethodAccessorImpl.invoke(DelegatingMethodAccessorImpl.java:43)
	at java.lang.reflect.Method.invoke(Method.java:498)
	at org.eclipse.equinox.launcher.Main.invokeFramework(Main.java:653)
	at org.eclipse.equinox.launcher.Main.basicRun(Main.java:590)
	at org.eclipse.equinox.launcher.Main.run(Main.java:1499)
	at org.eclipse.equinox.launcher.Main.main(Main.java:1472)
Caused by: java.lang.ClassNotFoundException: org.eclipse.contribution.xref.core.tests.UnknownProvider cannot be found by org.eclipse.contribution.xref.core.tests_2.2.4.qualifier
	at org.eclipse.osgi.internal.loader.BundleLoader.findClassInternal(BundleLoader.java:484)
	at org.eclipse.osgi.internal.loader.BundleLoader.findClass(BundleLoader.java:395)
	at org.eclipse.osgi.internal.loader.BundleLoader.findClass(BundleLoader.java:387)
	at org.eclipse.osgi.internal.loader.ModuleClassLoader.loadClass(ModuleClassLoader.java:150)
	at java.lang.ClassLoader.loadClass(ClassLoader.java:357)
	at org.eclipse.osgi.internal.framework.EquinoxBundle.loadClass(EquinoxBundle.java:564)
	at org.eclipse.core.internal.registry.osgi.RegistryStrategyOSGI.createExecutableExtension(RegistryStrategyOSGI.java:174)
	... 64 more
!SUBENTRY 1 org.eclipse.equinox.registry 4 1 2017-10-26 20:24:23.174
!MESSAGE Plug-in org.eclipse.contribution.xref.core.tests was unable to load class org.eclipse.contribution.xref.core.tests.UnknownProvider.
!STACK 0
java.lang.ClassNotFoundException: org.eclipse.contribution.xref.core.tests.UnknownProvider cannot be found by org.eclipse.contribution.xref.core.tests_2.2.4.qualifier
	at org.eclipse.osgi.internal.loader.BundleLoader.findClassInternal(BundleLoader.java:484)
	at org.eclipse.osgi.internal.loader.BundleLoader.findClass(BundleLoader.java:395)
	at org.eclipse.osgi.internal.loader.BundleLoader.findClass(BundleLoader.java:387)
	at org.eclipse.osgi.internal.loader.ModuleClassLoader.loadClass(ModuleClassLoader.java:150)
	at java.lang.ClassLoader.loadClass(ClassLoader.java:357)
	at org.eclipse.osgi.internal.framework.EquinoxBundle.loadClass(EquinoxBundle.java:564)
	at org.eclipse.core.internal.registry.osgi.RegistryStrategyOSGI.createExecutableExtension(RegistryStrategyOSGI.java:174)
	at org.eclipse.core.internal.registry.ExtensionRegistry.createExecutableExtension(ExtensionRegistry.java:905)
	at org.eclipse.core.internal.registry.ConfigurationElement.createExecutableExtension(ConfigurationElement.java:243)
	at org.eclipse.core.internal.registry.ConfigurationElementHandle.createExecutableExtension(ConfigurationElementHandle.java:55)
	at org.eclipse.contribution.xref.core.XReferenceProviderDefinition.<init>(XReferenceProviderDefinition.java:32)
	at org.eclipse.contribution.xref.core.XReferenceProviderManager.getRegisteredProviders(XReferenceProviderManager.java:95)
	at org.eclipse.contribution.xref.core.XReferenceProviderManager.getProvidersFor(XReferenceProviderManager.java:70)
	at org.eclipse.contribution.xref.core.XReferenceAdapter.getXReferences(XReferenceAdapter.java:67)
	at org.eclipse.contribution.xref.core.tests.XReferenceAdapterTest.testGetXReferences(XReferenceAdapterTest.java:41)
	at sun.reflect.NativeMethodAccessorImpl.invoke0(Native Method)
	at sun.reflect.NativeMethodAccessorImpl.invoke(NativeMethodAccessorImpl.java:62)
	at sun.reflect.DelegatingMethodAccessorImpl.invoke(DelegatingMethodAccessorImpl.java:43)
	at java.lang.reflect.Method.invoke(Method.java:498)
	at junit.framework.TestCase.runTest(TestCase.java:176)
	at junit.framework.TestCase.runBare(TestCase.java:141)
	at junit.framework.TestResult$1.protect(TestResult.java:122)
	at junit.framework.TestResult.runProtected(TestResult.java:142)
	at junit.framework.TestResult.run(TestResult.java:125)
	at junit.framework.TestCase.run(TestCase.java:129)
	at junit.framework.TestSuite.runTest(TestSuite.java:252)
	at junit.framework.TestSuite.run(TestSuite.java:247)
	at junit.framework.TestSuite.runTest(TestSuite.java:252)
	at junit.framework.TestSuite.run(TestSuite.java:247)
	at org.junit.internal.runners.JUnit38ClassRunner.run(JUnit38ClassRunner.java:86)
	at org.apache.maven.surefire.junit4.JUnit4Provider.execute(JUnit4Provider.java:264)
	at org.apache.maven.surefire.junit4.JUnit4Provider.executeTestSet(JUnit4Provider.java:153)
	at org.apache.maven.surefire.junit4.JUnit4Provider.invoke(JUnit4Provider.java:124)
	at sun.reflect.NativeMethodAccessorImpl.invoke0(Native Method)
	at sun.reflect.NativeMethodAccessorImpl.invoke(NativeMethodAccessorImpl.java:62)
	at sun.reflect.DelegatingMethodAccessorImpl.invoke(DelegatingMethodAccessorImpl.java:43)
	at java.lang.reflect.Method.invoke(Method.java:498)
	at org.apache.maven.surefire.util.ReflectionUtils.invokeMethodWithArray2(ReflectionUtils.java:208)
	at org.apache.maven.surefire.booter.ProviderFactory$ProviderProxy.invoke(ProviderFactory.java:156)
	at org.apache.maven.surefire.booter.ProviderFactory.invokeProvider(ProviderFactory.java:82)
	at org.eclipse.tycho.surefire.osgibooter.OsgiSurefireBooter.run(OsgiSurefireBooter.java:91)
	at org.eclipse.tycho.surefire.osgibooter.AbstractUITestApplication$1.run(AbstractUITestApplication.java:35)
	at org.eclipse.swt.widgets.RunnableLock.run(RunnableLock.java:37)
	at org.eclipse.swt.widgets.Synchronizer.runAsyncMessages(Synchronizer.java:182)
	at org.eclipse.swt.widgets.Display.runAsyncMessages(Display.java:4497)
	at org.eclipse.swt.widgets.Display.readAndDispatch(Display.java:4110)
	at org.eclipse.e4.ui.internal.workbench.swt.PartRenderingEngine$5.run(PartRenderingEngine.java:1150)
	at org.eclipse.core.databinding.observable.Realm.runWithDefault(Realm.java:336)
	at org.eclipse.e4.ui.internal.workbench.swt.PartRenderingEngine.run(PartRenderingEngine.java:1039)
	at org.eclipse.e4.ui.internal.workbench.E4Workbench.createAndRunUI(E4Workbench.java:153)
	at org.eclipse.ui.internal.Workbench.lambda$3(Workbench.java:680)
	at org.eclipse.core.databinding.observable.Realm.runWithDefault(Realm.java:336)
	at org.eclipse.ui.internal.Workbench.createAndRunWorkbench(Workbench.java:594)
	at org.eclipse.ui.PlatformUI.createAndRunWorkbench(PlatformUI.java:148)
	at org.eclipse.ui.internal.ide.application.IDEApplication.start(IDEApplication.java:151)
	at org.eclipse.tycho.surefire.osgibooter.UITestApplication.runApplication(UITestApplication.java:31)
	at org.eclipse.tycho.surefire.osgibooter.AbstractUITestApplication.run(AbstractUITestApplication.java:120)
	at org.eclipse.tycho.surefire.osgibooter.UITestApplication.start(UITestApplication.java:37)
	at org.eclipse.equinox.internal.app.EclipseAppHandle.run(EclipseAppHandle.java:196)
	at org.eclipse.core.runtime.internal.adaptor.EclipseAppLauncher.runApplication(EclipseAppLauncher.java:134)
	at org.eclipse.core.runtime.internal.adaptor.EclipseAppLauncher.start(EclipseAppLauncher.java:104)
	at org.eclipse.core.runtime.adaptor.EclipseStarter.run(EclipseStarter.java:388)
	at org.eclipse.core.runtime.adaptor.EclipseStarter.run(EclipseStarter.java:243)
	at sun.reflect.NativeMethodAccessorImpl.invoke0(Native Method)
	at sun.reflect.NativeMethodAccessorImpl.invoke(NativeMethodAccessorImpl.java:62)
	at sun.reflect.DelegatingMethodAccessorImpl.invoke(DelegatingMethodAccessorImpl.java:43)
	at java.lang.reflect.Method.invoke(Method.java:498)
	at org.eclipse.equinox.launcher.Main.invokeFramework(Main.java:653)
	at org.eclipse.equinox.launcher.Main.basicRun(Main.java:590)
	at org.eclipse.equinox.launcher.Main.run(Main.java:1499)
	at org.eclipse.equinox.launcher.Main.main(Main.java:1472)

!ENTRY org.eclipse.contribution.xref.core 4 2 2017-10-26 20:24:23.182
!MESSAGE Problems occurred when invoking code from plug-in: "org.eclipse.contribution.xref.core".
!STACK 0
java.lang.RuntimeException: You should never trust a provider you know...
	at org.eclipse.contribution.xref.core.tests.TestProvider.getProviderDescription(TestProvider.java:81)
	at org.eclipse.contribution.xref.core.XReferenceProviderDefinition.getProviderDescription_aroundBody0(XReferenceProviderDefinition.java:75)
	at org.eclipse.contribution.xref.core.XReferenceProviderDefinition$AjcClosure1.run(XReferenceProviderDefinition.java:1)
	at org.eclipse.contribution.xref.core.IXReferenceProvider$SafeExecution.ajc$around$org_eclipse_contribution_xref_core_IXReferenceProvider$SafeExecution$1$b538bdbdproceed(IXReferenceProvider.aj:133)
	at org.eclipse.contribution.xref.core.IXReferenceProvider$SafeExecution$1.run(IXReferenceProvider.aj:140)
	at org.eclipse.core.runtime.SafeRunner.run(SafeRunner.java:42)
	at org.eclipse.contribution.xref.core.IXReferenceProvider$SafeExecution.ajc$around$org_eclipse_contribution_xref_core_IXReferenceProvider$SafeExecution$1$b538bdbd(IXReferenceProvider.aj:146)
	at org.eclipse.contribution.xref.core.XReferenceProviderDefinition.getDescription(XReferenceProviderDefinition.java:75)
	at org.eclipse.contribution.xref.core.tests.XReferenceProviderDefinitionTest.testSafeExecution(XReferenceProviderDefinitionTest.java:78)
	at sun.reflect.NativeMethodAccessorImpl.invoke0(Native Method)
	at sun.reflect.NativeMethodAccessorImpl.invoke(NativeMethodAccessorImpl.java:62)
	at sun.reflect.DelegatingMethodAccessorImpl.invoke(DelegatingMethodAccessorImpl.java:43)
	at java.lang.reflect.Method.invoke(Method.java:498)
	at junit.framework.TestCase.runTest(TestCase.java:176)
	at junit.framework.TestCase.runBare(TestCase.java:141)
	at junit.framework.TestResult$1.protect(TestResult.java:122)
	at junit.framework.TestResult.runProtected(TestResult.java:142)
	at junit.framework.TestResult.run(TestResult.java:125)
	at junit.framework.TestCase.run(TestCase.java:129)
	at junit.framework.TestSuite.runTest(TestSuite.java:252)
	at junit.framework.TestSuite.run(TestSuite.java:247)
	at junit.framework.TestSuite.runTest(TestSuite.java:252)
	at junit.framework.TestSuite.run(TestSuite.java:247)
	at org.junit.internal.runners.JUnit38ClassRunner.run(JUnit38ClassRunner.java:86)
	at org.apache.maven.surefire.junit4.JUnit4Provider.execute(JUnit4Provider.java:264)
	at org.apache.maven.surefire.junit4.JUnit4Provider.executeTestSet(JUnit4Provider.java:153)
	at org.apache.maven.surefire.junit4.JUnit4Provider.invoke(JUnit4Provider.java:124)
	at sun.reflect.NativeMethodAccessorImpl.invoke0(Native Method)
	at sun.reflect.NativeMethodAccessorImpl.invoke(NativeMethodAccessorImpl.java:62)
	at sun.reflect.DelegatingMethodAccessorImpl.invoke(DelegatingMethodAccessorImpl.java:43)
	at java.lang.reflect.Method.invoke(Method.java:498)
	at org.apache.maven.surefire.util.ReflectionUtils.invokeMethodWithArray2(ReflectionUtils.java:208)
	at org.apache.maven.surefire.booter.ProviderFactory$ProviderProxy.invoke(ProviderFactory.java:156)
	at org.apache.maven.surefire.booter.ProviderFactory.invokeProvider(ProviderFactory.java:82)
	at org.eclipse.tycho.surefire.osgibooter.OsgiSurefireBooter.run(OsgiSurefireBooter.java:91)
	at org.eclipse.tycho.surefire.osgibooter.AbstractUITestApplication$1.run(AbstractUITestApplication.java:35)
	at org.eclipse.swt.widgets.RunnableLock.run(RunnableLock.java:37)
	at org.eclipse.swt.widgets.Synchronizer.runAsyncMessages(Synchronizer.java:182)
	at org.eclipse.swt.widgets.Display.runAsyncMessages(Display.java:4497)
	at org.eclipse.swt.widgets.Display.readAndDispatch(Display.java:4110)
	at org.eclipse.e4.ui.internal.workbench.swt.PartRenderingEngine$5.run(PartRenderingEngine.java:1150)
	at org.eclipse.core.databinding.observable.Realm.runWithDefault(Realm.java:336)
	at org.eclipse.e4.ui.internal.workbench.swt.PartRenderingEngine.run(PartRenderingEngine.java:1039)
	at org.eclipse.e4.ui.internal.workbench.E4Workbench.createAndRunUI(E4Workbench.java:153)
	at org.eclipse.ui.internal.Workbench.lambda$3(Workbench.java:680)
	at org.eclipse.core.databinding.observable.Realm.runWithDefault(Realm.java:336)
	at org.eclipse.ui.internal.Workbench.createAndRunWorkbench(Workbench.java:594)
	at org.eclipse.ui.PlatformUI.createAndRunWorkbench(PlatformUI.java:148)
	at org.eclipse.ui.internal.ide.application.IDEApplication.start(IDEApplication.java:151)
	at org.eclipse.tycho.surefire.osgibooter.UITestApplication.runApplication(UITestApplication.java:31)
	at org.eclipse.tycho.surefire.osgibooter.AbstractUITestApplication.run(AbstractUITestApplication.java:120)
	at org.eclipse.tycho.surefire.osgibooter.UITestApplication.start(UITestApplication.java:37)
	at org.eclipse.equinox.internal.app.EclipseAppHandle.run(EclipseAppHandle.java:196)
	at org.eclipse.core.runtime.internal.adaptor.EclipseAppLauncher.runApplication(EclipseAppLauncher.java:134)
	at org.eclipse.core.runtime.internal.adaptor.EclipseAppLauncher.start(EclipseAppLauncher.java:104)
	at org.eclipse.core.runtime.adaptor.EclipseStarter.run(EclipseStarter.java:388)
	at org.eclipse.core.runtime.adaptor.EclipseStarter.run(EclipseStarter.java:243)
	at sun.reflect.NativeMethodAccessorImpl.invoke0(Native Method)
	at sun.reflect.NativeMethodAccessorImpl.invoke(NativeMethodAccessorImpl.java:62)
	at sun.reflect.DelegatingMethodAccessorImpl.invoke(DelegatingMethodAccessorImpl.java:43)
	at java.lang.reflect.Method.invoke(Method.java:498)
	at org.eclipse.equinox.launcher.Main.invokeFramework(Main.java:653)
	at org.eclipse.equinox.launcher.Main.basicRun(Main.java:590)
	at org.eclipse.equinox.launcher.Main.run(Main.java:1499)
	at org.eclipse.equinox.launcher.Main.main(Main.java:1472)
Tests run: 23, Failures: 4, Errors: 0, Skipped: 0, Time elapsed: 0.639 sec <<< FAILURE! - in org.eclipse.contribution.xref.core.tests.AllTests
testLog(org.eclipse.contribution.xref.core.tests.XReferencePluginTest)  Time elapsed: 0.012 sec
testPluginID(org.eclipse.contribution.xref.core.tests.XReferencePluginTest)  Time elapsed: 0 sec
testGetDefault(org.eclipse.contribution.xref.core.tests.XReferencePluginTest)  Time elapsed: 0 sec
testAddAssociate(org.eclipse.contribution.xref.core.tests.XReferenceTest)  Time elapsed: 0.001 sec
testRemoveAssociate(org.eclipse.contribution.xref.core.tests.XReferenceTest)  Time elapsed: 0.001 sec
testXReferenceString(org.eclipse.contribution.xref.core.tests.XReferenceTest)  Time elapsed: 0 sec
testXReferenceStringSet(org.eclipse.contribution.xref.core.tests.XReferenceTest)  Time elapsed: 0 sec
testGetAdapterList(org.eclipse.contribution.xref.core.tests.XReferenceAdapterFactoryTest)  Time elapsed: 0.001 sec
testGetWrongAdapter(org.eclipse.contribution.xref.core.tests.XReferenceAdapterFactoryTest)  Time elapsed: 0 sec
testGetAdapter(org.eclipse.contribution.xref.core.tests.XReferenceAdapterFactoryTest)  Time elapsed: 0.002 sec  <<< FAILURE!
junit.framework.AssertionFailedError: null
	at junit.framework.Assert.fail(Assert.java:55)
	at junit.framework.Assert.assertTrue(Assert.java:22)
	at junit.framework.Assert.assertNotNull(Assert.java:256)
	at junit.framework.Assert.assertNotNull(Assert.java:248)
	at junit.framework.TestCase.assertNotNull(TestCase.java:417)
	at org.eclipse.contribution.xref.core.tests.XReferenceAdapterFactoryTest.testGetAdapter(XReferenceAdapterFactoryTest.java:50)

testGetReferenceSource(org.eclipse.contribution.xref.core.tests.XReferenceAdapterTest)  Time elapsed: 0.002 sec
testGetXReferences(org.eclipse.contribution.xref.core.tests.XReferenceAdapterTest)  Time elapsed: 0.588 sec  <<< FAILURE!
junit.framework.AssertionFailedError: expected:<1> but was:<0>
	at junit.framework.Assert.fail(Assert.java:57)
	at junit.framework.Assert.failNotEquals(Assert.java:329)
	at junit.framework.Assert.assertEquals(Assert.java:78)
	at junit.framework.Assert.assertEquals(Assert.java:234)
	at junit.framework.Assert.assertEquals(Assert.java:241)
	at junit.framework.TestCase.assertEquals(TestCase.java:409)
	at org.eclipse.contribution.xref.core.tests.XReferenceAdapterTest.testGetXReferences(XReferenceAdapterTest.java:45)

testSettingOfIsInplace(org.eclipse.contribution.xref.core.tests.XReferenceProviderManagerTest)  Time elapsed: 0 sec
testGetRegisteredProviders(org.eclipse.contribution.xref.core.tests.XReferenceProviderManagerTest)  Time elapsed: 0.001 sec  <<< FAILURE!
junit.framework.AssertionFailedError: null
	at junit.framework.Assert.fail(Assert.java:55)
	at junit.framework.Assert.assertTrue(Assert.java:22)
	at junit.framework.Assert.assertTrue(Assert.java:31)
	at junit.framework.TestCase.assertTrue(TestCase.java:201)
	at org.eclipse.contribution.xref.core.tests.XReferenceProviderManagerTest.testGetRegisteredProviders(XReferenceProviderManagerTest.java:73)

testGetProvidersFor(org.eclipse.contribution.xref.core.tests.XReferenceProviderManagerTest)  Time elapsed: 0.001 sec  <<< FAILURE!
junit.framework.AssertionFailedError: expected:<1> but was:<0>
	at junit.framework.Assert.fail(Assert.java:57)
	at junit.framework.Assert.failNotEquals(Assert.java:329)
	at junit.framework.Assert.assertEquals(Assert.java:78)
	at junit.framework.Assert.assertEquals(Assert.java:234)
	at junit.framework.Assert.assertEquals(Assert.java:241)
	at junit.framework.TestCase.assertEquals(TestCase.java:409)
	at org.eclipse.contribution.xref.core.tests.XReferenceProviderManagerTest.testGetProvidersFor(XReferenceProviderManagerTest.java:58)

testGetManager(org.eclipse.contribution.xref.core.tests.XReferenceProviderManagerTest)  Time elapsed: 0 sec
testGetLabel(org.eclipse.contribution.xref.core.tests.XReferenceProviderDefinitionTest)  Time elapsed: 0.001 sec
testGetID(org.eclipse.contribution.xref.core.tests.XReferenceProviderDefinitionTest)  Time elapsed: 0 sec
testSetCheckedInplaceFilters(org.eclipse.contribution.xref.core.tests.XReferenceProviderDefinitionTest)  Time elapsed: 0 sec
testIsAndSetEnabled(org.eclipse.contribution.xref.core.tests.XReferenceProviderDefinitionTest)  Time elapsed: 0 sec
testGetDescription(org.eclipse.contribution.xref.core.tests.XReferenceProviderDefinitionTest)  Time elapsed: 0 sec
testSetCheckedFilters(org.eclipse.contribution.xref.core.tests.XReferenceProviderDefinitionTest)  Time elapsed: 0 sec
testSafeExecution(org.eclipse.contribution.xref.core.tests.XReferenceProviderDefinitionTest)  Time elapsed: 0.002 sec

Results :

Failed tests: 
  XReferenceAdapterFactoryTest.testGetAdapter:50 null
  XReferenceAdapterTest.testGetXReferences:45 expected:<1> but was:<0>
  XReferenceProviderManagerTest.testGetRegisteredProviders:73 null
  XReferenceProviderManagerTest.testGetProvidersFor:58 expected:<1> but was:<0>

Tests run: 23, Failures: 4, Errors: 0, Skipped: 0

[ERROR] There are test failures.

Please refer to /jobs/genie.ajdt/ajdt-on-eclipse-47-aj9/workspace/org.eclipse.contribution.xref.core.tests/target/surefire-reports for the individual test results.
[INFO] 
[INFO] --- eclipse-jarsigner-plugin:1.0.4:sign (sign) @ org.eclipse.contribution.xref.core.tests ---
[INFO] Signed org.eclipse.ajdt:org.eclipse.contribution.xref.core.tests:eclipse-test-plugin:2.2.4-SNAPSHOT in 0 seconds.
[INFO] 
[INFO] --- tycho-p2-plugin:0.23.1:p2-metadata (p2-metadata) @ org.eclipse.contribution.xref.core.tests ---
[INFO]                                                                         
[INFO] ------------------------------------------------------------------------
[INFO] Building org.eclipse.contribution.xref.ui.tests 2.2.4-SNAPSHOT
[INFO] ------------------------------------------------------------------------
[INFO] 
[INFO] --- maven-clean-plugin:2.5:clean (default-clean) @ org.eclipse.contribution.xref.ui.tests ---
[INFO] 
[INFO] --- tycho-packaging-plugin:0.23.1:build-qualifier (default-build-qualifier) @ org.eclipse.contribution.xref.ui.tests ---
[INFO] The project's OSGi version is 2.2.4.201710262257
[INFO] 
[INFO] --- tycho-packaging-plugin:0.23.1:validate-id (default-validate-id) @ org.eclipse.contribution.xref.ui.tests ---
[INFO] 
[INFO] --- tycho-packaging-plugin:0.23.1:validate-version (default-validate-version) @ org.eclipse.contribution.xref.ui.tests ---
[INFO] 
[INFO] --- maven-resources-plugin:2.4.3:resources (default-resources) @ org.eclipse.contribution.xref.ui.tests ---
[WARNING] Using platform encoding (UTF-8 actually) to copy filtered resources, i.e. build is platform dependent!
[INFO] skip non existing resourceDirectory /jobs/genie.ajdt/ajdt-on-eclipse-47-aj9/workspace/org.eclipse.contribution.xref.ui.tests/src/main/resources
[INFO] 
[INFO] --- tycho-compiler-plugin:0.23.1:compile (default-compile) @ org.eclipse.contribution.xref.ui.tests ---
[INFO] Compiling 7 source files to /jobs/genie.ajdt/ajdt-on-eclipse-47-aj9/workspace/org.eclipse.contribution.xref.ui.tests/target/classes
[INFO] 
[INFO] --- maven-resources-plugin:2.4.3:testResources (default-testResources) @ org.eclipse.contribution.xref.ui.tests ---
[WARNING] Using platform encoding (UTF-8 actually) to copy filtered resources, i.e. build is platform dependent!
[INFO] skip non existing resourceDirectory /jobs/genie.ajdt/ajdt-on-eclipse-47-aj9/workspace/org.eclipse.contribution.xref.ui.tests/src/test/resources
[INFO] 
[INFO] --- target-platform-configuration:0.23.1:target-platform (default-target-platform) @ org.eclipse.contribution.xref.ui.tests ---
[INFO] 
[INFO] --- tycho-packaging-plugin:0.23.1:package-plugin (default-package-plugin) @ org.eclipse.contribution.xref.ui.tests ---
[INFO] Building jar: /jobs/genie.ajdt/ajdt-on-eclipse-47-aj9/workspace/org.eclipse.contribution.xref.ui.tests/xrefuitests.jar
[INFO] Building jar: /jobs/genie.ajdt/ajdt-on-eclipse-47-aj9/workspace/org.eclipse.contribution.xref.ui.tests/target/org.eclipse.contribution.xref.ui.tests-2.2.4-SNAPSHOT.jar
[INFO] 
[INFO] --- tycho-p2-plugin:0.23.1:p2-metadata-default (default-p2-metadata-default) @ org.eclipse.contribution.xref.ui.tests ---
[INFO] 
[INFO] --- tycho-surefire-plugin:0.23.1:test (default-test) @ org.eclipse.contribution.xref.ui.tests ---
[INFO] Expected eclipse log file: /jobs/genie.ajdt/ajdt-on-eclipse-47-aj9/workspace/org.eclipse.contribution.xref.ui.tests/target/work/data/.metadata/.log
[INFO] Command line:
	[/opt/public/common/jdk1.8.0_131.x64/jre/bin/java, -Dosgi.noShutdown=false, -Dosgi.os=linux, -Dosgi.ws=gtk, -Dosgi.arch=x86_64, -Xmx1024m, -XX:MaxPermSize=256m, -Dosgi.clean=true, -jar, /jobs/genie.ajdt/ajdt-on-eclipse-47-aj9/workspace/.maven/repo/p2/osgi/bundle/org.eclipse.equinox.launcher/1.4.0.v20161219-1356/org.eclipse.equinox.launcher-1.4.0.v20161219-1356.jar, -debug, -consolelog, -data, /jobs/genie.ajdt/ajdt-on-eclipse-47-aj9/workspace/org.eclipse.contribution.xref.ui.tests/target/work/data, -install, /jobs/genie.ajdt/ajdt-on-eclipse-47-aj9/workspace/org.eclipse.contribution.xref.ui.tests/target/work, -configuration, /jobs/genie.ajdt/ajdt-on-eclipse-47-aj9/workspace/org.eclipse.contribution.xref.ui.tests/target/work/configuration, -application, org.eclipse.tycho.surefire.osgibooter.uitest, -testproperties, /jobs/genie.ajdt/ajdt-on-eclipse-47-aj9/workspace/org.eclipse.contribution.xref.ui.tests/target/surefire.properties]
Java HotSpot(TM) 64-Bit Server VM warning: ignoring option MaxPermSize=256m; support was removed in 8.0
Configuration location:
    file:/jobs/genie.ajdt/ajdt-on-eclipse-47-aj9/workspace/org.eclipse.contribution.xref.ui.tests/target/work/configuration/
Configuration file:
    file:/jobs/genie.ajdt/ajdt-on-eclipse-47-aj9/workspace/org.eclipse.contribution.xref.ui.tests/target/work/configuration/config.ini loaded
Install location:
    file:/jobs/genie.ajdt/ajdt-on-eclipse-47-aj9/workspace/org.eclipse.contribution.xref.ui.tests/target/work/
Framework located:
    file:/home/hudson/genie.ajdt/.hudson/jobs/ajdt-on-eclipse-47-aj9/workspace/.maven/repo/p2/osgi/bundle/org.eclipse.osgi/3.12.50.v20170928-1321/org.eclipse.osgi-3.12.50.v20170928-1321.jar
Framework classpath:
    file:/home/hudson/genie.ajdt/.hudson/jobs/ajdt-on-eclipse-47-aj9/workspace/.maven/repo/p2/osgi/bundle/org.eclipse.osgi/3.12.50.v20170928-1321/org.eclipse.osgi-3.12.50.v20170928-1321.jar
Debug options:
    file:/jobs/genie.ajdt/ajdt-on-eclipse-47-aj9/workspace/org.eclipse.contribution.xref.ui.tests/.options not found
Time to load bundles: 762
!SESSION 2017-10-26 20:24:26.795 -----------------------------------------------
eclipse.buildId=unknown
java.version=1.8.0_131
java.vendor=Oracle Corporation
BootLoader constants: OS=linux, ARCH=x86_64, WS=gtk, NL=en_US
Framework arguments:  -application org.eclipse.tycho.surefire.osgibooter.uitest -testproperties /jobs/genie.ajdt/ajdt-on-eclipse-47-aj9/workspace/org.eclipse.contribution.xref.ui.tests/target/surefire.properties
Command-line arguments:  -debug -consolelog -data /jobs/genie.ajdt/ajdt-on-eclipse-47-aj9/workspace/org.eclipse.contribution.xref.ui.tests/target/work/data -application org.eclipse.tycho.surefire.osgibooter.uitest -testproperties /jobs/genie.ajdt/ajdt-on-eclipse-47-aj9/workspace/org.eclipse.contribution.xref.ui.tests/target/surefire.properties

!ENTRY org.eclipse.jdt.launching.macosx 4 0 2017-10-26 20:24:28.288
!MESSAGE FrameworkEvent ERROR
!STACK 0
org.osgi.framework.BundleException: Could not resolve module: org.eclipse.jdt.launching.macosx [217]
  Unresolved requirement: Require-Capability: eclipse.platform; filter:="(osgi.os=macosx)"

	at org.eclipse.osgi.container.Module.start(Module.java:444)
	at org.eclipse.osgi.container.ModuleContainer$ContainerStartLevel.incStartLevel(ModuleContainer.java:1634)
	at org.eclipse.osgi.container.ModuleContainer$ContainerStartLevel.incStartLevel(ModuleContainer.java:1613)
	at org.eclipse.osgi.container.ModuleContainer$ContainerStartLevel.doContainerStartLevel(ModuleContainer.java:1585)
	at org.eclipse.osgi.container.ModuleContainer$ContainerStartLevel.dispatchEvent(ModuleContainer.java:1528)
	at org.eclipse.osgi.container.ModuleContainer$ContainerStartLevel.dispatchEvent(ModuleContainer.java:1)
	at org.eclipse.osgi.framework.eventmgr.EventManager.dispatchEvent(EventManager.java:230)
	at org.eclipse.osgi.framework.eventmgr.EventManager$EventThread.run(EventManager.java:340)

!ENTRY org.eclipse.jdt.launching.ui.macosx 4 0 2017-10-26 20:24:28.290
!MESSAGE FrameworkEvent ERROR
!STACK 0
org.osgi.framework.BundleException: Could not resolve module: org.eclipse.jdt.launching.ui.macosx [218]
  Unresolved requirement: Require-Capability: eclipse.platform; filter:="(osgi.os=macosx)"

	at org.eclipse.osgi.container.Module.start(Module.java:444)
	at org.eclipse.osgi.container.ModuleContainer$ContainerStartLevel.incStartLevel(ModuleContainer.java:1634)
	at org.eclipse.osgi.container.ModuleContainer$ContainerStartLevel.incStartLevel(ModuleContainer.java:1613)
	at org.eclipse.osgi.container.ModuleContainer$ContainerStartLevel.doContainerStartLevel(ModuleContainer.java:1585)
	at org.eclipse.osgi.container.ModuleContainer$ContainerStartLevel.dispatchEvent(ModuleContainer.java:1528)
	at org.eclipse.osgi.container.ModuleContainer$ContainerStartLevel.dispatchEvent(ModuleContainer.java:1)
	at org.eclipse.osgi.framework.eventmgr.EventManager.dispatchEvent(EventManager.java:230)
	at org.eclipse.osgi.framework.eventmgr.EventManager$EventThread.run(EventManager.java:340)
Starting application: 2057
Application Started: 4243

-------------------------------------------------------
 T E S T S
-------------------------------------------------------
Running org.eclipse.contribution.xref.ui.tests.AllTests

!ENTRY org.eclipse.contribution.xref.core 2 1 2017-10-26 20:24:33.216
!MESSAGE Could not load provider org.eclipse.contribution.xref.core.tests.unknownProvider
!STACK 1
org.eclipse.core.runtime.CoreException: Plug-in org.eclipse.contribution.xref.core.tests was unable to load class org.eclipse.contribution.xref.core.tests.UnknownProvider.
	at org.eclipse.core.internal.registry.osgi.RegistryStrategyOSGI.throwException(RegistryStrategyOSGI.java:194)
	at org.eclipse.core.internal.registry.osgi.RegistryStrategyOSGI.createExecutableExtension(RegistryStrategyOSGI.java:176)
	at org.eclipse.core.internal.registry.ExtensionRegistry.createExecutableExtension(ExtensionRegistry.java:905)
	at org.eclipse.core.internal.registry.ConfigurationElement.createExecutableExtension(ConfigurationElement.java:243)
	at org.eclipse.core.internal.registry.ConfigurationElementHandle.createExecutableExtension(ConfigurationElementHandle.java:55)
	at org.eclipse.contribution.xref.core.XReferenceProviderDefinition.<init>(XReferenceProviderDefinition.java:32)
	at org.eclipse.contribution.xref.core.XReferenceProviderManager.getRegisteredProviders(XReferenceProviderManager.java:95)
	at org.eclipse.contribution.xref.internal.ui.actions.XReferenceCustomFilterAction.<init>(XReferenceCustomFilterAction.java:58)
	at org.eclipse.contribution.xref.ui.views.XReferenceView.makeActions(XReferenceView.java:458)
	at org.eclipse.contribution.xref.ui.views.XReferenceView.createPartControl(XReferenceView.java:117)
	at org.eclipse.ui.internal.e4.compatibility.CompatibilityPart.createPartControl(CompatibilityPart.java:151)
	at org.eclipse.ui.internal.e4.compatibility.CompatibilityView.createPartControl(CompatibilityView.java:147)
	at org.eclipse.ui.internal.e4.compatibility.CompatibilityPart.create(CompatibilityPart.java:355)
	at sun.reflect.NativeMethodAccessorImpl.invoke0(Native Method)
	at sun.reflect.NativeMethodAccessorImpl.invoke(NativeMethodAccessorImpl.java:62)
	at sun.reflect.DelegatingMethodAccessorImpl.invoke(DelegatingMethodAccessorImpl.java:43)
	at java.lang.reflect.Method.invoke(Method.java:498)
	at org.eclipse.e4.core.internal.di.MethodRequestor.execute(MethodRequestor.java:55)
	at org.eclipse.e4.core.internal.di.InjectorImpl.processAnnotated(InjectorImpl.java:990)
	at org.eclipse.e4.core.internal.di.InjectorImpl.processAnnotated(InjectorImpl.java:955)
	at org.eclipse.e4.core.internal.di.InjectorImpl.inject(InjectorImpl.java:124)
	at org.eclipse.e4.core.internal.di.InjectorImpl.internalMake(InjectorImpl.java:399)
	at org.eclipse.e4.core.internal.di.InjectorImpl.make(InjectorImpl.java:318)
	at org.eclipse.e4.core.contexts.ContextInjectionFactory.make(ContextInjectionFactory.java:162)
	at org.eclipse.e4.ui.internal.workbench.ReflectionContributionFactory.createFromBundle(ReflectionContributionFactory.java:105)
	at org.eclipse.e4.ui.internal.workbench.ReflectionContributionFactory.doCreate(ReflectionContributionFactory.java:74)
	at org.eclipse.e4.ui.internal.workbench.ReflectionContributionFactory.create(ReflectionContributionFactory.java:56)
	at org.eclipse.e4.ui.workbench.renderers.swt.ContributedPartRenderer.createWidget(ContributedPartRenderer.java:129)
	at org.eclipse.e4.ui.internal.workbench.swt.PartRenderingEngine.createWidget(PartRenderingEngine.java:992)
	at org.eclipse.e4.ui.internal.workbench.swt.PartRenderingEngine.safeCreateGui(PartRenderingEngine.java:661)
	at org.eclipse.e4.ui.internal.workbench.swt.PartRenderingEngine$1.run(PartRenderingEngine.java:546)
	at org.eclipse.core.runtime.SafeRunner.run(SafeRunner.java:42)
	at org.eclipse.e4.ui.internal.workbench.swt.PartRenderingEngine.createGui(PartRenderingEngine.java:530)
	at org.eclipse.e4.ui.workbench.renderers.swt.ElementReferenceRenderer.createWidget(ElementReferenceRenderer.java:70)
	at org.eclipse.e4.ui.internal.workbench.swt.PartRenderingEngine.createWidget(PartRenderingEngine.java:992)
	at org.eclipse.e4.ui.internal.workbench.swt.PartRenderingEngine.safeCreateGui(PartRenderingEngine.java:661)
	at org.eclipse.e4.ui.internal.workbench.swt.PartRenderingEngine.safeCreateGui(PartRenderingEngine.java:767)
	at org.eclipse.e4.ui.internal.workbench.swt.PartRenderingEngine.access$0(PartRenderingEngine.java:738)
	at org.eclipse.e4.ui.internal.workbench.swt.PartRenderingEngine$2.run(PartRenderingEngine.java:732)
	at org.eclipse.core.runtime.SafeRunner.run(SafeRunner.java:42)
	at org.eclipse.e4.ui.internal.workbench.swt.PartRenderingEngine.createGui(PartRenderingEngine.java:716)
	at org.eclipse.e4.ui.internal.workbench.PartServiceImpl$1.handleEvent(PartServiceImpl.java:109)
	at org.eclipse.e4.ui.services.internal.events.UIEventHandler$1.run(UIEventHandler.java:40)
	at org.eclipse.swt.widgets.Synchronizer.syncExec(Synchronizer.java:233)
	at org.eclipse.ui.internal.UISynchronizer.syncExec(UISynchronizer.java:144)
	at org.eclipse.swt.widgets.Display.syncExec(Display.java:5455)
	at org.eclipse.e4.ui.internal.workbench.swt.E4Application$1.syncExec(E4Application.java:212)
	at org.eclipse.e4.ui.services.internal.events.UIEventHandler.handleEvent(UIEventHandler.java:36)
	at org.eclipse.equinox.internal.event.EventHandlerWrapper.handleEvent(EventHandlerWrapper.java:201)
	at org.eclipse.equinox.internal.event.EventHandlerTracker.dispatchEvent(EventHandlerTracker.java:197)
	at org.eclipse.equinox.internal.event.EventHandlerTracker.dispatchEvent(EventHandlerTracker.java:1)
	at org.eclipse.osgi.framework.eventmgr.EventManager.dispatchEvent(EventManager.java:230)
	at org.eclipse.osgi.framework.eventmgr.ListenerQueue.dispatchEventSynchronous(ListenerQueue.java:148)
	at org.eclipse.equinox.internal.event.EventAdminImpl.dispatchEvent(EventAdminImpl.java:135)
	at org.eclipse.equinox.internal.event.EventAdminImpl.sendEvent(EventAdminImpl.java:78)
	at org.eclipse.equinox.internal.event.EventComponent.sendEvent(EventComponent.java:39)
	at org.eclipse.e4.ui.services.internal.events.EventBroker.send(EventBroker.java:52)
	at org.eclipse.e4.ui.internal.workbench.UIEventPublisher.notifyChanged(UIEventPublisher.java:60)
	at org.eclipse.emf.common.notify.impl.BasicNotifierImpl.eNotify(BasicNotifierImpl.java:374)
	at org.eclipse.e4.ui.model.application.ui.impl.ElementContainerImpl.setSelectedElement(ElementContainerImpl.java:173)
	at org.eclipse.e4.ui.internal.workbench.ModelServiceImpl.showElementInWindow(ModelServiceImpl.java:620)
	at org.eclipse.e4.ui.internal.workbench.ModelServiceImpl.bringToTop(ModelServiceImpl.java:584)
	at org.eclipse.e4.ui.internal.workbench.PartServiceImpl.delegateBringToTop(PartServiceImpl.java:769)
	at org.eclipse.e4.ui.internal.workbench.PartServiceImpl.activate(PartServiceImpl.java:743)
	at org.eclipse.e4.ui.internal.workbench.PartServiceImpl.activate(PartServiceImpl.java:681)
	at org.eclipse.e4.ui.internal.workbench.PartServiceImpl.activate(PartServiceImpl.java:676)
	at org.eclipse.e4.ui.internal.workbench.PartServiceImpl.showPart(PartServiceImpl.java:1179)
	at org.eclipse.ui.internal.WorkbenchPage.showPart(WorkbenchPage.java:1287)
	at org.eclipse.ui.internal.WorkbenchPage.busyShowView(WorkbenchPage.java:1278)
	at org.eclipse.ui.internal.WorkbenchPage$12.run(WorkbenchPage.java:4329)
	at org.eclipse.swt.custom.BusyIndicator.showWhile(BusyIndicator.java:70)
	at org.eclipse.ui.internal.WorkbenchPage.showView(WorkbenchPage.java:4325)
	at org.eclipse.ui.internal.WorkbenchPage.showView(WorkbenchPage.java:4305)
	at org.eclipse.contribution.xref.ui.tests.views.XReferenceViewTest.testShowHide(XReferenceViewTest.java:59)
	at sun.reflect.NativeMethodAccessorImpl.invoke0(Native Method)
	at sun.reflect.NativeMethodAccessorImpl.invoke(NativeMethodAccessorImpl.java:62)
	at sun.reflect.DelegatingMethodAccessorImpl.invoke(DelegatingMethodAccessorImpl.java:43)
	at java.lang.reflect.Method.invoke(Method.java:498)
	at junit.framework.TestCase.runTest(TestCase.java:176)
	at junit.framework.TestCase.runBare(TestCase.java:141)
	at junit.framework.TestResult$1.protect(TestResult.java:122)
	at junit.framework.TestResult.runProtected(TestResult.java:142)
	at junit.framework.TestResult.run(TestResult.java:125)
	at junit.framework.TestCase.run(TestCase.java:129)
	at junit.framework.TestSuite.runTest(TestSuite.java:252)
	at junit.framework.TestSuite.run(TestSuite.java:247)
	at junit.framework.TestSuite.runTest(TestSuite.java:252)
	at junit.framework.TestSuite.run(TestSuite.java:247)
	at org.junit.internal.runners.JUnit38ClassRunner.run(JUnit38ClassRunner.java:86)
	at org.apache.maven.surefire.junit4.JUnit4Provider.execute(JUnit4Provider.java:264)
	at org.apache.maven.surefire.junit4.JUnit4Provider.executeTestSet(JUnit4Provider.java:153)
	at org.apache.maven.surefire.junit4.JUnit4Provider.invoke(JUnit4Provider.java:124)
	at sun.reflect.NativeMethodAccessorImpl.invoke0(Native Method)
	at sun.reflect.NativeMethodAccessorImpl.invoke(NativeMethodAccessorImpl.java:62)
	at sun.reflect.DelegatingMethodAccessorImpl.invoke(DelegatingMethodAccessorImpl.java:43)
	at java.lang.reflect.Method.invoke(Method.java:498)
	at org.apache.maven.surefire.util.ReflectionUtils.invokeMethodWithArray2(ReflectionUtils.java:208)
	at org.apache.maven.surefire.booter.ProviderFactory$ProviderProxy.invoke(ProviderFactory.java:156)
	at org.apache.maven.surefire.booter.ProviderFactory.invokeProvider(ProviderFactory.java:82)
	at org.eclipse.tycho.surefire.osgibooter.OsgiSurefireBooter.run(OsgiSurefireBooter.java:91)
	at org.eclipse.tycho.surefire.osgibooter.AbstractUITestApplication$1.run(AbstractUITestApplication.java:35)
	at org.eclipse.swt.widgets.RunnableLock.run(RunnableLock.java:37)
	at org.eclipse.swt.widgets.Synchronizer.runAsyncMessages(Synchronizer.java:182)
	at org.eclipse.swt.widgets.Display.runAsyncMessages(Display.java:4497)
	at org.eclipse.swt.widgets.Display.readAndDispatch(Display.java:4110)
	at org.eclipse.e4.ui.internal.workbench.swt.PartRenderingEngine$5.run(PartRenderingEngine.java:1150)
	at org.eclipse.core.databinding.observable.Realm.runWithDefault(Realm.java:336)
	at org.eclipse.e4.ui.internal.workbench.swt.PartRenderingEngine.run(PartRenderingEngine.java:1039)
	at org.eclipse.e4.ui.internal.workbench.E4Workbench.createAndRunUI(E4Workbench.java:153)
	at org.eclipse.ui.internal.Workbench.lambda$3(Workbench.java:680)
	at org.eclipse.core.databinding.observable.Realm.runWithDefault(Realm.java:336)
	at org.eclipse.ui.internal.Workbench.createAndRunWorkbench(Workbench.java:594)
	at org.eclipse.ui.PlatformUI.createAndRunWorkbench(PlatformUI.java:148)
	at org.eclipse.ui.internal.ide.application.IDEApplication.start(IDEApplication.java:151)
	at org.eclipse.tycho.surefire.osgibooter.UITestApplication.runApplication(UITestApplication.java:31)
	at org.eclipse.tycho.surefire.osgibooter.AbstractUITestApplication.run(AbstractUITestApplication.java:120)
	at org.eclipse.tycho.surefire.osgibooter.UITestApplication.start(UITestApplication.java:37)
	at org.eclipse.equinox.internal.app.EclipseAppHandle.run(EclipseAppHandle.java:196)
	at org.eclipse.core.runtime.internal.adaptor.EclipseAppLauncher.runApplication(EclipseAppLauncher.java:134)
	at org.eclipse.core.runtime.internal.adaptor.EclipseAppLauncher.start(EclipseAppLauncher.java:104)
	at org.eclipse.core.runtime.adaptor.EclipseStarter.run(EclipseStarter.java:388)
	at org.eclipse.core.runtime.adaptor.EclipseStarter.run(EclipseStarter.java:243)
	at sun.reflect.NativeMethodAccessorImpl.invoke0(Native Method)
	at sun.reflect.NativeMethodAccessorImpl.invoke(NativeMethodAccessorImpl.java:62)
	at sun.reflect.DelegatingMethodAccessorImpl.invoke(DelegatingMethodAccessorImpl.java:43)
	at java.lang.reflect.Method.invoke(Method.java:498)
	at org.eclipse.equinox.launcher.Main.invokeFramework(Main.java:653)
	at org.eclipse.equinox.launcher.Main.basicRun(Main.java:590)
	at org.eclipse.equinox.launcher.Main.run(Main.java:1499)
	at org.eclipse.equinox.launcher.Main.main(Main.java:1472)
Caused by: java.lang.ClassNotFoundException: org.eclipse.contribution.xref.core.tests.UnknownProvider cannot be found by org.eclipse.contribution.xref.core.tests_2.2.4.201710262257
	at org.eclipse.osgi.internal.loader.BundleLoader.findClassInternal(BundleLoader.java:484)
	at org.eclipse.osgi.internal.loader.BundleLoader.findClass(BundleLoader.java:395)
	at org.eclipse.osgi.internal.loader.BundleLoader.findClass(BundleLoader.java:387)
	at org.eclipse.osgi.internal.loader.ModuleClassLoader.loadClass(ModuleClassLoader.java:150)
	at java.lang.ClassLoader.loadClass(ClassLoader.java:357)
	at org.eclipse.osgi.internal.framework.EquinoxBundle.loadClass(EquinoxBundle.java:564)
	at org.eclipse.core.internal.registry.osgi.RegistryStrategyOSGI.createExecutableExtension(RegistryStrategyOSGI.java:174)
	... 128 more
!SUBENTRY 1 org.eclipse.equinox.registry 4 1 2017-10-26 20:24:33.218
!MESSAGE Plug-in org.eclipse.contribution.xref.core.tests was unable to load class org.eclipse.contribution.xref.core.tests.UnknownProvider.
!STACK 0
java.lang.ClassNotFoundException: org.eclipse.contribution.xref.core.tests.UnknownProvider cannot be found by org.eclipse.contribution.xref.core.tests_2.2.4.201710262257
	at org.eclipse.osgi.internal.loader.BundleLoader.findClassInternal(BundleLoader.java:484)
	at org.eclipse.osgi.internal.loader.BundleLoader.findClass(BundleLoader.java:395)
	at org.eclipse.osgi.internal.loader.BundleLoader.findClass(BundleLoader.java:387)
	at org.eclipse.osgi.internal.loader.ModuleClassLoader.loadClass(ModuleClassLoader.java:150)
	at java.lang.ClassLoader.loadClass(ClassLoader.java:357)
	at org.eclipse.osgi.internal.framework.EquinoxBundle.loadClass(EquinoxBundle.java:564)
	at org.eclipse.core.internal.registry.osgi.RegistryStrategyOSGI.createExecutableExtension(RegistryStrategyOSGI.java:174)
	at org.eclipse.core.internal.registry.ExtensionRegistry.createExecutableExtension(ExtensionRegistry.java:905)
	at org.eclipse.core.internal.registry.ConfigurationElement.createExecutableExtension(ConfigurationElement.java:243)
	at org.eclipse.core.internal.registry.ConfigurationElementHandle.createExecutableExtension(ConfigurationElementHandle.java:55)
	at org.eclipse.contribution.xref.core.XReferenceProviderDefinition.<init>(XReferenceProviderDefinition.java:32)
	at org.eclipse.contribution.xref.core.XReferenceProviderManager.getRegisteredProviders(XReferenceProviderManager.java:95)
	at org.eclipse.contribution.xref.internal.ui.actions.XReferenceCustomFilterAction.<init>(XReferenceCustomFilterAction.java:58)
	at org.eclipse.contribution.xref.ui.views.XReferenceView.makeActions(XReferenceView.java:458)
	at org.eclipse.contribution.xref.ui.views.XReferenceView.createPartControl(XReferenceView.java:117)
	at org.eclipse.ui.internal.e4.compatibility.CompatibilityPart.createPartControl(CompatibilityPart.java:151)
	at org.eclipse.ui.internal.e4.compatibility.CompatibilityView.createPartControl(CompatibilityView.java:147)
	at org.eclipse.ui.internal.e4.compatibility.CompatibilityPart.create(CompatibilityPart.java:355)
	at sun.reflect.NativeMethodAccessorImpl.invoke0(Native Method)
	at sun.reflect.NativeMethodAccessorImpl.invoke(NativeMethodAccessorImpl.java:62)
	at sun.reflect.DelegatingMethodAccessorImpl.invoke(DelegatingMethodAccessorImpl.java:43)
	at java.lang.reflect.Method.invoke(Method.java:498)
	at org.eclipse.e4.core.internal.di.MethodRequestor.execute(MethodRequestor.java:55)
	at org.eclipse.e4.core.internal.di.InjectorImpl.processAnnotated(InjectorImpl.java:990)
	at org.eclipse.e4.core.internal.di.InjectorImpl.processAnnotated(InjectorImpl.java:955)
	at org.eclipse.e4.core.internal.di.InjectorImpl.inject(InjectorImpl.java:124)
	at org.eclipse.e4.core.internal.di.InjectorImpl.internalMake(InjectorImpl.java:399)
	at org.eclipse.e4.core.internal.di.InjectorImpl.make(InjectorImpl.java:318)
	at org.eclipse.e4.core.contexts.ContextInjectionFactory.make(ContextInjectionFactory.java:162)
	at org.eclipse.e4.ui.internal.workbench.ReflectionContributionFactory.createFromBundle(ReflectionContributionFactory.java:105)
	at org.eclipse.e4.ui.internal.workbench.ReflectionContributionFactory.doCreate(ReflectionContributionFactory.java:74)
	at org.eclipse.e4.ui.internal.workbench.ReflectionContributionFactory.create(ReflectionContributionFactory.java:56)
	at org.eclipse.e4.ui.workbench.renderers.swt.ContributedPartRenderer.createWidget(ContributedPartRenderer.java:129)
	at org.eclipse.e4.ui.internal.workbench.swt.PartRenderingEngine.createWidget(PartRenderingEngine.java:992)
	at org.eclipse.e4.ui.internal.workbench.swt.PartRenderingEngine.safeCreateGui(PartRenderingEngine.java:661)
	at org.eclipse.e4.ui.internal.workbench.swt.PartRenderingEngine$1.run(PartRenderingEngine.java:546)
	at org.eclipse.core.runtime.SafeRunner.run(SafeRunner.java:42)
	at org.eclipse.e4.ui.internal.workbench.swt.PartRenderingEngine.createGui(PartRenderingEngine.java:530)
	at org.eclipse.e4.ui.workbench.renderers.swt.ElementReferenceRenderer.createWidget(ElementReferenceRenderer.java:70)
	at org.eclipse.e4.ui.internal.workbench.swt.PartRenderingEngine.createWidget(PartRenderingEngine.java:992)
	at org.eclipse.e4.ui.internal.workbench.swt.PartRenderingEngine.safeCreateGui(PartRenderingEngine.java:661)
	at org.eclipse.e4.ui.internal.workbench.swt.PartRenderingEngine.safeCreateGui(PartRenderingEngine.java:767)
	at org.eclipse.e4.ui.internal.workbench.swt.PartRenderingEngine.access$0(PartRenderingEngine.java:738)
	at org.eclipse.e4.ui.internal.workbench.swt.PartRenderingEngine$2.run(PartRenderingEngine.java:732)
	at org.eclipse.core.runtime.SafeRunner.run(SafeRunner.java:42)
	at org.eclipse.e4.ui.internal.workbench.swt.PartRenderingEngine.createGui(PartRenderingEngine.java:716)
	at org.eclipse.e4.ui.internal.workbench.PartServiceImpl$1.handleEvent(PartServiceImpl.java:109)
	at org.eclipse.e4.ui.services.internal.events.UIEventHandler$1.run(UIEventHandler.java:40)
	at org.eclipse.swt.widgets.Synchronizer.syncExec(Synchronizer.java:233)
	at org.eclipse.ui.internal.UISynchronizer.syncExec(UISynchronizer.java:144)
	at org.eclipse.swt.widgets.Display.syncExec(Display.java:5455)
	at org.eclipse.e4.ui.internal.workbench.swt.E4Application$1.syncExec(E4Application.java:212)
	at org.eclipse.e4.ui.services.internal.events.UIEventHandler.handleEvent(UIEventHandler.java:36)
	at org.eclipse.equinox.internal.event.EventHandlerWrapper.handleEvent(EventHandlerWrapper.java:201)
	at org.eclipse.equinox.internal.event.EventHandlerTracker.dispatchEvent(EventHandlerTracker.java:197)
	at org.eclipse.equinox.internal.event.EventHandlerTracker.dispatchEvent(EventHandlerTracker.java:1)
	at org.eclipse.osgi.framework.eventmgr.EventManager.dispatchEvent(EventManager.java:230)
	at org.eclipse.osgi.framework.eventmgr.ListenerQueue.dispatchEventSynchronous(ListenerQueue.java:148)
	at org.eclipse.equinox.internal.event.EventAdminImpl.dispatchEvent(EventAdminImpl.java:135)
	at org.eclipse.equinox.internal.event.EventAdminImpl.sendEvent(EventAdminImpl.java:78)
	at org.eclipse.equinox.internal.event.EventComponent.sendEvent(EventComponent.java:39)
	at org.eclipse.e4.ui.services.internal.events.EventBroker.send(EventBroker.java:52)
	at org.eclipse.e4.ui.internal.workbench.UIEventPublisher.notifyChanged(UIEventPublisher.java:60)
	at org.eclipse.emf.common.notify.impl.BasicNotifierImpl.eNotify(BasicNotifierImpl.java:374)
	at org.eclipse.e4.ui.model.application.ui.impl.ElementContainerImpl.setSelectedElement(ElementContainerImpl.java:173)
	at org.eclipse.e4.ui.internal.workbench.ModelServiceImpl.showElementInWindow(ModelServiceImpl.java:620)
	at org.eclipse.e4.ui.internal.workbench.ModelServiceImpl.bringToTop(ModelServiceImpl.java:584)
	at org.eclipse.e4.ui.internal.workbench.PartServiceImpl.delegateBringToTop(PartServiceImpl.java:769)
	at org.eclipse.e4.ui.internal.workbench.PartServiceImpl.activate(PartServiceImpl.java:743)
	at org.eclipse.e4.ui.internal.workbench.PartServiceImpl.activate(PartServiceImpl.java:681)
	at org.eclipse.e4.ui.internal.workbench.PartServiceImpl.activate(PartServiceImpl.java:676)
	at org.eclipse.e4.ui.internal.workbench.PartServiceImpl.showPart(PartServiceImpl.java:1179)
	at org.eclipse.ui.internal.WorkbenchPage.showPart(WorkbenchPage.java:1287)
	at org.eclipse.ui.internal.WorkbenchPage.busyShowView(WorkbenchPage.java:1278)
	at org.eclipse.ui.internal.WorkbenchPage$12.run(WorkbenchPage.java:4329)
	at org.eclipse.swt.custom.BusyIndicator.showWhile(BusyIndicator.java:70)
	at org.eclipse.ui.internal.WorkbenchPage.showView(WorkbenchPage.java:4325)
	at org.eclipse.ui.internal.WorkbenchPage.showView(WorkbenchPage.java:4305)
	at org.eclipse.contribution.xref.ui.tests.views.XReferenceViewTest.testShowHide(XReferenceViewTest.java:59)
	at sun.reflect.NativeMethodAccessorImpl.invoke0(Native Method)
	at sun.reflect.NativeMethodAccessorImpl.invoke(NativeMethodAccessorImpl.java:62)
	at sun.reflect.DelegatingMethodAccessorImpl.invoke(DelegatingMethodAccessorImpl.java:43)
	at java.lang.reflect.Method.invoke(Method.java:498)
	at junit.framework.TestCase.runTest(TestCase.java:176)
	at junit.framework.TestCase.runBare(TestCase.java:141)
	at junit.framework.TestResult$1.protect(TestResult.java:122)
	at junit.framework.TestResult.runProtected(TestResult.java:142)
	at junit.framework.TestResult.run(TestResult.java:125)
	at junit.framework.TestCase.run(TestCase.java:129)
	at junit.framework.TestSuite.runTest(TestSuite.java:252)
	at junit.framework.TestSuite.run(TestSuite.java:247)
	at junit.framework.TestSuite.runTest(TestSuite.java:252)
	at junit.framework.TestSuite.run(TestSuite.java:247)
	at org.junit.internal.runners.JUnit38ClassRunner.run(JUnit38ClassRunner.java:86)
	at org.apache.maven.surefire.junit4.JUnit4Provider.execute(JUnit4Provider.java:264)
	at org.apache.maven.surefire.junit4.JUnit4Provider.executeTestSet(JUnit4Provider.java:153)
	at org.apache.maven.surefire.junit4.JUnit4Provider.invoke(JUnit4Provider.java:124)
	at sun.reflect.NativeMethodAccessorImpl.invoke0(Native Method)
	at sun.reflect.NativeMethodAccessorImpl.invoke(NativeMethodAccessorImpl.java:62)
	at sun.reflect.DelegatingMethodAccessorImpl.invoke(DelegatingMethodAccessorImpl.java:43)
	at java.lang.reflect.Method.invoke(Method.java:498)
	at org.apache.maven.surefire.util.ReflectionUtils.invokeMethodWithArray2(ReflectionUtils.java:208)
	at org.apache.maven.surefire.booter.ProviderFactory$ProviderProxy.invoke(ProviderFactory.java:156)
	at org.apache.maven.surefire.booter.ProviderFactory.invokeProvider(ProviderFactory.java:82)
	at org.eclipse.tycho.surefire.osgibooter.OsgiSurefireBooter.run(OsgiSurefireBooter.java:91)
	at org.eclipse.tycho.surefire.osgibooter.AbstractUITestApplication$1.run(AbstractUITestApplication.java:35)
	at org.eclipse.swt.widgets.RunnableLock.run(RunnableLock.java:37)
	at org.eclipse.swt.widgets.Synchronizer.runAsyncMessages(Synchronizer.java:182)
	at org.eclipse.swt.widgets.Display.runAsyncMessages(Display.java:4497)
	at org.eclipse.swt.widgets.Display.readAndDispatch(Display.java:4110)
	at org.eclipse.e4.ui.internal.workbench.swt.PartRenderingEngine$5.run(PartRenderingEngine.java:1150)
	at org.eclipse.core.databinding.observable.Realm.runWithDefault(Realm.java:336)
	at org.eclipse.e4.ui.internal.workbench.swt.PartRenderingEngine.run(PartRenderingEngine.java:1039)
	at org.eclipse.e4.ui.internal.workbench.E4Workbench.createAndRunUI(E4Workbench.java:153)
	at org.eclipse.ui.internal.Workbench.lambda$3(Workbench.java:680)
	at org.eclipse.core.databinding.observable.Realm.runWithDefault(Realm.java:336)
	at org.eclipse.ui.internal.Workbench.createAndRunWorkbench(Workbench.java:594)
	at org.eclipse.ui.PlatformUI.createAndRunWorkbench(PlatformUI.java:148)
	at org.eclipse.ui.internal.ide.application.IDEApplication.start(IDEApplication.java:151)
	at org.eclipse.tycho.surefire.osgibooter.UITestApplication.runApplication(UITestApplication.java:31)
	at org.eclipse.tycho.surefire.osgibooter.AbstractUITestApplication.run(AbstractUITestApplication.java:120)
	at org.eclipse.tycho.surefire.osgibooter.UITestApplication.start(UITestApplication.java:37)
	at org.eclipse.equinox.internal.app.EclipseAppHandle.run(EclipseAppHandle.java:196)
	at org.eclipse.core.runtime.internal.adaptor.EclipseAppLauncher.runApplication(EclipseAppLauncher.java:134)
	at org.eclipse.core.runtime.internal.adaptor.EclipseAppLauncher.start(EclipseAppLauncher.java:104)
	at org.eclipse.core.runtime.adaptor.EclipseStarter.run(EclipseStarter.java:388)
	at org.eclipse.core.runtime.adaptor.EclipseStarter.run(EclipseStarter.java:243)
	at sun.reflect.NativeMethodAccessorImpl.invoke0(Native Method)
	at sun.reflect.NativeMethodAccessorImpl.invoke(NativeMethodAccessorImpl.java:62)
	at sun.reflect.DelegatingMethodAccessorImpl.invoke(DelegatingMethodAccessorImpl.java:43)
	at java.lang.reflect.Method.invoke(Method.java:498)
	at org.eclipse.equinox.launcher.Main.invokeFramework(Main.java:653)
	at org.eclipse.equinox.launcher.Main.basicRun(Main.java:590)
	at org.eclipse.equinox.launcher.Main.run(Main.java:1499)
	at org.eclipse.equinox.launcher.Main.main(Main.java:1472)
Tests run: 6, Failures: 1, Errors: 0, Skipped: 0, Time elapsed: 2.113 sec <<< FAILURE! - in org.eclipse.contribution.xref.ui.tests.AllTests
testViewContentProvider(org.eclipse.contribution.xref.ui.tests.views.XReferenceViewTest)  Time elapsed: 0.295 sec
testTreeObject(org.eclipse.contribution.xref.ui.tests.views.XReferenceViewTest)  Time elapsed: 0 sec
testTreeParent(org.eclipse.contribution.xref.ui.tests.views.XReferenceViewTest)  Time elapsed: 0.001 sec
testShowHide(org.eclipse.contribution.xref.ui.tests.views.XReferenceViewTest)  Time elapsed: 1.79 sec
testViewContentProviderLive(org.eclipse.contribution.xref.ui.tests.views.XReferenceViewTest)  Time elapsed: 0.006 sec  <<< FAILURE!
junit.framework.AssertionFailedError: expected:<test associate> but was:<AdaptableString [val=test associate]>
	at junit.framework.Assert.fail(Assert.java:57)
	at junit.framework.Assert.failNotEquals(Assert.java:329)
	at junit.framework.Assert.assertEquals(Assert.java:78)
	at junit.framework.Assert.assertEquals(Assert.java:86)
	at junit.framework.TestCase.assertEquals(TestCase.java:253)
	at org.eclipse.contribution.xref.ui.tests.views.XReferenceViewTest.testViewContentProviderLive(XReferenceViewTest.java:205)

testSetCheckedFilters(org.eclipse.contribution.xref.ui.tests.AJXReferenceProviderTest)  Time elapsed: 0.001 sec

Results :

Failed tests: 
  XReferenceViewTest.testViewContentProviderLive:205 expected:<test associate> but was:<AdaptableString [val=test associate]>

Tests run: 6, Failures: 1, Errors: 0, Skipped: 0

[ERROR] There are test failures.

Please refer to /jobs/genie.ajdt/ajdt-on-eclipse-47-aj9/workspace/org.eclipse.contribution.xref.ui.tests/target/surefire-reports for the individual test results.
[INFO] 
[INFO] --- eclipse-jarsigner-plugin:1.0.4:sign (sign) @ org.eclipse.contribution.xref.ui.tests ---
[INFO] Signed org.eclipse.ajdt:org.eclipse.contribution.xref.ui.tests:eclipse-test-plugin:2.2.4-SNAPSHOT in 1 seconds.
[INFO] 
[INFO] --- tycho-p2-plugin:0.23.1:p2-metadata (p2-metadata) @ org.eclipse.contribution.xref.ui.tests ---
[INFO]                                                                         
[INFO] ------------------------------------------------------------------------
[INFO] Building org.eclipse.aspectj.feature_tests 2.2.4-SNAPSHOT
[INFO] ------------------------------------------------------------------------
[INFO] 
[INFO] --- maven-clean-plugin:2.5:clean (default-clean) @ org.eclipse.aspectj.feature_tests ---
[INFO] 
[INFO] --- tycho-packaging-plugin:0.23.1:build-qualifier-aggregator (default-build-qualifier-aggregator) @ org.eclipse.aspectj.feature_tests ---
[INFO] The project's OSGi version is 2.2.4.201710262257
[INFO] 
[INFO] --- tycho-packaging-plugin:0.23.1:validate-id (default-validate-id) @ org.eclipse.aspectj.feature_tests ---
[INFO] 
[INFO] --- tycho-packaging-plugin:0.23.1:validate-version (default-validate-version) @ org.eclipse.aspectj.feature_tests ---
[INFO] 
[INFO] --- target-platform-configuration:0.23.1:target-platform (default-target-platform) @ org.eclipse.aspectj.feature_tests ---
[INFO] 
[INFO] --- tycho-packaging-plugin:0.23.1:package-feature (default-package-feature) @ org.eclipse.aspectj.feature_tests ---
[INFO] Building jar: /jobs/genie.ajdt/ajdt-on-eclipse-47-aj9/workspace/org.eclipse.aspectj.feature_tests/target/org.eclipse.aspectj.feature_tests-2.2.4-SNAPSHOT.jar
[INFO] 
[INFO] --- tycho-p2-plugin:0.23.1:p2-metadata-default (default-p2-metadata-default) @ org.eclipse.aspectj.feature_tests ---
[INFO] 
[INFO] --- tycho-p2-plugin:0.23.1:feature-p2-metadata (default-feature-p2-metadata) @ org.eclipse.aspectj.feature_tests ---
[INFO] 
[INFO] --- eclipse-jarsigner-plugin:1.0.4:sign (sign) @ org.eclipse.aspectj.feature_tests ---
[INFO] Signed org.eclipse.ajdt:org.eclipse.aspectj.feature_tests:eclipse-feature:2.2.4-SNAPSHOT in 0 seconds.
[INFO] 
[INFO] --- tycho-p2-plugin:0.23.1:p2-metadata (p2-metadata) @ org.eclipse.aspectj.feature_tests ---
[INFO]                                                                         
[INFO] ------------------------------------------------------------------------
[INFO] Building org.eclipse.ajdt.releng 2.2.4-SNAPSHOT
[INFO] ------------------------------------------------------------------------
[INFO] 
[INFO] --- maven-clean-plugin:2.5:clean (default-clean) @ org.eclipse.ajdt.releng ---
[INFO] 
[INFO] --- tycho-packaging-plugin:0.23.1:build-qualifier-aggregator (default-build-qualifier-aggregator) @ org.eclipse.ajdt.releng ---
[INFO] The project's OSGi version is 2.2.4.201710262257
[INFO] 
[INFO] --- maven-clean-plugin:2.5:clean (default-clean-1) @ org.eclipse.ajdt.releng ---
[INFO] 
[INFO] --- maven-resources-plugin:2.4.3:resources (default-resources) @ org.eclipse.ajdt.releng ---
[WARNING] Using platform encoding (UTF-8 actually) to copy filtered resources, i.e. build is platform dependent!
[INFO] skip non existing resourceDirectory /jobs/genie.ajdt/ajdt-on-eclipse-47-aj9/workspace/org.eclipse.ajdt.releng/src/main/resources
[INFO] 
[INFO] --- target-platform-configuration:0.23.1:target-platform (default-target-platform) @ org.eclipse.ajdt.releng ---
[INFO] 
[INFO] --- tycho-p2-publisher-plugin:0.23.1:publish-products (default-publish-products) @ org.eclipse.ajdt.releng ---
[INFO] 
[INFO] --- tycho-p2-publisher-plugin:0.23.1:publish-categories (default-publish-categories) @ org.eclipse.ajdt.releng ---
[INFO] 
[INFO] --- tycho-p2-publisher-plugin:0.23.1:attach-artifacts (default-attach-artifacts) @ org.eclipse.ajdt.releng ---
[INFO] 
[INFO] --- tycho-p2-repository-plugin:0.23.1:assemble-repository (default-assemble-repository) @ org.eclipse.ajdt.releng ---
[INFO] 
[INFO] --- tycho-p2-repository-plugin:0.23.1:archive-repository (default-archive-repository) @ org.eclipse.ajdt.releng ---
[INFO] Building zip: /jobs/genie.ajdt/ajdt-on-eclipse-47-aj9/workspace/org.eclipse.ajdt.releng/target/ajdt-e47-2.2.4.201710262257.zip
[INFO] 
[INFO] --- maven-antrun-plugin:1.7:run (default) @ org.eclipse.ajdt.releng ---
Downloading: https://repo.eclipse.org/content/repositories/cbi-releases/org/apache/maven/maven-plugin-api/2.0.11/maven-plugin-api-2.0.11.pom
Downloading: https://repo.eclipse.org/content/repositories/maven_central/org/apache/maven/maven-plugin-api/2.0.11/maven-plugin-api-2.0.11.pom
Downloaded: https://repo.eclipse.org/content/repositories/maven_central/org/apache/maven/maven-plugin-api/2.0.11/maven-plugin-api-2.0.11.pom (2 KB at 68.0 KB/sec)
Downloading: https://repo.eclipse.org/content/repositories/cbi-releases/org/apache/maven/maven/2.0.11/maven-2.0.11.pom
Downloading: https://repo.eclipse.org/content/repositories/maven_central/org/apache/maven/maven/2.0.11/maven-2.0.11.pom
Downloaded: https://repo.eclipse.org/content/repositories/maven_central/org/apache/maven/maven/2.0.11/maven-2.0.11.pom (22 KB at 853.0 KB/sec)
Downloading: https://repo.eclipse.org/content/repositories/cbi-releases/org/apache/maven/maven-parent/12/maven-parent-12.pom
Downloading: https://repo.eclipse.org/content/repositories/maven_central/org/apache/maven/maven-parent/12/maven-parent-12.pom
Downloaded: https://repo.eclipse.org/content/repositories/maven_central/org/apache/maven/maven-parent/12/maven-parent-12.pom (22 KB at 1117.4 KB/sec)
Downloading: https://repo.eclipse.org/content/repositories/cbi-releases/org/apache/maven/maven-project/2.0.11/maven-project-2.0.11.pom
Downloading: https://repo.eclipse.org/content/repositories/maven_central/org/apache/maven/maven-project/2.0.11/maven-project-2.0.11.pom
Downloaded: https://repo.eclipse.org/content/repositories/maven_central/org/apache/maven/maven-project/2.0.11/maven-project-2.0.11.pom (3 KB at 150.7 KB/sec)
Downloading: https://repo.eclipse.org/content/repositories/cbi-releases/org/apache/maven/maven-settings/2.0.11/maven-settings-2.0.11.pom
Downloading: https://repo.eclipse.org/content/repositories/maven_central/org/apache/maven/maven-settings/2.0.11/maven-settings-2.0.11.pom
Downloaded: https://repo.eclipse.org/content/repositories/maven_central/org/apache/maven/maven-settings/2.0.11/maven-settings-2.0.11.pom (3 KB at 112.2 KB/sec)
Downloading: https://repo.eclipse.org/content/repositories/cbi-releases/org/apache/maven/maven-model/2.0.11/maven-model-2.0.11.pom
Downloading: https://repo.eclipse.org/content/repositories/maven_central/org/apache/maven/maven-model/2.0.11/maven-model-2.0.11.pom
Downloaded: https://repo.eclipse.org/content/repositories/maven_central/org/apache/maven/maven-model/2.0.11/maven-model-2.0.11.pom (4 KB at 121.8 KB/sec)
Downloading: https://repo.eclipse.org/content/repositories/cbi-releases/org/codehaus/plexus/plexus-utils/1.5.6/plexus-utils-1.5.6.pom
Downloading: https://repo.eclipse.org/content/repositories/maven_central/org/codehaus/plexus/plexus-utils/1.5.6/plexus-utils-1.5.6.pom
Downloaded: https://repo.eclipse.org/content/repositories/maven_central/org/codehaus/plexus/plexus-utils/1.5.6/plexus-utils-1.5.6.pom (6 KB at 258.9 KB/sec)
Downloading: https://repo.eclipse.org/content/repositories/cbi-releases/org/codehaus/plexus/plexus/1.0.12/plexus-1.0.12.pom
Downloading: https://repo.eclipse.org/content/repositories/maven_central/org/codehaus/plexus/plexus/1.0.12/plexus-1.0.12.pom
Downloaded: https://repo.eclipse.org/content/repositories/maven_central/org/codehaus/plexus/plexus/1.0.12/plexus-1.0.12.pom (10 KB at 503.7 KB/sec)
Downloading: https://repo.eclipse.org/content/repositories/cbi-releases/org/apache/maven/maven-profile/2.0.11/maven-profile-2.0.11.pom
Downloading: https://repo.eclipse.org/content/repositories/maven_central/org/apache/maven/maven-profile/2.0.11/maven-profile-2.0.11.pom
Downloaded: https://repo.eclipse.org/content/repositories/maven_central/org/apache/maven/maven-profile/2.0.11/maven-profile-2.0.11.pom (2 KB at 105.0 KB/sec)
Downloading: https://repo.eclipse.org/content/repositories/cbi-releases/org/apache/maven/maven-artifact-manager/2.0.11/maven-artifact-manager-2.0.11.pom
Downloading: https://repo.eclipse.org/content/repositories/maven_central/org/apache/maven/maven-artifact-manager/2.0.11/maven-artifact-manager-2.0.11.pom
Downloaded: https://repo.eclipse.org/content/repositories/maven_central/org/apache/maven/maven-artifact-manager/2.0.11/maven-artifact-manager-2.0.11.pom (3 KB at 135.2 KB/sec)
Downloading: https://repo.eclipse.org/content/repositories/cbi-releases/org/apache/maven/maven-repository-metadata/2.0.11/maven-repository-metadata-2.0.11.pom
Downloading: https://repo.eclipse.org/content/repositories/maven_central/org/apache/maven/maven-repository-metadata/2.0.11/maven-repository-metadata-2.0.11.pom
Downloaded: https://repo.eclipse.org/content/repositories/maven_central/org/apache/maven/maven-repository-metadata/2.0.11/maven-repository-metadata-2.0.11.pom (3 KB at 110.3 KB/sec)
Downloading: https://repo.eclipse.org/content/repositories/cbi-releases/org/apache/maven/maven-artifact/2.0.11/maven-artifact-2.0.11.pom
Downloading: https://repo.eclipse.org/content/repositories/maven_central/org/apache/maven/maven-artifact/2.0.11/maven-artifact-2.0.11.pom
Downloaded: https://repo.eclipse.org/content/repositories/maven_central/org/apache/maven/maven-artifact/2.0.11/maven-artifact-2.0.11.pom (2 KB at 77.4 KB/sec)
Downloading: https://repo.eclipse.org/content/repositories/cbi-releases/org/apache/maven/maven-plugin-registry/2.0.11/maven-plugin-registry-2.0.11.pom
Downloading: https://repo.eclipse.org/content/repositories/maven_central/org/apache/maven/maven-plugin-registry/2.0.11/maven-plugin-registry-2.0.11.pom
Downloaded: https://repo.eclipse.org/content/repositories/maven_central/org/apache/maven/maven-plugin-registry/2.0.11/maven-plugin-registry-2.0.11.pom (2 KB at 104.8 KB/sec)
Downloading: https://repo.eclipse.org/content/repositories/cbi-releases/org/apache/ant/ant/1.8.2/ant-1.8.2.pom
Downloading: https://repo.eclipse.org/content/repositories/maven_central/org/apache/ant/ant/1.8.2/ant-1.8.2.pom
Downloaded: https://repo.eclipse.org/content/repositories/maven_central/org/apache/ant/ant/1.8.2/ant-1.8.2.pom (10 KB at 482.2 KB/sec)
Downloading: https://repo.eclipse.org/content/repositories/cbi-releases/org/apache/ant/ant-parent/1.8.2/ant-parent-1.8.2.pom
Downloading: https://repo.eclipse.org/content/repositories/maven_central/org/apache/ant/ant-parent/1.8.2/ant-parent-1.8.2.pom
Downloaded: https://repo.eclipse.org/content/repositories/maven_central/org/apache/ant/ant-parent/1.8.2/ant-parent-1.8.2.pom (5 KB at 254.3 KB/sec)
Downloading: https://repo.eclipse.org/content/repositories/cbi-releases/org/apache/ant/ant-launcher/1.8.2/ant-launcher-1.8.2.pom
Downloading: https://repo.eclipse.org/content/repositories/maven_central/org/apache/ant/ant-launcher/1.8.2/ant-launcher-1.8.2.pom
Downloaded: https://repo.eclipse.org/content/repositories/maven_central/org/apache/ant/ant-launcher/1.8.2/ant-launcher-1.8.2.pom (3 KB at 118.1 KB/sec)
Downloading: https://repo.eclipse.org/content/repositories/cbi-releases/org/apache/maven/maven-plugin-api/2.0.11/maven-plugin-api-2.0.11.jar
Downloading: https://repo.eclipse.org/content/repositories/cbi-releases/org/apache/maven/maven-project/2.0.11/maven-project-2.0.11.jar
Downloading: https://repo.eclipse.org/content/repositories/cbi-releases/org/apache/maven/maven-settings/2.0.11/maven-settings-2.0.11.jar
Downloading: https://repo.eclipse.org/content/repositories/cbi-releases/org/apache/maven/maven-profile/2.0.11/maven-profile-2.0.11.jar
Downloading: https://repo.eclipse.org/content/repositories/cbi-releases/org/apache/maven/maven-model/2.0.11/maven-model-2.0.11.jar
Downloading: https://repo.eclipse.org/content/repositories/cbi-releases/org/apache/maven/maven-artifact-manager/2.0.11/maven-artifact-manager-2.0.11.jar
Downloading: https://repo.eclipse.org/content/repositories/cbi-releases/org/apache/maven/maven-repository-metadata/2.0.11/maven-repository-metadata-2.0.11.jar
Downloading: https://repo.eclipse.org/content/repositories/cbi-releases/org/apache/maven/maven-plugin-registry/2.0.11/maven-plugin-registry-2.0.11.jar
Downloading: https://repo.eclipse.org/content/repositories/cbi-releases/org/codehaus/plexus/plexus-interpolation/1.1/plexus-interpolation-1.1.jar
Downloading: https://repo.eclipse.org/content/repositories/cbi-releases/org/apache/maven/maven-artifact/2.0.11/maven-artifact-2.0.11.jar
Downloading: https://repo.eclipse.org/content/repositories/cbi-releases/org/apache/ant/ant/1.8.2/ant-1.8.2.jar
Downloading: https://repo.eclipse.org/content/repositories/cbi-releases/org/apache/ant/ant-launcher/1.8.2/ant-launcher-1.8.2.jar
Downloading: https://repo.eclipse.org/content/repositories/maven_central/org/apache/maven/maven-plugin-api/2.0.11/maven-plugin-api-2.0.11.jar
Downloading: https://repo.eclipse.org/content/repositories/maven_central/org/apache/maven/maven-project/2.0.11/maven-project-2.0.11.jar
Downloading: https://repo.eclipse.org/content/repositories/maven_central/org/apache/maven/maven-settings/2.0.11/maven-settings-2.0.11.jar
Downloading: https://repo.eclipse.org/content/repositories/maven_central/org/apache/maven/maven-profile/2.0.11/maven-profile-2.0.11.jar
Downloading: https://repo.eclipse.org/content/repositories/maven_central/org/apache/maven/maven-model/2.0.11/maven-model-2.0.11.jar
Downloaded: https://repo.eclipse.org/content/repositories/maven_central/org/apache/maven/maven-model/2.0.11/maven-model-2.0.11.jar (95 KB at 3498.2 KB/sec)
Downloading: https://repo.eclipse.org/content/repositories/maven_central/org/apache/maven/maven-artifact-manager/2.0.11/maven-artifact-manager-2.0.11.jar
Downloaded: https://repo.eclipse.org/content/repositories/maven_central/org/apache/maven/maven-plugin-api/2.0.11/maven-plugin-api-2.0.11.jar (13 KB at 440.4 KB/sec)
Downloading: https://repo.eclipse.org/content/repositories/maven_central/org/apache/maven/maven-repository-metadata/2.0.11/maven-repository-metadata-2.0.11.jar
Downloaded: https://repo.eclipse.org/content/repositories/maven_central/org/apache/maven/maven-settings/2.0.11/maven-settings-2.0.11.jar (51 KB at 1730.7 KB/sec)
Downloading: https://repo.eclipse.org/content/repositories/maven_central/org/apache/maven/maven-plugin-registry/2.0.11/maven-plugin-registry-2.0.11.jar
Downloaded: https://repo.eclipse.org/content/repositories/maven_central/org/apache/maven/maven-profile/2.0.11/maven-profile-2.0.11.jar (37 KB at 1210.0 KB/sec)
Downloading: https://repo.eclipse.org/content/repositories/maven_central/org/codehaus/plexus/plexus-interpolation/1.1/plexus-interpolation-1.1.jar
Downloaded: https://repo.eclipse.org/content/repositories/maven_central/org/apache/maven/maven-project/2.0.11/maven-project-2.0.11.jar (121 KB at 3653.7 KB/sec)
Downloading: https://repo.eclipse.org/content/repositories/maven_central/org/apache/maven/maven-artifact/2.0.11/maven-artifact-2.0.11.jar
Downloaded: https://repo.eclipse.org/content/repositories/maven_central/org/apache/maven/maven-artifact-manager/2.0.11/maven-artifact-manager-2.0.11.jar (58 KB at 1241.9 KB/sec)
Downloading: https://repo.eclipse.org/content/repositories/maven_central/org/apache/ant/ant/1.8.2/ant-1.8.2.jar
Downloaded: https://repo.eclipse.org/content/repositories/maven_central/org/apache/maven/maven-repository-metadata/2.0.11/maven-repository-metadata-2.0.11.jar (26 KB at 534.2 KB/sec)
Downloading: https://repo.eclipse.org/content/repositories/maven_central/org/apache/ant/ant-launcher/1.8.2/ant-launcher-1.8.2.jar
Downloaded: https://repo.eclipse.org/content/repositories/maven_central/org/apache/maven/maven-plugin-registry/2.0.11/maven-plugin-registry-2.0.11.jar (30 KB at 623.4 KB/sec)
Downloaded: https://repo.eclipse.org/content/repositories/maven_central/org/apache/maven/maven-artifact/2.0.11/maven-artifact-2.0.11.jar (88 KB at 1784.4 KB/sec)
Downloaded: https://repo.eclipse.org/content/repositories/maven_central/org/codehaus/plexus/plexus-interpolation/1.1/plexus-interpolation-1.1.jar (35 KB at 707.1 KB/sec)
Downloaded: https://repo.eclipse.org/content/repositories/maven_central/org/apache/ant/ant-launcher/1.8.2/ant-launcher-1.8.2.jar (13 KB at 197.3 KB/sec)
Downloaded: https://repo.eclipse.org/content/repositories/maven_central/org/apache/ant/ant/1.8.2/ant-1.8.2.jar (1889 KB at 18697.2 KB/sec)
[WARNING] Parameter tasks is deprecated, use target instead
[INFO] Executing tasks

main:
[propertyfile] Creating new property file: /jobs/genie.ajdt/ajdt-on-eclipse-47-aj9/workspace/org.eclipse.ajdt.releng/target/ajdt-zip.properties
[INFO] Executed tasks
[INFO] 
[INFO] --- maven-antrun-plugin:1.7:run (update-composite-update-site) @ org.eclipse.ajdt.releng ---
[INFO] Executing tasks

main:
  [taskdef] Could not load definitions from resource net/sf/antcontrib/antcontrib.properties. It could not be found.
     [copy] Copying 1 file to /jobs/genie.ajdt/ajdt-on-eclipse-47-aj9/workspace/org.eclipse.ajdt.releng/target
     [copy] Copying 1 file to /jobs/genie.ajdt/ajdt-on-eclipse-47-aj9/workspace/org.eclipse.ajdt.releng/target
     [copy] Copying 1 file to /jobs/genie.ajdt/ajdt-on-eclipse-47-aj9/workspace/org.eclipse.ajdt.releng/target
  [replace] Replaced 1 occurrences in 1 files.
  [replace] Replaced 1 occurrences in 1 files.
  [replace] Replaced 1 occurrences in 1 files.
  [replace] Replaced 1 occurrences in 1 files.
[INFO] Executed tasks
[INFO] 
[INFO] --- eclipse-jarsigner-plugin:1.0.4:sign (sign) @ org.eclipse.ajdt.releng ---
[INFO] 
[INFO] --- tycho-p2-plugin:0.23.1:p2-metadata (p2-metadata) @ org.eclipse.ajdt.releng ---
[INFO] ------------------------------------------------------------------------
[INFO] Reactor Summary:
[INFO] 
[INFO] parent ............................................. SUCCESS [  1.810 s]
[INFO] org.aspectj.runtime ................................ SUCCESS [  3.820 s]
[INFO] org.aspectj.weaver ................................. SUCCESS [  2.925 s]
[INFO] org.aspectj.ajde ................................... SUCCESS [  6.426 s]
[INFO] org.aspectj ........................................ SUCCESS [  1.713 s]
[INFO] org.eclipse.contribution.weaving.jdt ............... SUCCESS [ 10.006 s]
[INFO] org.eclipse.ajdt.core .............................. SUCCESS [  7.409 s]
[INFO] org.eclipse.ajdt.doc.user .......................... SUCCESS [  1.030 s]
[INFO] org.eclipse.ajdt.examples .......................... SUCCESS [  2.461 s]
[INFO] org.eclipse.contribution.visualiser ................ SUCCESS [  3.287 s]
[INFO] org.eclipse.contribution.xref.core ................. SUCCESS [  1.947 s]
[INFO] org.eclipse.contribution.xref.ui ................... SUCCESS [  2.165 s]
[INFO] org.eclipse.ajdt.ui ................................ SUCCESS [  7.670 s]
[INFO] org.eclipse.aspectj ................................ SUCCESS [  0.968 s]
[INFO] org.eclipse.equinox.weaving.aspectj ................ SUCCESS [  2.872 s]
[INFO] org.eclipse.equinox.weaving.sdk .................... SUCCESS [  0.870 s]
[INFO] org.eclipse.ajdt ................................... SUCCESS [  1.956 s]
[INFO] org.eclipse.contribution.weaving ................... SUCCESS [  1.734 s]
[INFO] org.eclipse.contribution.xref ...................... SUCCESS [  1.701 s]
[INFO] org.eclipse.ajdt.sdk ............................... SUCCESS [  1.081 s]
[INFO] org.eclipse.ajdt.core.tests ........................ SUCCESS [41:39 min]
[INFO] org.eclipse.contribution.visualiser.tests .......... SUCCESS [ 12.742 s]
[INFO] org.eclipse.ajdt.ui.tests .......................... SUCCESS [42:42 min]
[INFO] org.eclipse.contribution.weaving.jdt.tests ......... SUCCESS [01:35 min]
[INFO] org.eclipse.contribution.xref.core.tests ........... SUCCESS [  8.604 s]
[INFO] org.eclipse.contribution.xref.ui.tests ............. SUCCESS [ 11.030 s]
[INFO] org.eclipse.aspectj.feature_tests .................. SUCCESS [  0.918 s]
[INFO] org.eclipse.ajdt.releng ............................ SUCCESS [  3.609 s]
[INFO] ------------------------------------------------------------------------
[INFO] BUILD SUCCESS
[INFO] ------------------------------------------------------------------------
[INFO] Total time: 01:29 h
[INFO] Finished at: 2017-10-26T20:24:41-04:00
[INFO] Final Memory: 195M/3792M
[INFO] ------------------------------------------------------------------------
[DEBUG] Closing connection to remote
[DEBUG] Waiting for process to finish
[DEBUG] Result: 0
[workspace] $ /bin/sh -xe /tmp/hudson1559947299351235428.sh
+ cd org.eclipse.ajdt.releng/target
++ pwd
+ targetdir=/jobs/genie.ajdt/ajdt-on-eclipse-47-aj9/workspace/org.eclipse.ajdt.releng/target
+ zipfile=(ajdt-e47*.zip)
++ basename ajdt-e47-2.2.4.201710262257.zip .zip
+ zipname=ajdt-e47-2.2.4.201710262257
+ echo ajdt-e47-2.2.4.201710262257.zip
ajdt-e47-2.2.4.201710262257.zip
+ cp ajdt-e47-2.2.4.201710262257.zip /home/data/httpd/download.eclipse.org/tools/ajdt/47_aj9/dev/update
+ cd /home/data/httpd/download.eclipse.org/tools/ajdt/47_aj9/dev/update
/tmp/hudson1559947299351235428.sh: line 13: cd: /home/data/httpd/download.eclipse.org/tools/ajdt/47_aj9/dev/update: Not a directory
Terminating xvnc.
Recording test results
Finished: FAILURE