FailedConsole Output

Started by user mlippert@gmail.com
Checkout:workspace / /home/hudson/genie.ajdt/.hudson/jobs/ajdt-on-eclipse-45/workspace - hudson.remoting.LocalChannel@47f49e03
Using strategy: Default
Git Exe: git
Last Built Revision: Revision 109e17efd1719bff5e5c0d89b89b0e5551c2cb4b (origin/master)
Checkout:workspace / /home/hudson/genie.ajdt/.hudson/jobs/ajdt-on-eclipse-45/workspace - hudson.remoting.LocalChannel@47f49e03
Fetching changes from the remote Git repository
Fetching upstream changes from http://git.eclipse.org/gitroot/ajdt/org.eclipse.ajdt.git
Commencing build of Revision 689daddb7ed5a080524606a038c509aed676c48b (origin/master)
Checking out Revision 689daddb7ed5a080524606a038c509aed676c48b (origin/master)
Starting xvnc
[workspace] $ Xvnc :1421 -geometry 1024x768 -depth 24 -ac
[workspace] $ /bin/sh -xe /tmp/genie.ajdt/hudson831869042351145.sh
+ metacity --replace --sm-disable
11/01/2016 14:30:27 Xvnc version X.org/xf4vnc custom version
11/01/2016 14:30:27 Copyright (C) 2001-2004 Alan Hourihane.
11/01/2016 14:30:27 Copyright (C) 2000-2004 Constantin Kaplinsky
11/01/2016 14:30:27 Copyright (C) 1999 AT&T Laboratories Cambridge
11/01/2016 14:30:27 All Rights Reserved.
11/01/2016 14:30:27 See http://www.tightvnc.com/ for information on TightVNC
11/01/2016 14:30:27 See http://xf4vnc.sf.net for xf4vnc-specific information
11/01/2016 14:30:27 Desktop name 'x11' (hipp4:1421)
11/01/2016 14:30:27 Protocol versions supported: 3.7, 3.3
11/01/2016 14:30:27 RGB format 8 8 8
11/01/2016 14:30:27 Listening for VNC connections on TCP port 7321
[dix] Could not init font path element /usr/share/fonts/TTF/, removing from list!
[dix] Could not init font path element /usr/share/fonts/OTF, removing from list!
(EE) config/hal: NewInputDeviceRequest failed (2)
(EE) config/hal: NewInputDeviceRequest failed (2)
Xlib:  extension "RANDR" missing on display ":1421.0".
Window manager warning: 0 stored in GConf key /desktop/gnome/peripherals/mouse/cursor_size is out of range 1 to 128
Process leaked file descriptors. See http://wiki.hudson-ci.org/display/HUDSON/Spawning+processes+from+build for more information
[INFO] Using Maven 3 installation: apache-maven-latest
[INFO] Checking Maven 3 installation environment
[workspace] $ /shared/common/apache-maven-latest/bin/mvn --help
[INFO] Checking Maven 3 installation version
[INFO] Detected Maven 3 installation version: 3.3.9
[workspace] $ /shared/common/apache-maven-latest/bin/mvn -Pe45 -Peclipse-sign clean verify -V -B -e -Dmaven.ext.class.path=/home/hudson/genie.ajdt/.hudson/maven/slavebundle/resources:/home/hudson/genie.ajdt/.hudson/maven/slavebundle/lib/maven3-eventspy-3.1.jar:/home/hudson/genie.ajdt/.hudson/war/webapp/WEB-INF/lib/hudson-remoting-3.0.3.jar -Dhudson.eventspy.port=59641 -Dmaven.repo.local=/home/hudson/genie.ajdt/.hudson/jobs/ajdt-on-eclipse-45/workspace/.maven/repo -f pom.xml
[DEBUG] Waiting for connection on port: 59641
Apache Maven 3.3.9 (bb52d8502b132ec0a5a3f4c09453c07478323dc5; 2015-11-10T11:41:47-05:00)
Maven home: /shared/common/apache-maven-latest
Java version: 1.7.0_80, vendor: Oracle Corporation
Java home: /opt/public/common/jdk1.7.0_80/jre
Default locale: en_US, platform encoding: UTF-8
OS name: "linux", version: "3.0.101-0.46-default", arch: "amd64", family: "unix"
SLF4J: Class path contains multiple SLF4J bindings.
SLF4J: Found binding in [jar:file:/home/hudson/genie.ajdt/.hudson/maven/slavebundle/lib/maven3-eventspy-runtime.jar!/org/slf4j/impl/StaticLoggerBinder.class]
SLF4J: Found binding in [jar:file:/shared/common/apache-maven-latest/lib/slf4j-simple-1.7.5.jar!/org/slf4j/impl/StaticLoggerBinder.class]
SLF4J: See http://www.slf4j.org/codes.html#multiple_bindings for an explanation.
[DEBUG] Connected to remote
[INFO] Error stacktraces are turned on.
[WARN] o.h.m.e.EventSpyProcessor - Unhandled event: org.apache.maven.toolchain.building.DefaultToolchainsBuildingRequest@2c432b2e (org.apache.maven.toolchain.building.DefaultToolchainsBuildingRequest)
[WARN] o.h.m.e.EventSpyProcessor - Unhandled event: org.apache.maven.toolchain.building.DefaultToolchainsBuildingRequest@2c432b2e (org.apache.maven.toolchain.building.DefaultToolchainsBuildingRequest)
[INFO] Scanning for projects...
[WARNING] 
[WARNING] Some problems were encountered while building the effective model for org.aspectj.ajde:org.aspectj.runtime:eclipse-plugin:1.8.7-SNAPSHOT
[WARNING] 'build.plugins.plugin.version' for org.eclipse.tycho:tycho-p2-plugin is missing. @ org.eclipse.ajdt:parent:2.2.4-SNAPSHOT, /jobs/genie.ajdt/ajdt-on-eclipse-45/workspace/pom.xml, line 152, column 14
[WARNING] 'build.plugins.plugin.version' for org.eclipse.cbi.maven.plugins:eclipse-jarsigner-plugin is missing. @ org.eclipse.ajdt:parent:2.2.4-SNAPSHOT, /jobs/genie.ajdt/ajdt-on-eclipse-45/workspace/pom.xml, line 126, column 14
[WARNING] 
[WARNING] Some problems were encountered while building the effective model for org.aspectj.ajde:org.aspectj.weaver:eclipse-plugin:1.8.7-SNAPSHOT
[WARNING] 'build.plugins.plugin.version' for org.eclipse.tycho:tycho-p2-plugin is missing. @ org.eclipse.ajdt:parent:2.2.4-SNAPSHOT, /jobs/genie.ajdt/ajdt-on-eclipse-45/workspace/pom.xml, line 152, column 14
[WARNING] 'build.plugins.plugin.version' for org.eclipse.cbi.maven.plugins:eclipse-jarsigner-plugin is missing. @ org.eclipse.ajdt:parent:2.2.4-SNAPSHOT, /jobs/genie.ajdt/ajdt-on-eclipse-45/workspace/pom.xml, line 126, column 14
[WARNING] 
[WARNING] Some problems were encountered while building the effective model for org.aspectj.ajde:org.aspectj.ajde:eclipse-plugin:1.8.7-SNAPSHOT
[WARNING] 'build.plugins.plugin.version' for org.eclipse.tycho:tycho-p2-plugin is missing. @ org.eclipse.ajdt:parent:2.2.4-SNAPSHOT, /jobs/genie.ajdt/ajdt-on-eclipse-45/workspace/pom.xml, line 152, column 14
[WARNING] 'build.plugins.plugin.version' for org.eclipse.cbi.maven.plugins:eclipse-jarsigner-plugin is missing. @ org.eclipse.ajdt:parent:2.2.4-SNAPSHOT, /jobs/genie.ajdt/ajdt-on-eclipse-45/workspace/pom.xml, line 126, column 14
[WARNING] 
[WARNING] Some problems were encountered while building the effective model for org.aspectj.ajde:org.aspectj:eclipse-feature:1.8.7-SNAPSHOT
[WARNING] 'build.plugins.plugin.version' for org.eclipse.cbi.maven.plugins:eclipse-jarsigner-plugin is missing. @ org.eclipse.ajdt:parent:2.2.4-SNAPSHOT, /jobs/genie.ajdt/ajdt-on-eclipse-45/workspace/pom.xml, line 126, column 14
[WARNING] 
[WARNING] Some problems were encountered while building the effective model for org.eclipse.ajdt:org.eclipse.ajdt.core:eclipse-plugin:2.2.4-SNAPSHOT
[WARNING] 'build.plugins.plugin.version' for org.eclipse.tycho:tycho-p2-plugin is missing. @ org.eclipse.ajdt:parent:2.2.4-SNAPSHOT, /jobs/genie.ajdt/ajdt-on-eclipse-45/workspace/pom.xml, line 152, column 14
[WARNING] 'build.plugins.plugin.version' for org.eclipse.cbi.maven.plugins:eclipse-jarsigner-plugin is missing. @ org.eclipse.ajdt:parent:2.2.4-SNAPSHOT, /jobs/genie.ajdt/ajdt-on-eclipse-45/workspace/pom.xml, line 126, column 14
[WARNING] 
[WARNING] Some problems were encountered while building the effective model for org.eclipse.ajdt:org.eclipse.ajdt.doc.user:eclipse-plugin:2.2.4-SNAPSHOT
[WARNING] 'build.plugins.plugin.version' for org.eclipse.tycho:tycho-p2-plugin is missing. @ org.eclipse.ajdt:parent:2.2.4-SNAPSHOT, /jobs/genie.ajdt/ajdt-on-eclipse-45/workspace/pom.xml, line 152, column 14
[WARNING] 'build.plugins.plugin.version' for org.eclipse.cbi.maven.plugins:eclipse-jarsigner-plugin is missing. @ org.eclipse.ajdt:parent:2.2.4-SNAPSHOT, /jobs/genie.ajdt/ajdt-on-eclipse-45/workspace/pom.xml, line 126, column 14
[WARNING] 
[WARNING] Some problems were encountered while building the effective model for org.eclipse.ajdt:org.eclipse.ajdt.examples:eclipse-plugin:2.2.4-SNAPSHOT
[WARNING] 'build.plugins.plugin.version' for org.eclipse.tycho:tycho-p2-plugin is missing. @ org.eclipse.ajdt:parent:2.2.4-SNAPSHOT, /jobs/genie.ajdt/ajdt-on-eclipse-45/workspace/pom.xml, line 152, column 14
[WARNING] 'build.plugins.plugin.version' for org.eclipse.cbi.maven.plugins:eclipse-jarsigner-plugin is missing. @ org.eclipse.ajdt:parent:2.2.4-SNAPSHOT, /jobs/genie.ajdt/ajdt-on-eclipse-45/workspace/pom.xml, line 126, column 14
[WARNING] 
[WARNING] Some problems were encountered while building the effective model for org.eclipse.ajdt:org.eclipse.ajdt.ui:eclipse-plugin:2.2.4-SNAPSHOT
[WARNING] 'build.plugins.plugin.version' for org.eclipse.tycho:tycho-p2-plugin is missing. @ org.eclipse.ajdt:parent:2.2.4-SNAPSHOT, /jobs/genie.ajdt/ajdt-on-eclipse-45/workspace/pom.xml, line 152, column 14
[WARNING] 'build.plugins.plugin.version' for org.eclipse.cbi.maven.plugins:eclipse-jarsigner-plugin is missing. @ org.eclipse.ajdt:parent:2.2.4-SNAPSHOT, /jobs/genie.ajdt/ajdt-on-eclipse-45/workspace/pom.xml, line 126, column 14
[WARNING] 
[WARNING] Some problems were encountered while building the effective model for org.eclipse.ajdt:org.eclipse.aspectj:eclipse-plugin:2.2.4-SNAPSHOT
[WARNING] 'build.plugins.plugin.version' for org.eclipse.tycho:tycho-p2-plugin is missing. @ org.eclipse.ajdt:parent:2.2.4-SNAPSHOT, /jobs/genie.ajdt/ajdt-on-eclipse-45/workspace/pom.xml, line 152, column 14
[WARNING] 'build.plugins.plugin.version' for org.eclipse.cbi.maven.plugins:eclipse-jarsigner-plugin is missing. @ org.eclipse.ajdt:parent:2.2.4-SNAPSHOT, /jobs/genie.ajdt/ajdt-on-eclipse-45/workspace/pom.xml, line 126, column 14
[WARNING] 
[WARNING] Some problems were encountered while building the effective model for org.eclipse.ajdt:org.eclipse.ajdt.mylyn.ui:eclipse-plugin:2.2.4-SNAPSHOT
[WARNING] 'build.plugins.plugin.version' for org.eclipse.tycho:tycho-p2-plugin is missing. @ org.eclipse.ajdt:parent:2.2.4-SNAPSHOT, /jobs/genie.ajdt/ajdt-on-eclipse-45/workspace/pom.xml, line 152, column 14
[WARNING] 'build.plugins.plugin.version' for org.eclipse.cbi.maven.plugins:eclipse-jarsigner-plugin is missing. @ org.eclipse.ajdt:parent:2.2.4-SNAPSHOT, /jobs/genie.ajdt/ajdt-on-eclipse-45/workspace/pom.xml, line 126, column 14
[WARNING] 
[WARNING] Some problems were encountered while building the effective model for org.eclipse.ajdt:org.eclipse.contribution.weaving.jdt:eclipse-plugin:2.2.4-SNAPSHOT
[WARNING] 'build.plugins.plugin.version' for org.eclipse.tycho:tycho-p2-plugin is missing. @ org.eclipse.ajdt:parent:2.2.4-SNAPSHOT, /jobs/genie.ajdt/ajdt-on-eclipse-45/workspace/pom.xml, line 152, column 14
[WARNING] 'build.plugins.plugin.version' for org.eclipse.cbi.maven.plugins:eclipse-jarsigner-plugin is missing. @ org.eclipse.ajdt:parent:2.2.4-SNAPSHOT, /jobs/genie.ajdt/ajdt-on-eclipse-45/workspace/pom.xml, line 126, column 14
[WARNING] 
[WARNING] Some problems were encountered while building the effective model for org.eclipse.ajdt:org.eclipse.contribution.visualiser:eclipse-plugin:2.2.4-SNAPSHOT
[WARNING] 'build.plugins.plugin.version' for org.eclipse.tycho:tycho-p2-plugin is missing. @ org.eclipse.ajdt:parent:2.2.4-SNAPSHOT, /jobs/genie.ajdt/ajdt-on-eclipse-45/workspace/pom.xml, line 152, column 14
[WARNING] 'build.plugins.plugin.version' for org.eclipse.cbi.maven.plugins:eclipse-jarsigner-plugin is missing. @ org.eclipse.ajdt:parent:2.2.4-SNAPSHOT, /jobs/genie.ajdt/ajdt-on-eclipse-45/workspace/pom.xml, line 126, column 14
[WARNING] 
[WARNING] Some problems were encountered while building the effective model for org.eclipse.ajdt:org.eclipse.contribution.xref.core:eclipse-plugin:2.2.4-SNAPSHOT
[WARNING] 'build.plugins.plugin.version' for org.eclipse.tycho:tycho-p2-plugin is missing. @ org.eclipse.ajdt:parent:2.2.4-SNAPSHOT, /jobs/genie.ajdt/ajdt-on-eclipse-45/workspace/pom.xml, line 152, column 14
[WARNING] 'build.plugins.plugin.version' for org.eclipse.cbi.maven.plugins:eclipse-jarsigner-plugin is missing. @ org.eclipse.ajdt:parent:2.2.4-SNAPSHOT, /jobs/genie.ajdt/ajdt-on-eclipse-45/workspace/pom.xml, line 126, column 14
[WARNING] 
[WARNING] Some problems were encountered while building the effective model for org.eclipse.ajdt:org.eclipse.contribution.xref.ui:eclipse-plugin:2.2.4-SNAPSHOT
[WARNING] 'build.plugins.plugin.version' for org.eclipse.tycho:tycho-p2-plugin is missing. @ org.eclipse.ajdt:parent:2.2.4-SNAPSHOT, /jobs/genie.ajdt/ajdt-on-eclipse-45/workspace/pom.xml, line 152, column 14
[WARNING] 'build.plugins.plugin.version' for org.eclipse.cbi.maven.plugins:eclipse-jarsigner-plugin is missing. @ org.eclipse.ajdt:parent:2.2.4-SNAPSHOT, /jobs/genie.ajdt/ajdt-on-eclipse-45/workspace/pom.xml, line 126, column 14
[WARNING] 
[WARNING] Some problems were encountered while building the effective model for org.eclipse.ajdt:org.eclipse.ajdt:eclipse-feature:2.2.4-SNAPSHOT
[WARNING] 'build.plugins.plugin.version' for org.eclipse.cbi.maven.plugins:eclipse-jarsigner-plugin is missing. @ org.eclipse.ajdt:parent:2.2.4-SNAPSHOT, /jobs/genie.ajdt/ajdt-on-eclipse-45/workspace/pom.xml, line 126, column 14
[WARNING] 
[WARNING] Some problems were encountered while building the effective model for org.eclipse.ajdt:org.eclipse.ajdt.sdk:eclipse-feature:2.2.4-SNAPSHOT
[WARNING] 'build.plugins.plugin.version' for org.eclipse.tycho:tycho-p2-plugin is missing. @ org.eclipse.ajdt:parent:2.2.4-SNAPSHOT, /jobs/genie.ajdt/ajdt-on-eclipse-45/workspace/pom.xml, line 152, column 14
[WARNING] 'build.plugins.plugin.version' for org.eclipse.cbi.maven.plugins:eclipse-jarsigner-plugin is missing. @ org.eclipse.ajdt:parent:2.2.4-SNAPSHOT, /jobs/genie.ajdt/ajdt-on-eclipse-45/workspace/pom.xml, line 126, column 14
[WARNING] 
[WARNING] Some problems were encountered while building the effective model for org.eclipse.ajdt:org.eclipse.contribution.weaving:eclipse-feature:2.2.4-SNAPSHOT
[WARNING] 'build.plugins.plugin.version' for org.eclipse.cbi.maven.plugins:eclipse-jarsigner-plugin is missing. @ org.eclipse.ajdt:parent:2.2.4-SNAPSHOT, /jobs/genie.ajdt/ajdt-on-eclipse-45/workspace/pom.xml, line 126, column 14
[WARNING] 
[WARNING] Some problems were encountered while building the effective model for org.eclipse.ajdt:org.eclipse.contribution.xref:eclipse-feature:2.2.4-SNAPSHOT
[WARNING] 'build.plugins.plugin.version' for org.eclipse.cbi.maven.plugins:eclipse-jarsigner-plugin is missing. @ org.eclipse.ajdt:parent:2.2.4-SNAPSHOT, /jobs/genie.ajdt/ajdt-on-eclipse-45/workspace/pom.xml, line 126, column 14
[WARNING] 
[WARNING] Some problems were encountered while building the effective model for org.eclipse.ajdt:org.eclipse.equinox.weaving.aspectj:eclipse-plugin:1.0.400-SNAPSHOT
[WARNING] 'build.plugins.plugin.version' for org.eclipse.tycho:tycho-p2-plugin is missing. @ org.eclipse.ajdt:parent:2.2.4-SNAPSHOT, /jobs/genie.ajdt/ajdt-on-eclipse-45/workspace/pom.xml, line 152, column 14
[WARNING] 'build.plugins.plugin.version' for org.eclipse.cbi.maven.plugins:eclipse-jarsigner-plugin is missing. @ org.eclipse.ajdt:parent:2.2.4-SNAPSHOT, /jobs/genie.ajdt/ajdt-on-eclipse-45/workspace/pom.xml, line 126, column 14
[WARNING] 
[WARNING] Some problems were encountered while building the effective model for org.eclipse.ajdt:org.eclipse.equinox.weaving.sdk:eclipse-feature:1.2.0-SNAPSHOT
[WARNING] 'build.plugins.plugin.version' for org.eclipse.tycho:tycho-p2-plugin is missing. @ org.eclipse.ajdt:parent:2.2.4-SNAPSHOT, /jobs/genie.ajdt/ajdt-on-eclipse-45/workspace/pom.xml, line 152, column 14
[WARNING] 'build.plugins.plugin.version' for org.eclipse.cbi.maven.plugins:eclipse-jarsigner-plugin is missing. @ org.eclipse.ajdt:parent:2.2.4-SNAPSHOT, /jobs/genie.ajdt/ajdt-on-eclipse-45/workspace/pom.xml, line 126, column 14
[WARNING] 
[WARNING] Some problems were encountered while building the effective model for org.eclipse.ajdt:org.eclipse.ajdt.core.tests:eclipse-test-plugin:2.2.4-SNAPSHOT
[WARNING] 'build.plugins.plugin.version' for org.eclipse.tycho:tycho-p2-plugin is missing. @ org.eclipse.ajdt:parent:2.2.4-SNAPSHOT, /jobs/genie.ajdt/ajdt-on-eclipse-45/workspace/pom.xml, line 152, column 14
[WARNING] 'build.plugins.plugin.version' for org.eclipse.cbi.maven.plugins:eclipse-jarsigner-plugin is missing. @ org.eclipse.ajdt:parent:2.2.4-SNAPSHOT, /jobs/genie.ajdt/ajdt-on-eclipse-45/workspace/pom.xml, line 126, column 14
[WARNING] 
[WARNING] Some problems were encountered while building the effective model for org.eclipse.ajdt:org.eclipse.ajdt.ui.tests:eclipse-test-plugin:2.2.4-SNAPSHOT
[WARNING] 'build.plugins.plugin.version' for org.eclipse.tycho:tycho-p2-plugin is missing. @ org.eclipse.ajdt:parent:2.2.4-SNAPSHOT, /jobs/genie.ajdt/ajdt-on-eclipse-45/workspace/pom.xml, line 152, column 14
[WARNING] 'build.plugins.plugin.version' for org.eclipse.cbi.maven.plugins:eclipse-jarsigner-plugin is missing. @ org.eclipse.ajdt:parent:2.2.4-SNAPSHOT, /jobs/genie.ajdt/ajdt-on-eclipse-45/workspace/pom.xml, line 126, column 14
[WARNING] 
[WARNING] Some problems were encountered while building the effective model for org.eclipse.ajdt:org.eclipse.ajdt.mylyn.ui.tests:eclipse-plugin:2.2.4-SNAPSHOT
[WARNING] 'build.plugins.plugin.version' for org.eclipse.tycho:tycho-p2-plugin is missing. @ org.eclipse.ajdt:parent:2.2.4-SNAPSHOT, /jobs/genie.ajdt/ajdt-on-eclipse-45/workspace/pom.xml, line 152, column 14
[WARNING] 'build.plugins.plugin.version' for org.eclipse.cbi.maven.plugins:eclipse-jarsigner-plugin is missing. @ org.eclipse.ajdt:parent:2.2.4-SNAPSHOT, /jobs/genie.ajdt/ajdt-on-eclipse-45/workspace/pom.xml, line 126, column 14
[WARNING] 
[WARNING] Some problems were encountered while building the effective model for org.eclipse.ajdt:org.eclipse.contribution.weaving.jdt.tests:eclipse-test-plugin:2.2.4-SNAPSHOT
[WARNING] 'build.plugins.plugin.version' for org.eclipse.tycho:tycho-p2-plugin is missing. @ org.eclipse.ajdt:parent:2.2.4-SNAPSHOT, /jobs/genie.ajdt/ajdt-on-eclipse-45/workspace/pom.xml, line 152, column 14
[WARNING] 'build.plugins.plugin.version' for org.eclipse.cbi.maven.plugins:eclipse-jarsigner-plugin is missing. @ org.eclipse.ajdt:parent:2.2.4-SNAPSHOT, /jobs/genie.ajdt/ajdt-on-eclipse-45/workspace/pom.xml, line 126, column 14
[WARNING] 
[WARNING] Some problems were encountered while building the effective model for org.eclipse.ajdt:org.eclipse.contribution.visualiser.tests:eclipse-test-plugin:2.2.4-SNAPSHOT
[WARNING] 'build.plugins.plugin.version' for org.eclipse.tycho:tycho-p2-plugin is missing. @ org.eclipse.ajdt:parent:2.2.4-SNAPSHOT, /jobs/genie.ajdt/ajdt-on-eclipse-45/workspace/pom.xml, line 152, column 14
[WARNING] 'build.plugins.plugin.version' for org.eclipse.cbi.maven.plugins:eclipse-jarsigner-plugin is missing. @ org.eclipse.ajdt:parent:2.2.4-SNAPSHOT, /jobs/genie.ajdt/ajdt-on-eclipse-45/workspace/pom.xml, line 126, column 14
[WARNING] 
[WARNING] Some problems were encountered while building the effective model for org.eclipse.ajdt:org.eclipse.contribution.xref.core.tests:eclipse-test-plugin:2.2.4-SNAPSHOT
[WARNING] 'build.plugins.plugin.version' for org.eclipse.tycho:tycho-p2-plugin is missing. @ org.eclipse.ajdt:parent:2.2.4-SNAPSHOT, /jobs/genie.ajdt/ajdt-on-eclipse-45/workspace/pom.xml, line 152, column 14
[WARNING] 'build.plugins.plugin.version' for org.eclipse.cbi.maven.plugins:eclipse-jarsigner-plugin is missing. @ org.eclipse.ajdt:parent:2.2.4-SNAPSHOT, /jobs/genie.ajdt/ajdt-on-eclipse-45/workspace/pom.xml, line 126, column 14
[WARNING] 
[WARNING] Some problems were encountered while building the effective model for org.eclipse.ajdt:org.eclipse.contribution.xref.ui.tests:eclipse-test-plugin:2.2.4-SNAPSHOT
[WARNING] 'build.plugins.plugin.version' for org.eclipse.tycho:tycho-p2-plugin is missing. @ org.eclipse.ajdt:parent:2.2.4-SNAPSHOT, /jobs/genie.ajdt/ajdt-on-eclipse-45/workspace/pom.xml, line 152, column 14
[WARNING] 'build.plugins.plugin.version' for org.eclipse.cbi.maven.plugins:eclipse-jarsigner-plugin is missing. @ org.eclipse.ajdt:parent:2.2.4-SNAPSHOT, /jobs/genie.ajdt/ajdt-on-eclipse-45/workspace/pom.xml, line 126, column 14
[WARNING] 
[WARNING] Some problems were encountered while building the effective model for org.eclipse.ajdt:org.eclipse.aspectj.feature_tests:eclipse-feature:2.2.4-SNAPSHOT
[WARNING] 'build.plugins.plugin.version' for org.eclipse.tycho:tycho-p2-plugin is missing. @ org.eclipse.ajdt:parent:2.2.4-SNAPSHOT, /jobs/genie.ajdt/ajdt-on-eclipse-45/workspace/pom.xml, line 152, column 14
[WARNING] 'build.plugins.plugin.version' for org.eclipse.cbi.maven.plugins:eclipse-jarsigner-plugin is missing. @ org.eclipse.ajdt:parent:2.2.4-SNAPSHOT, /jobs/genie.ajdt/ajdt-on-eclipse-45/workspace/pom.xml, line 126, column 14
[WARNING] 
[WARNING] Some problems were encountered while building the effective model for org.eclipse.ajdt:org.eclipse.ajdt.releng:eclipse-repository:2.2.4-SNAPSHOT
[WARNING] 'build.plugins.plugin.version' for org.eclipse.tycho:tycho-p2-plugin is missing. @ org.eclipse.ajdt:parent:2.2.4-SNAPSHOT, /jobs/genie.ajdt/ajdt-on-eclipse-45/workspace/pom.xml, line 152, column 14
[WARNING] 'build.plugins.plugin.version' for org.eclipse.cbi.maven.plugins:eclipse-jarsigner-plugin is missing. @ org.eclipse.ajdt:parent:2.2.4-SNAPSHOT, /jobs/genie.ajdt/ajdt-on-eclipse-45/workspace/pom.xml, line 126, column 14
[WARNING] 
[WARNING] Some problems were encountered while building the effective model for org.eclipse.ajdt:parent:pom:2.2.4-SNAPSHOT
[WARNING] 'build.plugins.plugin.version' for org.eclipse.tycho:tycho-p2-plugin is missing. @ line 152, column 14
[WARNING] 'build.plugins.plugin.version' for org.eclipse.cbi.maven.plugins:eclipse-jarsigner-plugin is missing. @ line 126, column 14
[WARNING] 
[WARNING] It is highly recommended to fix these problems because they threaten the stability of your build.
[WARNING] 
[WARNING] For this reason, future Maven versions might no longer support building such malformed projects.
[WARNING] 
Downloading: https://repo.maven.apache.org/maven2/org/eclipse/cbi/maven/plugins/eclipse-jarsigner-plugin/maven-metadata.xml
[INFO] o.h.m.e.h.MavenExecutionResultHandler - Build failed with exception(s)
[INFO] o.h.m.e.h.MavenExecutionResultHandler - [1] org.apache.maven.InternalErrorException: Internal error: java.lang.RuntimeException: org.apache.maven.MavenExecutionException: Could not setup plugin ClassRealm
[DEBUG] Closing connection to remote
[ERROR] Internal error: java.lang.RuntimeException: org.apache.maven.MavenExecutionException: Could not setup plugin ClassRealm: Error resolving version for plugin 'org.eclipse.cbi.maven.plugins:eclipse-jarsigner-plugin' from the repositories [local (/home/hudson/genie.ajdt/.hudson/jobs/ajdt-on-eclipse-45/workspace/.maven/repo), central (https://repo.maven.apache.org/maven2)]: Plugin not found in any plugin repository -> [Help 1]
org.apache.maven.InternalErrorException: Internal error: java.lang.RuntimeException: org.apache.maven.MavenExecutionException: Could not setup plugin ClassRealm
	at org.apache.maven.DefaultMaven.execute(DefaultMaven.java:121)
	at org.apache.maven.cli.MavenCli.execute(MavenCli.java:863)
	at org.apache.maven.cli.MavenCli.doMain(MavenCli.java:288)
	at org.apache.maven.cli.MavenCli.main(MavenCli.java:199)
	at sun.reflect.NativeMethodAccessorImpl.invoke0(Native Method)
	at sun.reflect.NativeMethodAccessorImpl.invoke(NativeMethodAccessorImpl.java:57)
	at sun.reflect.DelegatingMethodAccessorImpl.invoke(DelegatingMethodAccessorImpl.java:43)
	at java.lang.reflect.Method.invoke(Method.java:606)
	at org.codehaus.plexus.classworlds.launcher.Launcher.launchEnhanced(Launcher.java:289)
	at org.codehaus.plexus.classworlds.launcher.Launcher.launch(Launcher.java:229)
	at org.codehaus.plexus.classworlds.launcher.Launcher.mainWithExitCode(Launcher.java:415)
	at org.codehaus.plexus.classworlds.launcher.Launcher.main(Launcher.java:356)
Caused by: java.lang.RuntimeException: org.apache.maven.MavenExecutionException: Could not setup plugin ClassRealm
	at org.eclipse.tycho.p2.resolver.P2DependencyResolver.getDependencyMetadata(P2DependencyResolver.java:174)
	at org.eclipse.tycho.p2.resolver.P2DependencyResolver.setupProjects(P2DependencyResolver.java:130)
	at org.eclipse.tycho.core.resolver.DefaultTychoResolver.setupProject(DefaultTychoResolver.java:96)
	at org.eclipse.tycho.core.maven.TychoMavenLifecycleParticipant.afterProjectsRead(TychoMavenLifecycleParticipant.java:90)
	at org.apache.maven.DefaultMaven.doExecute(DefaultMaven.java:266)
	at org.apache.maven.DefaultMaven.doExecute(DefaultMaven.java:193)
	at org.apache.maven.DefaultMaven.execute(DefaultMaven.java:106)
	... 11 more
Caused by: org.apache.maven.MavenExecutionException: Could not setup plugin ClassRealm
	at org.eclipse.tycho.core.maven.utils.PluginRealmHelper.newMavenExecutionException(PluginRealmHelper.java:154)
	at org.eclipse.tycho.core.maven.utils.PluginRealmHelper.execute(PluginRealmHelper.java:143)
	at org.eclipse.tycho.p2.resolver.P2DependencyResolver.getDependencyMetadata(P2DependencyResolver.java:152)
	... 17 more
Caused by: org.apache.maven.plugin.version.PluginVersionResolutionException: Error resolving version for plugin 'org.eclipse.cbi.maven.plugins:eclipse-jarsigner-plugin' from the repositories [local (/home/hudson/genie.ajdt/.hudson/jobs/ajdt-on-eclipse-45/workspace/.maven/repo), central (https://repo.maven.apache.org/maven2)]: Plugin not found in any plugin repository
	at org.apache.maven.plugin.version.internal.DefaultPluginVersionResolver.selectVersion(DefaultPluginVersionResolver.java:236)
	at org.apache.maven.plugin.version.internal.DefaultPluginVersionResolver.resolveFromRepository(DefaultPluginVersionResolver.java:148)
	at org.apache.maven.plugin.version.internal.DefaultPluginVersionResolver.resolve(DefaultPluginVersionResolver.java:96)
	at org.apache.maven.lifecycle.internal.LifecyclePluginResolver.resolveMissingPluginVersions(LifecyclePluginResolver.java:71)
	at org.eclipse.tycho.core.maven.utils.PluginRealmHelper.execute(PluginRealmHelper.java:98)
	... 18 more
[ERROR] 
[ERROR] Re-run Maven using the -X switch to enable full debug logging.
[ERROR] 
[ERROR] For more information about the errors and possible solutions, please read the following articles:
[ERROR] [Help 1] http://cwiki.apache.org/confluence/display/MAVEN/InternalErrorException
[DEBUG] Waiting for process to finish
[DEBUG] Result: 1
Terminating xvnc.
Window manager warning: Fatal IO error 11 (Resource temporarily unavailable) on display ':1421'.
Recording test results
Finished: FAILURE