FailedConsole Output

Skipping 2,927 KB.. Full Log
_80/jre/lib/ext/zipfs.jar:/opt/public/common/jdk1.7.0_80/jre/lib/ext/sunec.jar:/opt/public/common/jdk1.7.0_80/jre/lib/ext/sunjce_provider.jar:/opt/public/common/jdk1.7.0_80/jre/lib/ext/localedata.jar:/jobs/genie.ajdt/ajdt-on-eclipse-45/workspace/org.eclipse.ajdt.core.tests/target/work/configuration/org.eclipse.osgi/40/0/.cp/junit.jar:/jobs/genie.ajdt/ajdt-on-eclipse-45/workspace/org.eclipse.ajdt.core.tests/target/work/configuration/org.eclipse.osgi/218/0/.cp:
Timer event: 2ms: Pre compile
Compiler configuration for project DefaultEmptyProject has been read by compiler.  Resetting.
     Configuration was []
Resetting list of modified source files.  Was []
AJC: compiling source files
Timer event: 36ms: Time to first compiled message
AJC: compiled: /jobs/genie.ajdt/ajdt-on-eclipse-45/workspace/org.eclipse.ajdt.core.tests/target/work/data/DefaultEmptyProject/src/p/Aspect.aj
Timer event: 38ms: Time to first woven message
AJC: woven aspect p.Aspect (from /jobs/genie.ajdt/ajdt-on-eclipse-45/workspace/org.eclipse.ajdt.core.tests/target/work/data/DefaultEmptyProject/src/p/Aspect.aj)
AJC: compiled: /jobs/genie.ajdt/ajdt-on-eclipse-45/workspace/org.eclipse.ajdt.core.tests/target/work/data/DefaultEmptyProject/src/p/Java.java
AJC: woven class p.Java (from /jobs/genie.ajdt/ajdt-on-eclipse-45/workspace/org.eclipse.ajdt.core.tests/target/work/data/DefaultEmptyProject/src/p/Java.java)
AJC: compiled: /jobs/genie.ajdt/ajdt-on-eclipse-45/workspace/org.eclipse.ajdt.core.tests/target/work/data/DefaultEmptyProject/src/p/Other.java
AJC: woven class p.Other (from /jobs/genie.ajdt/ajdt-on-eclipse-45/workspace/org.eclipse.ajdt.core.tests/target/work/data/DefaultEmptyProject/src/p/Other.java)
AJDE Callback: finish. Was full build: true
Timer event: 42ms: Total time spent in AJDE
Timer event: 0ms: Refresh after build
Types affected during build = 3
Timer event: 45ms: Total time spent in AJBuilder.build()
Timer event: 1ms: Delete markers: DefaultEmptyProject (Finished deleting markers for DefaultEmptyProject)
Timer event: 2ms: Create markers: DefaultEmptyProject (Finished creating markers for DefaultEmptyProject)
Created 2 markers in 3 files
------------------------
Starting testMoveTypeInDeclareParentsOther2
Timer event: 0ms: Update visualizer, xref, advice listeners for (separate thread): DefaultEmptyProject
===========================================================================================
Build kind = FULLBUILD
Project=DefaultEmptyProject, kind of build requested=Full AspectJ compilation
Timer event: 0ms: Flush included source file cache
Timer event: 0ms: Check delta
Builder: Tidied output folder(s), removed class files and derived resources
Classpath = /jobs/genie.ajdt/ajdt-on-eclipse-45/workspace/org.eclipse.ajdt.core.tests/target/work/data/DefaultEmptyProject/bin:/jobs/genie.ajdt/ajdt-on-eclipse-45/workspace/org.aspectj.runtime/target/org.aspectj.runtime-1.8.9-SNAPSHOT.jar:/opt/public/common/jdk1.7.0_80/jre/lib/resources.jar:/opt/public/common/jdk1.7.0_80/jre/lib/rt.jar:/opt/public/common/jdk1.7.0_80/jre/lib/jsse.jar:/opt/public/common/jdk1.7.0_80/jre/lib/jce.jar:/opt/public/common/jdk1.7.0_80/jre/lib/charsets.jar:/opt/public/common/jdk1.7.0_80/jre/lib/jfr.jar:/opt/public/common/jdk1.7.0_80/jre/lib/ext/dnsns.jar:/opt/public/common/jdk1.7.0_80/jre/lib/ext/sunpkcs11.jar:/opt/public/common/jdk1.7.0_80/jre/lib/ext/zipfs.jar:/opt/public/common/jdk1.7.0_80/jre/lib/ext/sunec.jar:/opt/public/common/jdk1.7.0_80/jre/lib/ext/sunjce_provider.jar:/opt/public/common/jdk1.7.0_80/jre/lib/ext/localedata.jar:/jobs/genie.ajdt/ajdt-on-eclipse-45/workspace/org.eclipse.ajdt.core.tests/target/work/configuration/org.eclipse.osgi/40/0/.cp/junit.jar:/jobs/genie.ajdt/ajdt-on-eclipse-45/workspace/org.eclipse.ajdt.core.tests/target/work/configuration/org.eclipse.osgi/218/0/.cp:
Timer event: 6ms: Pre compile
Compiler configuration for project DefaultEmptyProject has been read by compiler.  Resetting.
     Configuration was []
Resetting list of modified source files.  Was []
AJC: compiling source files
Timer event: 35ms: Time to first compiled message
AJC: compiled: /jobs/genie.ajdt/ajdt-on-eclipse-45/workspace/org.eclipse.ajdt.core.tests/target/work/data/DefaultEmptyProject/src/p/Aspect.aj
Timer event: 36ms: Time to first woven message
AJC: woven aspect p.Aspect (from /jobs/genie.ajdt/ajdt-on-eclipse-45/workspace/org.eclipse.ajdt.core.tests/target/work/data/DefaultEmptyProject/src/p/Aspect.aj)
AJC: compiled: /jobs/genie.ajdt/ajdt-on-eclipse-45/workspace/org.eclipse.ajdt.core.tests/target/work/data/DefaultEmptyProject/src/p/Java.java
AJC: woven class p.Java (from /jobs/genie.ajdt/ajdt-on-eclipse-45/workspace/org.eclipse.ajdt.core.tests/target/work/data/DefaultEmptyProject/src/p/Java.java)
AJC: compiled: /jobs/genie.ajdt/ajdt-on-eclipse-45/workspace/org.eclipse.ajdt.core.tests/target/work/data/DefaultEmptyProject/src/p/Other.java
AJC: woven class p.Other (from /jobs/genie.ajdt/ajdt-on-eclipse-45/workspace/org.eclipse.ajdt.core.tests/target/work/data/DefaultEmptyProject/src/p/Other.java)
AJDE Callback: finish. Was full build: true
Timer event: 41ms: Total time spent in AJDE
Timer event: 0ms: Refresh after build
Types affected during build = 3
Timer event: 48ms: Total time spent in AJBuilder.build()
Timer event: 4ms: Delete markers: DefaultEmptyProject (Finished deleting markers for DefaultEmptyProject)
Timer event: 2ms: Create markers: DefaultEmptyProject (Finished creating markers for DefaultEmptyProject)
Created 2 markers in 3 files
Timer event: 0ms: Update visualizer, xref, advice listeners for (separate thread): DefaultEmptyProject
===========================================================================================
Build kind = FULLBUILD
Project=DefaultEmptyProject, kind of build requested=Full AspectJ compilation
Timer event: 0ms: Flush included source file cache
Timer event: 0ms: Check delta
Builder: Tidied output folder(s), removed class files and derived resources
Classpath = /jobs/genie.ajdt/ajdt-on-eclipse-45/workspace/org.eclipse.ajdt.core.tests/target/work/data/DefaultEmptyProject/bin:/jobs/genie.ajdt/ajdt-on-eclipse-45/workspace/org.aspectj.runtime/target/org.aspectj.runtime-1.8.9-SNAPSHOT.jar:/opt/public/common/jdk1.7.0_80/jre/lib/resources.jar:/opt/public/common/jdk1.7.0_80/jre/lib/rt.jar:/opt/public/common/jdk1.7.0_80/jre/lib/jsse.jar:/opt/public/common/jdk1.7.0_80/jre/lib/jce.jar:/opt/public/common/jdk1.7.0_80/jre/lib/charsets.jar:/opt/public/common/jdk1.7.0_80/jre/lib/jfr.jar:/opt/public/common/jdk1.7.0_80/jre/lib/ext/dnsns.jar:/opt/public/common/jdk1.7.0_80/jre/lib/ext/sunpkcs11.jar:/opt/public/common/jdk1.7.0_80/jre/lib/ext/zipfs.jar:/opt/public/common/jdk1.7.0_80/jre/lib/ext/sunec.jar:/opt/public/common/jdk1.7.0_80/jre/lib/ext/sunjce_provider.jar:/opt/public/common/jdk1.7.0_80/jre/lib/ext/localedata.jar:/jobs/genie.ajdt/ajdt-on-eclipse-45/workspace/org.eclipse.ajdt.core.tests/target/work/configuration/org.eclipse.osgi/40/0/.cp/junit.jar:/jobs/genie.ajdt/ajdt-on-eclipse-45/workspace/org.eclipse.ajdt.core.tests/target/work/configuration/org.eclipse.osgi/218/0/.cp:
Timer event: 2ms: Pre compile
Compiler configuration for project DefaultEmptyProject has been read by compiler.  Resetting.
     Configuration was []
Resetting list of modified source files.  Was []
AJC: compiling source files
Timer event: 36ms: Time to first compiled message
AJC: compiled: /jobs/genie.ajdt/ajdt-on-eclipse-45/workspace/org.eclipse.ajdt.core.tests/target/work/data/DefaultEmptyProject/src/p/Aspect.aj
Timer event: 38ms: Time to first woven message
AJC: woven aspect p.Aspect (from /jobs/genie.ajdt/ajdt-on-eclipse-45/workspace/org.eclipse.ajdt.core.tests/target/work/data/DefaultEmptyProject/src/p/Aspect.aj)
AJC: compiled: /jobs/genie.ajdt/ajdt-on-eclipse-45/workspace/org.eclipse.ajdt.core.tests/target/work/data/DefaultEmptyProject/src/p/Java.java
AJC: woven class p.Java (from /jobs/genie.ajdt/ajdt-on-eclipse-45/workspace/org.eclipse.ajdt.core.tests/target/work/data/DefaultEmptyProject/src/p/Java.java)
AJC: compiled: /jobs/genie.ajdt/ajdt-on-eclipse-45/workspace/org.eclipse.ajdt.core.tests/target/work/data/DefaultEmptyProject/src/p/Other.java
AJC: woven class p.Other (from /jobs/genie.ajdt/ajdt-on-eclipse-45/workspace/org.eclipse.ajdt.core.tests/target/work/data/DefaultEmptyProject/src/p/Other.java)
AJDE Callback: finish. Was full build: true
Timer event: 43ms: Total time spent in AJDE
Timer event: 0ms: Refresh after build
Types affected during build = 3
Timer event: 46ms: Total time spent in AJBuilder.build()
Timer event: 1ms: Delete markers: DefaultEmptyProject (Finished deleting markers for DefaultEmptyProject)
Timer event: 2ms: Create markers: DefaultEmptyProject (Finished creating markers for DefaultEmptyProject)
Created 2 markers in 3 files
------------------------
Starting testMoveTypeInDeclareParentsOther6
Timer event: 0ms: Update visualizer, xref, advice listeners for (separate thread): DefaultEmptyProject
===========================================================================================
Build kind = FULLBUILD
Project=DefaultEmptyProject, kind of build requested=Full AspectJ compilation
Timer event: 0ms: Flush included source file cache
Timer event: 0ms: Check delta
Builder: Tidied output folder(s), removed class files and derived resources
Classpath = /jobs/genie.ajdt/ajdt-on-eclipse-45/workspace/org.eclipse.ajdt.core.tests/target/work/data/DefaultEmptyProject/bin:/jobs/genie.ajdt/ajdt-on-eclipse-45/workspace/org.aspectj.runtime/target/org.aspectj.runtime-1.8.9-SNAPSHOT.jar:/opt/public/common/jdk1.7.0_80/jre/lib/resources.jar:/opt/public/common/jdk1.7.0_80/jre/lib/rt.jar:/opt/public/common/jdk1.7.0_80/jre/lib/jsse.jar:/opt/public/common/jdk1.7.0_80/jre/lib/jce.jar:/opt/public/common/jdk1.7.0_80/jre/lib/charsets.jar:/opt/public/common/jdk1.7.0_80/jre/lib/jfr.jar:/opt/public/common/jdk1.7.0_80/jre/lib/ext/dnsns.jar:/opt/public/common/jdk1.7.0_80/jre/lib/ext/sunpkcs11.jar:/opt/public/common/jdk1.7.0_80/jre/lib/ext/zipfs.jar:/opt/public/common/jdk1.7.0_80/jre/lib/ext/sunec.jar:/opt/public/common/jdk1.7.0_80/jre/lib/ext/sunjce_provider.jar:/opt/public/common/jdk1.7.0_80/jre/lib/ext/localedata.jar:/jobs/genie.ajdt/ajdt-on-eclipse-45/workspace/org.eclipse.ajdt.core.tests/target/work/configuration/org.eclipse.osgi/40/0/.cp/junit.jar:/jobs/genie.ajdt/ajdt-on-eclipse-45/workspace/org.eclipse.ajdt.core.tests/target/work/configuration/org.eclipse.osgi/218/0/.cp:
Timer event: 9ms: Pre compile
Compiler configuration for project DefaultEmptyProject has been read by compiler.  Resetting.
     Configuration was []
Resetting list of modified source files.  Was []
AJC: compiling source files
Timer event: 44ms: Time to first compiled message
AJC: compiled: /jobs/genie.ajdt/ajdt-on-eclipse-45/workspace/org.eclipse.ajdt.core.tests/target/work/data/DefaultEmptyProject/src/p/Aspect.aj
Timer event: 46ms: Time to first woven message
AJC: woven aspect p.Aspect (from /jobs/genie.ajdt/ajdt-on-eclipse-45/workspace/org.eclipse.ajdt.core.tests/target/work/data/DefaultEmptyProject/src/p/Aspect.aj)
AJC: compiled: /jobs/genie.ajdt/ajdt-on-eclipse-45/workspace/org.eclipse.ajdt.core.tests/target/work/data/DefaultEmptyProject/src/q/Other.java
AJC: woven class q.Other (from /jobs/genie.ajdt/ajdt-on-eclipse-45/workspace/org.eclipse.ajdt.core.tests/target/work/data/DefaultEmptyProject/src/q/Other.java)
AJC: compiled: /jobs/genie.ajdt/ajdt-on-eclipse-45/workspace/org.eclipse.ajdt.core.tests/target/work/data/DefaultEmptyProject/src/p/Java.java
AJC: woven class p.Java (from /jobs/genie.ajdt/ajdt-on-eclipse-45/workspace/org.eclipse.ajdt.core.tests/target/work/data/DefaultEmptyProject/src/p/Java.java)
AJDE Callback: finish. Was full build: true
Timer event: 52ms: Total time spent in AJDE
Timer event: 0ms: Refresh after build
Types affected during build = 3
Timer event: 61ms: Total time spent in AJBuilder.build()
Timer event: 5ms: Delete markers: DefaultEmptyProject (Finished deleting markers for DefaultEmptyProject)
Timer event: 3ms: Create markers: DefaultEmptyProject (Finished creating markers for DefaultEmptyProject)
Created 2 markers in 3 files
Timer event: 0ms: Update visualizer, xref, advice listeners for (separate thread): DefaultEmptyProject
===========================================================================================
Build kind = FULLBUILD
Project=DefaultEmptyProject, kind of build requested=Full AspectJ compilation
Timer event: 0ms: Flush included source file cache
Timer event: 0ms: Check delta
Builder: Tidied output folder(s), removed class files and derived resources
Classpath = /jobs/genie.ajdt/ajdt-on-eclipse-45/workspace/org.eclipse.ajdt.core.tests/target/work/data/DefaultEmptyProject/bin:/jobs/genie.ajdt/ajdt-on-eclipse-45/workspace/org.aspectj.runtime/target/org.aspectj.runtime-1.8.9-SNAPSHOT.jar:/opt/public/common/jdk1.7.0_80/jre/lib/resources.jar:/opt/public/common/jdk1.7.0_80/jre/lib/rt.jar:/opt/public/common/jdk1.7.0_80/jre/lib/jsse.jar:/opt/public/common/jdk1.7.0_80/jre/lib/jce.jar:/opt/public/common/jdk1.7.0_80/jre/lib/charsets.jar:/opt/public/common/jdk1.7.0_80/jre/lib/jfr.jar:/opt/public/common/jdk1.7.0_80/jre/lib/ext/dnsns.jar:/opt/public/common/jdk1.7.0_80/jre/lib/ext/sunpkcs11.jar:/opt/public/common/jdk1.7.0_80/jre/lib/ext/zipfs.jar:/opt/public/common/jdk1.7.0_80/jre/lib/ext/sunec.jar:/opt/public/common/jdk1.7.0_80/jre/lib/ext/sunjce_provider.jar:/opt/public/common/jdk1.7.0_80/jre/lib/ext/localedata.jar:/jobs/genie.ajdt/ajdt-on-eclipse-45/workspace/org.eclipse.ajdt.core.tests/target/work/configuration/org.eclipse.osgi/40/0/.cp/junit.jar:/jobs/genie.ajdt/ajdt-on-eclipse-45/workspace/org.eclipse.ajdt.core.tests/target/work/configuration/org.eclipse.osgi/218/0/.cp:
Timer event: 2ms: Pre compile
Compiler configuration for project DefaultEmptyProject has been read by compiler.  Resetting.
     Configuration was []
Resetting list of modified source files.  Was []
AJC: compiling source files
Timer event: 39ms: Time to first compiled message
AJC: compiled: /jobs/genie.ajdt/ajdt-on-eclipse-45/workspace/org.eclipse.ajdt.core.tests/target/work/data/DefaultEmptyProject/src/p/Aspect.aj
Timer event: 40ms: Time to first woven message
AJC: woven aspect p.Aspect (from /jobs/genie.ajdt/ajdt-on-eclipse-45/workspace/org.eclipse.ajdt.core.tests/target/work/data/DefaultEmptyProject/src/p/Aspect.aj)
AJC: compiled: /jobs/genie.ajdt/ajdt-on-eclipse-45/workspace/org.eclipse.ajdt.core.tests/target/work/data/DefaultEmptyProject/src/q/Other.java
AJC: woven class q.Other (from /jobs/genie.ajdt/ajdt-on-eclipse-45/workspace/org.eclipse.ajdt.core.tests/target/work/data/DefaultEmptyProject/src/q/Other.java)
AJC: compiled: /jobs/genie.ajdt/ajdt-on-eclipse-45/workspace/org.eclipse.ajdt.core.tests/target/work/data/DefaultEmptyProject/src/p/Java.java
AJC: woven class p.Java (from /jobs/genie.ajdt/ajdt-on-eclipse-45/workspace/org.eclipse.ajdt.core.tests/target/work/data/DefaultEmptyProject/src/p/Java.java)
AJDE Callback: finish. Was full build: true
Timer event: 45ms: Total time spent in AJDE
Timer event: 0ms: Refresh after build
Types affected during build = 3
Timer event: 48ms: Total time spent in AJBuilder.build()
Timer event: 1ms: Delete markers: DefaultEmptyProject (Finished deleting markers for DefaultEmptyProject)
Timer event: 2ms: Create markers: DefaultEmptyProject (Finished creating markers for DefaultEmptyProject)
Created 2 markers in 3 files
------------------------
Starting testMoveTypeInDeclareParentsComplex1
Timer event: 0ms: Update visualizer, xref, advice listeners for (separate thread): DefaultEmptyProject
===========================================================================================
Build kind = FULLBUILD
Project=DefaultEmptyProject, kind of build requested=Full AspectJ compilation
Timer event: 0ms: Flush included source file cache
Timer event: 0ms: Check delta
Builder: Tidied output folder(s), removed class files and derived resources
Classpath = /jobs/genie.ajdt/ajdt-on-eclipse-45/workspace/org.eclipse.ajdt.core.tests/target/work/data/DefaultEmptyProject/bin:/jobs/genie.ajdt/ajdt-on-eclipse-45/workspace/org.aspectj.runtime/target/org.aspectj.runtime-1.8.9-SNAPSHOT.jar:/opt/public/common/jdk1.7.0_80/jre/lib/resources.jar:/opt/public/common/jdk1.7.0_80/jre/lib/rt.jar:/opt/public/common/jdk1.7.0_80/jre/lib/jsse.jar:/opt/public/common/jdk1.7.0_80/jre/lib/jce.jar:/opt/public/common/jdk1.7.0_80/jre/lib/charsets.jar:/opt/public/common/jdk1.7.0_80/jre/lib/jfr.jar:/opt/public/common/jdk1.7.0_80/jre/lib/ext/dnsns.jar:/opt/public/common/jdk1.7.0_80/jre/lib/ext/sunpkcs11.jar:/opt/public/common/jdk1.7.0_80/jre/lib/ext/zipfs.jar:/opt/public/common/jdk1.7.0_80/jre/lib/ext/sunec.jar:/opt/public/common/jdk1.7.0_80/jre/lib/ext/sunjce_provider.jar:/opt/public/common/jdk1.7.0_80/jre/lib/ext/localedata.jar:/jobs/genie.ajdt/ajdt-on-eclipse-45/workspace/org.eclipse.ajdt.core.tests/target/work/configuration/org.eclipse.osgi/40/0/.cp/junit.jar:/jobs/genie.ajdt/ajdt-on-eclipse-45/workspace/org.eclipse.ajdt.core.tests/target/work/configuration/org.eclipse.osgi/218/0/.cp:
Timer event: 7ms: Pre compile
Compiler configuration for project DefaultEmptyProject has been read by compiler.  Resetting.
     Configuration was []
Resetting list of modified source files.  Was []
AJC: compiling source files
Timer event: 37ms: Time to first compiled message
AJC: compiled: /jobs/genie.ajdt/ajdt-on-eclipse-45/workspace/org.eclipse.ajdt.core.tests/target/work/data/DefaultEmptyProject/src/p/Aspect.aj
Timer event: 38ms: Time to first woven message
AJC: woven aspect p.Aspect (from /jobs/genie.ajdt/ajdt-on-eclipse-45/workspace/org.eclipse.ajdt.core.tests/target/work/data/DefaultEmptyProject/src/p/Aspect.aj)
AJC: compiled: /jobs/genie.ajdt/ajdt-on-eclipse-45/workspace/org.eclipse.ajdt.core.tests/target/work/data/DefaultEmptyProject/src/p/Other.java
AJC: woven class p.Other (from /jobs/genie.ajdt/ajdt-on-eclipse-45/workspace/org.eclipse.ajdt.core.tests/target/work/data/DefaultEmptyProject/src/p/Other.java)
AJC: compiled: /jobs/genie.ajdt/ajdt-on-eclipse-45/workspace/org.eclipse.ajdt.core.tests/target/work/data/DefaultEmptyProject/src/p/Annotation.java
AJC: woven class p.Annotation (from /jobs/genie.ajdt/ajdt-on-eclipse-45/workspace/org.eclipse.ajdt.core.tests/target/work/data/DefaultEmptyProject/src/p/Annotation.java)
AJDE Callback: finish. Was full build: true
Timer event: 43ms: Total time spent in AJDE
Timer event: 0ms: Refresh after build
Types affected during build = 3
Timer event: 50ms: Total time spent in AJBuilder.build()
Timer event: 4ms: Delete markers: DefaultEmptyProject (Finished deleting markers for DefaultEmptyProject)
Timer event: 1ms: Create markers: DefaultEmptyProject (Finished creating markers for DefaultEmptyProject)
Created 0 markers in 3 files
Timer event: 1ms: Update visualizer, xref, advice listeners for (separate thread): DefaultEmptyProject
===========================================================================================
Build kind = FULLBUILD
Project=DefaultEmptyProject, kind of build requested=Full AspectJ compilation
Timer event: 0ms: Flush included source file cache
Timer event: 1ms: Check delta
Builder: Tidied output folder(s), removed class files and derived resources
Classpath = /jobs/genie.ajdt/ajdt-on-eclipse-45/workspace/org.eclipse.ajdt.core.tests/target/work/data/DefaultEmptyProject/bin:/jobs/genie.ajdt/ajdt-on-eclipse-45/workspace/org.aspectj.runtime/target/org.aspectj.runtime-1.8.9-SNAPSHOT.jar:/opt/public/common/jdk1.7.0_80/jre/lib/resources.jar:/opt/public/common/jdk1.7.0_80/jre/lib/rt.jar:/opt/public/common/jdk1.7.0_80/jre/lib/jsse.jar:/opt/public/common/jdk1.7.0_80/jre/lib/jce.jar:/opt/public/common/jdk1.7.0_80/jre/lib/charsets.jar:/opt/public/common/jdk1.7.0_80/jre/lib/jfr.jar:/opt/public/common/jdk1.7.0_80/jre/lib/ext/dnsns.jar:/opt/public/common/jdk1.7.0_80/jre/lib/ext/sunpkcs11.jar:/opt/public/common/jdk1.7.0_80/jre/lib/ext/zipfs.jar:/opt/public/common/jdk1.7.0_80/jre/lib/ext/sunec.jar:/opt/public/common/jdk1.7.0_80/jre/lib/ext/sunjce_provider.jar:/opt/public/common/jdk1.7.0_80/jre/lib/ext/localedata.jar:/jobs/genie.ajdt/ajdt-on-eclipse-45/workspace/org.eclipse.ajdt.core.tests/target/work/configuration/org.eclipse.osgi/40/0/.cp/junit.jar:/jobs/genie.ajdt/ajdt-on-eclipse-45/workspace/org.eclipse.ajdt.core.tests/target/work/configuration/org.eclipse.osgi/218/0/.cp:
Timer event: 2ms: Pre compile
Compiler configuration for project DefaultEmptyProject has been read by compiler.  Resetting.
     Configuration was []
Resetting list of modified source files.  Was []
AJC: compiling source files
Timer event: 36ms: Time to first compiled message
AJC: compiled: /jobs/genie.ajdt/ajdt-on-eclipse-45/workspace/org.eclipse.ajdt.core.tests/target/work/data/DefaultEmptyProject/src/p/Aspect.aj
Timer event: 37ms: Time to first woven message
AJC: woven aspect p.Aspect (from /jobs/genie.ajdt/ajdt-on-eclipse-45/workspace/org.eclipse.ajdt.core.tests/target/work/data/DefaultEmptyProject/src/p/Aspect.aj)
AJC: compiled: /jobs/genie.ajdt/ajdt-on-eclipse-45/workspace/org.eclipse.ajdt.core.tests/target/work/data/DefaultEmptyProject/src/p/Other.java
AJC: woven class p.Other (from /jobs/genie.ajdt/ajdt-on-eclipse-45/workspace/org.eclipse.ajdt.core.tests/target/work/data/DefaultEmptyProject/src/p/Other.java)
AJC: compiled: /jobs/genie.ajdt/ajdt-on-eclipse-45/workspace/org.eclipse.ajdt.core.tests/target/work/data/DefaultEmptyProject/src/p/Annotation.java
AJC: woven class p.Annotation (from /jobs/genie.ajdt/ajdt-on-eclipse-45/workspace/org.eclipse.ajdt.core.tests/target/work/data/DefaultEmptyProject/src/p/Annotation.java)
AJDE Callback: finish. Was full build: true
Timer event: 41ms: Total time spent in AJDE
Timer event: 0ms: Refresh after build
Types affected during build = 3
Timer event: 44ms: Total time spent in AJBuilder.build()
Timer event: 1ms: Delete markers: DefaultEmptyProject (Finished deleting markers for DefaultEmptyProject)
Timer event: 0ms: Create markers: DefaultEmptyProject (Finished creating markers for DefaultEmptyProject)
Created 0 markers in 3 files
------------------------
Starting testMoveTypeInDeclareParentsComplex2
Timer event: 0ms: Update visualizer, xref, advice listeners for (separate thread): DefaultEmptyProject
===========================================================================================
Build kind = FULLBUILD
Project=DefaultEmptyProject, kind of build requested=Full AspectJ compilation
Timer event: 0ms: Flush included source file cache
Timer event: 0ms: Check delta
Builder: Tidied output folder(s), removed class files and derived resources
Classpath = /jobs/genie.ajdt/ajdt-on-eclipse-45/workspace/org.eclipse.ajdt.core.tests/target/work/data/DefaultEmptyProject/bin:/jobs/genie.ajdt/ajdt-on-eclipse-45/workspace/org.aspectj.runtime/target/org.aspectj.runtime-1.8.9-SNAPSHOT.jar:/opt/public/common/jdk1.7.0_80/jre/lib/resources.jar:/opt/public/common/jdk1.7.0_80/jre/lib/rt.jar:/opt/public/common/jdk1.7.0_80/jre/lib/jsse.jar:/opt/public/common/jdk1.7.0_80/jre/lib/jce.jar:/opt/public/common/jdk1.7.0_80/jre/lib/charsets.jar:/opt/public/common/jdk1.7.0_80/jre/lib/jfr.jar:/opt/public/common/jdk1.7.0_80/jre/lib/ext/dnsns.jar:/opt/public/common/jdk1.7.0_80/jre/lib/ext/sunpkcs11.jar:/opt/public/common/jdk1.7.0_80/jre/lib/ext/zipfs.jar:/opt/public/common/jdk1.7.0_80/jre/lib/ext/sunec.jar:/opt/public/common/jdk1.7.0_80/jre/lib/ext/sunjce_provider.jar:/opt/public/common/jdk1.7.0_80/jre/lib/ext/localedata.jar:/jobs/genie.ajdt/ajdt-on-eclipse-45/workspace/org.eclipse.ajdt.core.tests/target/work/configuration/org.eclipse.osgi/40/0/.cp/junit.jar:/jobs/genie.ajdt/ajdt-on-eclipse-45/workspace/org.eclipse.ajdt.core.tests/target/work/configuration/org.eclipse.osgi/218/0/.cp:
Timer event: 9ms: Pre compile
Compiler configuration for project DefaultEmptyProject has been read by compiler.  Resetting.
     Configuration was []
Resetting list of modified source files.  Was []
AJC: compiling source files
Timer event: 41ms: Time to first compiled message
AJC: compiled: /jobs/genie.ajdt/ajdt-on-eclipse-45/workspace/org.eclipse.ajdt.core.tests/target/work/data/DefaultEmptyProject/src/p/Aspect.aj
Timer event: 43ms: Time to first woven message
AJC: woven aspect p.Aspect (from /jobs/genie.ajdt/ajdt-on-eclipse-45/workspace/org.eclipse.ajdt.core.tests/target/work/data/DefaultEmptyProject/src/p/Aspect.aj)
AJC: compiled: /jobs/genie.ajdt/ajdt-on-eclipse-45/workspace/org.eclipse.ajdt.core.tests/target/work/data/DefaultEmptyProject/src/p/Other.java
AJC: woven class p.Other (from /jobs/genie.ajdt/ajdt-on-eclipse-45/workspace/org.eclipse.ajdt.core.tests/target/work/data/DefaultEmptyProject/src/p/Other.java)
AJC: compiled: /jobs/genie.ajdt/ajdt-on-eclipse-45/workspace/org.eclipse.ajdt.core.tests/target/work/data/DefaultEmptyProject/src/p/Annotation.java
AJC: woven class p.Annotation (from /jobs/genie.ajdt/ajdt-on-eclipse-45/workspace/org.eclipse.ajdt.core.tests/target/work/data/DefaultEmptyProject/src/p/Annotation.java)
AJDE Callback: finish. Was full build: true
Timer event: 47ms: Total time spent in AJDE
Timer event: 0ms: Refresh after build
Types affected during build = 3
Timer event: 57ms: Total time spent in AJBuilder.build()
Timer event: 5ms: Delete markers: DefaultEmptyProject (Finished deleting markers for DefaultEmptyProject)
Timer event: 1ms: Create markers: DefaultEmptyProject (Finished creating markers for DefaultEmptyProject)
Created 0 markers in 3 files
Timer event: 0ms: Update visualizer, xref, advice listeners for (separate thread): DefaultEmptyProject
===========================================================================================
Build kind = FULLBUILD
Project=DefaultEmptyProject, kind of build requested=Full AspectJ compilation
Timer event: 0ms: Flush included source file cache
Timer event: 0ms: Check delta
Builder: Tidied output folder(s), removed class files and derived resources
Classpath = /jobs/genie.ajdt/ajdt-on-eclipse-45/workspace/org.eclipse.ajdt.core.tests/target/work/data/DefaultEmptyProject/bin:/jobs/genie.ajdt/ajdt-on-eclipse-45/workspace/org.aspectj.runtime/target/org.aspectj.runtime-1.8.9-SNAPSHOT.jar:/opt/public/common/jdk1.7.0_80/jre/lib/resources.jar:/opt/public/common/jdk1.7.0_80/jre/lib/rt.jar:/opt/public/common/jdk1.7.0_80/jre/lib/jsse.jar:/opt/public/common/jdk1.7.0_80/jre/lib/jce.jar:/opt/public/common/jdk1.7.0_80/jre/lib/charsets.jar:/opt/public/common/jdk1.7.0_80/jre/lib/jfr.jar:/opt/public/common/jdk1.7.0_80/jre/lib/ext/dnsns.jar:/opt/public/common/jdk1.7.0_80/jre/lib/ext/sunpkcs11.jar:/opt/public/common/jdk1.7.0_80/jre/lib/ext/zipfs.jar:/opt/public/common/jdk1.7.0_80/jre/lib/ext/sunec.jar:/opt/public/common/jdk1.7.0_80/jre/lib/ext/sunjce_provider.jar:/opt/public/common/jdk1.7.0_80/jre/lib/ext/localedata.jar:/jobs/genie.ajdt/ajdt-on-eclipse-45/workspace/org.eclipse.ajdt.core.tests/target/work/configuration/org.eclipse.osgi/40/0/.cp/junit.jar:/jobs/genie.ajdt/ajdt-on-eclipse-45/workspace/org.eclipse.ajdt.core.tests/target/work/configuration/org.eclipse.osgi/218/0/.cp:
Timer event: 41ms: Pre compile
Compiler configuration for project DefaultEmptyProject has been read by compiler.  Resetting.
     Configuration was []
Resetting list of modified source files.  Was []
AJC: compiling source files
Timer event: 687ms: Time to first compiled message
AJC: compiled: /jobs/genie.ajdt/ajdt-on-eclipse-45/workspace/org.eclipse.ajdt.core.tests/target/work/data/DefaultEmptyProject/src/p/Aspect.aj
Timer event: 689ms: Time to first woven message
AJC: woven aspect p.Aspect (from /jobs/genie.ajdt/ajdt-on-eclipse-45/workspace/org.eclipse.ajdt.core.tests/target/work/data/DefaultEmptyProject/src/p/Aspect.aj)
AJC: compiled: /jobs/genie.ajdt/ajdt-on-eclipse-45/workspace/org.eclipse.ajdt.core.tests/target/work/data/DefaultEmptyProject/src/p/Other.java
AJC: woven class p.Other (from /jobs/genie.ajdt/ajdt-on-eclipse-45/workspace/org.eclipse.ajdt.core.tests/target/work/data/DefaultEmptyProject/src/p/Other.java)
AJC: compiled: /jobs/genie.ajdt/ajdt-on-eclipse-45/workspace/org.eclipse.ajdt.core.tests/target/work/data/DefaultEmptyProject/src/p/Annotation.java
AJC: woven class p.Annotation (from /jobs/genie.ajdt/ajdt-on-eclipse-45/workspace/org.eclipse.ajdt.core.tests/target/work/data/DefaultEmptyProject/src/p/Annotation.java)
AJDE Callback: finish. Was full build: true
Timer event: 693ms: Total time spent in AJDE
Timer event: 0ms: Refresh after build
Types affected during build = 3
Timer event: 734ms: Total time spent in AJBuilder.build()
Timer event: 0ms: Delete markers: DefaultEmptyProject (Finished deleting markers for DefaultEmptyProject)
Timer event: 0ms: Create markers: DefaultEmptyProject (Finished creating markers for DefaultEmptyProject)
Created 0 markers in 3 files
------------------------
Starting testMoveTypeInDeclareParentsComplex6
Timer event: 0ms: Update visualizer, xref, advice listeners for (separate thread): DefaultEmptyProject
===========================================================================================
Build kind = FULLBUILD
Project=DefaultEmptyProject, kind of build requested=Full AspectJ compilation
Timer event: 0ms: Flush included source file cache
Timer event: 0ms: Check delta
Builder: Tidied output folder(s), removed class files and derived resources
Classpath = /jobs/genie.ajdt/ajdt-on-eclipse-45/workspace/org.eclipse.ajdt.core.tests/target/work/data/DefaultEmptyProject/bin:/jobs/genie.ajdt/ajdt-on-eclipse-45/workspace/org.aspectj.runtime/target/org.aspectj.runtime-1.8.9-SNAPSHOT.jar:/opt/public/common/jdk1.7.0_80/jre/lib/resources.jar:/opt/public/common/jdk1.7.0_80/jre/lib/rt.jar:/opt/public/common/jdk1.7.0_80/jre/lib/jsse.jar:/opt/public/common/jdk1.7.0_80/jre/lib/jce.jar:/opt/public/common/jdk1.7.0_80/jre/lib/charsets.jar:/opt/public/common/jdk1.7.0_80/jre/lib/jfr.jar:/opt/public/common/jdk1.7.0_80/jre/lib/ext/dnsns.jar:/opt/public/common/jdk1.7.0_80/jre/lib/ext/sunpkcs11.jar:/opt/public/common/jdk1.7.0_80/jre/lib/ext/zipfs.jar:/opt/public/common/jdk1.7.0_80/jre/lib/ext/sunec.jar:/opt/public/common/jdk1.7.0_80/jre/lib/ext/sunjce_provider.jar:/opt/public/common/jdk1.7.0_80/jre/lib/ext/localedata.jar:/jobs/genie.ajdt/ajdt-on-eclipse-45/workspace/org.eclipse.ajdt.core.tests/target/work/configuration/org.eclipse.osgi/40/0/.cp/junit.jar:/jobs/genie.ajdt/ajdt-on-eclipse-45/workspace/org.eclipse.ajdt.core.tests/target/work/configuration/org.eclipse.osgi/218/0/.cp:
Timer event: 9ms: Pre compile
Compiler configuration for project DefaultEmptyProject has been read by compiler.  Resetting.
     Configuration was []
Resetting list of modified source files.  Was []
AJC: compiling source files
Timer event: 43ms: Time to first compiled message
AJC: compiled: /jobs/genie.ajdt/ajdt-on-eclipse-45/workspace/org.eclipse.ajdt.core.tests/target/work/data/DefaultEmptyProject/src/p/Aspect.aj
Timer event: 45ms: Time to first woven message
AJC: woven aspect p.Aspect (from /jobs/genie.ajdt/ajdt-on-eclipse-45/workspace/org.eclipse.ajdt.core.tests/target/work/data/DefaultEmptyProject/src/p/Aspect.aj)
AJC: compiled: /jobs/genie.ajdt/ajdt-on-eclipse-45/workspace/org.eclipse.ajdt.core.tests/target/work/data/DefaultEmptyProject/src/q/Annotation.java
AJC: woven class q.Annotation (from /jobs/genie.ajdt/ajdt-on-eclipse-45/workspace/org.eclipse.ajdt.core.tests/target/work/data/DefaultEmptyProject/src/q/Annotation.java)
AJC: compiled: /jobs/genie.ajdt/ajdt-on-eclipse-45/workspace/org.eclipse.ajdt.core.tests/target/work/data/DefaultEmptyProject/src/p/Other.java
AJC: woven class p.Other (from /jobs/genie.ajdt/ajdt-on-eclipse-45/workspace/org.eclipse.ajdt.core.tests/target/work/data/DefaultEmptyProject/src/p/Other.java)
AJDE Callback: finish. Was full build: true
Timer event: 49ms: Total time spent in AJDE
Timer event: 0ms: Refresh after build
Types affected during build = 3
Timer event: 59ms: Total time spent in AJBuilder.build()
Timer event: 4ms: Delete markers: DefaultEmptyProject (Finished deleting markers for DefaultEmptyProject)
Timer event: 2ms: Create markers: DefaultEmptyProject (Finished creating markers for DefaultEmptyProject)
Created 0 markers in 3 files
Timer event: 0ms: Update visualizer, xref, advice listeners for (separate thread): DefaultEmptyProject
===========================================================================================
Build kind = FULLBUILD
Project=DefaultEmptyProject, kind of build requested=Full AspectJ compilation
Timer event: 0ms: Flush included source file cache
Timer event: 0ms: Check delta
Builder: Tidied output folder(s), removed class files and derived resources
Classpath = /jobs/genie.ajdt/ajdt-on-eclipse-45/workspace/org.eclipse.ajdt.core.tests/target/work/data/DefaultEmptyProject/bin:/jobs/genie.ajdt/ajdt-on-eclipse-45/workspace/org.aspectj.runtime/target/org.aspectj.runtime-1.8.9-SNAPSHOT.jar:/opt/public/common/jdk1.7.0_80/jre/lib/resources.jar:/opt/public/common/jdk1.7.0_80/jre/lib/rt.jar:/opt/public/common/jdk1.7.0_80/jre/lib/jsse.jar:/opt/public/common/jdk1.7.0_80/jre/lib/jce.jar:/opt/public/common/jdk1.7.0_80/jre/lib/charsets.jar:/opt/public/common/jdk1.7.0_80/jre/lib/jfr.jar:/opt/public/common/jdk1.7.0_80/jre/lib/ext/dnsns.jar:/opt/public/common/jdk1.7.0_80/jre/lib/ext/sunpkcs11.jar:/opt/public/common/jdk1.7.0_80/jre/lib/ext/zipfs.jar:/opt/public/common/jdk1.7.0_80/jre/lib/ext/sunec.jar:/opt/public/common/jdk1.7.0_80/jre/lib/ext/sunjce_provider.jar:/opt/public/common/jdk1.7.0_80/jre/lib/ext/localedata.jar:/jobs/genie.ajdt/ajdt-on-eclipse-45/workspace/org.eclipse.ajdt.core.tests/target/work/configuration/org.eclipse.osgi/40/0/.cp/junit.jar:/jobs/genie.ajdt/ajdt-on-eclipse-45/workspace/org.eclipse.ajdt.core.tests/target/work/configuration/org.eclipse.osgi/218/0/.cp:
Timer event: 2ms: Pre compile
Compiler configuration for project DefaultEmptyProject has been read by compiler.  Resetting.
     Configuration was []
Resetting list of modified source files.  Was []
AJC: compiling source files
Timer event: 44ms: Time to first compiled message
AJC: compiled: /jobs/genie.ajdt/ajdt-on-eclipse-45/workspace/org.eclipse.ajdt.core.tests/target/work/data/DefaultEmptyProject/src/p/Aspect.aj
Timer event: 46ms: Time to first woven message
AJC: woven aspect p.Aspect (from /jobs/genie.ajdt/ajdt-on-eclipse-45/workspace/org.eclipse.ajdt.core.tests/target/work/data/DefaultEmptyProject/src/p/Aspect.aj)
AJC: compiled: /jobs/genie.ajdt/ajdt-on-eclipse-45/workspace/org.eclipse.ajdt.core.tests/target/work/data/DefaultEmptyProject/src/q/Annotation.java
AJC: woven class q.Annotation (from /jobs/genie.ajdt/ajdt-on-eclipse-45/workspace/org.eclipse.ajdt.core.tests/target/work/data/DefaultEmptyProject/src/q/Annotation.java)
AJC: compiled: /jobs/genie.ajdt/ajdt-on-eclipse-45/workspace/org.eclipse.ajdt.core.tests/target/work/data/DefaultEmptyProject/src/p/Other.java
AJC: woven class p.Other (from /jobs/genie.ajdt/ajdt-on-eclipse-45/workspace/org.eclipse.ajdt.core.tests/target/work/data/DefaultEmptyProject/src/p/Other.java)
AJDE Callback: finish. Was full build: true
Timer event: 51ms: Total time spent in AJDE
Timer event: 0ms: Refresh after build
Types affected during build = 3
Timer event: 54ms: Total time spent in AJBuilder.build()
Timer event: 1ms: Delete markers: DefaultEmptyProject (Finished deleting markers for DefaultEmptyProject)
Timer event: 0ms: Create markers: DefaultEmptyProject (Finished creating markers for DefaultEmptyProject)
Created 0 markers in 3 files
------------------------
Starting testMoveTypeInDeclareAtField1
Timer event: 0ms: Update visualizer, xref, advice listeners for (separate thread): DefaultEmptyProject
===========================================================================================
Build kind = FULLBUILD
Project=DefaultEmptyProject, kind of build requested=Full AspectJ compilation
Timer event: 0ms: Flush included source file cache
Timer event: 0ms: Check delta
Builder: Tidied output folder(s), removed class files and derived resources
Classpath = /jobs/genie.ajdt/ajdt-on-eclipse-45/workspace/org.eclipse.ajdt.core.tests/target/work/data/DefaultEmptyProject/bin:/jobs/genie.ajdt/ajdt-on-eclipse-45/workspace/org.aspectj.runtime/target/org.aspectj.runtime-1.8.9-SNAPSHOT.jar:/opt/public/common/jdk1.7.0_80/jre/lib/resources.jar:/opt/public/common/jdk1.7.0_80/jre/lib/rt.jar:/opt/public/common/jdk1.7.0_80/jre/lib/jsse.jar:/opt/public/common/jdk1.7.0_80/jre/lib/jce.jar:/opt/public/common/jdk1.7.0_80/jre/lib/charsets.jar:/opt/public/common/jdk1.7.0_80/jre/lib/jfr.jar:/opt/public/common/jdk1.7.0_80/jre/lib/ext/dnsns.jar:/opt/public/common/jdk1.7.0_80/jre/lib/ext/sunpkcs11.jar:/opt/public/common/jdk1.7.0_80/jre/lib/ext/zipfs.jar:/opt/public/common/jdk1.7.0_80/jre/lib/ext/sunec.jar:/opt/public/common/jdk1.7.0_80/jre/lib/ext/sunjce_provider.jar:/opt/public/common/jdk1.7.0_80/jre/lib/ext/localedata.jar:/jobs/genie.ajdt/ajdt-on-eclipse-45/workspace/org.eclipse.ajdt.core.tests/target/work/configuration/org.eclipse.osgi/40/0/.cp/junit.jar:/jobs/genie.ajdt/ajdt-on-eclipse-45/workspace/org.eclipse.ajdt.core.tests/target/work/configuration/org.eclipse.osgi/218/0/.cp:
Timer event: 7ms: Pre compile
Compiler configuration for project DefaultEmptyProject has been read by compiler.  Resetting.
     Configuration was []
Resetting list of modified source files.  Was []
AJC: compiling source files
Timer event: 43ms: Time to first compiled message
AJC: compiled: /jobs/genie.ajdt/ajdt-on-eclipse-45/workspace/org.eclipse.ajdt.core.tests/target/work/data/DefaultEmptyProject/src/p/Aspect.aj
Timer event: 52ms: Time to first woven message
AJC: woven aspect p.Aspect (from /jobs/genie.ajdt/ajdt-on-eclipse-45/workspace/org.eclipse.ajdt.core.tests/target/work/data/DefaultEmptyProject/src/p/Aspect.aj)
AJC: compiled: /jobs/genie.ajdt/ajdt-on-eclipse-45/workspace/org.eclipse.ajdt.core.tests/target/work/data/DefaultEmptyProject/src/p/Java.java
AJC: woven class p.Java (from /jobs/genie.ajdt/ajdt-on-eclipse-45/workspace/org.eclipse.ajdt.core.tests/target/work/data/DefaultEmptyProject/src/p/Java.java)
AJC: compiled: /jobs/genie.ajdt/ajdt-on-eclipse-45/workspace/org.eclipse.ajdt.core.tests/target/work/data/DefaultEmptyProject/src/p/Other.java
AJC: woven class p.Other (from /jobs/genie.ajdt/ajdt-on-eclipse-45/workspace/org.eclipse.ajdt.core.tests/target/work/data/DefaultEmptyProject/src/p/Other.java)
AJDE Callback: finish. Was full build: true
Timer event: 58ms: Total time spent in AJDE
Timer event: 0ms: Refresh after build
Types affected during build = 3
Timer event: 65ms: Total time spent in AJBuilder.build()
Timer event: 4ms: Delete markers: DefaultEmptyProject (Finished deleting markers for DefaultEmptyProject)
Timer event: 2ms: Create markers: DefaultEmptyProject (Finished creating markers for DefaultEmptyProject)
Created 2 markers in 3 files
Timer event: 0ms: Update visualizer, xref, advice listeners for (separate thread): DefaultEmptyProject
===========================================================================================
Build kind = FULLBUILD
Project=DefaultEmptyProject, kind of build requested=Full AspectJ compilation
Timer event: 0ms: Flush included source file cache
Timer event: 0ms: Check delta
Builder: Tidied output folder(s), removed class files and derived resources
Classpath = /jobs/genie.ajdt/ajdt-on-eclipse-45/workspace/org.eclipse.ajdt.core.tests/target/work/data/DefaultEmptyProject/bin:/jobs/genie.ajdt/ajdt-on-eclipse-45/workspace/org.aspectj.runtime/target/org.aspectj.runtime-1.8.9-SNAPSHOT.jar:/opt/public/common/jdk1.7.0_80/jre/lib/resources.jar:/opt/public/common/jdk1.7.0_80/jre/lib/rt.jar:/opt/public/common/jdk1.7.0_80/jre/lib/jsse.jar:/opt/public/common/jdk1.7.0_80/jre/lib/jce.jar:/opt/public/common/jdk1.7.0_80/jre/lib/charsets.jar:/opt/public/common/jdk1.7.0_80/jre/lib/jfr.jar:/opt/public/common/jdk1.7.0_80/jre/lib/ext/dnsns.jar:/opt/public/common/jdk1.7.0_80/jre/lib/ext/sunpkcs11.jar:/opt/public/common/jdk1.7.0_80/jre/lib/ext/zipfs.jar:/opt/public/common/jdk1.7.0_80/jre/lib/ext/sunec.jar:/opt/public/common/jdk1.7.0_80/jre/lib/ext/sunjce_provider.jar:/opt/public/common/jdk1.7.0_80/jre/lib/ext/localedata.jar:/jobs/genie.ajdt/ajdt-on-eclipse-45/workspace/org.eclipse.ajdt.core.tests/target/work/configuration/org.eclipse.osgi/40/0/.cp/junit.jar:/jobs/genie.ajdt/ajdt-on-eclipse-45/workspace/org.eclipse.ajdt.core.tests/target/work/configuration/org.eclipse.osgi/218/0/.cp:
Timer event: 2ms: Pre compile
Compiler configuration for project DefaultEmptyProject has been read by compiler.  Resetting.
     Configuration was []
Resetting list of modified source files.  Was []
AJC: compiling source files
Timer event: 52ms: Time to first compiled message
AJC: compiled: /jobs/genie.ajdt/ajdt-on-eclipse-45/workspace/org.eclipse.ajdt.core.tests/target/work/data/DefaultEmptyProject/src/p/Aspect.aj
Timer event: 54ms: Time to first woven message
AJC: woven aspect p.Aspect (from /jobs/genie.ajdt/ajdt-on-eclipse-45/workspace/org.eclipse.ajdt.core.tests/target/work/data/DefaultEmptyProject/src/p/Aspect.aj)
AJC: compiled: /jobs/genie.ajdt/ajdt-on-eclipse-45/workspace/org.eclipse.ajdt.core.tests/target/work/data/DefaultEmptyProject/src/p/Java.java
AJC: woven class p.Java (from /jobs/genie.ajdt/ajdt-on-eclipse-45/workspace/org.eclipse.ajdt.core.tests/target/work/data/DefaultEmptyProject/src/p/Java.java)
AJC: compiled: /jobs/genie.ajdt/ajdt-on-eclipse-45/workspace/org.eclipse.ajdt.core.tests/target/work/data/DefaultEmptyProject/src/p/Other.java
AJC: woven class p.Other (from /jobs/genie.ajdt/ajdt-on-eclipse-45/workspace/org.eclipse.ajdt.core.tests/target/work/data/DefaultEmptyProject/src/p/Other.java)
AJDE Callback: finish. Was full build: true
Timer event: 58ms: Total time spent in AJDE
Timer event: 0ms: Refresh after build
Types affected during build = 3
Timer event: 61ms: Total time spent in AJBuilder.build()
Timer event: 1ms: Delete markers: DefaultEmptyProject (Finished deleting markers for DefaultEmptyProject)
Timer event: 2ms: Create markers: DefaultEmptyProject (Finished creating markers for DefaultEmptyProject)
Created 2 markers in 3 files
------------------------
Starting testMoveTypeInDeclareAtField2
Timer event: 0ms: Update visualizer, xref, advice listeners for (separate thread): DefaultEmptyProject
===========================================================================================
Build kind = FULLBUILD
Project=DefaultEmptyProject, kind of build requested=Full AspectJ compilation
Timer event: 0ms: Flush included source file cache
Timer event: 0ms: Check delta
Builder: Tidied output folder(s), removed class files and derived resources
Classpath = /jobs/genie.ajdt/ajdt-on-eclipse-45/workspace/org.eclipse.ajdt.core.tests/target/work/data/DefaultEmptyProject/bin:/jobs/genie.ajdt/ajdt-on-eclipse-45/workspace/org.aspectj.runtime/target/org.aspectj.runtime-1.8.9-SNAPSHOT.jar:/opt/public/common/jdk1.7.0_80/jre/lib/resources.jar:/opt/public/common/jdk1.7.0_80/jre/lib/rt.jar:/opt/public/common/jdk1.7.0_80/jre/lib/jsse.jar:/opt/public/common/jdk1.7.0_80/jre/lib/jce.jar:/opt/public/common/jdk1.7.0_80/jre/lib/charsets.jar:/opt/public/common/jdk1.7.0_80/jre/lib/jfr.jar:/opt/public/common/jdk1.7.0_80/jre/lib/ext/dnsns.jar:/opt/public/common/jdk1.7.0_80/jre/lib/ext/sunpkcs11.jar:/opt/public/common/jdk1.7.0_80/jre/lib/ext/zipfs.jar:/opt/public/common/jdk1.7.0_80/jre/lib/ext/sunec.jar:/opt/public/common/jdk1.7.0_80/jre/lib/ext/sunjce_provider.jar:/opt/public/common/jdk1.7.0_80/jre/lib/ext/localedata.jar:/jobs/genie.ajdt/ajdt-on-eclipse-45/workspace/org.eclipse.ajdt.core.tests/target/work/configuration/org.eclipse.osgi/40/0/.cp/junit.jar:/jobs/genie.ajdt/ajdt-on-eclipse-45/workspace/org.eclipse.ajdt.core.tests/target/work/configuration/org.eclipse.osgi/218/0/.cp:
Timer event: 7ms: Pre compile
Compiler configuration for project DefaultEmptyProject has been read by compiler.  Resetting.
     Configuration was []
Resetting list of modified source files.  Was []
AJC: compiling source files
Timer event: 36ms: Time to first compiled message
AJC: compiled: /jobs/genie.ajdt/ajdt-on-eclipse-45/workspace/org.eclipse.ajdt.core.tests/target/work/data/DefaultEmptyProject/src/p/Aspect.aj
Timer event: 38ms: Time to first woven message
AJC: woven aspect p.Aspect (from /jobs/genie.ajdt/ajdt-on-eclipse-45/workspace/org.eclipse.ajdt.core.tests/target/work/data/DefaultEmptyProject/src/p/Aspect.aj)
AJC: compiled: /jobs/genie.ajdt/ajdt-on-eclipse-45/workspace/org.eclipse.ajdt.core.tests/target/work/data/DefaultEmptyProject/src/p/Java.java
AJC: woven class p.Java (from /jobs/genie.ajdt/ajdt-on-eclipse-45/workspace/org.eclipse.ajdt.core.tests/target/work/data/DefaultEmptyProject/src/p/Java.java)
AJC: compiled: /jobs/genie.ajdt/ajdt-on-eclipse-45/workspace/org.eclipse.ajdt.core.tests/target/work/data/DefaultEmptyProject/src/p/Other.java
AJC: woven class p.Other (from /jobs/genie.ajdt/ajdt-on-eclipse-45/workspace/org.eclipse.ajdt.core.tests/target/work/data/DefaultEmptyProject/src/p/Other.java)
AJDE Callback: finish. Was full build: true
Timer event: 41ms: Total time spent in AJDE
Timer event: 0ms: Refresh after build
Types affected during build = 3
Timer event: 49ms: Total time spent in AJBuilder.build()
Timer event: 4ms: Delete markers: DefaultEmptyProject (Finished deleting markers for DefaultEmptyProject)
Timer event: 2ms: Create markers: DefaultEmptyProject (Finished creating markers for DefaultEmptyProject)
Created 2 markers in 3 files
Timer event: 0ms: Update visualizer, xref, advice listeners for (separate thread): DefaultEmptyProject
===========================================================================================
Build kind = FULLBUILD
Project=DefaultEmptyProject, kind of build requested=Full AspectJ compilation
Timer event: 0ms: Flush included source file cache
Timer event: 0ms: Check delta
Builder: Tidied output folder(s), removed class files and derived resources
Classpath = /jobs/genie.ajdt/ajdt-on-eclipse-45/workspace/org.eclipse.ajdt.core.tests/target/work/data/DefaultEmptyProject/bin:/jobs/genie.ajdt/ajdt-on-eclipse-45/workspace/org.aspectj.runtime/target/org.aspectj.runtime-1.8.9-SNAPSHOT.jar:/opt/public/common/jdk1.7.0_80/jre/lib/resources.jar:/opt/public/common/jdk1.7.0_80/jre/lib/rt.jar:/opt/public/common/jdk1.7.0_80/jre/lib/jsse.jar:/opt/public/common/jdk1.7.0_80/jre/lib/jce.jar:/opt/public/common/jdk1.7.0_80/jre/lib/charsets.jar:/opt/public/common/jdk1.7.0_80/jre/lib/jfr.jar:/opt/public/common/jdk1.7.0_80/jre/lib/ext/dnsns.jar:/opt/public/common/jdk1.7.0_80/jre/lib/ext/sunpkcs11.jar:/opt/public/common/jdk1.7.0_80/jre/lib/ext/zipfs.jar:/opt/public/common/jdk1.7.0_80/jre/lib/ext/sunec.jar:/opt/public/common/jdk1.7.0_80/jre/lib/ext/sunjce_provider.jar:/opt/public/common/jdk1.7.0_80/jre/lib/ext/localedata.jar:/jobs/genie.ajdt/ajdt-on-eclipse-45/workspace/org.eclipse.ajdt.core.tests/target/work/configuration/org.eclipse.osgi/40/0/.cp/junit.jar:/jobs/genie.ajdt/ajdt-on-eclipse-45/workspace/org.eclipse.ajdt.core.tests/target/work/configuration/org.eclipse.osgi/218/0/.cp:
Timer event: 2ms: Pre compile
Compiler configuration for project DefaultEmptyProject has been read by compiler.  Resetting.
     Configuration was []
Resetting list of modified source files.  Was []
AJC: compiling source files
Timer event: 45ms: Time to first compiled message
AJC: compiled: /jobs/genie.ajdt/ajdt-on-eclipse-45/workspace/org.eclipse.ajdt.core.tests/target/work/data/DefaultEmptyProject/src/p/Aspect.aj
Timer event: 47ms: Time to first woven message
AJC: woven aspect p.Aspect (from /jobs/genie.ajdt/ajdt-on-eclipse-45/workspace/org.eclipse.ajdt.core.tests/target/work/data/DefaultEmptyProject/src/p/Aspect.aj)
AJC: compiled: /jobs/genie.ajdt/ajdt-on-eclipse-45/workspace/org.eclipse.ajdt.core.tests/target/work/data/DefaultEmptyProject/src/p/Java.java
AJC: woven class p.Java (from /jobs/genie.ajdt/ajdt-on-eclipse-45/workspace/org.eclipse.ajdt.core.tests/target/work/data/DefaultEmptyProject/src/p/Java.java)
AJC: compiled: /jobs/genie.ajdt/ajdt-on-eclipse-45/workspace/org.eclipse.ajdt.core.tests/target/work/data/DefaultEmptyProject/src/p/Other.java
AJC: woven class p.Other (from /jobs/genie.ajdt/ajdt-on-eclipse-45/workspace/org.eclipse.ajdt.core.tests/target/work/data/DefaultEmptyProject/src/p/Other.java)
AJDE Callback: finish. Was full build: true
Timer event: 50ms: Total time spent in AJDE
Timer event: 0ms: Refresh after build
Types affected during build = 3
Timer event: 53ms: Total time spent in AJBuilder.build()
Timer event: 1ms: Delete markers: DefaultEmptyProject (Finished deleting markers for DefaultEmptyProject)
Timer event: 2ms: Create markers: DefaultEmptyProject (Finished creating markers for DefaultEmptyProject)
Created 2 markers in 3 files
------------------------
Starting testMoveTypeInDeclareAtField6
Timer event: 0ms: Update visualizer, xref, advice listeners for (separate thread): DefaultEmptyProject
===========================================================================================
Build kind = FULLBUILD
Project=DefaultEmptyProject, kind of build requested=Full AspectJ compilation
Timer event: 0ms: Flush included source file cache
Timer event: 0ms: Check delta
Builder: Tidied output folder(s), removed class files and derived resources
Classpath = /jobs/genie.ajdt/ajdt-on-eclipse-45/workspace/org.eclipse.ajdt.core.tests/target/work/data/DefaultEmptyProject/bin:/jobs/genie.ajdt/ajdt-on-eclipse-45/workspace/org.aspectj.runtime/target/org.aspectj.runtime-1.8.9-SNAPSHOT.jar:/opt/public/common/jdk1.7.0_80/jre/lib/resources.jar:/opt/public/common/jdk1.7.0_80/jre/lib/rt.jar:/opt/public/common/jdk1.7.0_80/jre/lib/jsse.jar:/opt/public/common/jdk1.7.0_80/jre/lib/jce.jar:/opt/public/common/jdk1.7.0_80/jre/lib/charsets.jar:/opt/public/common/jdk1.7.0_80/jre/lib/jfr.jar:/opt/public/common/jdk1.7.0_80/jre/lib/ext/dnsns.jar:/opt/public/common/jdk1.7.0_80/jre/lib/ext/sunpkcs11.jar:/opt/public/common/jdk1.7.0_80/jre/lib/ext/zipfs.jar:/opt/public/common/jdk1.7.0_80/jre/lib/ext/sunec.jar:/opt/public/common/jdk1.7.0_80/jre/lib/ext/sunjce_provider.jar:/opt/public/common/jdk1.7.0_80/jre/lib/ext/localedata.jar:/jobs/genie.ajdt/ajdt-on-eclipse-45/workspace/org.eclipse.ajdt.core.tests/target/work/configuration/org.eclipse.osgi/40/0/.cp/junit.jar:/jobs/genie.ajdt/ajdt-on-eclipse-45/workspace/org.eclipse.ajdt.core.tests/target/work/configuration/org.eclipse.osgi/218/0/.cp:
Timer event: 6ms: Pre compile
Compiler configuration for project DefaultEmptyProject has been read by compiler.  Resetting.
     Configuration was []
Resetting list of modified source files.  Was []
AJC: compiling source files
Timer event: 36ms: Time to first compiled message
AJC: compiled: /jobs/genie.ajdt/ajdt-on-eclipse-45/workspace/org.eclipse.ajdt.core.tests/target/work/data/DefaultEmptyProject/src/p/Aspect.aj
Timer event: 37ms: Time to first woven message
AJC: woven aspect p.Aspect (from /jobs/genie.ajdt/ajdt-on-eclipse-45/workspace/org.eclipse.ajdt.core.tests/target/work/data/DefaultEmptyProject/src/p/Aspect.aj)
AJC: compiled: /jobs/genie.ajdt/ajdt-on-eclipse-45/workspace/org.eclipse.ajdt.core.tests/target/work/data/DefaultEmptyProject/src/q/Java.java
AJC: woven class q.Java (from /jobs/genie.ajdt/ajdt-on-eclipse-45/workspace/org.eclipse.ajdt.core.tests/target/work/data/DefaultEmptyProject/src/q/Java.java)
AJC: compiled: /jobs/genie.ajdt/ajdt-on-eclipse-45/workspace/org.eclipse.ajdt.core.tests/target/work/data/DefaultEmptyProject/src/p/Other.java
AJC: woven class p.Other (from /jobs/genie.ajdt/ajdt-on-eclipse-45/workspace/org.eclipse.ajdt.core.tests/target/work/data/DefaultEmptyProject/src/p/Other.java)
AJDE Callback: finish. Was full build: true
Timer event: 42ms: Total time spent in AJDE
Timer event: 0ms: Refresh after build
Types affected during build = 3
Timer event: 48ms: Total time spent in AJBuilder.build()
Timer event: 4ms: Delete markers: DefaultEmptyProject (Finished deleting markers for DefaultEmptyProject)
Timer event: 2ms: Create markers: DefaultEmptyProject (Finished creating markers for DefaultEmptyProject)
Created 2 markers in 3 files
Timer event: 0ms: Update visualizer, xref, advice listeners for (separate thread): DefaultEmptyProject
===========================================================================================
Build kind = FULLBUILD
Project=DefaultEmptyProject, kind of build requested=Full AspectJ compilation
Timer event: 0ms: Flush included source file cache
Timer event: 0ms: Check delta
Builder: Tidied output folder(s), removed class files and derived resources
Classpath = /jobs/genie.ajdt/ajdt-on-eclipse-45/workspace/org.eclipse.ajdt.core.tests/target/work/data/DefaultEmptyProject/bin:/jobs/genie.ajdt/ajdt-on-eclipse-45/workspace/org.aspectj.runtime/target/org.aspectj.runtime-1.8.9-SNAPSHOT.jar:/opt/public/common/jdk1.7.0_80/jre/lib/resources.jar:/opt/public/common/jdk1.7.0_80/jre/lib/rt.jar:/opt/public/common/jdk1.7.0_80/jre/lib/jsse.jar:/opt/public/common/jdk1.7.0_80/jre/lib/jce.jar:/opt/public/common/jdk1.7.0_80/jre/lib/charsets.jar:/opt/public/common/jdk1.7.0_80/jre/lib/jfr.jar:/opt/public/common/jdk1.7.0_80/jre/lib/ext/dnsns.jar:/opt/public/common/jdk1.7.0_80/jre/lib/ext/sunpkcs11.jar:/opt/public/common/jdk1.7.0_80/jre/lib/ext/zipfs.jar:/opt/public/common/jdk1.7.0_80/jre/lib/ext/sunec.jar:/opt/public/common/jdk1.7.0_80/jre/lib/ext/sunjce_provider.jar:/opt/public/common/jdk1.7.0_80/jre/lib/ext/localedata.jar:/jobs/genie.ajdt/ajdt-on-eclipse-45/workspace/org.eclipse.ajdt.core.tests/target/work/configuration/org.eclipse.osgi/40/0/.cp/junit.jar:/jobs/genie.ajdt/ajdt-on-eclipse-45/workspace/org.eclipse.ajdt.core.tests/target/work/configuration/org.eclipse.osgi/218/0/.cp:
Timer event: 2ms: Pre compile
Compiler configuration for project DefaultEmptyProject has been read by compiler.  Resetting.
     Configuration was []
Resetting list of modified source files.  Was []
AJC: compiling source files
Timer event: 35ms: Time to first compiled message
AJC: compiled: /jobs/genie.ajdt/ajdt-on-eclipse-45/workspace/org.eclipse.ajdt.core.tests/target/work/data/DefaultEmptyProject/src/p/Aspect.aj
Timer event: 36ms: Time to first woven message
AJC: woven aspect p.Aspect (from /jobs/genie.ajdt/ajdt-on-eclipse-45/workspace/org.eclipse.ajdt.core.tests/target/work/data/DefaultEmptyProject/src/p/Aspect.aj)
AJC: compiled: /jobs/genie.ajdt/ajdt-on-eclipse-45/workspace/org.eclipse.ajdt.core.tests/target/work/data/DefaultEmptyProject/src/q/Java.java
AJC: woven class q.Java (from /jobs/genie.ajdt/ajdt-on-eclipse-45/workspace/org.eclipse.ajdt.core.tests/target/work/data/DefaultEmptyProject/src/q/Java.java)
AJC: compiled: /jobs/genie.ajdt/ajdt-on-eclipse-45/workspace/org.eclipse.ajdt.core.tests/target/work/data/DefaultEmptyProject/src/p/Other.java
AJC: woven class p.Other (from /jobs/genie.ajdt/ajdt-on-eclipse-45/workspace/org.eclipse.ajdt.core.tests/target/work/data/DefaultEmptyProject/src/p/Other.java)
AJDE Callback: finish. Was full build: true
Timer event: 40ms: Total time spent in AJDE
Timer event: 0ms: Refresh after build
Types affected during build = 3
Timer event: 43ms: Total time spent in AJBuilder.build()
Timer event: 1ms: Delete markers: DefaultEmptyProject (Finished deleting markers for DefaultEmptyProject)
Timer event: 2ms: Create markers: DefaultEmptyProject (Finished creating markers for DefaultEmptyProject)
Created 2 markers in 3 files
------------------------
Starting testMoveTypeInITDMethod1
Timer event: 1ms: Update visualizer, xref, advice listeners for (separate thread): DefaultEmptyProject
===========================================================================================
Build kind = FULLBUILD
Project=DefaultEmptyProject, kind of build requested=Full AspectJ compilation
Timer event: 0ms: Flush included source file cache
Timer event: 0ms: Check delta
Builder: Tidied output folder(s), removed class files and derived resources
Classpath = /jobs/genie.ajdt/ajdt-on-eclipse-45/workspace/org.eclipse.ajdt.core.tests/target/work/data/DefaultEmptyProject/bin:/jobs/genie.ajdt/ajdt-on-eclipse-45/workspace/org.aspectj.runtime/target/org.aspectj.runtime-1.8.9-SNAPSHOT.jar:/opt/public/common/jdk1.7.0_80/jre/lib/resources.jar:/opt/public/common/jdk1.7.0_80/jre/lib/rt.jar:/opt/public/common/jdk1.7.0_80/jre/lib/jsse.jar:/opt/public/common/jdk1.7.0_80/jre/lib/jce.jar:/opt/public/common/jdk1.7.0_80/jre/lib/charsets.jar:/opt/public/common/jdk1.7.0_80/jre/lib/jfr.jar:/opt/public/common/jdk1.7.0_80/jre/lib/ext/dnsns.jar:/opt/public/common/jdk1.7.0_80/jre/lib/ext/sunpkcs11.jar:/opt/public/common/jdk1.7.0_80/jre/lib/ext/zipfs.jar:/opt/public/common/jdk1.7.0_80/jre/lib/ext/sunec.jar:/opt/public/common/jdk1.7.0_80/jre/lib/ext/sunjce_provider.jar:/opt/public/common/jdk1.7.0_80/jre/lib/ext/localedata.jar:/jobs/genie.ajdt/ajdt-on-eclipse-45/workspace/org.eclipse.ajdt.core.tests/target/work/configuration/org.eclipse.osgi/40/0/.cp/junit.jar:/jobs/genie.ajdt/ajdt-on-eclipse-45/workspace/org.eclipse.ajdt.core.tests/target/work/configuration/org.eclipse.osgi/218/0/.cp:
Timer event: 7ms: Pre compile
Compiler configuration for project DefaultEmptyProject has been read by compiler.  Resetting.
     Configuration was []
Resetting list of modified source files.  Was []
AJC: compiling source files
Timer event: 38ms: Time to first compiled message
AJC: compiled: /jobs/genie.ajdt/ajdt-on-eclipse-45/workspace/org.eclipse.ajdt.core.tests/target/work/data/DefaultEmptyProject/src/p/Aspect.aj
Timer event: 40ms: Time to first woven message
AJC: woven aspect p.Aspect (from /jobs/genie.ajdt/ajdt-on-eclipse-45/workspace/org.eclipse.ajdt.core.tests/target/work/data/DefaultEmptyProject/src/p/Aspect.aj)
AJC: compiled: /jobs/genie.ajdt/ajdt-on-eclipse-45/workspace/org.eclipse.ajdt.core.tests/target/work/data/DefaultEmptyProject/src/p/Java.java
AJC: woven class p.Java (from /jobs/genie.ajdt/ajdt-on-eclipse-45/workspace/org.eclipse.ajdt.core.tests/target/work/data/DefaultEmptyProject/src/p/Java.java)
AJDE Callback: finish. Was full build: true
Timer event: 42ms: Total time spent in AJDE
Timer event: 0ms: Refresh after build
Types affected during build = 2
Timer event: 49ms: Total time spent in AJBuilder.build()
Timer event: 4ms: Delete markers: DefaultEmptyProject (Finished deleting markers for DefaultEmptyProject)
Timer event: 2ms: Create markers: DefaultEmptyProject (Finished creating markers for DefaultEmptyProject)
Created 2 markers in 2 files
Timer event: 0ms: Update visualizer, xref, advice listeners for (separate thread): DefaultEmptyProject
===========================================================================================
Build kind = FULLBUILD
Project=DefaultEmptyProject, kind of build requested=Full AspectJ compilation
Timer event: 0ms: Flush included source file cache
Timer event: 0ms: Check delta
Builder: Tidied output folder(s), removed class files and derived resources
Classpath = /jobs/genie.ajdt/ajdt-on-eclipse-45/workspace/org.eclipse.ajdt.core.tests/target/work/data/DefaultEmptyProject/bin:/jobs/genie.ajdt/ajdt-on-eclipse-45/workspace/org.aspectj.runtime/target/org.aspectj.runtime-1.8.9-SNAPSHOT.jar:/opt/public/common/jdk1.7.0_80/jre/lib/resources.jar:/opt/public/common/jdk1.7.0_80/jre/lib/rt.jar:/opt/public/common/jdk1.7.0_80/jre/lib/jsse.jar:/opt/public/common/jdk1.7.0_80/jre/lib/jce.jar:/opt/public/common/jdk1.7.0_80/jre/lib/charsets.jar:/opt/public/common/jdk1.7.0_80/jre/lib/jfr.jar:/opt/public/common/jdk1.7.0_80/jre/lib/ext/dnsns.jar:/opt/public/common/jdk1.7.0_80/jre/lib/ext/sunpkcs11.jar:/opt/public/common/jdk1.7.0_80/jre/lib/ext/zipfs.jar:/opt/public/common/jdk1.7.0_80/jre/lib/ext/sunec.jar:/opt/public/common/jdk1.7.0_80/jre/lib/ext/sunjce_provider.jar:/opt/public/common/jdk1.7.0_80/jre/lib/ext/localedata.jar:/jobs/genie.ajdt/ajdt-on-eclipse-45/workspace/org.eclipse.ajdt.core.tests/target/work/configuration/org.eclipse.osgi/40/0/.cp/junit.jar:/jobs/genie.ajdt/ajdt-on-eclipse-45/workspace/org.eclipse.ajdt.core.tests/target/work/configuration/org.eclipse.osgi/218/0/.cp:
Timer event: 2ms: Pre compile
Compiler configuration for project DefaultEmptyProject has been read by compiler.  Resetting.
     Configuration was []
Resetting list of modified source files.  Was []
AJC: compiling source files
Timer event: 35ms: Time to first compiled message
AJC: compiled: /jobs/genie.ajdt/ajdt-on-eclipse-45/workspace/org.eclipse.ajdt.core.tests/target/work/data/DefaultEmptyProject/src/p/Aspect.aj
Timer event: 36ms: Time to first woven message
AJC: woven aspect p.Aspect (from /jobs/genie.ajdt/ajdt-on-eclipse-45/workspace/org.eclipse.ajdt.core.tests/target/work/data/DefaultEmptyProject/src/p/Aspect.aj)
AJC: compiled: /jobs/genie.ajdt/ajdt-on-eclipse-45/workspace/org.eclipse.ajdt.core.tests/target/work/data/DefaultEmptyProject/src/p/Java.java
AJC: woven class p.Java (from /jobs/genie.ajdt/ajdt-on-eclipse-45/workspace/org.eclipse.ajdt.core.tests/target/work/data/DefaultEmptyProject/src/p/Java.java)
AJDE Callback: finish. Was full build: true
Timer event: 39ms: Total time spent in AJDE
Timer event: 0ms: Refresh after build
Types affected during build = 2
Timer event: 41ms: Total time spent in AJBuilder.build()
Timer event: 8ms: Delete markers: DefaultEmptyProject (Finished deleting markers for DefaultEmptyProject)
Timer event: 1ms: Create markers: DefaultEmptyProject (Finished creating markers for DefaultEmptyProject)
Created 2 markers in 2 files
------------------------
Starting testMoveTypeInITDMethod2
Timer event: 0ms: Update visualizer, xref, advice listeners for (separate thread): DefaultEmptyProject
===========================================================================================
Build kind = FULLBUILD
Project=DefaultEmptyProject, kind of build requested=Full AspectJ compilation
Timer event: 0ms: Flush included source file cache
Timer event: 0ms: Check delta
Builder: Tidied output folder(s), removed class files and derived resources
Classpath = /jobs/genie.ajdt/ajdt-on-eclipse-45/workspace/org.eclipse.ajdt.core.tests/target/work/data/DefaultEmptyProject/bin:/jobs/genie.ajdt/ajdt-on-eclipse-45/workspace/org.aspectj.runtime/target/org.aspectj.runtime-1.8.9-SNAPSHOT.jar:/opt/public/common/jdk1.7.0_80/jre/lib/resources.jar:/opt/public/common/jdk1.7.0_80/jre/lib/rt.jar:/opt/public/common/jdk1.7.0_80/jre/lib/jsse.jar:/opt/public/common/jdk1.7.0_80/jre/lib/jce.jar:/opt/public/common/jdk1.7.0_80/jre/lib/charsets.jar:/opt/public/common/jdk1.7.0_80/jre/lib/jfr.jar:/opt/public/common/jdk1.7.0_80/jre/lib/ext/dnsns.jar:/opt/public/common/jdk1.7.0_80/jre/lib/ext/sunpkcs11.jar:/opt/public/common/jdk1.7.0_80/jre/lib/ext/zipfs.jar:/opt/public/common/jdk1.7.0_80/jre/lib/ext/sunec.jar:/opt/public/common/jdk1.7.0_80/jre/lib/ext/sunjce_provider.jar:/opt/public/common/jdk1.7.0_80/jre/lib/ext/localedata.jar:/jobs/genie.ajdt/ajdt-on-eclipse-45/workspace/org.eclipse.ajdt.core.tests/target/work/configuration/org.eclipse.osgi/40/0/.cp/junit.jar:/jobs/genie.ajdt/ajdt-on-eclipse-45/workspace/org.eclipse.ajdt.core.tests/target/work/configuration/org.eclipse.osgi/218/0/.cp:
Timer event: 7ms: Pre compile
Compiler configuration for project DefaultEmptyProject has been read by compiler.  Resetting.
     Configuration was []
Resetting list of modified source files.  Was []
AJC: compiling source files
Timer event: 37ms: Time to first compiled message
AJC: compiled: /jobs/genie.ajdt/ajdt-on-eclipse-45/workspace/org.eclipse.ajdt.core.tests/target/work/data/DefaultEmptyProject/src/p/Aspect.aj
Timer event: 39ms: Time to first woven message
AJC: woven aspect p.Aspect (from /jobs/genie.ajdt/ajdt-on-eclipse-45/workspace/org.eclipse.ajdt.core.tests/target/work/data/DefaultEmptyProject/src/p/Aspect.aj)
AJC: compiled: /jobs/genie.ajdt/ajdt-on-eclipse-45/workspace/org.eclipse.ajdt.core.tests/target/work/data/DefaultEmptyProject/src/p/Java.java
AJC: woven class p.Java (from /jobs/genie.ajdt/ajdt-on-eclipse-45/workspace/org.eclipse.ajdt.core.tests/target/work/data/DefaultEmptyProject/src/p/Java.java)
AJDE Callback: finish. Was full build: true
Timer event: 43ms: Total time spent in AJDE
Timer event: 0ms: Refresh after build
Types affected during build = 2
Timer event: 50ms: Total time spent in AJBuilder.build()
Timer event: 5ms: Delete markers: DefaultEmptyProject (Finished deleting markers for DefaultEmptyProject)
Timer event: 2ms: Create markers: DefaultEmptyProject (Finished creating markers for DefaultEmptyProject)
Created 2 markers in 2 files
Timer event: 0ms: Update visualizer, xref, advice listeners for (separate thread): DefaultEmptyProject
===========================================================================================
Build kind = FULLBUILD
Project=DefaultEmptyProject, kind of build requested=Full AspectJ compilation
Timer event: 0ms: Flush included source file cache
Timer event: 0ms: Check delta
Builder: Tidied output folder(s), removed class files and derived resources
Classpath = /jobs/genie.ajdt/ajdt-on-eclipse-45/workspace/org.eclipse.ajdt.core.tests/target/work/data/DefaultEmptyProject/bin:/jobs/genie.ajdt/ajdt-on-eclipse-45/workspace/org.aspectj.runtime/target/org.aspectj.runtime-1.8.9-SNAPSHOT.jar:/opt/public/common/jdk1.7.0_80/jre/lib/resources.jar:/opt/public/common/jdk1.7.0_80/jre/lib/rt.jar:/opt/public/common/jdk1.7.0_80/jre/lib/jsse.jar:/opt/public/common/jdk1.7.0_80/jre/lib/jce.jar:/opt/public/common/jdk1.7.0_80/jre/lib/charsets.jar:/opt/public/common/jdk1.7.0_80/jre/lib/jfr.jar:/opt/public/common/jdk1.7.0_80/jre/lib/ext/dnsns.jar:/opt/public/common/jdk1.7.0_80/jre/lib/ext/sunpkcs11.jar:/opt/public/common/jdk1.7.0_80/jre/lib/ext/zipfs.jar:/opt/public/common/jdk1.7.0_80/jre/lib/ext/sunec.jar:/opt/public/common/jdk1.7.0_80/jre/lib/ext/sunjce_provider.jar:/opt/public/common/jdk1.7.0_80/jre/lib/ext/localedata.jar:/jobs/genie.ajdt/ajdt-on-eclipse-45/workspace/org.eclipse.ajdt.core.tests/target/work/configuration/org.eclipse.osgi/40/0/.cp/junit.jar:/jobs/genie.ajdt/ajdt-on-eclipse-45/workspace/org.eclipse.ajdt.core.tests/target/work/configuration/org.eclipse.osgi/218/0/.cp:
Timer event: 2ms: Pre compile
Compiler configuration for project DefaultEmptyProject has been read by compiler.  Resetting.
     Configuration was []
Resetting list of modified source files.  Was []
AJC: compiling source files
Timer event: 59ms: Time to first compiled message
AJC: compiled: /jobs/genie.ajdt/ajdt-on-eclipse-45/workspace/org.eclipse.ajdt.core.tests/target/work/data/DefaultEmptyProject/src/p/Aspect.aj
Timer event: 61ms: Time to first woven message
AJC: woven aspect p.Aspect (from /jobs/genie.ajdt/ajdt-on-eclipse-45/workspace/org.eclipse.ajdt.core.tests/target/work/data/DefaultEmptyProject/src/p/Aspect.aj)
AJC: compiled: /jobs/genie.ajdt/ajdt-on-eclipse-45/workspace/org.eclipse.ajdt.core.tests/target/work/data/DefaultEmptyProject/src/p/Java.java
AJC: woven class p.Java (from /jobs/genie.ajdt/ajdt-on-eclipse-45/workspace/org.eclipse.ajdt.core.tests/target/work/data/DefaultEmptyProject/src/p/Java.java)
AJDE Callback: finish. Was full build: true
Timer event: 65ms: Total time spent in AJDE
Timer event: 0ms: Refresh after build
Types affected during build = 2
Timer event: 67ms: Total time spent in AJBuilder.build()
Timer event: 2ms: Delete markers: DefaultEmptyProject (Finished deleting markers for DefaultEmptyProject)
Timer event: 2ms: Create markers: DefaultEmptyProject (Finished creating markers for DefaultEmptyProject)
Created 2 markers in 2 files
------------------------
Starting testMoveTypeInITDMethod3
Timer event: 0ms: Update visualizer, xref, advice listeners for (separate thread): DefaultEmptyProject
===========================================================================================
Build kind = FULLBUILD
Project=DefaultEmptyProject, kind of build requested=Full AspectJ compilation
Timer event: 0ms: Flush included source file cache
Timer event: 0ms: Check delta
Builder: Tidied output folder(s), removed class files and derived resources
Classpath = /jobs/genie.ajdt/ajdt-on-eclipse-45/workspace/org.eclipse.ajdt.core.tests/target/work/data/DefaultEmptyProject/bin:/jobs/genie.ajdt/ajdt-on-eclipse-45/workspace/org.aspectj.runtime/target/org.aspectj.runtime-1.8.9-SNAPSHOT.jar:/opt/public/common/jdk1.7.0_80/jre/lib/resources.jar:/opt/public/common/jdk1.7.0_80/jre/lib/rt.jar:/opt/public/common/jdk1.7.0_80/jre/lib/jsse.jar:/opt/public/common/jdk1.7.0_80/jre/lib/jce.jar:/opt/public/common/jdk1.7.0_80/jre/lib/charsets.jar:/opt/public/common/jdk1.7.0_80/jre/lib/jfr.jar:/opt/public/common/jdk1.7.0_80/jre/lib/ext/dnsns.jar:/opt/public/common/jdk1.7.0_80/jre/lib/ext/sunpkcs11.jar:/opt/public/common/jdk1.7.0_80/jre/lib/ext/zipfs.jar:/opt/public/common/jdk1.7.0_80/jre/lib/ext/sunec.jar:/opt/public/common/jdk1.7.0_80/jre/lib/ext/sunjce_provider.jar:/opt/public/common/jdk1.7.0_80/jre/lib/ext/localedata.jar:/jobs/genie.ajdt/ajdt-on-eclipse-45/workspace/org.eclipse.ajdt.core.tests/target/work/configuration/org.eclipse.osgi/40/0/.cp/junit.jar:/jobs/genie.ajdt/ajdt-on-eclipse-45/workspace/org.eclipse.ajdt.core.tests/target/work/configuration/org.eclipse.osgi/218/0/.cp:
Timer event: 7ms: Pre compile
Compiler configuration for project DefaultEmptyProject has been read by compiler.  Resetting.
     Configuration was []
Resetting list of modified source files.  Was []
AJC: compiling source files
Timer event: 37ms: Time to first compiled message
AJC: compiled: /jobs/genie.ajdt/ajdt-on-eclipse-45/workspace/org.eclipse.ajdt.core.tests/target/work/data/DefaultEmptyProject/src/q/Aspect.aj
Timer event: 39ms: Time to first woven message
AJC: woven aspect q.Aspect (from /jobs/genie.ajdt/ajdt-on-eclipse-45/workspace/org.eclipse.ajdt.core.tests/target/work/data/DefaultEmptyProject/src/q/Aspect.aj)
AJC: compiled: /jobs/genie.ajdt/ajdt-on-eclipse-45/workspace/org.eclipse.ajdt.core.tests/target/work/data/DefaultEmptyProject/src/p/Java.java
AJC: woven class p.Java (from /jobs/genie.ajdt/ajdt-on-eclipse-45/workspace/org.eclipse.ajdt.core.tests/target/work/data/DefaultEmptyProject/src/p/Java.java)
AJDE Callback: finish. Was full build: true
Timer event: 42ms: Total time spent in AJDE
Timer event: 0ms: Refresh after build
Types affected during build = 2
Timer event: 49ms: Total time spent in AJBuilder.build()
Timer event: 4ms: Delete markers: DefaultEmptyProject (Finished deleting markers for DefaultEmptyProject)
Timer event: 2ms: Create markers: DefaultEmptyProject (Finished creating markers for DefaultEmptyProject)
Created 2 markers in 2 files
Timer event: 0ms: Update visualizer, xref, advice listeners for (separate thread): DefaultEmptyProject
===========================================================================================
Build kind = FULLBUILD
Project=DefaultEmptyProject, kind of build requested=Full AspectJ compilation
Timer event: 0ms: Flush included source file cache
Timer event: 0ms: Check delta
Builder: Tidied output folder(s), removed class files and derived resources
Classpath = /jobs/genie.ajdt/ajdt-on-eclipse-45/workspace/org.eclipse.ajdt.core.tests/target/work/data/DefaultEmptyProject/bin:/jobs/genie.ajdt/ajdt-on-eclipse-45/workspace/org.aspectj.runtime/target/org.aspectj.runtime-1.8.9-SNAPSHOT.jar:/opt/public/common/jdk1.7.0_80/jre/lib/resources.jar:/opt/public/common/jdk1.7.0_80/jre/lib/rt.jar:/opt/public/common/jdk1.7.0_80/jre/lib/jsse.jar:/opt/public/common/jdk1.7.0_80/jre/lib/jce.jar:/opt/public/common/jdk1.7.0_80/jre/lib/charsets.jar:/opt/public/common/jdk1.7.0_80/jre/lib/jfr.jar:/opt/public/common/jdk1.7.0_80/jre/lib/ext/dnsns.jar:/opt/public/common/jdk1.7.0_80/jre/lib/ext/sunpkcs11.jar:/opt/public/common/jdk1.7.0_80/jre/lib/ext/zipfs.jar:/opt/public/common/jdk1.7.0_80/jre/lib/ext/sunec.jar:/opt/public/common/jdk1.7.0_80/jre/lib/ext/sunjce_provider.jar:/opt/public/common/jdk1.7.0_80/jre/lib/ext/localedata.jar:/jobs/genie.ajdt/ajdt-on-eclipse-45/workspace/org.eclipse.ajdt.core.tests/target/work/configuration/org.eclipse.osgi/40/0/.cp/junit.jar:/jobs/genie.ajdt/ajdt-on-eclipse-45/workspace/org.eclipse.ajdt.core.tests/target/work/configuration/org.eclipse.osgi/218/0/.cp:
Timer event: 3ms: Pre compile
Compiler configuration for project DefaultEmptyProject has been read by compiler.  Resetting.
     Configuration was []
Resetting list of modified source files.  Was []
AJC: compiling source files
Timer event: 48ms: Time to first compiled message
AJC: compiled: /jobs/genie.ajdt/ajdt-on-eclipse-45/workspace/org.eclipse.ajdt.core.tests/target/work/data/DefaultEmptyProject/src/q/Aspect.aj
Timer event: 50ms: Time to first woven message
AJC: woven aspect q.Aspect (from /jobs/genie.ajdt/ajdt-on-eclipse-45/workspace/org.eclipse.ajdt.core.tests/target/work/data/DefaultEmptyProject/src/q/Aspect.aj)
AJC: compiled: /jobs/genie.ajdt/ajdt-on-eclipse-45/workspace/org.eclipse.ajdt.core.tests/target/work/data/DefaultEmptyProject/src/p/Java.java
AJC: woven class p.Java (from /jobs/genie.ajdt/ajdt-on-eclipse-45/workspace/org.eclipse.ajdt.core.tests/target/work/data/DefaultEmptyProject/src/p/Java.java)
AJDE Callback: finish. Was full build: true
Timer event: 53ms: Total time spent in AJDE
Timer event: 0ms: Refresh after build
Types affected during build = 2
Timer event: 56ms: Total time spent in AJBuilder.build()
Timer event: 1ms: Delete markers: DefaultEmptyProject (Finished deleting markers for DefaultEmptyProject)
Timer event: 2ms: Create markers: DefaultEmptyProject (Finished creating markers for DefaultEmptyProject)
Created 2 markers in 2 files
------------------------
Starting testMoveTypeInITDMethod4
Timer event: 0ms: Update visualizer, xref, advice listeners for (separate thread): DefaultEmptyProject
===========================================================================================
Build kind = FULLBUILD
Project=DefaultEmptyProject, kind of build requested=Full AspectJ compilation
Timer event: 0ms: Flush included source file cache
Timer event: 0ms: Check delta
Builder: Tidied output folder(s), removed class files and derived resources
Classpath = /jobs/genie.ajdt/ajdt-on-eclipse-45/workspace/org.eclipse.ajdt.core.tests/target/work/data/DefaultEmptyProject/bin:/jobs/genie.ajdt/ajdt-on-eclipse-45/workspace/org.aspectj.runtime/target/org.aspectj.runtime-1.8.9-SNAPSHOT.jar:/opt/public/common/jdk1.7.0_80/jre/lib/resources.jar:/opt/public/common/jdk1.7.0_80/jre/lib/rt.jar:/opt/public/common/jdk1.7.0_80/jre/lib/jsse.jar:/opt/public/common/jdk1.7.0_80/jre/lib/jce.jar:/opt/public/common/jdk1.7.0_80/jre/lib/charsets.jar:/opt/public/common/jdk1.7.0_80/jre/lib/jfr.jar:/opt/public/common/jdk1.7.0_80/jre/lib/ext/dnsns.jar:/opt/public/common/jdk1.7.0_80/jre/lib/ext/sunpkcs11.jar:/opt/public/common/jdk1.7.0_80/jre/lib/ext/zipfs.jar:/opt/public/common/jdk1.7.0_80/jre/lib/ext/sunec.jar:/opt/public/common/jdk1.7.0_80/jre/lib/ext/sunjce_provider.jar:/opt/public/common/jdk1.7.0_80/jre/lib/ext/localedata.jar:/jobs/genie.ajdt/ajdt-on-eclipse-45/workspace/org.eclipse.ajdt.core.tests/target/work/configuration/org.eclipse.osgi/40/0/.cp/junit.jar:/jobs/genie.ajdt/ajdt-on-eclipse-45/workspace/org.eclipse.ajdt.core.tests/target/work/configuration/org.eclipse.osgi/218/0/.cp:
Timer event: 7ms: Pre compile
Compiler configuration for project DefaultEmptyProject has been read by compiler.  Resetting.
     Configuration was []
Resetting list of modified source files.  Was []
AJC: compiling source files
Timer event: 38ms: Time to first compiled message
AJC: compiled: /jobs/genie.ajdt/ajdt-on-eclipse-45/workspace/org.eclipse.ajdt.core.tests/target/work/data/DefaultEmptyProject/src/q/Aspect.aj
Timer event: 40ms: Time to first woven message
AJC: woven aspect q.Aspect (from /jobs/genie.ajdt/ajdt-on-eclipse-45/workspace/org.eclipse.ajdt.core.tests/target/work/data/DefaultEmptyProject/src/q/Aspect.aj)
AJC: compiled: /jobs/genie.ajdt/ajdt-on-eclipse-45/workspace/org.eclipse.ajdt.core.tests/target/work/data/DefaultEmptyProject/src/p/Java.java
AJC: woven class p.Java (from /jobs/genie.ajdt/ajdt-on-eclipse-45/workspace/org.eclipse.ajdt.core.tests/target/work/data/DefaultEmptyProject/src/p/Java.java)
AJDE Callback: finish. Was full build: true
Timer event: 43ms: Total time spent in AJDE
Timer event: 0ms: Refresh after build
Types affected during build = 2
Timer event: 50ms: Total time spent in AJBuilder.build()
Timer event: 4ms: Delete markers: DefaultEmptyProject (Finished deleting markers for DefaultEmptyProject)
Timer event: 2ms: Create markers: DefaultEmptyProject (Finished creating markers for DefaultEmptyProject)
Created 2 markers in 2 files
Timer event: 0ms: Update visualizer, xref, advice listeners for (separate thread): DefaultEmptyProject
===========================================================================================
Build kind = FULLBUILD
Project=DefaultEmptyProject, kind of build requested=Full AspectJ compilation
Timer event: 0ms: Flush included source file cache
Timer event: 0ms: Check delta
Builder: Tidied output folder(s), removed class files and derived resources
Classpath = /jobs/genie.ajdt/ajdt-on-eclipse-45/workspace/org.eclipse.ajdt.core.tests/target/work/data/DefaultEmptyProject/bin:/jobs/genie.ajdt/ajdt-on-eclipse-45/workspace/org.aspectj.runtime/target/org.aspectj.runtime-1.8.9-SNAPSHOT.jar:/opt/public/common/jdk1.7.0_80/jre/lib/resources.jar:/opt/public/common/jdk1.7.0_80/jre/lib/rt.jar:/opt/public/common/jdk1.7.0_80/jre/lib/jsse.jar:/opt/public/common/jdk1.7.0_80/jre/lib/jce.jar:/opt/public/common/jdk1.7.0_80/jre/lib/charsets.jar:/opt/public/common/jdk1.7.0_80/jre/lib/jfr.jar:/opt/public/common/jdk1.7.0_80/jre/lib/ext/dnsns.jar:/opt/public/common/jdk1.7.0_80/jre/lib/ext/sunpkcs11.jar:/opt/public/common/jdk1.7.0_80/jre/lib/ext/zipfs.jar:/opt/public/common/jdk1.7.0_80/jre/lib/ext/sunec.jar:/opt/public/common/jdk1.7.0_80/jre/lib/ext/sunjce_provider.jar:/opt/public/common/jdk1.7.0_80/jre/lib/ext/localedata.jar:/jobs/genie.ajdt/ajdt-on-eclipse-45/workspace/org.eclipse.ajdt.core.tests/target/work/configuration/org.eclipse.osgi/40/0/.cp/junit.jar:/jobs/genie.ajdt/ajdt-on-eclipse-45/workspace/org.eclipse.ajdt.core.tests/target/work/configuration/org.eclipse.osgi/218/0/.cp:
Timer event: 336ms: Pre compile
Compiler configuration for project DefaultEmptyProject has been read by compiler.  Resetting.
     Configuration was []
Resetting list of modified source files.  Was []
AJC: compiling source files
Timer event: 38ms: Time to first compiled message
AJC: compiled: /jobs/genie.ajdt/ajdt-on-eclipse-45/workspace/org.eclipse.ajdt.core.tests/target/work/data/DefaultEmptyProject/src/q/Aspect.aj
Timer event: 40ms: Time to first woven message
AJC: woven aspect q.Aspect (from /jobs/genie.ajdt/ajdt-on-eclipse-45/workspace/org.eclipse.ajdt.core.tests/target/work/data/DefaultEmptyProject/src/q/Aspect.aj)
AJC: compiled: /jobs/genie.ajdt/ajdt-on-eclipse-45/workspace/org.eclipse.ajdt.core.tests/target/work/data/DefaultEmptyProject/src/p/Java.java
AJC: woven class p.Java (from /jobs/genie.ajdt/ajdt-on-eclipse-45/workspace/org.eclipse.ajdt.core.tests/target/work/data/DefaultEmptyProject/src/p/Java.java)
AJDE Callback: finish. Was full build: true
Timer event: 43ms: Total time spent in AJDE
Timer event: 0ms: Refresh after build
Types affected during build = 2
Timer event: 379ms: Total time spent in AJBuilder.build()
Timer event: 1ms: Delete markers: DefaultEmptyProject (Finished deleting markers for DefaultEmptyProject)
Timer event: 3ms: Create markers: DefaultEmptyProject (Finished creating markers for DefaultEmptyProject)
Created 2 markers in 2 files
------------------------
Starting testMoveTypeInITDMethod6
Timer event: 0ms: Update visualizer, xref, advice listeners for (separate thread): DefaultEmptyProject
===========================================================================================
Build kind = FULLBUILD
Project=DefaultEmptyProject, kind of build requested=Full AspectJ compilation
Timer event: 0ms: Flush included source file cache
Timer event: 0ms: Check delta
Builder: Tidied output folder(s), removed class files and derived resources
Classpath = /jobs/genie.ajdt/ajdt-on-eclipse-45/workspace/org.eclipse.ajdt.core.tests/target/work/data/DefaultEmptyProject/bin:/jobs/genie.ajdt/ajdt-on-eclipse-45/workspace/org.aspectj.runtime/target/org.aspectj.runtime-1.8.9-SNAPSHOT.jar:/opt/public/common/jdk1.7.0_80/jre/lib/resources.jar:/opt/public/common/jdk1.7.0_80/jre/lib/rt.jar:/opt/public/common/jdk1.7.0_80/jre/lib/jsse.jar:/opt/public/common/jdk1.7.0_80/jre/lib/jce.jar:/opt/public/common/jdk1.7.0_80/jre/lib/charsets.jar:/opt/public/common/jdk1.7.0_80/jre/lib/jfr.jar:/opt/public/common/jdk1.7.0_80/jre/lib/ext/dnsns.jar:/opt/public/common/jdk1.7.0_80/jre/lib/ext/sunpkcs11.jar:/opt/public/common/jdk1.7.0_80/jre/lib/ext/zipfs.jar:/opt/public/common/jdk1.7.0_80/jre/lib/ext/sunec.jar:/opt/public/common/jdk1.7.0_80/jre/lib/ext/sunjce_provider.jar:/opt/public/common/jdk1.7.0_80/jre/lib/ext/localedata.jar:/jobs/genie.ajdt/ajdt-on-eclipse-45/workspace/org.eclipse.ajdt.core.tests/target/work/configuration/org.eclipse.osgi/40/0/.cp/junit.jar:/jobs/genie.ajdt/ajdt-on-eclipse-45/workspace/org.eclipse.ajdt.core.tests/target/work/configuration/org.eclipse.osgi/218/0/.cp:
Timer event: 7ms: Pre compile
Compiler configuration for project DefaultEmptyProject has been read by compiler.  Resetting.
     Configuration was []
Resetting list of modified source files.  Was []
AJC: compiling source files
Timer event: 43ms: Time to first compiled message
AJC: compiled: /jobs/genie.ajdt/ajdt-on-eclipse-45/workspace/org.eclipse.ajdt.core.tests/target/work/data/DefaultEmptyProject/src/q/Aspect.aj
Timer event: 45ms: Time to first woven message
AJC: woven aspect q.Aspect (from /jobs/genie.ajdt/ajdt-on-eclipse-45/workspace/org.eclipse.ajdt.core.tests/target/work/data/DefaultEmptyProject/src/q/Aspect.aj)
AJC: compiled: /jobs/genie.ajdt/ajdt-on-eclipse-45/workspace/org.eclipse.ajdt.core.tests/target/work/data/DefaultEmptyProject/src/p/Java.java
AJC: woven class p.Java (from /jobs/genie.ajdt/ajdt-on-eclipse-45/workspace/org.eclipse.ajdt.core.tests/target/work/data/DefaultEmptyProject/src/p/Java.java)
AJDE Callback: finish. Was full build: true
Timer event: 49ms: Total time spent in AJDE
Timer event: 0ms: Refresh after build
Types affected during build = 2
Timer event: 56ms: Total time spent in AJBuilder.build()
Timer event: 5ms: Delete markers: DefaultEmptyProject (Finished deleting markers for DefaultEmptyProject)
Timer event: 4ms: Create markers: DefaultEmptyProject (Finished creating markers for DefaultEmptyProject)
Created 2 markers in 2 files
Timer event: 0ms: Update visualizer, xref, advice listeners for (separate thread): DefaultEmptyProject
===========================================================================================
Build kind = FULLBUILD
Project=DefaultEmptyProject, kind of build requested=Full AspectJ compilation
Timer event: 0ms: Flush included source file cache
Timer event: 0ms: Check delta
Builder: Tidied output folder(s), removed class files and derived resources
Classpath = /jobs/genie.ajdt/ajdt-on-eclipse-45/workspace/org.eclipse.ajdt.core.tests/target/work/data/DefaultEmptyProject/bin:/jobs/genie.ajdt/ajdt-on-eclipse-45/workspace/org.aspectj.runtime/target/org.aspectj.runtime-1.8.9-SNAPSHOT.jar:/opt/public/common/jdk1.7.0_80/jre/lib/resources.jar:/opt/public/common/jdk1.7.0_80/jre/lib/rt.jar:/opt/public/common/jdk1.7.0_80/jre/lib/jsse.jar:/opt/public/common/jdk1.7.0_80/jre/lib/jce.jar:/opt/public/common/jdk1.7.0_80/jre/lib/charsets.jar:/opt/public/common/jdk1.7.0_80/jre/lib/jfr.jar:/opt/public/common/jdk1.7.0_80/jre/lib/ext/dnsns.jar:/opt/public/common/jdk1.7.0_80/jre/lib/ext/sunpkcs11.jar:/opt/public/common/jdk1.7.0_80/jre/lib/ext/zipfs.jar:/opt/public/common/jdk1.7.0_80/jre/lib/ext/sunec.jar:/opt/public/common/jdk1.7.0_80/jre/lib/ext/sunjce_provider.jar:/opt/public/common/jdk1.7.0_80/jre/lib/ext/localedata.jar:/jobs/genie.ajdt/ajdt-on-eclipse-45/workspace/org.eclipse.ajdt.core.tests/target/work/configuration/org.eclipse.osgi/40/0/.cp/junit.jar:/jobs/genie.ajdt/ajdt-on-eclipse-45/workspace/org.eclipse.ajdt.core.tests/target/work/configuration/org.eclipse.osgi/218/0/.cp:
Timer event: 3ms: Pre compile
Compiler configuration for project DefaultEmptyProject has been read by compiler.  Resetting.
     Configuration was []
Resetting list of modified source files.  Was []
AJC: compiling source files
Timer event: 40ms: Time to first compiled message
AJC: compiled: /jobs/genie.ajdt/ajdt-on-eclipse-45/workspace/org.eclipse.ajdt.core.tests/target/work/data/DefaultEmptyProject/src/q/Aspect.aj
Timer event: 42ms: Time to first woven message
AJC: woven aspect q.Aspect (from /jobs/genie.ajdt/ajdt-on-eclipse-45/workspace/org.eclipse.ajdt.core.tests/target/work/data/DefaultEmptyProject/src/q/Aspect.aj)
AJC: compiled: /jobs/genie.ajdt/ajdt-on-eclipse-45/workspace/org.eclipse.ajdt.core.tests/target/work/data/DefaultEmptyProject/src/p/Java.java
AJC: woven class p.Java (from /jobs/genie.ajdt/ajdt-on-eclipse-45/workspace/org.eclipse.ajdt.core.tests/target/work/data/DefaultEmptyProject/src/p/Java.java)
AJDE Callback: finish. Was full build: true
Timer event: 44ms: Total time spent in AJDE
Timer event: 0ms: Refresh after build
Types affected during build = 2
Timer event: 48ms: Total time spent in AJBuilder.build()
Timer event: 2ms: Delete markers: DefaultEmptyProject (Finished deleting markers for DefaultEmptyProject)
Timer event: 1ms: Create markers: DefaultEmptyProject (Finished creating markers for DefaultEmptyProject)
Created 2 markers in 2 files
------------------------
Starting testMoveTypeWhenMultipleTypesOfSameSimpleNameExist1
Timer event: 0ms: Update visualizer, xref, advice listeners for (separate thread): DefaultEmptyProject
===========================================================================================
Build kind = FULLBUILD
Project=DefaultEmptyProject, kind of build requested=Full AspectJ compilation
Timer event: 0ms: Flush included source file cache
Timer event: 0ms: Check delta
Builder: Tidied output folder(s), removed class files and derived resources
Classpath = /jobs/genie.ajdt/ajdt-on-eclipse-45/workspace/org.eclipse.ajdt.core.tests/target/work/data/DefaultEmptyProject/bin:/jobs/genie.ajdt/ajdt-on-eclipse-45/workspace/org.aspectj.runtime/target/org.aspectj.runtime-1.8.9-SNAPSHOT.jar:/opt/public/common/jdk1.7.0_80/jre/lib/resources.jar:/opt/public/common/jdk1.7.0_80/jre/lib/rt.jar:/opt/public/common/jdk1.7.0_80/jre/lib/jsse.jar:/opt/public/common/jdk1.7.0_80/jre/lib/jce.jar:/opt/public/common/jdk1.7.0_80/jre/lib/charsets.jar:/opt/public/common/jdk1.7.0_80/jre/lib/jfr.jar:/opt/public/common/jdk1.7.0_80/jre/lib/ext/dnsns.jar:/opt/public/common/jdk1.7.0_80/jre/lib/ext/sunpkcs11.jar:/opt/public/common/jdk1.7.0_80/jre/lib/ext/zipfs.jar:/opt/public/common/jdk1.7.0_80/jre/lib/ext/sunec.jar:/opt/public/common/jdk1.7.0_80/jre/lib/ext/sunjce_provider.jar:/opt/public/common/jdk1.7.0_80/jre/lib/ext/localedata.jar:/jobs/genie.ajdt/ajdt-on-eclipse-45/workspace/org.eclipse.ajdt.core.tests/target/work/configuration/org.eclipse.osgi/40/0/.cp/junit.jar:/jobs/genie.ajdt/ajdt-on-eclipse-45/workspace/org.eclipse.ajdt.core.tests/target/work/configuration/org.eclipse.osgi/218/0/.cp:
Timer event: 7ms: Pre compile
Compiler configuration for project DefaultEmptyProject has been read by compiler.  Resetting.
     Configuration was []
Resetting list of modified source files.  Was []
AJC: compiling source files
Timer event: 35ms: Time to first compiled message
AJC: compiled: /jobs/genie.ajdt/ajdt-on-eclipse-45/workspace/org.eclipse.ajdt.core.tests/target/work/data/DefaultEmptyProject/src/p/Aspect.aj
Timer event: 37ms: Time to first woven message
AJC: woven aspect p.Aspect (from /jobs/genie.ajdt/ajdt-on-eclipse-45/workspace/org.eclipse.ajdt.core.tests/target/work/data/DefaultEmptyProject/src/p/Aspect.aj)
AJC: compiled: /jobs/genie.ajdt/ajdt-on-eclipse-45/workspace/org.eclipse.ajdt.core.tests/target/work/data/DefaultEmptyProject/src/q/Java.java
AJC: woven class q.Java (from /jobs/genie.ajdt/ajdt-on-eclipse-45/workspace/org.eclipse.ajdt.core.tests/target/work/data/DefaultEmptyProject/src/q/Java.java)
AJC: compiled: /jobs/genie.ajdt/ajdt-on-eclipse-45/workspace/org.eclipse.ajdt.core.tests/target/work/data/DefaultEmptyProject/src/p/Other.java
AJC: woven class p.Other (from /jobs/genie.ajdt/ajdt-on-eclipse-45/workspace/org.eclipse.ajdt.core.tests/target/work/data/DefaultEmptyProject/src/p/Other.java)
AJC: compiled: /jobs/genie.ajdt/ajdt-on-eclipse-45/workspace/org.eclipse.ajdt.core.tests/target/work/data/DefaultEmptyProject/src/r/Java.java
AJC: woven class r.Java (from /jobs/genie.ajdt/ajdt-on-eclipse-45/workspace/org.eclipse.ajdt.core.tests/target/work/data/DefaultEmptyProject/src/r/Java.java)
AJDE Callback: finish. Was full build: true
Timer event: 43ms: Total time spent in AJDE
Timer event: 0ms: Refresh after build
Types affected during build = 4
Timer event: 51ms: Total time spent in AJBuilder.build()
Timer event: 4ms: Delete markers: DefaultEmptyProject (Finished deleting markers for DefaultEmptyProject)
Timer event: 4ms: Create markers: DefaultEmptyProject (Finished creating markers for DefaultEmptyProject)
Created 4 markers in 4 files
Timer event: 0ms: Update visualizer, xref, advice listeners for (separate thread): DefaultEmptyProject
===========================================================================================
Build kind = FULLBUILD
Project=DefaultEmptyProject, kind of build requested=Full AspectJ compilation
Timer event: 0ms: Flush included source file cache
Timer event: 0ms: Check delta
Builder: Tidied output folder(s), removed class files and derived resources
Classpath = /jobs/genie.ajdt/ajdt-on-eclipse-45/workspace/org.eclipse.ajdt.core.tests/target/work/data/DefaultEmptyProject/bin:/jobs/genie.ajdt/ajdt-on-eclipse-45/workspace/org.aspectj.runtime/target/org.aspectj.runtime-1.8.9-SNAPSHOT.jar:/opt/public/common/jdk1.7.0_80/jre/lib/resources.jar:/opt/public/common/jdk1.7.0_80/jre/lib/rt.jar:/opt/public/common/jdk1.7.0_80/jre/lib/jsse.jar:/opt/public/common/jdk1.7.0_80/jre/lib/jce.jar:/opt/public/common/jdk1.7.0_80/jre/lib/charsets.jar:/opt/public/common/jdk1.7.0_80/jre/lib/jfr.jar:/opt/public/common/jdk1.7.0_80/jre/lib/ext/dnsns.jar:/opt/public/common/jdk1.7.0_80/jre/lib/ext/sunpkcs11.jar:/opt/public/common/jdk1.7.0_80/jre/lib/ext/zipfs.jar:/opt/public/common/jdk1.7.0_80/jre/lib/ext/sunec.jar:/opt/public/common/jdk1.7.0_80/jre/lib/ext/sunjce_provider.jar:/opt/public/common/jdk1.7.0_80/jre/lib/ext/localedata.jar:/jobs/genie.ajdt/ajdt-on-eclipse-45/workspace/org.eclipse.ajdt.core.tests/target/work/configuration/org.eclipse.osgi/40/0/.cp/junit.jar:/jobs/genie.ajdt/ajdt-on-eclipse-45/workspace/org.eclipse.ajdt.core.tests/target/work/configuration/org.eclipse.osgi/218/0/.cp:
Timer event: 3ms: Pre compile
Compiler configuration for project DefaultEmptyProject has been read by compiler.  Resetting.
     Configuration was []
Resetting list of modified source files.  Was []
AJC: compiling source files
Timer event: 31ms: Time to first compiled message
AJC: compiled: /jobs/genie.ajdt/ajdt-on-eclipse-45/workspace/org.eclipse.ajdt.core.tests/target/work/data/DefaultEmptyProject/src/p/Aspect.aj
Timer event: 33ms: Time to first woven message
AJC: woven aspect p.Aspect (from /jobs/genie.ajdt/ajdt-on-eclipse-45/workspace/org.eclipse.ajdt.core.tests/target/work/data/DefaultEmptyProject/src/p/Aspect.aj)
AJC: compiled: /jobs/genie.ajdt/ajdt-on-eclipse-45/workspace/org.eclipse.ajdt.core.tests/target/work/data/DefaultEmptyProject/src/q/Java.java
AJC: woven class q.Java (from /jobs/genie.ajdt/ajdt-on-eclipse-45/workspace/org.eclipse.ajdt.core.tests/target/work/data/DefaultEmptyProject/src/q/Java.java)
AJC: compiled: /jobs/genie.ajdt/ajdt-on-eclipse-45/workspace/org.eclipse.ajdt.core.tests/target/work/data/DefaultEmptyProject/src/p/Other.java
AJC: woven class p.Other (from /jobs/genie.ajdt/ajdt-on-eclipse-45/workspace/org.eclipse.ajdt.core.tests/target/work/data/DefaultEmptyProject/src/p/Other.java)
AJC: compiled: /jobs/genie.ajdt/ajdt-on-eclipse-45/workspace/org.eclipse.ajdt.core.tests/target/work/data/DefaultEmptyProject/src/r/Java.java
AJC: woven class r.Java (from /jobs/genie.ajdt/ajdt-on-eclipse-45/workspace/org.eclipse.ajdt.core.tests/target/work/data/DefaultEmptyProject/src/r/Java.java)
AJDE Callback: finish. Was full build: true
Timer event: 38ms: Total time spent in AJDE
Timer event: 0ms: Refresh after build
Types affected during build = 4
Timer event: 42ms: Total time spent in AJBuilder.build()
Timer event: 1ms: Delete markers: DefaultEmptyProject (Finished deleting markers for DefaultEmptyProject)
Timer event: 3ms: Create markers: DefaultEmptyProject (Finished creating markers for DefaultEmptyProject)
Created 4 markers in 4 files
------------------------
Starting testMoveTypeWhenMultipleTypesOfSameSimpleNameExist2
Timer event: 0ms: Update visualizer, xref, advice listeners for (separate thread): DefaultEmptyProject
===========================================================================================
Build kind = FULLBUILD
Project=DefaultEmptyProject, kind of build requested=Full AspectJ compilation
Timer event: 0ms: Flush included source file cache
Timer event: 0ms: Check delta
Builder: Tidied output folder(s), removed class files and derived resources
Classpath = /jobs/genie.ajdt/ajdt-on-eclipse-45/workspace/org.eclipse.ajdt.core.tests/target/work/data/DefaultEmptyProject/bin:/jobs/genie.ajdt/ajdt-on-eclipse-45/workspace/org.aspectj.runtime/target/org.aspectj.runtime-1.8.9-SNAPSHOT.jar:/opt/public/common/jdk1.7.0_80/jre/lib/resources.jar:/opt/public/common/jdk1.7.0_80/jre/lib/rt.jar:/opt/public/common/jdk1.7.0_80/jre/lib/jsse.jar:/opt/public/common/jdk1.7.0_80/jre/lib/jce.jar:/opt/public/common/jdk1.7.0_80/jre/lib/charsets.jar:/opt/public/common/jdk1.7.0_80/jre/lib/jfr.jar:/opt/public/common/jdk1.7.0_80/jre/lib/ext/dnsns.jar:/opt/public/common/jdk1.7.0_80/jre/lib/ext/sunpkcs11.jar:/opt/public/common/jdk1.7.0_80/jre/lib/ext/zipfs.jar:/opt/public/common/jdk1.7.0_80/jre/lib/ext/sunec.jar:/opt/public/common/jdk1.7.0_80/jre/lib/ext/sunjce_provider.jar:/opt/public/common/jdk1.7.0_80/jre/lib/ext/localedata.jar:/jobs/genie.ajdt/ajdt-on-eclipse-45/workspace/org.eclipse.ajdt.core.tests/target/work/configuration/org.eclipse.osgi/40/0/.cp/junit.jar:/jobs/genie.ajdt/ajdt-on-eclipse-45/workspace/org.eclipse.ajdt.core.tests/target/work/configuration/org.eclipse.osgi/218/0/.cp:
Timer event: 358ms: Pre compile
Compiler configuration for project DefaultEmptyProject has been read by compiler.  Resetting.
     Configuration was []
Resetting list of modified source files.  Was []
AJC: compiling source files
Timer event: 46ms: Time to first compiled message
AJC: compiled: /jobs/genie.ajdt/ajdt-on-eclipse-45/workspace/org.eclipse.ajdt.core.tests/target/work/data/DefaultEmptyProject/src/p/Aspect.aj
Timer event: 48ms: Time to first woven message
AJC: woven aspect p.Aspect (from /jobs/genie.ajdt/ajdt-on-eclipse-45/workspace/org.eclipse.ajdt.core.tests/target/work/data/DefaultEmptyProject/src/p/Aspect.aj)
AJC: compiled: /jobs/genie.ajdt/ajdt-on-eclipse-45/workspace/org.eclipse.ajdt.core.tests/target/work/data/DefaultEmptyProject/src/q/Java.java
AJC: woven class q.Java (from /jobs/genie.ajdt/ajdt-on-eclipse-45/workspace/org.eclipse.ajdt.core.tests/target/work/data/DefaultEmptyProject/src/q/Java.java)
AJC: compiled: /jobs/genie.ajdt/ajdt-on-eclipse-45/workspace/org.eclipse.ajdt.core.tests/target/work/data/DefaultEmptyProject/src/p/Other.java
AJC: woven class p.Other (from /jobs/genie.ajdt/ajdt-on-eclipse-45/workspace/org.eclipse.ajdt.core.tests/target/work/data/DefaultEmptyProject/src/p/Other.java)
AJC: compiled: /jobs/genie.ajdt/ajdt-on-eclipse-45/workspace/org.eclipse.ajdt.core.tests/target/work/data/DefaultEmptyProject/src/r/Java.java
AJC: woven class r.Java (from /jobs/genie.ajdt/ajdt-on-eclipse-45/workspace/org.eclipse.ajdt.core.tests/target/work/data/DefaultEmptyProject/src/r/Java.java)
AJDE Callback: finish. Was full build: true
Timer event: 57ms: Total time spent in AJDE
Timer event: 0ms: Refresh after build
Types affected during build = 4
Timer event: 415ms: Total time spent in AJBuilder.build()
Timer event: 4ms: Delete markers: DefaultEmptyProject (Finished deleting markers for DefaultEmptyProject)
Timer event: 4ms: Create markers: DefaultEmptyProject (Finished creating markers for DefaultEmptyProject)
Created 4 markers in 4 files
Timer event: 0ms: Update visualizer, xref, advice listeners for (separate thread): DefaultEmptyProject
===========================================================================================
Build kind = FULLBUILD
Project=DefaultEmptyProject, kind of build requested=Full AspectJ compilation
Timer event: 0ms: Flush included source file cache
Timer event: 0ms: Check delta
Builder: Tidied output folder(s), removed class files and derived resources
Classpath = /jobs/genie.ajdt/ajdt-on-eclipse-45/workspace/org.eclipse.ajdt.core.tests/target/work/data/DefaultEmptyProject/bin:/jobs/genie.ajdt/ajdt-on-eclipse-45/workspace/org.aspectj.runtime/target/org.aspectj.runtime-1.8.9-SNAPSHOT.jar:/opt/public/common/jdk1.7.0_80/jre/lib/resources.jar:/opt/public/common/jdk1.7.0_80/jre/lib/rt.jar:/opt/public/common/jdk1.7.0_80/jre/lib/jsse.jar:/opt/public/common/jdk1.7.0_80/jre/lib/jce.jar:/opt/public/common/jdk1.7.0_80/jre/lib/charsets.jar:/opt/public/common/jdk1.7.0_80/jre/lib/jfr.jar:/opt/public/common/jdk1.7.0_80/jre/lib/ext/dnsns.jar:/opt/public/common/jdk1.7.0_80/jre/lib/ext/sunpkcs11.jar:/opt/public/common/jdk1.7.0_80/jre/lib/ext/zipfs.jar:/opt/public/common/jdk1.7.0_80/jre/lib/ext/sunec.jar:/opt/public/common/jdk1.7.0_80/jre/lib/ext/sunjce_provider.jar:/opt/public/common/jdk1.7.0_80/jre/lib/ext/localedata.jar:/jobs/genie.ajdt/ajdt-on-eclipse-45/workspace/org.eclipse.ajdt.core.tests/target/work/configuration/org.eclipse.osgi/40/0/.cp/junit.jar:/jobs/genie.ajdt/ajdt-on-eclipse-45/workspace/org.eclipse.ajdt.core.tests/target/work/configuration/org.eclipse.osgi/218/0/.cp:
Timer event: 3ms: Pre compile
Compiler configuration for project DefaultEmptyProject has been read by compiler.  Resetting.
     Configuration was []
Resetting list of modified source files.  Was []
AJC: compiling source files
Timer event: 37ms: Time to first compiled message
AJC: compiled: /jobs/genie.ajdt/ajdt-on-eclipse-45/workspace/org.eclipse.ajdt.core.tests/target/work/data/DefaultEmptyProject/src/p/Aspect.aj
Timer event: 38ms: Time to first woven message
AJC: woven aspect p.Aspect (from /jobs/genie.ajdt/ajdt-on-eclipse-45/workspace/org.eclipse.ajdt.core.tests/target/work/data/DefaultEmptyProject/src/p/Aspect.aj)
AJC: compiled: /jobs/genie.ajdt/ajdt-on-eclipse-45/workspace/org.eclipse.ajdt.core.tests/target/work/data/DefaultEmptyProject/src/q/Java.java
AJC: woven class q.Java (from /jobs/genie.ajdt/ajdt-on-eclipse-45/workspace/org.eclipse.ajdt.core.tests/target/work/data/DefaultEmptyProject/src/q/Java.java)
AJC: compiled: /jobs/genie.ajdt/ajdt-on-eclipse-45/workspace/org.eclipse.ajdt.core.tests/target/work/data/DefaultEmptyProject/src/p/Other.java
AJC: woven class p.Other (from /jobs/genie.ajdt/ajdt-on-eclipse-45/workspace/org.eclipse.ajdt.core.tests/target/work/data/DefaultEmptyProject/src/p/Other.java)
AJC: compiled: /jobs/genie.ajdt/ajdt-on-eclipse-45/workspace/org.eclipse.ajdt.core.tests/target/work/data/DefaultEmptyProject/src/r/Java.java
AJC: woven class r.Java (from /jobs/genie.ajdt/ajdt-on-eclipse-45/workspace/org.eclipse.ajdt.core.tests/target/work/data/DefaultEmptyProject/src/r/Java.java)
AJDE Callback: finish. Was full build: true
Timer event: 44ms: Total time spent in AJDE
Timer event: 0ms: Refresh after build
Types affected during build = 4
Timer event: 48ms: Total time spent in AJBuilder.build()
Timer event: 2ms: Delete markers: DefaultEmptyProject (Finished deleting markers for DefaultEmptyProject)
Timer event: 3ms: Create markers: DefaultEmptyProject (Finished creating markers for DefaultEmptyProject)
Created 4 markers in 4 files
------------------------
Starting testMoveTypeWhenMultipleTypesOfSameSimpleNameExist3
Timer event: 0ms: Update visualizer, xref, advice listeners for (separate thread): DefaultEmptyProject
===========================================================================================
Build kind = FULLBUILD
Project=DefaultEmptyProject, kind of build requested=Full AspectJ compilation
Timer event: 0ms: Flush included source file cache
Timer event: 0ms: Check delta
Builder: Tidied output folder(s), removed class files and derived resources
Classpath = /jobs/genie.ajdt/ajdt-on-eclipse-45/workspace/org.eclipse.ajdt.core.tests/target/work/data/DefaultEmptyProject/bin:/jobs/genie.ajdt/ajdt-on-eclipse-45/workspace/org.aspectj.runtime/target/org.aspectj.runtime-1.8.9-SNAPSHOT.jar:/opt/public/common/jdk1.7.0_80/jre/lib/resources.jar:/opt/public/common/jdk1.7.0_80/jre/lib/rt.jar:/opt/public/common/jdk1.7.0_80/jre/lib/jsse.jar:/opt/public/common/jdk1.7.0_80/jre/lib/jce.jar:/opt/public/common/jdk1.7.0_80/jre/lib/charsets.jar:/opt/public/common/jdk1.7.0_80/jre/lib/jfr.jar:/opt/public/common/jdk1.7.0_80/jre/lib/ext/dnsns.jar:/opt/public/common/jdk1.7.0_80/jre/lib/ext/sunpkcs11.jar:/opt/public/common/jdk1.7.0_80/jre/lib/ext/zipfs.jar:/opt/public/common/jdk1.7.0_80/jre/lib/ext/sunec.jar:/opt/public/common/jdk1.7.0_80/jre/lib/ext/sunjce_provider.jar:/opt/public/common/jdk1.7.0_80/jre/lib/ext/localedata.jar:/jobs/genie.ajdt/ajdt-on-eclipse-45/workspace/org.eclipse.ajdt.core.tests/target/work/configuration/org.eclipse.osgi/40/0/.cp/junit.jar:/jobs/genie.ajdt/ajdt-on-eclipse-45/workspace/org.eclipse.ajdt.core.tests/target/work/configuration/org.eclipse.osgi/218/0/.cp:
Timer event: 8ms: Pre compile
Compiler configuration for project DefaultEmptyProject has been read by compiler.  Resetting.
     Configuration was []
Resetting list of modified source files.  Was []
AJC: compiling source files
Timer event: 37ms: Time to first compiled message
AJC: compiled: /jobs/genie.ajdt/ajdt-on-eclipse-45/workspace/org.eclipse.ajdt.core.tests/target/work/data/DefaultEmptyProject/src/p/Aspect.aj
Timer event: 39ms: Time to first woven message
AJC: woven aspect p.Aspect (from /jobs/genie.ajdt/ajdt-on-eclipse-45/workspace/org.eclipse.ajdt.core.tests/target/work/data/DefaultEmptyProject/src/p/Aspect.aj)
AJC: compiled: /jobs/genie.ajdt/ajdt-on-eclipse-45/workspace/org.eclipse.ajdt.core.tests/target/work/data/DefaultEmptyProject/src/q/Java.java
AJC: woven class q.Java (from /jobs/genie.ajdt/ajdt-on-eclipse-45/workspace/org.eclipse.ajdt.core.tests/target/work/data/DefaultEmptyProject/src/q/Java.java)
AJC: compiled: /jobs/genie.ajdt/ajdt-on-eclipse-45/workspace/org.eclipse.ajdt.core.tests/target/work/data/DefaultEmptyProject/src/p/Other.java
AJC: woven class p.Other (from /jobs/genie.ajdt/ajdt-on-eclipse-45/workspace/org.eclipse.ajdt.core.tests/target/work/data/DefaultEmptyProject/src/p/Other.java)
AJC: compiled: /jobs/genie.ajdt/ajdt-on-eclipse-45/workspace/org.eclipse.ajdt.core.tests/target/work/data/DefaultEmptyProject/src/r/Java.java
AJC: woven class r.Java (from /jobs/genie.ajdt/ajdt-on-eclipse-45/workspace/org.eclipse.ajdt.core.tests/target/work/data/DefaultEmptyProject/src/r/Java.java)
AJDE Callback: finish. Was full build: true
Timer event: 45ms: Total time spent in AJDE
Timer event: 0ms: Refresh after build
Types affected during build = 4
Timer event: 54ms: Total time spent in AJBuilder.build()
Timer event: 4ms: Delete markers: DefaultEmptyProject (Finished deleting markers for DefaultEmptyProject)
Timer event: 5ms: Create markers: DefaultEmptyProject (Finished creating markers for DefaultEmptyProject)
Created 4 markers in 4 files
Timer event: 0ms: Update visualizer, xref, advice listeners for (separate thread): DefaultEmptyProject
===========================================================================================
Build kind = FULLBUILD
Project=DefaultEmptyProject, kind of build requested=Full AspectJ compilation
Timer event: 0ms: Flush included source file cache
Timer event: 0ms: Check delta
Builder: Tidied output folder(s), removed class files and derived resources
Classpath = /jobs/genie.ajdt/ajdt-on-eclipse-45/workspace/org.eclipse.ajdt.core.tests/target/work/data/DefaultEmptyProject/bin:/jobs/genie.ajdt/ajdt-on-eclipse-45/workspace/org.aspectj.runtime/target/org.aspectj.runtime-1.8.9-SNAPSHOT.jar:/opt/public/common/jdk1.7.0_80/jre/lib/resources.jar:/opt/public/common/jdk1.7.0_80/jre/lib/rt.jar:/opt/public/common/jdk1.7.0_80/jre/lib/jsse.jar:/opt/public/common/jdk1.7.0_80/jre/lib/jce.jar:/opt/public/common/jdk1.7.0_80/jre/lib/charsets.jar:/opt/public/common/jdk1.7.0_80/jre/lib/jfr.jar:/opt/public/common/jdk1.7.0_80/jre/lib/ext/dnsns.jar:/opt/public/common/jdk1.7.0_80/jre/lib/ext/sunpkcs11.jar:/opt/public/common/jdk1.7.0_80/jre/lib/ext/zipfs.jar:/opt/public/common/jdk1.7.0_80/jre/lib/ext/sunec.jar:/opt/public/common/jdk1.7.0_80/jre/lib/ext/sunjce_provider.jar:/opt/public/common/jdk1.7.0_80/jre/lib/ext/localedata.jar:/jobs/genie.ajdt/ajdt-on-eclipse-45/workspace/org.eclipse.ajdt.core.tests/target/work/configuration/org.eclipse.osgi/40/0/.cp/junit.jar:/jobs/genie.ajdt/ajdt-on-eclipse-45/workspace/org.eclipse.ajdt.core.tests/target/work/configuration/org.eclipse.osgi/218/0/.cp:
Timer event: 3ms: Pre compile
Compiler configuration for project DefaultEmptyProject has been read by compiler.  Resetting.
     Configuration was []
Resetting list of modified source files.  Was []
AJC: compiling source files
Timer event: 47ms: Time to first compiled message
AJC: compiled: /jobs/genie.ajdt/ajdt-on-eclipse-45/workspace/org.eclipse.ajdt.core.tests/target/work/data/DefaultEmptyProject/src/p/Aspect.aj
Timer event: 49ms: Time to first woven message
AJC: woven aspect p.Aspect (from /jobs/genie.ajdt/ajdt-on-eclipse-45/workspace/org.eclipse.ajdt.core.tests/target/work/data/DefaultEmptyProject/src/p/Aspect.aj)
AJC: compiled: /jobs/genie.ajdt/ajdt-on-eclipse-45/workspace/org.eclipse.ajdt.core.tests/target/work/data/DefaultEmptyProject/src/q/Java.java
AJC: woven class q.Java (from /jobs/genie.ajdt/ajdt-on-eclipse-45/workspace/org.eclipse.ajdt.core.tests/target/work/data/DefaultEmptyProject/src/q/Java.java)
AJC: compiled: /jobs/genie.ajdt/ajdt-on-eclipse-45/workspace/org.eclipse.ajdt.core.tests/target/work/data/DefaultEmptyProject/src/p/Other.java
AJC: woven class p.Other (from /jobs/genie.ajdt/ajdt-on-eclipse-45/workspace/org.eclipse.ajdt.core.tests/target/work/data/DefaultEmptyProject/src/p/Other.java)
AJC: compiled: /jobs/genie.ajdt/ajdt-on-eclipse-45/workspace/org.eclipse.ajdt.core.tests/target/work/data/DefaultEmptyProject/src/r/Java.java
AJC: woven class r.Java (from /jobs/genie.ajdt/ajdt-on-eclipse-45/workspace/org.eclipse.ajdt.core.tests/target/work/data/DefaultEmptyProject/src/r/Java.java)
AJDE Callback: finish. Was full build: true
Timer event: 55ms: Total time spent in AJDE
Timer event: 0ms: Refresh after build
Types affected during build = 4
Timer event: 1ms: Delete markers: DefaultEmptyProject (Finished deleting markers for DefaultEmptyProject)
Timer event: 1ms: Create markers: DefaultEmptyProject (Finished creating markers for DefaultEmptyProject)
Created 4 markers in 4 files
Timer event: 61ms: Total time spent in AJBuilder.build()
------------------------
Starting testMoveTypeWhenMultipleTypesOfSameSimpleNameExist4
Timer event: 0ms: Update visualizer, xref, advice listeners for (separate thread): DefaultEmptyProject
===========================================================================================
Build kind = FULLBUILD
Project=DefaultEmptyProject, kind of build requested=Full AspectJ compilation
Timer event: 0ms: Flush included source file cache
Timer event: 0ms: Check delta
Builder: Tidied output folder(s), removed class files and derived resources
Classpath = /jobs/genie.ajdt/ajdt-on-eclipse-45/workspace/org.eclipse.ajdt.core.tests/target/work/data/DefaultEmptyProject/bin:/jobs/genie.ajdt/ajdt-on-eclipse-45/workspace/org.aspectj.runtime/target/org.aspectj.runtime-1.8.9-SNAPSHOT.jar:/opt/public/common/jdk1.7.0_80/jre/lib/resources.jar:/opt/public/common/jdk1.7.0_80/jre/lib/rt.jar:/opt/public/common/jdk1.7.0_80/jre/lib/jsse.jar:/opt/public/common/jdk1.7.0_80/jre/lib/jce.jar:/opt/public/common/jdk1.7.0_80/jre/lib/charsets.jar:/opt/public/common/jdk1.7.0_80/jre/lib/jfr.jar:/opt/public/common/jdk1.7.0_80/jre/lib/ext/dnsns.jar:/opt/public/common/jdk1.7.0_80/jre/lib/ext/sunpkcs11.jar:/opt/public/common/jdk1.7.0_80/jre/lib/ext/zipfs.jar:/opt/public/common/jdk1.7.0_80/jre/lib/ext/sunec.jar:/opt/public/common/jdk1.7.0_80/jre/lib/ext/sunjce_provider.jar:/opt/public/common/jdk1.7.0_80/jre/lib/ext/localedata.jar:/jobs/genie.ajdt/ajdt-on-eclipse-45/workspace/org.eclipse.ajdt.core.tests/target/work/configuration/org.eclipse.osgi/40/0/.cp/junit.jar:/jobs/genie.ajdt/ajdt-on-eclipse-45/workspace/org.eclipse.ajdt.core.tests/target/work/configuration/org.eclipse.osgi/218/0/.cp:
Timer event: 6ms: Pre compile
Compiler configuration for project DefaultEmptyProject has been read by compiler.  Resetting.
     Configuration was []
Resetting list of modified source files.  Was []
AJC: compiling source files
Timer event: 34ms: Time to first compiled message
AJC: compiled: /jobs/genie.ajdt/ajdt-on-eclipse-45/workspace/org.eclipse.ajdt.core.tests/target/work/data/DefaultEmptyProject/src/p/Aspect.aj
Timer event: 36ms: Time to first woven message
AJC: woven aspect p.Aspect (from /jobs/genie.ajdt/ajdt-on-eclipse-45/workspace/org.eclipse.ajdt.core.tests/target/work/data/DefaultEmptyProject/src/p/Aspect.aj)
AJC: compiled: /jobs/genie.ajdt/ajdt-on-eclipse-45/workspace/org.eclipse.ajdt.core.tests/target/work/data/DefaultEmptyProject/src/q/Java.java
AJC: woven class q.Java (from /jobs/genie.ajdt/ajdt-on-eclipse-45/workspace/org.eclipse.ajdt.core.tests/target/work/data/DefaultEmptyProject/src/q/Java.java)
AJC: compiled: /jobs/genie.ajdt/ajdt-on-eclipse-45/workspace/org.eclipse.ajdt.core.tests/target/work/data/DefaultEmptyProject/src/p/Other.java
AJC: woven class p.Other (from /jobs/genie.ajdt/ajdt-on-eclipse-45/workspace/org.eclipse.ajdt.core.tests/target/work/data/DefaultEmptyProject/src/p/Other.java)
AJC: compiled: /jobs/genie.ajdt/ajdt-on-eclipse-45/workspace/org.eclipse.ajdt.core.tests/target/work/data/DefaultEmptyProject/src/r/Java.java
AJC: woven class r.Java (from /jobs/genie.ajdt/ajdt-on-eclipse-45/workspace/org.eclipse.ajdt.core.tests/target/work/data/DefaultEmptyProject/src/r/Java.java)
AJDE Callback: finish. Was full build: true
Timer event: 41ms: Total time spent in AJDE
Timer event: 0ms: Refresh after build
Types affected during build = 4
Timer event: 48ms: Total time spent in AJBuilder.build()
Timer event: 4ms: Delete markers: DefaultEmptyProject (Finished deleting markers for DefaultEmptyProject)
Timer event: 2ms: Create markers: DefaultEmptyProject (Finished creating markers for DefaultEmptyProject)
Created 2 markers in 4 files
Timer event: 0ms: Update visualizer, xref, advice listeners for (separate thread): DefaultEmptyProject
===========================================================================================
Build kind = FULLBUILD
Project=DefaultEmptyProject, kind of build requested=Full AspectJ compilation
Timer event: 0ms: Flush included source file cache
Timer event: 0ms: Check delta
Builder: Tidied output folder(s), removed class files and derived resources
Classpath = /jobs/genie.ajdt/ajdt-on-eclipse-45/workspace/org.eclipse.ajdt.core.tests/target/work/data/DefaultEmptyProject/bin:/jobs/genie.ajdt/ajdt-on-eclipse-45/workspace/org.aspectj.runtime/target/org.aspectj.runtime-1.8.9-SNAPSHOT.jar:/opt/public/common/jdk1.7.0_80/jre/lib/resources.jar:/opt/public/common/jdk1.7.0_80/jre/lib/rt.jar:/opt/public/common/jdk1.7.0_80/jre/lib/jsse.jar:/opt/public/common/jdk1.7.0_80/jre/lib/jce.jar:/opt/public/common/jdk1.7.0_80/jre/lib/charsets.jar:/opt/public/common/jdk1.7.0_80/jre/lib/jfr.jar:/opt/public/common/jdk1.7.0_80/jre/lib/ext/dnsns.jar:/opt/public/common/jdk1.7.0_80/jre/lib/ext/sunpkcs11.jar:/opt/public/common/jdk1.7.0_80/jre/lib/ext/zipfs.jar:/opt/public/common/jdk1.7.0_80/jre/lib/ext/sunec.jar:/opt/public/common/jdk1.7.0_80/jre/lib/ext/sunjce_provider.jar:/opt/public/common/jdk1.7.0_80/jre/lib/ext/localedata.jar:/jobs/genie.ajdt/ajdt-on-eclipse-45/workspace/org.eclipse.ajdt.core.tests/target/work/configuration/org.eclipse.osgi/40/0/.cp/junit.jar:/jobs/genie.ajdt/ajdt-on-eclipse-45/workspace/org.eclipse.ajdt.core.tests/target/work/configuration/org.eclipse.osgi/218/0/.cp:
Timer event: 3ms: Pre compile
Compiler configuration for project DefaultEmptyProject has been read by compiler.  Resetting.
     Configuration was []
Resetting list of modified source files.  Was []
AJC: compiling source files
Timer event: 34ms: Time to first compiled message
AJC: compiled: /jobs/genie.ajdt/ajdt-on-eclipse-45/workspace/org.eclipse.ajdt.core.tests/target/work/data/DefaultEmptyProject/src/p/Aspect.aj
Timer event: 35ms: Time to first woven message
AJC: woven aspect p.Aspect (from /jobs/genie.ajdt/ajdt-on-eclipse-45/workspace/org.eclipse.ajdt.core.tests/target/work/data/DefaultEmptyProject/src/p/Aspect.aj)
AJC: compiled: /jobs/genie.ajdt/ajdt-on-eclipse-45/workspace/org.eclipse.ajdt.core.tests/target/work/data/DefaultEmptyProject/src/q/Java.java
AJC: woven class q.Java (from /jobs/genie.ajdt/ajdt-on-eclipse-45/workspace/org.eclipse.ajdt.core.tests/target/work/data/DefaultEmptyProject/src/q/Java.java)
AJC: compiled: /jobs/genie.ajdt/ajdt-on-eclipse-45/workspace/org.eclipse.ajdt.core.tests/target/work/data/DefaultEmptyProject/src/p/Other.java
AJC: woven class p.Other (from /jobs/genie.ajdt/ajdt-on-eclipse-45/workspace/org.eclipse.ajdt.core.tests/target/work/data/DefaultEmptyProject/src/p/Other.java)
AJC: compiled: /jobs/genie.ajdt/ajdt-on-eclipse-45/workspace/org.eclipse.ajdt.core.tests/target/work/data/DefaultEmptyProject/src/r/Java.java
AJC: woven class r.Java (from /jobs/genie.ajdt/ajdt-on-eclipse-45/workspace/org.eclipse.ajdt.core.tests/target/work/data/DefaultEmptyProject/src/r/Java.java)
AJDE Callback: finish. Was full build: true
Timer event: 40ms: Total time spent in AJDE
Timer event: 0ms: Refresh after build
Types affected during build = 4
Timer event: 43ms: Total time spent in AJBuilder.build()
Timer event: 2ms: Delete markers: DefaultEmptyProject (Finished deleting markers for DefaultEmptyProject)
Timer event: 2ms: Create markers: DefaultEmptyProject (Finished creating markers for DefaultEmptyProject)
Created 2 markers in 4 files
------------------------
Starting testMoveTypeInDeclareAtType1
Timer event: 0ms: Update visualizer, xref, advice listeners for (separate thread): DefaultEmptyProject
===========================================================================================
Build kind = FULLBUILD
Project=DefaultEmptyProject, kind of build requested=Full AspectJ compilation
Timer event: 1ms: Flush included source file cache
Timer event: 0ms: Check delta
Builder: Tidied output folder(s), removed class files and derived resources
Classpath = /jobs/genie.ajdt/ajdt-on-eclipse-45/workspace/org.eclipse.ajdt.core.tests/target/work/data/DefaultEmptyProject/bin:/jobs/genie.ajdt/ajdt-on-eclipse-45/workspace/org.aspectj.runtime/target/org.aspectj.runtime-1.8.9-SNAPSHOT.jar:/opt/public/common/jdk1.7.0_80/jre/lib/resources.jar:/opt/public/common/jdk1.7.0_80/jre/lib/rt.jar:/opt/public/common/jdk1.7.0_80/jre/lib/jsse.jar:/opt/public/common/jdk1.7.0_80/jre/lib/jce.jar:/opt/public/common/jdk1.7.0_80/jre/lib/charsets.jar:/opt/public/common/jdk1.7.0_80/jre/lib/jfr.jar:/opt/public/common/jdk1.7.0_80/jre/lib/ext/dnsns.jar:/opt/public/common/jdk1.7.0_80/jre/lib/ext/sunpkcs11.jar:/opt/public/common/jdk1.7.0_80/jre/lib/ext/zipfs.jar:/opt/public/common/jdk1.7.0_80/jre/lib/ext/sunec.jar:/opt/public/common/jdk1.7.0_80/jre/lib/ext/sunjce_provider.jar:/opt/public/common/jdk1.7.0_80/jre/lib/ext/localedata.jar:/jobs/genie.ajdt/ajdt-on-eclipse-45/workspace/org.eclipse.ajdt.core.tests/target/work/configuration/org.eclipse.osgi/40/0/.cp/junit.jar:/jobs/genie.ajdt/ajdt-on-eclipse-45/workspace/org.eclipse.ajdt.core.tests/target/work/configuration/org.eclipse.osgi/218/0/.cp:
Timer event: 8ms: Pre compile
Compiler configuration for project DefaultEmptyProject has been read by compiler.  Resetting.
     Configuration was []
Resetting list of modified source files.  Was []
AJC: compiling source files
Timer event: 42ms: Time to first compiled message
AJC: compiled: /jobs/genie.ajdt/ajdt-on-eclipse-45/workspace/org.eclipse.ajdt.core.tests/target/work/data/DefaultEmptyProject/src/p/Aspect.aj
Timer event: 43ms: Time to first woven message
AJC: woven aspect p.Aspect (from /jobs/genie.ajdt/ajdt-on-eclipse-45/workspace/org.eclipse.ajdt.core.tests/target/work/data/DefaultEmptyProject/src/p/Aspect.aj)
AJC: compiled: /jobs/genie.ajdt/ajdt-on-eclipse-45/workspace/org.eclipse.ajdt.core.tests/target/work/data/DefaultEmptyProject/src/p/Java.java
AJC: woven class p.Java (from /jobs/genie.ajdt/ajdt-on-eclipse-45/workspace/org.eclipse.ajdt.core.tests/target/work/data/DefaultEmptyProject/src/p/Java.java)
AJC: compiled: /jobs/genie.ajdt/ajdt-on-eclipse-45/workspace/org.eclipse.ajdt.core.tests/target/work/data/DefaultEmptyProject/src/p/Other.java
AJC: woven class p.Other (from /jobs/genie.ajdt/ajdt-on-eclipse-45/workspace/org.eclipse.ajdt.core.tests/target/work/data/DefaultEmptyProject/src/p/Other.java)
AJDE Callback: finish. Was full build: true
Timer event: 47ms: Total time spent in AJDE
Timer event: 0ms: Refresh after build
Types affected during build = 3
Timer event: 56ms: Total time spent in AJBuilder.build()
Timer event: 4ms: Delete markers: DefaultEmptyProject (Finished deleting markers for DefaultEmptyProject)
Timer event: 3ms: Create markers: DefaultEmptyProject (Finished creating markers for DefaultEmptyProject)
Created 2 markers in 3 files
Timer event: 0ms: Update visualizer, xref, advice listeners for (separate thread): DefaultEmptyProject
===========================================================================================
Build kind = FULLBUILD
Project=DefaultEmptyProject, kind of build requested=Full AspectJ compilation
Timer event: 0ms: Flush included source file cache
Timer event: 0ms: Check delta
Builder: Tidied output folder(s), removed class files and derived resources
Classpath = /jobs/genie.ajdt/ajdt-on-eclipse-45/workspace/org.eclipse.ajdt.core.tests/target/work/data/DefaultEmptyProject/bin:/jobs/genie.ajdt/ajdt-on-eclipse-45/workspace/org.aspectj.runtime/target/org.aspectj.runtime-1.8.9-SNAPSHOT.jar:/opt/public/common/jdk1.7.0_80/jre/lib/resources.jar:/opt/public/common/jdk1.7.0_80/jre/lib/rt.jar:/opt/public/common/jdk1.7.0_80/jre/lib/jsse.jar:/opt/public/common/jdk1.7.0_80/jre/lib/jce.jar:/opt/public/common/jdk1.7.0_80/jre/lib/charsets.jar:/opt/public/common/jdk1.7.0_80/jre/lib/jfr.jar:/opt/public/common/jdk1.7.0_80/jre/lib/ext/dnsns.jar:/opt/public/common/jdk1.7.0_80/jre/lib/ext/sunpkcs11.jar:/opt/public/common/jdk1.7.0_80/jre/lib/ext/zipfs.jar:/opt/public/common/jdk1.7.0_80/jre/lib/ext/sunec.jar:/opt/public/common/jdk1.7.0_80/jre/lib/ext/sunjce_provider.jar:/opt/public/common/jdk1.7.0_80/jre/lib/ext/localedata.jar:/jobs/genie.ajdt/ajdt-on-eclipse-45/workspace/org.eclipse.ajdt.core.tests/target/work/configuration/org.eclipse.osgi/40/0/.cp/junit.jar:/jobs/genie.ajdt/ajdt-on-eclipse-45/workspace/org.eclipse.ajdt.core.tests/target/work/configuration/org.eclipse.osgi/218/0/.cp:
Timer event: 2ms: Pre compile
Compiler configuration for project DefaultEmptyProject has been read by compiler.  Resetting.
     Configuration was []
Resetting list of modified source files.  Was []
AJC: compiling source files
Timer event: 37ms: Time to first compiled message
AJC: compiled: /jobs/genie.ajdt/ajdt-on-eclipse-45/workspace/org.eclipse.ajdt.core.tests/target/work/data/DefaultEmptyProject/src/p/Aspect.aj
Timer event: 39ms: Time to first woven message
AJC: woven aspect p.Aspect (from /jobs/genie.ajdt/ajdt-on-eclipse-45/workspace/org.eclipse.ajdt.core.tests/target/work/data/DefaultEmptyProject/src/p/Aspect.aj)
AJC: compiled: /jobs/genie.ajdt/ajdt-on-eclipse-45/workspace/org.eclipse.ajdt.core.tests/target/work/data/DefaultEmptyProject/src/p/Java.java
AJC: woven class p.Java (from /jobs/genie.ajdt/ajdt-on-eclipse-45/workspace/org.eclipse.ajdt.core.tests/target/work/data/DefaultEmptyProject/src/p/Java.java)
AJC: compiled: /jobs/genie.ajdt/ajdt-on-eclipse-45/workspace/org.eclipse.ajdt.core.tests/target/work/data/DefaultEmptyProject/src/p/Other.java
AJC: woven class p.Other (from /jobs/genie.ajdt/ajdt-on-eclipse-45/workspace/org.eclipse.ajdt.core.tests/target/work/data/DefaultEmptyProject/src/p/Other.java)
AJDE Callback: finish. Was full build: true
Timer event: 44ms: Total time spent in AJDE
Timer event: 0ms: Refresh after build
Types affected during build = 3
Timer event: 47ms: Total time spent in AJBuilder.build()
Timer event: 1ms: Delete markers: DefaultEmptyProject (Finished deleting markers for DefaultEmptyProject)
Timer event: 2ms: Create markers: DefaultEmptyProject (Finished creating markers for DefaultEmptyProject)
Created 2 markers in 3 files
------------------------
Starting testMoveTypeInDeclareAtType2
Timer event: 0ms: Update visualizer, xref, advice listeners for (separate thread): DefaultEmptyProject
===========================================================================================
Build kind = FULLBUILD
Project=DefaultEmptyProject, kind of build requested=Full AspectJ compilation
Timer event: 0ms: Flush included source file cache
Timer event: 0ms: Check delta
Builder: Tidied output folder(s), removed class files and derived resources
Classpath = /jobs/genie.ajdt/ajdt-on-eclipse-45/workspace/org.eclipse.ajdt.core.tests/target/work/data/DefaultEmptyProject/bin:/jobs/genie.ajdt/ajdt-on-eclipse-45/workspace/org.aspectj.runtime/target/org.aspectj.runtime-1.8.9-SNAPSHOT.jar:/opt/public/common/jdk1.7.0_80/jre/lib/resources.jar:/opt/public/common/jdk1.7.0_80/jre/lib/rt.jar:/opt/public/common/jdk1.7.0_80/jre/lib/jsse.jar:/opt/public/common/jdk1.7.0_80/jre/lib/jce.jar:/opt/public/common/jdk1.7.0_80/jre/lib/charsets.jar:/opt/public/common/jdk1.7.0_80/jre/lib/jfr.jar:/opt/public/common/jdk1.7.0_80/jre/lib/ext/dnsns.jar:/opt/public/common/jdk1.7.0_80/jre/lib/ext/sunpkcs11.jar:/opt/public/common/jdk1.7.0_80/jre/lib/ext/zipfs.jar:/opt/public/common/jdk1.7.0_80/jre/lib/ext/sunec.jar:/opt/public/common/jdk1.7.0_80/jre/lib/ext/sunjce_provider.jar:/opt/public/common/jdk1.7.0_80/jre/lib/ext/localedata.jar:/jobs/genie.ajdt/ajdt-on-eclipse-45/workspace/org.eclipse.ajdt.core.tests/target/work/configuration/org.eclipse.osgi/40/0/.cp/junit.jar:/jobs/genie.ajdt/ajdt-on-eclipse-45/workspace/org.eclipse.ajdt.core.tests/target/work/configuration/org.eclipse.osgi/218/0/.cp:
Timer event: 9ms: Pre compile
Compiler configuration for project DefaultEmptyProject has been read by compiler.  Resetting.
     Configuration was []
Resetting list of modified source files.  Was []
AJC: compiling source files
Timer event: 38ms: Time to first compiled message
AJC: compiled: /jobs/genie.ajdt/ajdt-on-eclipse-45/workspace/org.eclipse.ajdt.core.tests/target/work/data/DefaultEmptyProject/src/p/Aspect.aj
Timer event: 39ms: Time to first woven message
AJC: woven aspect p.Aspect (from /jobs/genie.ajdt/ajdt-on-eclipse-45/workspace/org.eclipse.ajdt.core.tests/target/work/data/DefaultEmptyProject/src/p/Aspect.aj)
AJC: compiled: /jobs/genie.ajdt/ajdt-on-eclipse-45/workspace/org.eclipse.ajdt.core.tests/target/work/data/DefaultEmptyProject/src/p/Java.java
AJC: woven class p.Java (from /jobs/genie.ajdt/ajdt-on-eclipse-45/workspace/org.eclipse.ajdt.core.tests/target/work/data/DefaultEmptyProject/src/p/Java.java)
AJC: compiled: /jobs/genie.ajdt/ajdt-on-eclipse-45/workspace/org.eclipse.ajdt.core.tests/target/work/data/DefaultEmptyProject/src/p/Other.java
AJC: woven class p.Other (from /jobs/genie.ajdt/ajdt-on-eclipse-45/workspace/org.eclipse.ajdt.core.tests/target/work/data/DefaultEmptyProject/src/p/Other.java)
AJDE Callback: finish. Was full build: true
Timer event: 44ms: Total time spent in AJDE
Timer event: 0ms: Refresh after build
Types affected during build = 3
Timer event: 54ms: Total time spent in AJBuilder.build()
Timer event: 4ms: Delete markers: DefaultEmptyProject (Finished deleting markers for DefaultEmptyProject)
Timer event: 2ms: Create markers: DefaultEmptyProject (Finished creating markers for DefaultEmptyProject)
Created 2 markers in 3 files
Timer event: 0ms: Update visualizer, xref, advice listeners for (separate thread): DefaultEmptyProject
===========================================================================================
Build kind = FULLBUILD
Project=DefaultEmptyProject, kind of build requested=Full AspectJ compilation
Timer event: 0ms: Flush included source file cache
Timer event: 0ms: Check delta
Builder: Tidied output folder(s), removed class files and derived resources
Classpath = /jobs/genie.ajdt/ajdt-on-eclipse-45/workspace/org.eclipse.ajdt.core.tests/target/work/data/DefaultEmptyProject/bin:/jobs/genie.ajdt/ajdt-on-eclipse-45/workspace/org.aspectj.runtime/target/org.aspectj.runtime-1.8.9-SNAPSHOT.jar:/opt/public/common/jdk1.7.0_80/jre/lib/resources.jar:/opt/public/common/jdk1.7.0_80/jre/lib/rt.jar:/opt/public/common/jdk1.7.0_80/jre/lib/jsse.jar:/opt/public/common/jdk1.7.0_80/jre/lib/jce.jar:/opt/public/common/jdk1.7.0_80/jre/lib/charsets.jar:/opt/public/common/jdk1.7.0_80/jre/lib/jfr.jar:/opt/public/common/jdk1.7.0_80/jre/lib/ext/dnsns.jar:/opt/public/common/jdk1.7.0_80/jre/lib/ext/sunpkcs11.jar:/opt/public/common/jdk1.7.0_80/jre/lib/ext/zipfs.jar:/opt/public/common/jdk1.7.0_80/jre/lib/ext/sunec.jar:/opt/public/common/jdk1.7.0_80/jre/lib/ext/sunjce_provider.jar:/opt/public/common/jdk1.7.0_80/jre/lib/ext/localedata.jar:/jobs/genie.ajdt/ajdt-on-eclipse-45/workspace/org.eclipse.ajdt.core.tests/target/work/configuration/org.eclipse.osgi/40/0/.cp/junit.jar:/jobs/genie.ajdt/ajdt-on-eclipse-45/workspace/org.eclipse.ajdt.core.tests/target/work/configuration/org.eclipse.osgi/218/0/.cp:
Timer event: 3ms: Pre compile
Compiler configuration for project DefaultEmptyProject has been read by compiler.  Resetting.
     Configuration was []
Resetting list of modified source files.  Was []
AJC: compiling source files
Timer event: 46ms: Time to first compiled message
AJC: compiled: /jobs/genie.ajdt/ajdt-on-eclipse-45/workspace/org.eclipse.ajdt.core.tests/target/work/data/DefaultEmptyProject/src/p/Aspect.aj
Timer event: 48ms: Time to first woven message
AJC: woven aspect p.Aspect (from /jobs/genie.ajdt/ajdt-on-eclipse-45/workspace/org.eclipse.ajdt.core.tests/target/work/data/DefaultEmptyProject/src/p/Aspect.aj)
AJC: compiled: /jobs/genie.ajdt/ajdt-on-eclipse-45/workspace/org.eclipse.ajdt.core.tests/target/work/data/DefaultEmptyProject/src/p/Java.java
AJC: woven class p.Java (from /jobs/genie.ajdt/ajdt-on-eclipse-45/workspace/org.eclipse.ajdt.core.tests/target/work/data/DefaultEmptyProject/src/p/Java.java)
AJC: compiled: /jobs/genie.ajdt/ajdt-on-eclipse-45/workspace/org.eclipse.ajdt.core.tests/target/work/data/DefaultEmptyProject/src/p/Other.java
AJC: woven class p.Other (from /jobs/genie.ajdt/ajdt-on-eclipse-45/workspace/org.eclipse.ajdt.core.tests/target/work/data/DefaultEmptyProject/src/p/Other.java)
AJDE Callback: finish. Was full build: true
Timer event: 52ms: Total time spent in AJDE
Timer event: 0ms: Refresh after build
Types affected during build = 3
Timer event: 55ms: Total time spent in AJBuilder.build()
Timer event: 1ms: Delete markers: DefaultEmptyProject (Finished deleting markers for DefaultEmptyProject)
Timer event: 1ms: Create markers: DefaultEmptyProject (Finished creating markers for DefaultEmptyProject)
Created 2 markers in 3 files
------------------------
Starting testMoveTypeInDeclareAtType6
Timer event: 0ms: Update visualizer, xref, advice listeners for (separate thread): DefaultEmptyProject
===========================================================================================
Build kind = FULLBUILD
Project=DefaultEmptyProject, kind of build requested=Full AspectJ compilation
Timer event: 0ms: Flush included source file cache
Timer event: 0ms: Check delta
Builder: Tidied output folder(s), removed class files and derived resources
Classpath = /jobs/genie.ajdt/ajdt-on-eclipse-45/workspace/org.eclipse.ajdt.core.tests/target/work/data/DefaultEmptyProject/bin:/jobs/genie.ajdt/ajdt-on-eclipse-45/workspace/org.aspectj.runtime/target/org.aspectj.runtime-1.8.9-SNAPSHOT.jar:/opt/public/common/jdk1.7.0_80/jre/lib/resources.jar:/opt/public/common/jdk1.7.0_80/jre/lib/rt.jar:/opt/public/common/jdk1.7.0_80/jre/lib/jsse.jar:/opt/public/common/jdk1.7.0_80/jre/lib/jce.jar:/opt/public/common/jdk1.7.0_80/jre/lib/charsets.jar:/opt/public/common/jdk1.7.0_80/jre/lib/jfr.jar:/opt/public/common/jdk1.7.0_80/jre/lib/ext/dnsns.jar:/opt/public/common/jdk1.7.0_80/jre/lib/ext/sunpkcs11.jar:/opt/public/common/jdk1.7.0_80/jre/lib/ext/zipfs.jar:/opt/public/common/jdk1.7.0_80/jre/lib/ext/sunec.jar:/opt/public/common/jdk1.7.0_80/jre/lib/ext/sunjce_provider.jar:/opt/public/common/jdk1.7.0_80/jre/lib/ext/localedata.jar:/jobs/genie.ajdt/ajdt-on-eclipse-45/workspace/org.eclipse.ajdt.core.tests/target/work/configuration/org.eclipse.osgi/40/0/.cp/junit.jar:/jobs/genie.ajdt/ajdt-on-eclipse-45/workspace/org.eclipse.ajdt.core.tests/target/work/configuration/org.eclipse.osgi/218/0/.cp:
Timer event: 6ms: Pre compile
Compiler configuration for project DefaultEmptyProject has been read by compiler.  Resetting.
     Configuration was []
Resetting list of modified source files.  Was []
AJC: compiling source files
Timer event: 36ms: Time to first compiled message
AJC: compiled: /jobs/genie.ajdt/ajdt-on-eclipse-45/workspace/org.eclipse.ajdt.core.tests/target/work/data/DefaultEmptyProject/src/p/Aspect.aj
Timer event: 37ms: Time to first woven message
AJC: woven aspect p.Aspect (from /jobs/genie.ajdt/ajdt-on-eclipse-45/workspace/org.eclipse.ajdt.core.tests/target/work/data/DefaultEmptyProject/src/p/Aspect.aj)
AJC: compiled: /jobs/genie.ajdt/ajdt-on-eclipse-45/workspace/org.eclipse.ajdt.core.tests/target/work/data/DefaultEmptyProject/src/q/Java.java
AJC: woven class q.Java (from /jobs/genie.ajdt/ajdt-on-eclipse-45/workspace/org.eclipse.ajdt.core.tests/target/work/data/DefaultEmptyProject/src/q/Java.java)
AJC: compiled: /jobs/genie.ajdt/ajdt-on-eclipse-45/workspace/org.eclipse.ajdt.core.tests/target/work/data/DefaultEmptyProject/src/p/Other.java
AJC: woven class p.Other (from /jobs/genie.ajdt/ajdt-on-eclipse-45/workspace/org.eclipse.ajdt.core.tests/target/work/data/DefaultEmptyProject/src/p/Other.java)
AJDE Callback: finish. Was full build: true
Timer event: 40ms: Total time spent in AJDE
Timer event: 0ms: Refresh after build
Types affected during build = 3
Timer event: 48ms: Total time spent in AJBuilder.build()
Timer event: 4ms: Delete markers: DefaultEmptyProject (Finished deleting markers for DefaultEmptyProject)
Timer event: 2ms: Create markers: DefaultEmptyProject (Finished creating markers for DefaultEmptyProject)
Created 2 markers in 3 files
Timer event: 0ms: Update visualizer, xref, advice listeners for (separate thread): DefaultEmptyProject
===========================================================================================
Build kind = FULLBUILD
Project=DefaultEmptyProject, kind of build requested=Full AspectJ compilation
Timer event: 0ms: Flush included source file cache
Timer event: 0ms: Check delta
Builder: Tidied output folder(s), removed class files and derived resources
Classpath = /jobs/genie.ajdt/ajdt-on-eclipse-45/workspace/org.eclipse.ajdt.core.tests/target/work/data/DefaultEmptyProject/bin:/jobs/genie.ajdt/ajdt-on-eclipse-45/workspace/org.aspectj.runtime/target/org.aspectj.runtime-1.8.9-SNAPSHOT.jar:/opt/public/common/jdk1.7.0_80/jre/lib/resources.jar:/opt/public/common/jdk1.7.0_80/jre/lib/rt.jar:/opt/public/common/jdk1.7.0_80/jre/lib/jsse.jar:/opt/public/common/jdk1.7.0_80/jre/lib/jce.jar:/opt/public/common/jdk1.7.0_80/jre/lib/charsets.jar:/opt/public/common/jdk1.7.0_80/jre/lib/jfr.jar:/opt/public/common/jdk1.7.0_80/jre/lib/ext/dnsns.jar:/opt/public/common/jdk1.7.0_80/jre/lib/ext/sunpkcs11.jar:/opt/public/common/jdk1.7.0_80/jre/lib/ext/zipfs.jar:/opt/public/common/jdk1.7.0_80/jre/lib/ext/sunec.jar:/opt/public/common/jdk1.7.0_80/jre/lib/ext/sunjce_provider.jar:/opt/public/common/jdk1.7.0_80/jre/lib/ext/localedata.jar:/jobs/genie.ajdt/ajdt-on-eclipse-45/workspace/org.eclipse.ajdt.core.tests/target/work/configuration/org.eclipse.osgi/40/0/.cp/junit.jar:/jobs/genie.ajdt/ajdt-on-eclipse-45/workspace/org.eclipse.ajdt.core.tests/target/work/configuration/org.eclipse.osgi/218/0/.cp:
Timer event: 3ms: Pre compile
Compiler configuration for project DefaultEmptyProject has been read by compiler.  Resetting.
     Configuration was []
Resetting list of modified source files.  Was []
AJC: compiling source files
Timer event: 44ms: Time to first compiled message
AJC: compiled: /jobs/genie.ajdt/ajdt-on-eclipse-45/workspace/org.eclipse.ajdt.core.tests/target/work/data/DefaultEmptyProject/src/p/Aspect.aj
Timer event: 46ms: Time to first woven message
AJC: woven aspect p.Aspect (from /jobs/genie.ajdt/ajdt-on-eclipse-45/workspace/org.eclipse.ajdt.core.tests/target/work/data/DefaultEmptyProject/src/p/Aspect.aj)
AJC: compiled: /jobs/genie.ajdt/ajdt-on-eclipse-45/workspace/org.eclipse.ajdt.core.tests/target/work/data/DefaultEmptyProject/src/q/Java.java
AJC: woven class q.Java (from /jobs/genie.ajdt/ajdt-on-eclipse-45/workspace/org.eclipse.ajdt.core.tests/target/work/data/DefaultEmptyProject/src/q/Java.java)
AJC: compiled: /jobs/genie.ajdt/ajdt-on-eclipse-45/workspace/org.eclipse.ajdt.core.tests/target/work/data/DefaultEmptyProject/src/p/Other.java
AJC: woven class p.Other (from /jobs/genie.ajdt/ajdt-on-eclipse-45/workspace/org.eclipse.ajdt.core.tests/target/work/data/DefaultEmptyProject/src/p/Other.java)
AJDE Callback: finish. Was full build: true
Timer event: 50ms: Total time spent in AJDE
Timer event: 0ms: Refresh after build
Types affected during build = 3
Timer event: 53ms: Total time spent in AJBuilder.build()
Timer event: 2ms: Delete markers: DefaultEmptyProject (Finished deleting markers for DefaultEmptyProject)
Timer event: 3ms: Create markers: DefaultEmptyProject (Finished creating markers for DefaultEmptyProject)
Created 2 markers in 3 files
------------------------
Starting testMoveTypeInDeclareParents1
Timer event: 0ms: Update visualizer, xref, advice listeners for (separate thread): DefaultEmptyProject
===========================================================================================
Build kind = FULLBUILD
Project=DefaultEmptyProject, kind of build requested=Full AspectJ compilation
Timer event: 0ms: Flush included source file cache
Timer event: 0ms: Check delta
Builder: Tidied output folder(s), removed class files and derived resources
Classpath = /jobs/genie.ajdt/ajdt-on-eclipse-45/workspace/org.eclipse.ajdt.core.tests/target/work/data/DefaultEmptyProject/bin:/jobs/genie.ajdt/ajdt-on-eclipse-45/workspace/org.aspectj.runtime/target/org.aspectj.runtime-1.8.9-SNAPSHOT.jar:/opt/public/common/jdk1.7.0_80/jre/lib/resources.jar:/opt/public/common/jdk1.7.0_80/jre/lib/rt.jar:/opt/public/common/jdk1.7.0_80/jre/lib/jsse.jar:/opt/public/common/jdk1.7.0_80/jre/lib/jce.jar:/opt/public/common/jdk1.7.0_80/jre/lib/charsets.jar:/opt/public/common/jdk1.7.0_80/jre/lib/jfr.jar:/opt/public/common/jdk1.7.0_80/jre/lib/ext/dnsns.jar:/opt/public/common/jdk1.7.0_80/jre/lib/ext/sunpkcs11.jar:/opt/public/common/jdk1.7.0_80/jre/lib/ext/zipfs.jar:/opt/public/common/jdk1.7.0_80/jre/lib/ext/sunec.jar:/opt/public/common/jdk1.7.0_80/jre/lib/ext/sunjce_provider.jar:/opt/public/common/jdk1.7.0_80/jre/lib/ext/localedata.jar:/jobs/genie.ajdt/ajdt-on-eclipse-45/workspace/org.eclipse.ajdt.core.tests/target/work/configuration/org.eclipse.osgi/40/0/.cp/junit.jar:/jobs/genie.ajdt/ajdt-on-eclipse-45/workspace/org.eclipse.ajdt.core.tests/target/work/configuration/org.eclipse.osgi/218/0/.cp:
Timer event: 8ms: Pre compile
Compiler configuration for project DefaultEmptyProject has been read by compiler.  Resetting.
     Configuration was []
Resetting list of modified source files.  Was []
AJC: compiling source files
Timer event: 37ms: Time to first compiled message
AJC: compiled: /jobs/genie.ajdt/ajdt-on-eclipse-45/workspace/org.eclipse.ajdt.core.tests/target/work/data/DefaultEmptyProject/src/p/Aspect.aj
Timer event: 39ms: Time to first woven message
AJC: woven aspect p.Aspect (from /jobs/genie.ajdt/ajdt-on-eclipse-45/workspace/org.eclipse.ajdt.core.tests/target/work/data/DefaultEmptyProject/src/p/Aspect.aj)
AJC: compiled: /jobs/genie.ajdt/ajdt-on-eclipse-45/workspace/org.eclipse.ajdt.core.tests/target/work/data/DefaultEmptyProject/src/p/Java.java
AJC: woven class p.Java (from /jobs/genie.ajdt/ajdt-on-eclipse-45/workspace/org.eclipse.ajdt.core.tests/target/work/data/DefaultEmptyProject/src/p/Java.java)
AJC: compiled: /jobs/genie.ajdt/ajdt-on-eclipse-45/workspace/org.eclipse.ajdt.core.tests/target/work/data/DefaultEmptyProject/src/p/Other.java
AJC: woven class p.Other (from /jobs/genie.ajdt/ajdt-on-eclipse-45/workspace/org.eclipse.ajdt.core.tests/target/work/data/DefaultEmptyProject/src/p/Other.java)
AJDE Callback: finish. Was full build: true
Timer event: 44ms: Total time spent in AJDE
Timer event: 0ms: Refresh after build
Types affected during build = 3
Timer event: 53ms: Total time spent in AJBuilder.build()
Timer event: 4ms: Delete markers: DefaultEmptyProject (Finished deleting markers for DefaultEmptyProject)
Timer event: 3ms: Create markers: DefaultEmptyProject (Finished creating markers for DefaultEmptyProject)
Created 2 markers in 3 files
Timer event: 0ms: Update visualizer, xref, advice listeners for (separate thread): DefaultEmptyProject
===========================================================================================
Build kind = FULLBUILD
Project=DefaultEmptyProject, kind of build requested=Full AspectJ compilation
Timer event: 0ms: Flush included source file cache
Timer event: 0ms: Check delta
Builder: Tidied output folder(s), removed class files and derived resources
Classpath = /jobs/genie.ajdt/ajdt-on-eclipse-45/workspace/org.eclipse.ajdt.core.tests/target/work/data/DefaultEmptyProject/bin:/jobs/genie.ajdt/ajdt-on-eclipse-45/workspace/org.aspectj.runtime/target/org.aspectj.runtime-1.8.9-SNAPSHOT.jar:/opt/public/common/jdk1.7.0_80/jre/lib/resources.jar:/opt/public/common/jdk1.7.0_80/jre/lib/rt.jar:/opt/public/common/jdk1.7.0_80/jre/lib/jsse.jar:/opt/public/common/jdk1.7.0_80/jre/lib/jce.jar:/opt/public/common/jdk1.7.0_80/jre/lib/charsets.jar:/opt/public/common/jdk1.7.0_80/jre/lib/jfr.jar:/opt/public/common/jdk1.7.0_80/jre/lib/ext/dnsns.jar:/opt/public/common/jdk1.7.0_80/jre/lib/ext/sunpkcs11.jar:/opt/public/common/jdk1.7.0_80/jre/lib/ext/zipfs.jar:/opt/public/common/jdk1.7.0_80/jre/lib/ext/sunec.jar:/opt/public/common/jdk1.7.0_80/jre/lib/ext/sunjce_provider.jar:/opt/public/common/jdk1.7.0_80/jre/lib/ext/localedata.jar:/jobs/genie.ajdt/ajdt-on-eclipse-45/workspace/org.eclipse.ajdt.core.tests/target/work/configuration/org.eclipse.osgi/40/0/.cp/junit.jar:/jobs/genie.ajdt/ajdt-on-eclipse-45/workspace/org.eclipse.ajdt.core.tests/target/work/configuration/org.eclipse.osgi/218/0/.cp:
Timer event: 2ms: Pre compile
Compiler configuration for project DefaultEmptyProject has been read by compiler.  Resetting.
     Configuration was []
Resetting list of modified source files.  Was []
AJC: compiling source files
Timer event: 38ms: Time to first compiled message
AJC: compiled: /jobs/genie.ajdt/ajdt-on-eclipse-45/workspace/org.eclipse.ajdt.core.tests/target/work/data/DefaultEmptyProject/src/p/Aspect.aj
Timer event: 39ms: Time to first woven message
AJC: woven aspect p.Aspect (from /jobs/genie.ajdt/ajdt-on-eclipse-45/workspace/org.eclipse.ajdt.core.tests/target/work/data/DefaultEmptyProject/src/p/Aspect.aj)
AJC: compiled: /jobs/genie.ajdt/ajdt-on-eclipse-45/workspace/org.eclipse.ajdt.core.tests/target/work/data/DefaultEmptyProject/src/p/Java.java
AJC: woven class p.Java (from /jobs/genie.ajdt/ajdt-on-eclipse-45/workspace/org.eclipse.ajdt.core.tests/target/work/data/DefaultEmptyProject/src/p/Java.java)
AJC: compiled: /jobs/genie.ajdt/ajdt-on-eclipse-45/workspace/org.eclipse.ajdt.core.tests/target/work/data/DefaultEmptyProject/src/p/Other.java
AJC: woven class p.Other (from /jobs/genie.ajdt/ajdt-on-eclipse-45/workspace/org.eclipse.ajdt.core.tests/target/work/data/DefaultEmptyProject/src/p/Other.java)
AJDE Callback: finish. Was full build: true
Timer event: 43ms: Total time spent in AJDE
Timer event: 0ms: Refresh after build
Types affected during build = 3
Timer event: 45ms: Total time spent in AJBuilder.build()
Timer event: 2ms: Delete markers: DefaultEmptyProject (Finished deleting markers for DefaultEmptyProject)
Timer event: 2ms: Create markers: DefaultEmptyProject (Finished creating markers for DefaultEmptyProject)
Created 2 markers in 3 files
------------------------
Starting testMoveTypeInDeclareParents2
Timer event: 0ms: Update visualizer, xref, advice listeners for (separate thread): DefaultEmptyProject
===========================================================================================
Build kind = FULLBUILD
Project=DefaultEmptyProject, kind of build requested=Full AspectJ compilation
Timer event: 0ms: Flush included source file cache
Timer event: 0ms: Check delta
Builder: Tidied output folder(s), removed class files and derived resources
Classpath = /jobs/genie.ajdt/ajdt-on-eclipse-45/workspace/org.eclipse.ajdt.core.tests/target/work/data/DefaultEmptyProject/bin:/jobs/genie.ajdt/ajdt-on-eclipse-45/workspace/org.aspectj.runtime/target/org.aspectj.runtime-1.8.9-SNAPSHOT.jar:/opt/public/common/jdk1.7.0_80/jre/lib/resources.jar:/opt/public/common/jdk1.7.0_80/jre/lib/rt.jar:/opt/public/common/jdk1.7.0_80/jre/lib/jsse.jar:/opt/public/common/jdk1.7.0_80/jre/lib/jce.jar:/opt/public/common/jdk1.7.0_80/jre/lib/charsets.jar:/opt/public/common/jdk1.7.0_80/jre/lib/jfr.jar:/opt/public/common/jdk1.7.0_80/jre/lib/ext/dnsns.jar:/opt/public/common/jdk1.7.0_80/jre/lib/ext/sunpkcs11.jar:/opt/public/common/jdk1.7.0_80/jre/lib/ext/zipfs.jar:/opt/public/common/jdk1.7.0_80/jre/lib/ext/sunec.jar:/opt/public/common/jdk1.7.0_80/jre/lib/ext/sunjce_provider.jar:/opt/public/common/jdk1.7.0_80/jre/lib/ext/localedata.jar:/jobs/genie.ajdt/ajdt-on-eclipse-45/workspace/org.eclipse.ajdt.core.tests/target/work/configuration/org.eclipse.osgi/40/0/.cp/junit.jar:/jobs/genie.ajdt/ajdt-on-eclipse-45/workspace/org.eclipse.ajdt.core.tests/target/work/configuration/org.eclipse.osgi/218/0/.cp:
Timer event: 9ms: Pre compile
Compiler configuration for project DefaultEmptyProject has been read by compiler.  Resetting.
     Configuration was []
Resetting list of modified source files.  Was []
AJC: compiling source files
Timer event: 38ms: Time to first compiled message
AJC: compiled: /jobs/genie.ajdt/ajdt-on-eclipse-45/workspace/org.eclipse.ajdt.core.tests/target/work/data/DefaultEmptyProject/src/p/Aspect.aj
Timer event: 40ms: Time to first woven message
AJC: woven aspect p.Aspect (from /jobs/genie.ajdt/ajdt-on-eclipse-45/workspace/org.eclipse.ajdt.core.tests/target/work/data/DefaultEmptyProject/src/p/Aspect.aj)
AJC: compiled: /jobs/genie.ajdt/ajdt-on-eclipse-45/workspace/org.eclipse.ajdt.core.tests/target/work/data/DefaultEmptyProject/src/p/Java.java
AJC: woven class p.Java (from /jobs/genie.ajdt/ajdt-on-eclipse-45/workspace/org.eclipse.ajdt.core.tests/target/work/data/DefaultEmptyProject/src/p/Java.java)
AJC: compiled: /jobs/genie.ajdt/ajdt-on-eclipse-45/workspace/org.eclipse.ajdt.core.tests/target/work/data/DefaultEmptyProject/src/p/Other.java
AJC: woven class p.Other (from /jobs/genie.ajdt/ajdt-on-eclipse-45/workspace/org.eclipse.ajdt.core.tests/target/work/data/DefaultEmptyProject/src/p/Other.java)
AJDE Callback: finish. Was full build: true
Timer event: 45ms: Total time spent in AJDE
Timer event: 0ms: Refresh after build
Types affected during build = 3
Timer event: 54ms: Total time spent in AJBuilder.build()
Timer event: 4ms: Delete markers: DefaultEmptyProject (Finished deleting markers for DefaultEmptyProject)
Timer event: 2ms: Create markers: DefaultEmptyProject (Finished creating markers for DefaultEmptyProject)
Created 2 markers in 3 files
Timer event: 0ms: Update visualizer, xref, advice listeners for (separate thread): DefaultEmptyProject
===========================================================================================
Build kind = FULLBUILD
Project=DefaultEmptyProject, kind of build requested=Full AspectJ compilation
Timer event: 0ms: Flush included source file cache
Timer event: 0ms: Check delta
Builder: Tidied output folder(s), removed class files and derived resources
Classpath = /jobs/genie.ajdt/ajdt-on-eclipse-45/workspace/org.eclipse.ajdt.core.tests/target/work/data/DefaultEmptyProject/bin:/jobs/genie.ajdt/ajdt-on-eclipse-45/workspace/org.aspectj.runtime/target/org.aspectj.runtime-1.8.9-SNAPSHOT.jar:/opt/public/common/jdk1.7.0_80/jre/lib/resources.jar:/opt/public/common/jdk1.7.0_80/jre/lib/rt.jar:/opt/public/common/jdk1.7.0_80/jre/lib/jsse.jar:/opt/public/common/jdk1.7.0_80/jre/lib/jce.jar:/opt/public/common/jdk1.7.0_80/jre/lib/charsets.jar:/opt/public/common/jdk1.7.0_80/jre/lib/jfr.jar:/opt/public/common/jdk1.7.0_80/jre/lib/ext/dnsns.jar:/opt/public/common/jdk1.7.0_80/jre/lib/ext/sunpkcs11.jar:/opt/public/common/jdk1.7.0_80/jre/lib/ext/zipfs.jar:/opt/public/common/jdk1.7.0_80/jre/lib/ext/sunec.jar:/opt/public/common/jdk1.7.0_80/jre/lib/ext/sunjce_provider.jar:/opt/public/common/jdk1.7.0_80/jre/lib/ext/localedata.jar:/jobs/genie.ajdt/ajdt-on-eclipse-45/workspace/org.eclipse.ajdt.core.tests/target/work/configuration/org.eclipse.osgi/40/0/.cp/junit.jar:/jobs/genie.ajdt/ajdt-on-eclipse-45/workspace/org.eclipse.ajdt.core.tests/target/work/configuration/org.eclipse.osgi/218/0/.cp:
Timer event: 2ms: Pre compile
Compiler configuration for project DefaultEmptyProject has been read by compiler.  Resetting.
     Configuration was []
Resetting list of modified source files.  Was []
AJC: compiling source files
Timer event: 35ms: Time to first compiled message
AJC: compiled: /jobs/genie.ajdt/ajdt-on-eclipse-45/workspace/org.eclipse.ajdt.core.tests/target/work/data/DefaultEmptyProject/src/p/Aspect.aj
Timer event: 38ms: Time to first woven message
AJC: woven aspect p.Aspect (from /jobs/genie.ajdt/ajdt-on-eclipse-45/workspace/org.eclipse.ajdt.core.tests/target/work/data/DefaultEmptyProject/src/p/Aspect.aj)
AJC: compiled: /jobs/genie.ajdt/ajdt-on-eclipse-45/workspace/org.eclipse.ajdt.core.tests/target/work/data/DefaultEmptyProject/src/p/Java.java
AJC: woven class p.Java (from /jobs/genie.ajdt/ajdt-on-eclipse-45/workspace/org.eclipse.ajdt.core.tests/target/work/data/DefaultEmptyProject/src/p/Java.java)
AJC: compiled: /jobs/genie.ajdt/ajdt-on-eclipse-45/workspace/org.eclipse.ajdt.core.tests/target/work/data/DefaultEmptyProject/src/p/Other.java
AJC: woven class p.Other (from /jobs/genie.ajdt/ajdt-on-eclipse-45/workspace/org.eclipse.ajdt.core.tests/target/work/data/DefaultEmptyProject/src/p/Other.java)
AJDE Callback: finish. Was full build: true
Timer event: 43ms: Total time spent in AJDE
Timer event: 0ms: Refresh after build
Types affected during build = 3
Timer event: 46ms: Total time spent in AJBuilder.build()
Timer event: 2ms: Delete markers: DefaultEmptyProject (Finished deleting markers for DefaultEmptyProject)
Timer event: 2ms: Create markers: DefaultEmptyProject (Finished creating markers for DefaultEmptyProject)
Created 2 markers in 3 files
[INFO] ------------------------------------------------------------------------
[INFO] Reactor Summary:
[INFO] 
[INFO] parent ............................................. SUCCESS [  0.286 s]
[INFO] org.aspectj.runtime ................................ SUCCESS [  5.238 s]
[INFO] org.aspectj.weaver ................................. SUCCESS [  3.969 s]
[INFO] org.aspectj.ajde ................................... SUCCESS [  7.426 s]
[INFO] org.aspectj ........................................ SUCCESS [  3.596 s]
[INFO] org.eclipse.contribution.weaving.jdt ............... SUCCESS [  6.612 s]
[INFO] org.eclipse.ajdt.core .............................. SUCCESS [ 11.197 s]
[INFO] org.eclipse.ajdt.doc.user .......................... SUCCESS [  1.356 s]
[INFO] org.eclipse.ajdt.examples .......................... SUCCESS [  5.591 s]
[INFO] org.eclipse.contribution.visualiser ................ SUCCESS [ 14.512 s]
[INFO] org.eclipse.contribution.xref.core ................. SUCCESS [  2.336 s]
[INFO] org.eclipse.contribution.xref.ui ................... SUCCESS [  3.372 s]
[INFO] org.eclipse.ajdt.ui ................................ SUCCESS [ 10.430 s]
[INFO] org.eclipse.aspectj ................................ SUCCESS [  1.495 s]
[INFO] org.eclipse.ajdt.mylyn.ui .......................... SUCCESS [  2.573 s]
[INFO] org.eclipse.equinox.weaving.aspectj ................ SUCCESS [  2.380 s]
[INFO] org.eclipse.equinox.weaving.sdk .................... SUCCESS [  1.457 s]
[INFO] org.eclipse.ajdt ................................... SUCCESS [  3.202 s]
[INFO] org.eclipse.contribution.weaving ................... SUCCESS [  2.605 s]
[INFO] org.eclipse.contribution.xref ...................... SUCCESS [  3.231 s]
[INFO] org.eclipse.ajdt.sdk ............................... SUCCESS [  5.719 s]
[INFO] org.eclipse.ajdt.core.tests ........................ FAILURE [25:03 min]
[INFO] org.eclipse.contribution.visualiser.tests .......... SKIPPED
[INFO] org.eclipse.ajdt.ui.tests .......................... SKIPPED
[INFO] org.eclipse.ajdt.mylyn.ui.tests .................... SKIPPED
[INFO] org.eclipse.contribution.weaving.jdt.tests ......... SKIPPED
[INFO] org.eclipse.contribution.xref.core.tests ........... SKIPPED
[INFO] org.eclipse.contribution.xref.ui.tests ............. SKIPPED
[INFO] org.eclipse.aspectj.feature_tests .................. SKIPPED
[INFO] org.eclipse.ajdt.releng ............................ SKIPPED
[INFO] ------------------------------------------------------------------------
[INFO] BUILD FAILURE
[INFO] ------------------------------------------------------------------------
[INFO] Total time: 27:29 min
[INFO] Finished at: 2016-03-16T12:10:01-04:00
[INFO] Final Memory: 311M/6623M
[INFO] ------------------------------------------------------------------------
[INFO] o.h.m.e.h.MavenExecutionResultHandler - Build failed with exception(s)
[INFO] o.h.m.e.h.MavenExecutionResultHandler - [1] org.apache.maven.lifecycle.LifecycleExecutionException: Failed to execute goal org.eclipse.tycho:tycho-surefire-plugin:0.23.1:test (default-test) on project org.eclipse.ajdt.core.tests: An unexpected error occured while launching the test runtime (return code 137). See log for details.
[DEBUG] Closing connection to remote
[ERROR] Failed to execute goal org.eclipse.tycho:tycho-surefire-plugin:0.23.1:test (default-test) on project org.eclipse.ajdt.core.tests: An unexpected error occured while launching the test runtime (return code 137). See log for details. -> [Help 1]
org.apache.maven.lifecycle.LifecycleExecutionException: Failed to execute goal org.eclipse.tycho:tycho-surefire-plugin:0.23.1:test (default-test) on project org.eclipse.ajdt.core.tests: An unexpected error occured while launching the test runtime (return code 137). See log for details.
	at org.apache.maven.lifecycle.internal.MojoExecutor.execute(MojoExecutor.java:212)
	at org.apache.maven.lifecycle.internal.MojoExecutor.execute(MojoExecutor.java:153)
	at org.apache.maven.lifecycle.internal.MojoExecutor.execute(MojoExecutor.java:145)
	at org.apache.maven.lifecycle.internal.LifecycleModuleBuilder.buildProject(LifecycleModuleBuilder.java:116)
	at org.apache.maven.lifecycle.internal.LifecycleModuleBuilder.buildProject(LifecycleModuleBuilder.java:80)
	at org.apache.maven.lifecycle.internal.builder.singlethreaded.SingleThreadedBuilder.build(SingleThreadedBuilder.java:51)
	at org.apache.maven.lifecycle.internal.LifecycleStarter.execute(LifecycleStarter.java:128)
	at org.apache.maven.DefaultMaven.doExecute(DefaultMaven.java:307)
	at org.apache.maven.DefaultMaven.doExecute(DefaultMaven.java:193)
	at org.apache.maven.DefaultMaven.execute(DefaultMaven.java:106)
	at org.apache.maven.cli.MavenCli.execute(MavenCli.java:863)
	at org.apache.maven.cli.MavenCli.doMain(MavenCli.java:288)
	at org.apache.maven.cli.MavenCli.main(MavenCli.java:199)
	at sun.reflect.NativeMethodAccessorImpl.invoke0(Native Method)
	at sun.reflect.NativeMethodAccessorImpl.invoke(NativeMethodAccessorImpl.java:57)
	at sun.reflect.DelegatingMethodAccessorImpl.invoke(DelegatingMethodAccessorImpl.java:43)
	at java.lang.reflect.Method.invoke(Method.java:606)
	at org.codehaus.plexus.classworlds.launcher.Launcher.launchEnhanced(Launcher.java:289)
	at org.codehaus.plexus.classworlds.launcher.Launcher.launch(Launcher.java:229)
	at org.codehaus.plexus.classworlds.launcher.Launcher.mainWithExitCode(Launcher.java:415)
	at org.codehaus.plexus.classworlds.launcher.Launcher.main(Launcher.java:356)
Caused by: org.apache.maven.plugin.MojoFailureException: An unexpected error occured while launching the test runtime (return code 137). See log for details.
	at org.eclipse.tycho.surefire.TestMojo.runTest(TestMojo.java:950)
	at org.eclipse.tycho.surefire.TestMojo.execute(TestMojo.java:630)
	at org.apache.maven.plugin.DefaultBuildPluginManager.executeMojo(DefaultBuildPluginManager.java:134)
	at org.apache.maven.lifecycle.internal.MojoExecutor.execute(MojoExecutor.java:207)
	... 20 more
[ERROR] 
[ERROR] Re-run Maven using the -X switch to enable full debug logging.
[ERROR] 
[ERROR] For more information about the errors and possible solutions, please read the following articles:
[ERROR] [Help 1] http://cwiki.apache.org/confluence/display/MAVEN/MojoFailureException
[ERROR] 
[ERROR] After correcting the problems, you can resume the build with the command
[ERROR]   mvn <goals> -rf :org.eclipse.ajdt.core.tests
[DEBUG] Waiting for process to finish
[DEBUG] Result: 1
Terminating xvnc.
Recording test results
Finished: FAILURE