FailedConsole Output

Skipping 7,215 KB.. Full Log
ANGED, INPATH_CHANGED, NONSTANDARDOPTIONS_CHANGED, OUTJAR_CHANGED, PROJECTSOURCERESOURCES_CHANGED, OUTPUTDESTINATIONS_CHANGED, INJARS_CHANGED]
Resetting list of modified source files.  Was null
Preparing for build: not going to be incremental because no successful previous full build
AJC: compiling source files
The type org.apache.commons.logging.Log cannot be resolved. It is indirectly referenced from required .class files
AspectJ reports build successful, build was: FULL
AJDE Callback: finish. Was full build: true
Timer event: 34ms: Total time spent in AJDE
Timer event: 0ms: Refresh after build
Types affected during build = 0
>> scheduled a build
Crosscutting model sanity checked with no problems
Timer event: 0ms: Model sanity check for: bug151818
Timer event: 36ms: Total time spent in AJBuilder.build()
Timer event: 2ms: Delete markers: bug151818 (Finished deleting markers for bug151818)
Timer event: 1ms: Create markers: bug151818 (Finished creating markers for bug151818)
Created 0 markers in 2 files
>> finished a build
Timer event: 0ms: Update visualizer, xref, advice listeners for (separate thread): bug151818
===========================================================================================
Build kind = AUTOBUILD
Project=DefaultEmptyProject, kind of build requested=Incremental AspectJ compilation
Timer event: 0ms: Flush included source file cache
Timer event: 0ms: Check delta
CoreCompilerConfiguration for project DefaultEmptyProject registered a configuration change: [ASPECTPATH_CHANGED, CLASSPATH_CHANGED, INPATH_CHANGED, OUTPUTDESTINATIONS_CHANGED]
Timer event: 0ms: Looking for and marking configuration changes in DefaultEmptyProject
	Configuration changes found: true
Timer event: 0ms: Look for source/resource changes
Setting list of classpath elements with modified contents:
      []
Classpath = /jobs/genie.ajdt/ajdt-on-eclipse-45/workspace/org.eclipse.ajdt.ui.tests/target/work/data/DefaultEmptyProject/bin:/jobs/genie.ajdt/ajdt-on-eclipse-45/workspace/org.aspectj.runtime/target/org.aspectj.runtime-1.8.9-SNAPSHOT.jar:/opt/public/common/jdk1.7.0_80/jre/lib/resources.jar:/opt/public/common/jdk1.7.0_80/jre/lib/rt.jar:/opt/public/common/jdk1.7.0_80/jre/lib/jsse.jar:/opt/public/common/jdk1.7.0_80/jre/lib/jce.jar:/opt/public/common/jdk1.7.0_80/jre/lib/charsets.jar:/opt/public/common/jdk1.7.0_80/jre/lib/jfr.jar:/opt/public/common/jdk1.7.0_80/jre/lib/ext/dnsns.jar:/opt/public/common/jdk1.7.0_80/jre/lib/ext/sunpkcs11.jar:/opt/public/common/jdk1.7.0_80/jre/lib/ext/zipfs.jar:/opt/public/common/jdk1.7.0_80/jre/lib/ext/sunec.jar:/opt/public/common/jdk1.7.0_80/jre/lib/ext/sunjce_provider.jar:/opt/public/common/jdk1.7.0_80/jre/lib/ext/localedata.jar:/jobs/genie.ajdt/ajdt-on-eclipse-45/workspace/org.eclipse.ajdt.ui.tests/target/work/configuration/org.eclipse.osgi/40/0/.cp/junit.jar:/jobs/genie.ajdt/ajdt-on-eclipse-45/workspace/org.eclipse.ajdt.ui.tests/target/work/configuration/org.eclipse.osgi/223/0/.cp:
Timer event: 8ms: Pre compile
Sending the following configuration changes to the compiler: [ASPECTPATH_CHANGED, CLASSPATH_CHANGED, INPATH_CHANGED, OUTPUTDESTINATIONS_CHANGED]
Compiler configuration for project DefaultEmptyProject has been read by compiler.  Resetting.
     Configuration was [ASPECTPATH_CHANGED, CLASSPATH_CHANGED, INPATH_CHANGED, OUTPUTDESTINATIONS_CHANGED]
Resetting list of modified source files.  Was []
ClassFileChangeChecking: failed to find a state instance managing output location : /jobs/genie.ajdt/ajdt-on-eclipse-45/workspace/org.eclipse.ajdt.ui.tests/target/work/configuration/org.eclipse.osgi/223/0/.cp (could be getting managed by JDT)
Timer event: 0ms: OutputLocationManager: binary folder to declaring project map creation: P/DefaultEmptyProject
Preparing for build: planning to be an incremental build
AspectJ reports build successful, build was: INCREMENTAL
AJDE Callback: finish. Was full build: false
Timer event: 4ms: Total time spent in AJDE
Timer event: 0ms: Refresh after build
Crosscutting model sanity checked with no problems
Timer event: 0ms: Model sanity check for: DefaultEmptyProject
Timer event: 13ms: Total time spent in AJBuilder.build()
>> finished a build
>> scheduled a build
Timer event: 0ms: Update visualizer, xref, advice listeners for (separate thread): DefaultEmptyProject
>> finished a build
>> scheduled a build
>> finished a build
>> scheduled a build
------------------------
Starting testnothing
===========================================================================================
Build kind = AUTOBUILD
Project=DefaultEmptyProject, kind of build requested=Incremental AspectJ compilation
Timer event: 0ms: Flush included source file cache
Timer event: 0ms: Check delta
CoreCompilerConfiguration for project DefaultEmptyProject registered a configuration change: [ASPECTPATH_CHANGED, CLASSPATH_CHANGED, INPATH_CHANGED, OUTPUTDESTINATIONS_CHANGED]
Timer event: 0ms: Looking for and marking configuration changes in DefaultEmptyProject
	Configuration changes found: true
Timer event: 0ms: Look for source/resource changes
Setting list of classpath elements with modified contents:
      []
Classpath = /jobs/genie.ajdt/ajdt-on-eclipse-45/workspace/org.eclipse.ajdt.ui.tests/target/work/data/DefaultEmptyProject/bin:/jobs/genie.ajdt/ajdt-on-eclipse-45/workspace/org.aspectj.runtime/target/org.aspectj.runtime-1.8.9-SNAPSHOT.jar:/opt/public/common/jdk1.7.0_80/jre/lib/resources.jar:/opt/public/common/jdk1.7.0_80/jre/lib/rt.jar:/opt/public/common/jdk1.7.0_80/jre/lib/jsse.jar:/opt/public/common/jdk1.7.0_80/jre/lib/jce.jar:/opt/public/common/jdk1.7.0_80/jre/lib/charsets.jar:/opt/public/common/jdk1.7.0_80/jre/lib/jfr.jar:/opt/public/common/jdk1.7.0_80/jre/lib/ext/dnsns.jar:/opt/public/common/jdk1.7.0_80/jre/lib/ext/sunpkcs11.jar:/opt/public/common/jdk1.7.0_80/jre/lib/ext/zipfs.jar:/opt/public/common/jdk1.7.0_80/jre/lib/ext/sunec.jar:/opt/public/common/jdk1.7.0_80/jre/lib/ext/sunjce_provider.jar:/opt/public/common/jdk1.7.0_80/jre/lib/ext/localedata.jar:/jobs/genie.ajdt/ajdt-on-eclipse-45/workspace/org.eclipse.ajdt.ui.tests/target/work/configuration/org.eclipse.osgi/40/0/.cp/junit.jar:/jobs/genie.ajdt/ajdt-on-eclipse-45/workspace/org.eclipse.ajdt.ui.tests/target/work/configuration/org.eclipse.osgi/223/0/.cp:
Timer event: 6ms: Pre compile
Sending the following configuration changes to the compiler: [ASPECTPATH_CHANGED, CLASSPATH_CHANGED, INPATH_CHANGED, OUTPUTDESTINATIONS_CHANGED]
Compiler configuration for project DefaultEmptyProject has been read by compiler.  Resetting.
     Configuration was [ASPECTPATH_CHANGED, CLASSPATH_CHANGED, INPATH_CHANGED, OUTPUTDESTINATIONS_CHANGED]
Resetting list of modified source files.  Was []
ClassFileChangeChecking: failed to find a state instance managing output location : /jobs/genie.ajdt/ajdt-on-eclipse-45/workspace/org.eclipse.ajdt.ui.tests/target/work/configuration/org.eclipse.osgi/223/0/.cp (could be getting managed by JDT)
Timer event: 0ms: OutputLocationManager: binary folder to declaring project map creation: P/DefaultEmptyProject
Preparing for build: planning to be an incremental build
AspectJ reports build successful, build was: INCREMENTAL
AJDE Callback: finish. Was full build: false
Timer event: 5ms: Total time spent in AJDE
Timer event: 0ms: Refresh after build
Crosscutting model sanity checked with no problems
Timer event: 0ms: Model sanity check for: DefaultEmptyProject
Timer event: 12ms: Total time spent in AJBuilder.build()
>> finished a build
>> scheduled a build
Timer event: 0ms: Update visualizer, xref, advice listeners for (separate thread): DefaultEmptyProject
>> finished a build
>> scheduled a build
------------------------
Starting testCopyAndRemoveNewNonSrcFileWithNonStandardOutputDir
Compiler configuration for project NonStandardOutputLocation doesn't know previous state, so assuming EVERYTHING has changed.
===========================================================================================
Build kind = FULLBUILD
Project=NonStandardOutputLocation, kind of build requested=Full AspectJ compilation
Timer event: 0ms: Flush included source file cache
Timer event: 0ms: Check delta
Builder: Tidied output folder(s), removed class files and derived resources
Classpath = /jobs/genie.ajdt/ajdt-on-eclipse-45/workspace/org.eclipse.ajdt.ui.tests/target/work/data/NonStandardOutputLocation/nonStandardBin:/opt/public/common/jdk1.7.0_80/jre/lib/resources.jar:/opt/public/common/jdk1.7.0_80/jre/lib/rt.jar:/opt/public/common/jdk1.7.0_80/jre/lib/jsse.jar:/opt/public/common/jdk1.7.0_80/jre/lib/jce.jar:/opt/public/common/jdk1.7.0_80/jre/lib/charsets.jar:/opt/public/common/jdk1.7.0_80/jre/lib/jfr.jar:/opt/public/common/jdk1.7.0_80/jre/lib/ext/dnsns.jar:/opt/public/common/jdk1.7.0_80/jre/lib/ext/sunpkcs11.jar:/opt/public/common/jdk1.7.0_80/jre/lib/ext/zipfs.jar:/opt/public/common/jdk1.7.0_80/jre/lib/ext/sunec.jar:/opt/public/common/jdk1.7.0_80/jre/lib/ext/sunjce_provider.jar:/opt/public/common/jdk1.7.0_80/jre/lib/ext/localedata.jar:/jobs/genie.ajdt/ajdt-on-eclipse-45/workspace/org.aspectj.runtime/target/org.aspectj.runtime-1.8.9-SNAPSHOT.jar:
Timer event: 4ms: Pre compile
Compiler configuration for project NonStandardOutputLocation has been read by compiler.  Resetting.
     Configuration was [PROJECTSOURCEFILES_CHANGED, JAVAOPTIONS_CHANGED, ASPECTPATH_CHANGED, CLASSPATH_CHANGED, INPATH_CHANGED, NONSTANDARDOPTIONS_CHANGED, OUTJAR_CHANGED, PROJECTSOURCERESOURCES_CHANGED, OUTPUTDESTINATIONS_CHANGED, INJARS_CHANGED]
Resetting list of modified source files.  Was null
Preparing for build: not going to be incremental because no successful previous full build
AJC: compiling source files
Timer event: 39ms: Time to first compiled message
AJC: compiled: /jobs/genie.ajdt/ajdt-on-eclipse-45/workspace/org.eclipse.ajdt.ui.tests/target/work/data/NonStandardOutputLocation/src/pack/A.aj
Timer event: 41ms: Time to first woven message
AJC: woven aspect pack.A (from /jobs/genie.ajdt/ajdt-on-eclipse-45/workspace/org.eclipse.ajdt.ui.tests/target/work/data/NonStandardOutputLocation/src/pack/A.aj)
AJC: compiled: /jobs/genie.ajdt/ajdt-on-eclipse-45/workspace/org.eclipse.ajdt.ui.tests/target/work/data/NonStandardOutputLocation/src/pack/Main.java
AJC: woven class pack.Main (from /jobs/genie.ajdt/ajdt-on-eclipse-45/workspace/org.eclipse.ajdt.ui.tests/target/work/data/NonStandardOutputLocation/src/pack/Main.java)
AspectJ reports build successful, build was: FULL
AJDE Callback: finish. Was full build: true
Timer event: 45ms: Total time spent in AJDE
Timer event: 0ms: Refresh after build
Types affected during build = 2
>> scheduled a build
Timer event: 1ms: Delete markers: NonStandardOutputLocation (Finished deleting markers for NonStandardOutputLocation)
Timer event: 2ms: Create markers: NonStandardOutputLocation (Finished creating markers for NonStandardOutputLocation)
Created 2 markers in 2 files
>> finished a build
Crosscutting model sanity checked with no problems
Timer event: 5ms: Model sanity check for: NonStandardOutputLocation
Timer event: 54ms: Total time spent in AJBuilder.build()
Timer event: 0ms: Update visualizer, xref, advice listeners for (separate thread): NonStandardOutputLocation
===========================================================================================
Build kind = AUTOBUILD
Project=DefaultEmptyProject, kind of build requested=Incremental AspectJ compilation
Timer event: 0ms: Flush included source file cache
Timer event: 0ms: Check delta
CoreCompilerConfiguration for project DefaultEmptyProject registered a configuration change: [ASPECTPATH_CHANGED, CLASSPATH_CHANGED, INPATH_CHANGED, OUTPUTDESTINATIONS_CHANGED]
Timer event: 0ms: Looking for and marking configuration changes in DefaultEmptyProject
	Configuration changes found: true
Timer event: 1ms: Look for source/resource changes
Setting list of classpath elements with modified contents:
      []
Classpath = /jobs/genie.ajdt/ajdt-on-eclipse-45/workspace/org.eclipse.ajdt.ui.tests/target/work/data/DefaultEmptyProject/bin:/jobs/genie.ajdt/ajdt-on-eclipse-45/workspace/org.aspectj.runtime/target/org.aspectj.runtime-1.8.9-SNAPSHOT.jar:/opt/public/common/jdk1.7.0_80/jre/lib/resources.jar:/opt/public/common/jdk1.7.0_80/jre/lib/rt.jar:/opt/public/common/jdk1.7.0_80/jre/lib/jsse.jar:/opt/public/common/jdk1.7.0_80/jre/lib/jce.jar:/opt/public/common/jdk1.7.0_80/jre/lib/charsets.jar:/opt/public/common/jdk1.7.0_80/jre/lib/jfr.jar:/opt/public/common/jdk1.7.0_80/jre/lib/ext/dnsns.jar:/opt/public/common/jdk1.7.0_80/jre/lib/ext/sunpkcs11.jar:/opt/public/common/jdk1.7.0_80/jre/lib/ext/zipfs.jar:/opt/public/common/jdk1.7.0_80/jre/lib/ext/sunec.jar:/opt/public/common/jdk1.7.0_80/jre/lib/ext/sunjce_provider.jar:/opt/public/common/jdk1.7.0_80/jre/lib/ext/localedata.jar:/jobs/genie.ajdt/ajdt-on-eclipse-45/workspace/org.eclipse.ajdt.ui.tests/target/work/configuration/org.eclipse.osgi/40/0/.cp/junit.jar:/jobs/genie.ajdt/ajdt-on-eclipse-45/workspace/org.eclipse.ajdt.ui.tests/target/work/configuration/org.eclipse.osgi/223/0/.cp:
Timer event: 8ms: Pre compile
Sending the following configuration changes to the compiler: [ASPECTPATH_CHANGED, CLASSPATH_CHANGED, INPATH_CHANGED, OUTPUTDESTINATIONS_CHANGED]
Compiler configuration for project DefaultEmptyProject has been read by compiler.  Resetting.
     Configuration was [ASPECTPATH_CHANGED, CLASSPATH_CHANGED, INPATH_CHANGED, OUTPUTDESTINATIONS_CHANGED]
Resetting list of modified source files.  Was []
ClassFileChangeChecking: failed to find a state instance managing output location : /jobs/genie.ajdt/ajdt-on-eclipse-45/workspace/org.eclipse.ajdt.ui.tests/target/work/configuration/org.eclipse.osgi/223/0/.cp (could be getting managed by JDT)
Timer event: 0ms: OutputLocationManager: binary folder to declaring project map creation: P/DefaultEmptyProject
Preparing for build: planning to be an incremental build
AspectJ reports build successful, build was: INCREMENTAL
AJDE Callback: finish. Was full build: false
Timer event: 6ms: Total time spent in AJDE
Timer event: 0ms: Refresh after build
Crosscutting model sanity checked with no problems
Timer event: 0ms: Model sanity check for: DefaultEmptyProject
Timer event: 14ms: Total time spent in AJBuilder.build()
>> finished a build
Timer event: 1ms: Update visualizer, xref, advice listeners for (separate thread): DefaultEmptyProject
>> scheduled a build
===========================================================================================
Build kind = AUTOBUILD
Project=NonStandardOutputLocation, kind of build requested=Incremental AspectJ compilation
Timer event: 0ms: Flush included source file cache
Copying added file pack/newFile.txt
CoreCompilerConfiguration for project NonStandardOutputLocation registered a configuration change: [PROJECTSOURCERESOURCES_CHANGED]
Timer event: 1ms: Check delta
Timer event: 0ms: Looking for and marking configuration changes in NonStandardOutputLocation
	Configuration changes found: false
build: Examined delta - no source file or classpath changes for project NonStandardOutputLocation
Compiler configuration for project NonStandardOutputLocation has been read by compiler.  Resetting.
     Configuration was [PROJECTSOURCERESOURCES_CHANGED]
Resetting list of modified source files.  Was []
Timer event: 1ms: Look for source/resource changes
No source/resource changes found, exiting build
Timer event: 3ms: Total time spent in AJBuilder.build()
>> finished a build
>> scheduled a build
>> finished a build
>> scheduled a build
===========================================================================================
Build kind = AUTOBUILD
Project=NonStandardOutputLocation, kind of build requested=Incremental AspectJ compilation
Timer event: 1ms: Flush included source file cache
Deleting removed file pack/newFile.txt
CoreCompilerConfiguration for project NonStandardOutputLocation registered a configuration change: [PROJECTSOURCERESOURCES_CHANGED]
Timer event: 1ms: Check delta
Timer event: 0ms: Looking for and marking configuration changes in NonStandardOutputLocation
	Configuration changes found: false
build: Examined delta - no source file or classpath changes for project NonStandardOutputLocation
Compiler configuration for project NonStandardOutputLocation has been read by compiler.  Resetting.
     Configuration was [PROJECTSOURCERESOURCES_CHANGED]
Resetting list of modified source files.  Was []
Timer event: 0ms: Look for source/resource changes
No source/resource changes found, exiting build
Timer event: 2ms: Total time spent in AJBuilder.build()
>> finished a build
>> scheduled a build
>> finished a build
>> scheduled a build
------------------------
Starting testCopyAndRemoveResourceWithoutSrcFolder
Compiler configuration for project WithoutSourceFolder doesn't know previous state, so assuming EVERYTHING has changed.
===========================================================================================
Build kind = FULLBUILD
Project=WithoutSourceFolder, kind of build requested=Full AspectJ compilation
Timer event: 0ms: Flush included source file cache
Timer event: 0ms: Check delta
Builder: Tidied output folder(s), removed class files and derived resources
Classpath = /jobs/genie.ajdt/ajdt-on-eclipse-45/workspace/org.eclipse.ajdt.ui.tests/target/work/data/WithoutSourceFolder:/opt/public/common/jdk1.7.0_80/jre/lib/resources.jar:/opt/public/common/jdk1.7.0_80/jre/lib/rt.jar:/opt/public/common/jdk1.7.0_80/jre/lib/jsse.jar:/opt/public/common/jdk1.7.0_80/jre/lib/jce.jar:/opt/public/common/jdk1.7.0_80/jre/lib/charsets.jar:/opt/public/common/jdk1.7.0_80/jre/lib/jfr.jar:/opt/public/common/jdk1.7.0_80/jre/lib/ext/dnsns.jar:/opt/public/common/jdk1.7.0_80/jre/lib/ext/sunpkcs11.jar:/opt/public/common/jdk1.7.0_80/jre/lib/ext/zipfs.jar:/opt/public/common/jdk1.7.0_80/jre/lib/ext/sunec.jar:/opt/public/common/jdk1.7.0_80/jre/lib/ext/sunjce_provider.jar:/opt/public/common/jdk1.7.0_80/jre/lib/ext/localedata.jar:/jobs/genie.ajdt/ajdt-on-eclipse-45/workspace/org.aspectj.runtime/target/org.aspectj.runtime-1.8.9-SNAPSHOT.jar:
Timer event: 6ms: Pre compile
Compiler configuration for project WithoutSourceFolder has been read by compiler.  Resetting.
     Configuration was [PROJECTSOURCEFILES_CHANGED, JAVAOPTIONS_CHANGED, ASPECTPATH_CHANGED, CLASSPATH_CHANGED, INPATH_CHANGED, NONSTANDARDOPTIONS_CHANGED, OUTJAR_CHANGED, PROJECTSOURCERESOURCES_CHANGED, OUTPUTDESTINATIONS_CHANGED, INJARS_CHANGED]
Resetting list of modified source files.  Was null
Preparing for build: not going to be incremental because no successful previous full build
AJC: compiling source files
Timer event: 36ms: Time to first compiled message
AJC: compiled: /jobs/genie.ajdt/ajdt-on-eclipse-45/workspace/org.eclipse.ajdt.ui.tests/target/work/data/WithoutSourceFolder/A.aj
Timer event: 37ms: Time to first woven message
AJC: woven aspect A (from /jobs/genie.ajdt/ajdt-on-eclipse-45/workspace/org.eclipse.ajdt.ui.tests/target/work/data/WithoutSourceFolder/A.aj)
AJC: compiled: /jobs/genie.ajdt/ajdt-on-eclipse-45/workspace/org.eclipse.ajdt.ui.tests/target/work/data/WithoutSourceFolder/C.java
AJC: woven class C (from /jobs/genie.ajdt/ajdt-on-eclipse-45/workspace/org.eclipse.ajdt.ui.tests/target/work/data/WithoutSourceFolder/C.java)
AspectJ reports build successful, build was: FULL
AJDE Callback: finish. Was full build: true
Timer event: 40ms: Total time spent in AJDE
Timer event: 0ms: Refresh after build
Types affected during build = 2
>> scheduled a build
Crosscutting model sanity checked with no problems
Timer event: 0ms: Model sanity check for: WithoutSourceFolder
Timer event: 46ms: Total time spent in AJBuilder.build()
Timer event: 5ms: Delete markers: WithoutSourceFolder (Finished deleting markers for WithoutSourceFolder)
Timer event: 1ms: Create markers: WithoutSourceFolder (Finished creating markers for WithoutSourceFolder)
Created 0 markers in 2 files
>> finished a build
Timer event: 1ms: Update visualizer, xref, advice listeners for (separate thread): WithoutSourceFolder
===========================================================================================
Build kind = AUTOBUILD
Project=DefaultEmptyProject, kind of build requested=Incremental AspectJ compilation
Timer event: 0ms: Flush included source file cache
Timer event: 0ms: Check delta
CoreCompilerConfiguration for project DefaultEmptyProject registered a configuration change: [ASPECTPATH_CHANGED, CLASSPATH_CHANGED, INPATH_CHANGED, OUTPUTDESTINATIONS_CHANGED]
Timer event: 0ms: Looking for and marking configuration changes in DefaultEmptyProject
	Configuration changes found: true
Timer event: 0ms: Look for source/resource changes
Setting list of classpath elements with modified contents:
      []
Classpath = /jobs/genie.ajdt/ajdt-on-eclipse-45/workspace/org.eclipse.ajdt.ui.tests/target/work/data/DefaultEmptyProject/bin:/jobs/genie.ajdt/ajdt-on-eclipse-45/workspace/org.aspectj.runtime/target/org.aspectj.runtime-1.8.9-SNAPSHOT.jar:/opt/public/common/jdk1.7.0_80/jre/lib/resources.jar:/opt/public/common/jdk1.7.0_80/jre/lib/rt.jar:/opt/public/common/jdk1.7.0_80/jre/lib/jsse.jar:/opt/public/common/jdk1.7.0_80/jre/lib/jce.jar:/opt/public/common/jdk1.7.0_80/jre/lib/charsets.jar:/opt/public/common/jdk1.7.0_80/jre/lib/jfr.jar:/opt/public/common/jdk1.7.0_80/jre/lib/ext/dnsns.jar:/opt/public/common/jdk1.7.0_80/jre/lib/ext/sunpkcs11.jar:/opt/public/common/jdk1.7.0_80/jre/lib/ext/zipfs.jar:/opt/public/common/jdk1.7.0_80/jre/lib/ext/sunec.jar:/opt/public/common/jdk1.7.0_80/jre/lib/ext/sunjce_provider.jar:/opt/public/common/jdk1.7.0_80/jre/lib/ext/localedata.jar:/jobs/genie.ajdt/ajdt-on-eclipse-45/workspace/org.eclipse.ajdt.ui.tests/target/work/configuration/org.eclipse.osgi/40/0/.cp/junit.jar:/jobs/genie.ajdt/ajdt-on-eclipse-45/workspace/org.eclipse.ajdt.ui.tests/target/work/configuration/org.eclipse.osgi/223/0/.cp:
Timer event: 6ms: Pre compile
Sending the following configuration changes to the compiler: [ASPECTPATH_CHANGED, CLASSPATH_CHANGED, INPATH_CHANGED, OUTPUTDESTINATIONS_CHANGED]
Compiler configuration for project DefaultEmptyProject has been read by compiler.  Resetting.
     Configuration was [ASPECTPATH_CHANGED, CLASSPATH_CHANGED, INPATH_CHANGED, OUTPUTDESTINATIONS_CHANGED]
Resetting list of modified source files.  Was []
ClassFileChangeChecking: failed to find a state instance managing output location : /jobs/genie.ajdt/ajdt-on-eclipse-45/workspace/org.eclipse.ajdt.ui.tests/target/work/configuration/org.eclipse.osgi/223/0/.cp (could be getting managed by JDT)
Timer event: 1ms: OutputLocationManager: binary folder to declaring project map creation: P/DefaultEmptyProject
Preparing for build: planning to be an incremental build
AspectJ reports build successful, build was: INCREMENTAL
AJDE Callback: finish. Was full build: false
Timer event: 7ms: Total time spent in AJDE
Timer event: 0ms: Refresh after build
Crosscutting model sanity checked with no problems
Timer event: 0ms: Model sanity check for: DefaultEmptyProject
Timer event: 13ms: Total time spent in AJBuilder.build()
>> finished a build
>> scheduled a build
Timer event: 1ms: Update visualizer, xref, advice listeners for (separate thread): DefaultEmptyProject
>> finished a build
>> scheduled a build
===========================================================================================
Build kind = AUTOBUILD
Project=WithoutSourceFolder, kind of build requested=Incremental AspectJ compilation
Timer event: 0ms: Flush included source file cache
Timer event: 0ms: Check delta
Timer event: 0ms: Looking for and marking configuration changes in WithoutSourceFolder
	Configuration changes found: false
build: Examined delta - no source file or classpath changes for project WithoutSourceFolder
Compiler configuration for project WithoutSourceFolder has been read by compiler.  Resetting.
     Configuration was []
Resetting list of modified source files.  Was []
Timer event: 0ms: Look for source/resource changes
No source/resource changes found, exiting build
Timer event: 1ms: Total time spent in AJBuilder.build()
>> finished a build
>> scheduled a build
===========================================================================================
Build kind = AUTOBUILD
Project=WithoutSourceFolder, kind of build requested=Incremental AspectJ compilation
Timer event: 0ms: Flush included source file cache
Timer event: 0ms: Check delta
Timer event: 0ms: Looking for and marking configuration changes in WithoutSourceFolder
	Configuration changes found: false
build: Examined delta - no source file or classpath changes for project WithoutSourceFolder
Compiler configuration for project WithoutSourceFolder has been read by compiler.  Resetting.
     Configuration was []
Resetting list of modified source files.  Was []
Timer event: 0ms: Look for source/resource changes
No source/resource changes found, exiting build
Timer event: 0ms: Total time spent in AJBuilder.build()
>> finished a build
>> scheduled a build
>> finished a build
>> scheduled a build
------------------------
Starting testCreateAndDeleteNewFolder
Compiler configuration for project AnotherSimpleAJProject doesn't know previous state, so assuming EVERYTHING has changed.
===========================================================================================
Build kind = FULLBUILD
Project=AnotherSimpleAJProject, kind of build requested=Full AspectJ compilation
Timer event: 0ms: Flush included source file cache
Timer event: 0ms: Check delta
Builder: Tidied output folder(s), removed class files and derived resources
Classpath = /jobs/genie.ajdt/ajdt-on-eclipse-45/workspace/org.eclipse.ajdt.ui.tests/target/work/data/AnotherSimpleAJProject/bin:/opt/public/common/jdk1.7.0_80/jre/lib/resources.jar:/opt/public/common/jdk1.7.0_80/jre/lib/rt.jar:/opt/public/common/jdk1.7.0_80/jre/lib/jsse.jar:/opt/public/common/jdk1.7.0_80/jre/lib/jce.jar:/opt/public/common/jdk1.7.0_80/jre/lib/charsets.jar:/opt/public/common/jdk1.7.0_80/jre/lib/jfr.jar:/opt/public/common/jdk1.7.0_80/jre/lib/ext/dnsns.jar:/opt/public/common/jdk1.7.0_80/jre/lib/ext/sunpkcs11.jar:/opt/public/common/jdk1.7.0_80/jre/lib/ext/zipfs.jar:/opt/public/common/jdk1.7.0_80/jre/lib/ext/sunec.jar:/opt/public/common/jdk1.7.0_80/jre/lib/ext/sunjce_provider.jar:/opt/public/common/jdk1.7.0_80/jre/lib/ext/localedata.jar:/jobs/genie.ajdt/ajdt-on-eclipse-45/workspace/org.aspectj.runtime/target/org.aspectj.runtime-1.8.9-SNAPSHOT.jar:
Timer event: 5ms: Pre compile
Compiler configuration for project AnotherSimpleAJProject has been read by compiler.  Resetting.
     Configuration was [PROJECTSOURCEFILES_CHANGED, JAVAOPTIONS_CHANGED, ASPECTPATH_CHANGED, CLASSPATH_CHANGED, INPATH_CHANGED, NONSTANDARDOPTIONS_CHANGED, OUTJAR_CHANGED, PROJECTSOURCERESOURCES_CHANGED, OUTPUTDESTINATIONS_CHANGED, INJARS_CHANGED]
Resetting list of modified source files.  Was null
Preparing for build: not going to be incremental because no successful previous full build
AJC: compiling source files
Timer event: 36ms: Time to first compiled message
AJC: compiled: /jobs/genie.ajdt/ajdt-on-eclipse-45/workspace/org.eclipse.ajdt.ui.tests/target/work/data/AnotherSimpleAJProject/src/p2/Aspect.aj
AJC: compiled: /jobs/genie.ajdt/ajdt-on-eclipse-45/workspace/org.eclipse.ajdt.ui.tests/target/work/data/AnotherSimpleAJProject/src/AspectInDefaultPackage.aj
Timer event: 40ms: Time to first woven message
AJC: woven aspect p2.Aspect (from /jobs/genie.ajdt/ajdt-on-eclipse-45/workspace/org.eclipse.ajdt.ui.tests/target/work/data/AnotherSimpleAJProject/src/p2/Aspect.aj)
AJC: woven aspect p2.AspectInDefaultPackage (from /jobs/genie.ajdt/ajdt-on-eclipse-45/workspace/org.eclipse.ajdt.ui.tests/target/work/data/AnotherSimpleAJProject/src/AspectInDefaultPackage.aj)
AJC: compiled: /jobs/genie.ajdt/ajdt-on-eclipse-45/workspace/org.eclipse.ajdt.ui.tests/target/work/data/AnotherSimpleAJProject/src/p1/Main.java
AJC: woven class p1.Main (from /jobs/genie.ajdt/ajdt-on-eclipse-45/workspace/org.eclipse.ajdt.ui.tests/target/work/data/AnotherSimpleAJProject/src/p1/Main.java)
AJC: compiled: /jobs/genie.ajdt/ajdt-on-eclipse-45/workspace/org.eclipse.ajdt.ui.tests/target/work/data/AnotherSimpleAJProject/src/ClassInDefaultPackage.java
AJC: woven class ClassInDefaultPackage (from /jobs/genie.ajdt/ajdt-on-eclipse-45/workspace/org.eclipse.ajdt.ui.tests/target/work/data/AnotherSimpleAJProject/src/ClassInDefaultPackage.java)
AspectJ reports build successful, build was: FULL
AJDE Callback: finish. Was full build: true
Timer event: 48ms: Total time spent in AJDE
Timer event: 0ms: Refresh after build
Types affected during build = 4
>> scheduled a build
Timer event: 1ms: Delete markers: AnotherSimpleAJProject (Finished deleting markers for AnotherSimpleAJProject)
Timer event: 2ms: Create markers: AnotherSimpleAJProject (Finished creating markers for AnotherSimpleAJProject)
Created 3 markers in 4 files
>> finished a build
Crosscutting model sanity checked.  The following problems found:
Java Element does not exist: =AnotherSimpleAJProject/src<p2*AspectInDefaultPackage.aj'AspectInDefaultPackage&after
	It is the source relationship of =AnotherSimpleAJProject/src<p1{Main.java[Main~main~\[QString; --advised by--> =AnotherSimpleAJProject/src<p2*AspectInDefaultPackage.aj'AspectInDefaultPackage&after,   =AnotherSimpleAJProject/src<p2*Aspect.aj'Aspect&after
	This may not actually be a problem if compiling broken code or advising static initializers.
Java Element does not exist: =AnotherSimpleAJProject/src<p2*AspectInDefaultPackage.aj'AspectInDefaultPackage&after
	It is the source relationship of =AnotherSimpleAJProject/src<p2*AspectInDefaultPackage.aj'AspectInDefaultPackage&after --advises--> =AnotherSimpleAJProject/src<p1{Main.java[Main~main~\[QString;,   =AnotherSimpleAJProject/src<{ClassInDefaultPackage.java[ClassInDefaultPackage~main~\[QString;
	This may not actually be a problem if compiling broken code or advising static initializers.
Java Element does not exist: =AnotherSimpleAJProject/src<p2*AspectInDefaultPackage.aj'AspectInDefaultPackage&after
	It is the source relationship of =AnotherSimpleAJProject/src<{ClassInDefaultPackage.java[ClassInDefaultPackage~main~\[QString; --advised by--> =AnotherSimpleAJProject/src<p2*AspectInDefaultPackage.aj'AspectInDefaultPackage&after,   =AnotherSimpleAJProject/src<p2*Aspect.aj'Aspect&after
	This may not actually be a problem if compiling broken code or advising static initializers.

Timer event: 7ms: Model sanity check for: AnotherSimpleAJProject
Timer event: 60ms: Total time spent in AJBuilder.build()
Timer event: 1ms: Update visualizer, xref, advice listeners for (separate thread): AnotherSimpleAJProject
===========================================================================================
Build kind = AUTOBUILD
Project=DefaultEmptyProject, kind of build requested=Incremental AspectJ compilation
Timer event: 0ms: Flush included source file cache
Timer event: 0ms: Check delta
CoreCompilerConfiguration for project DefaultEmptyProject registered a configuration change: [ASPECTPATH_CHANGED, CLASSPATH_CHANGED, INPATH_CHANGED, OUTPUTDESTINATIONS_CHANGED]
Timer event: 0ms: Looking for and marking configuration changes in DefaultEmptyProject
	Configuration changes found: true
Timer event: 0ms: Look for source/resource changes
Setting list of classpath elements with modified contents:
      []
Classpath = /jobs/genie.ajdt/ajdt-on-eclipse-45/workspace/org.eclipse.ajdt.ui.tests/target/work/data/DefaultEmptyProject/bin:/jobs/genie.ajdt/ajdt-on-eclipse-45/workspace/org.aspectj.runtime/target/org.aspectj.runtime-1.8.9-SNAPSHOT.jar:/opt/public/common/jdk1.7.0_80/jre/lib/resources.jar:/opt/public/common/jdk1.7.0_80/jre/lib/rt.jar:/opt/public/common/jdk1.7.0_80/jre/lib/jsse.jar:/opt/public/common/jdk1.7.0_80/jre/lib/jce.jar:/opt/public/common/jdk1.7.0_80/jre/lib/charsets.jar:/opt/public/common/jdk1.7.0_80/jre/lib/jfr.jar:/opt/public/common/jdk1.7.0_80/jre/lib/ext/dnsns.jar:/opt/public/common/jdk1.7.0_80/jre/lib/ext/sunpkcs11.jar:/opt/public/common/jdk1.7.0_80/jre/lib/ext/zipfs.jar:/opt/public/common/jdk1.7.0_80/jre/lib/ext/sunec.jar:/opt/public/common/jdk1.7.0_80/jre/lib/ext/sunjce_provider.jar:/opt/public/common/jdk1.7.0_80/jre/lib/ext/localedata.jar:/jobs/genie.ajdt/ajdt-on-eclipse-45/workspace/org.eclipse.ajdt.ui.tests/target/work/configuration/org.eclipse.osgi/40/0/.cp/junit.jar:/jobs/genie.ajdt/ajdt-on-eclipse-45/workspace/org.eclipse.ajdt.ui.tests/target/work/configuration/org.eclipse.osgi/223/0/.cp:
Timer event: 7ms: Pre compile
Sending the following configuration changes to the compiler: [ASPECTPATH_CHANGED, CLASSPATH_CHANGED, INPATH_CHANGED, OUTPUTDESTINATIONS_CHANGED]
Compiler configuration for project DefaultEmptyProject has been read by compiler.  Resetting.
     Configuration was [ASPECTPATH_CHANGED, CLASSPATH_CHANGED, INPATH_CHANGED, OUTPUTDESTINATIONS_CHANGED]
Resetting list of modified source files.  Was []
ClassFileChangeChecking: failed to find a state instance managing output location : /jobs/genie.ajdt/ajdt-on-eclipse-45/workspace/org.eclipse.ajdt.ui.tests/target/work/configuration/org.eclipse.osgi/223/0/.cp (could be getting managed by JDT)
Timer event: 0ms: OutputLocationManager: binary folder to declaring project map creation: P/DefaultEmptyProject
Preparing for build: planning to be an incremental build
AspectJ reports build successful, build was: INCREMENTAL
AJDE Callback: finish. Was full build: false
Timer event: 8ms: Total time spent in AJDE
Timer event: 0ms: Refresh after build
Crosscutting model sanity checked with no problems
Timer event: 0ms: Model sanity check for: DefaultEmptyProject
Timer event: 15ms: Total time spent in AJBuilder.build()
>> finished a build
>> scheduled a build
Timer event: 1ms: Update visualizer, xref, advice listeners for (separate thread): DefaultEmptyProject
>> finished a build
>> scheduled a build
===========================================================================================
Build kind = AUTOBUILD
Project=AnotherSimpleAJProject, kind of build requested=Incremental AspectJ compilation
Timer event: 0ms: Flush included source file cache
Timer event: 1ms: Check delta
Timer event: 0ms: Looking for and marking configuration changes in AnotherSimpleAJProject
	Configuration changes found: false
build: Examined delta - no source file or classpath changes for project AnotherSimpleAJProject
Compiler configuration for project AnotherSimpleAJProject has been read by compiler.  Resetting.
     Configuration was []
Resetting list of modified source files.  Was []
Timer event: 0ms: Look for source/resource changes
No source/resource changes found, exiting build
Timer event: 1ms: Total time spent in AJBuilder.build()
>> finished a build
>> scheduled a build
>> finished a build
>> scheduled a build
===========================================================================================
Build kind = AUTOBUILD
Project=AnotherSimpleAJProject, kind of build requested=Incremental AspectJ compilation
Timer event: 0ms: Flush included source file cache
Timer event: 0ms: Check delta
Timer event: 0ms: Looking for and marking configuration changes in AnotherSimpleAJProject
	Configuration changes found: false
build: Examined delta - no source file or classpath changes for project AnotherSimpleAJProject
Compiler configuration for project AnotherSimpleAJProject has been read by compiler.  Resetting.
     Configuration was []
Resetting list of modified source files.  Was []
Timer event: 1ms: Look for source/resource changes
No source/resource changes found, exiting build
Timer event: 2ms: Total time spent in AJBuilder.build()
>> finished a build
>> scheduled a build
>> finished a build
>> scheduled a build
>> finished a build
>> scheduled a build
>> finished a build
>> scheduled a build
------------------------
Starting testIncrementalBuildWithSrcFolder
>> scheduled a build
>> finished a build
rep: AspectJ reports build successful, build was: FULL
>> finished a build
>> scheduled a build
>> finished a build
>> scheduled a build
>> finished a build
>> scheduled a build
------------------------
Starting testCopyAndRemoveNewNonSrcFileWithMultipleSrcDirs
Compiler configuration for project MultipleSourceFolders doesn't know previous state, so assuming EVERYTHING has changed.
===========================================================================================
Build kind = FULLBUILD
Project=MultipleSourceFolders, kind of build requested=Full AspectJ compilation
Timer event: 0ms: Flush included source file cache
Timer event: 0ms: Check delta
Builder: Tidied output folder(s), removed class files and derived resources
Classpath = /jobs/genie.ajdt/ajdt-on-eclipse-45/workspace/org.eclipse.ajdt.ui.tests/target/work/data/MultipleSourceFolders/bin:/opt/public/common/jdk1.7.0_80/jre/lib/resources.jar:/opt/public/common/jdk1.7.0_80/jre/lib/rt.jar:/opt/public/common/jdk1.7.0_80/jre/lib/jsse.jar:/opt/public/common/jdk1.7.0_80/jre/lib/jce.jar:/opt/public/common/jdk1.7.0_80/jre/lib/charsets.jar:/opt/public/common/jdk1.7.0_80/jre/lib/jfr.jar:/opt/public/common/jdk1.7.0_80/jre/lib/ext/dnsns.jar:/opt/public/common/jdk1.7.0_80/jre/lib/ext/sunpkcs11.jar:/opt/public/common/jdk1.7.0_80/jre/lib/ext/zipfs.jar:/opt/public/common/jdk1.7.0_80/jre/lib/ext/sunec.jar:/opt/public/common/jdk1.7.0_80/jre/lib/ext/sunjce_provider.jar:/opt/public/common/jdk1.7.0_80/jre/lib/ext/localedata.jar:/jobs/genie.ajdt/ajdt-on-eclipse-45/workspace/org.aspectj.runtime/target/org.aspectj.runtime-1.8.9-SNAPSHOT.jar:
Timer event: 7ms: Pre compile
Compiler configuration for project MultipleSourceFolders has been read by compiler.  Resetting.
     Configuration was [PROJECTSOURCEFILES_CHANGED, JAVAOPTIONS_CHANGED, ASPECTPATH_CHANGED, CLASSPATH_CHANGED, INPATH_CHANGED, NONSTANDARDOPTIONS_CHANGED, OUTJAR_CHANGED, PROJECTSOURCERESOURCES_CHANGED, OUTPUTDESTINATIONS_CHANGED, INJARS_CHANGED]
Resetting list of modified source files.  Was null
Preparing for build: not going to be incremental because no successful previous full build
AJC: compiling source files
Timer event: 34ms: Time to first compiled message
AJC: compiled: /jobs/genie.ajdt/ajdt-on-eclipse-45/workspace/org.eclipse.ajdt.ui.tests/target/work/data/MultipleSourceFolders/src/Class1.java
Timer event: 34ms: Time to first woven message
AJC: woven class Class1 (from /jobs/genie.ajdt/ajdt-on-eclipse-45/workspace/org.eclipse.ajdt.ui.tests/target/work/data/MultipleSourceFolders/src/Class1.java)
TODO To change the template for this generated file go to
TODO To change the template for this generated type comment go to
AJC: compiled: /jobs/genie.ajdt/ajdt-on-eclipse-45/workspace/org.eclipse.ajdt.ui.tests/target/work/data/MultipleSourceFolders/src2/pack/Class3.java
AJC: woven class pack.Class3 (from /jobs/genie.ajdt/ajdt-on-eclipse-45/workspace/org.eclipse.ajdt.ui.tests/target/work/data/MultipleSourceFolders/src2/pack/Class3.java)
TODO To change the template for this generated file go to
TODO To change the template for this generated type comment go to
AJC: compiled: /jobs/genie.ajdt/ajdt-on-eclipse-45/workspace/org.eclipse.ajdt.ui.tests/target/work/data/MultipleSourceFolders/src/pack/Class2.java
AJC: woven class pack.Class2 (from /jobs/genie.ajdt/ajdt-on-eclipse-45/workspace/org.eclipse.ajdt.ui.tests/target/work/data/MultipleSourceFolders/src/pack/Class2.java)
TODO To change the template for this generated file go to
TODO To change the template for this generated type comment go to
AspectJ reports build successful, build was: FULL
AJDE Callback: finish. Was full build: true
Timer event: 39ms: Total time spent in AJDE
Timer event: 0ms: Refresh after build
Types affected during build = 3
>> scheduled a build
Crosscutting model sanity checked with no problems
Timer event: 0ms: Model sanity check for: MultipleSourceFolders
Timer event: 47ms: Total time spent in AJBuilder.build()
Timer event: 5ms: Delete markers: MultipleSourceFolders (Finished deleting markers for MultipleSourceFolders)
Timer event: 2ms: Create markers: MultipleSourceFolders (Finished creating markers for MultipleSourceFolders)
Created 0 markers in 3 files
>> finished a build
Timer event: 0ms: Update visualizer, xref, advice listeners for (separate thread): MultipleSourceFolders
===========================================================================================
Build kind = AUTOBUILD
Project=DefaultEmptyProject, kind of build requested=Incremental AspectJ compilation
Timer event: 0ms: Flush included source file cache
Timer event: 0ms: Check delta
CoreCompilerConfiguration for project DefaultEmptyProject registered a configuration change: [ASPECTPATH_CHANGED, CLASSPATH_CHANGED, INPATH_CHANGED, OUTPUTDESTINATIONS_CHANGED]
Timer event: 0ms: Looking for and marking configuration changes in DefaultEmptyProject
	Configuration changes found: true
Timer event: 0ms: Look for source/resource changes
Setting list of classpath elements with modified contents:
      []
Classpath = /jobs/genie.ajdt/ajdt-on-eclipse-45/workspace/org.eclipse.ajdt.ui.tests/target/work/data/DefaultEmptyProject/bin:/jobs/genie.ajdt/ajdt-on-eclipse-45/workspace/org.aspectj.runtime/target/org.aspectj.runtime-1.8.9-SNAPSHOT.jar:/opt/public/common/jdk1.7.0_80/jre/lib/resources.jar:/opt/public/common/jdk1.7.0_80/jre/lib/rt.jar:/opt/public/common/jdk1.7.0_80/jre/lib/jsse.jar:/opt/public/common/jdk1.7.0_80/jre/lib/jce.jar:/opt/public/common/jdk1.7.0_80/jre/lib/charsets.jar:/opt/public/common/jdk1.7.0_80/jre/lib/jfr.jar:/opt/public/common/jdk1.7.0_80/jre/lib/ext/dnsns.jar:/opt/public/common/jdk1.7.0_80/jre/lib/ext/sunpkcs11.jar:/opt/public/common/jdk1.7.0_80/jre/lib/ext/zipfs.jar:/opt/public/common/jdk1.7.0_80/jre/lib/ext/sunec.jar:/opt/public/common/jdk1.7.0_80/jre/lib/ext/sunjce_provider.jar:/opt/public/common/jdk1.7.0_80/jre/lib/ext/localedata.jar:/jobs/genie.ajdt/ajdt-on-eclipse-45/workspace/org.eclipse.ajdt.ui.tests/target/work/configuration/org.eclipse.osgi/40/0/.cp/junit.jar:/jobs/genie.ajdt/ajdt-on-eclipse-45/workspace/org.eclipse.ajdt.ui.tests/target/work/configuration/org.eclipse.osgi/223/0/.cp:
Timer event: 5ms: Pre compile
Sending the following configuration changes to the compiler: [ASPECTPATH_CHANGED, CLASSPATH_CHANGED, INPATH_CHANGED, OUTPUTDESTINATIONS_CHANGED]
Compiler configuration for project DefaultEmptyProject has been read by compiler.  Resetting.
     Configuration was [ASPECTPATH_CHANGED, CLASSPATH_CHANGED, INPATH_CHANGED, OUTPUTDESTINATIONS_CHANGED]
Resetting list of modified source files.  Was []
ClassFileChangeChecking: failed to find a state instance managing output location : /jobs/genie.ajdt/ajdt-on-eclipse-45/workspace/org.eclipse.ajdt.ui.tests/target/work/configuration/org.eclipse.osgi/223/0/.cp (could be getting managed by JDT)
Timer event: 0ms: OutputLocationManager: binary folder to declaring project map creation: P/DefaultEmptyProject
Preparing for build: planning to be an incremental build
AspectJ reports build successful, build was: INCREMENTAL
AJDE Callback: finish. Was full build: false
Timer event: 8ms: Total time spent in AJDE
Timer event: 0ms: Refresh after build
Crosscutting model sanity checked with no problems
Timer event: 0ms: Model sanity check for: DefaultEmptyProject
Timer event: 13ms: Total time spent in AJBuilder.build()
>> finished a build
>> scheduled a build
Timer event: 0ms: Update visualizer, xref, advice listeners for (separate thread): DefaultEmptyProject
>> finished a build
>> scheduled a build
===========================================================================================
Build kind = AUTOBUILD
Project=MultipleSourceFolders, kind of build requested=Incremental AspectJ compilation
Timer event: 0ms: Flush included source file cache
Copying added file pack/newFile.txt
CoreCompilerConfiguration for project MultipleSourceFolders registered a configuration change: [PROJECTSOURCERESOURCES_CHANGED]
Timer event: 1ms: Check delta
Timer event: 1ms: Looking for and marking configuration changes in MultipleSourceFolders
	Configuration changes found: false
build: Examined delta - no source file or classpath changes for project MultipleSourceFolders
Compiler configuration for project MultipleSourceFolders has been read by compiler.  Resetting.
     Configuration was [PROJECTSOURCERESOURCES_CHANGED]
Resetting list of modified source files.  Was []
Timer event: 1ms: Look for source/resource changes
No source/resource changes found, exiting build
Timer event: 3ms: Total time spent in AJBuilder.build()
>> finished a build
>> scheduled a build
>> finished a build
>> scheduled a build
===========================================================================================
Build kind = AUTOBUILD
Project=MultipleSourceFolders, kind of build requested=Incremental AspectJ compilation
Timer event: 0ms: Flush included source file cache
Deleting removed file pack/newFile.txt
CoreCompilerConfiguration for project MultipleSourceFolders registered a configuration change: [PROJECTSOURCERESOURCES_CHANGED]
Timer event: 1ms: Check delta
Timer event: 0ms: Looking for and marking configuration changes in MultipleSourceFolders
	Configuration changes found: false
build: Examined delta - no source file or classpath changes for project MultipleSourceFolders
Compiler configuration for project MultipleSourceFolders has been read by compiler.  Resetting.
     Configuration was [PROJECTSOURCERESOURCES_CHANGED]
Resetting list of modified source files.  Was []
Timer event: 1ms: Look for source/resource changes
No source/resource changes found, exiting build
Timer event: 2ms: Total time spent in AJBuilder.build()
>> finished a build
>> scheduled a build
>> finished a build
>> scheduled a build
------------------------
Starting testCreateAndDeleteNewPackage
Compiler configuration for project AnotherSimpleAJProject doesn't know previous state, so assuming EVERYTHING has changed.
===========================================================================================
Build kind = FULLBUILD
Project=AnotherSimpleAJProject, kind of build requested=Full AspectJ compilation
Timer event: 0ms: Flush included source file cache
Timer event: 0ms: Check delta
Builder: Tidied output folder(s), removed class files and derived resources
Classpath = /jobs/genie.ajdt/ajdt-on-eclipse-45/workspace/org.eclipse.ajdt.ui.tests/target/work/data/AnotherSimpleAJProject/bin:/opt/public/common/jdk1.7.0_80/jre/lib/resources.jar:/opt/public/common/jdk1.7.0_80/jre/lib/rt.jar:/opt/public/common/jdk1.7.0_80/jre/lib/jsse.jar:/opt/public/common/jdk1.7.0_80/jre/lib/jce.jar:/opt/public/common/jdk1.7.0_80/jre/lib/charsets.jar:/opt/public/common/jdk1.7.0_80/jre/lib/jfr.jar:/opt/public/common/jdk1.7.0_80/jre/lib/ext/dnsns.jar:/opt/public/common/jdk1.7.0_80/jre/lib/ext/sunpkcs11.jar:/opt/public/common/jdk1.7.0_80/jre/lib/ext/zipfs.jar:/opt/public/common/jdk1.7.0_80/jre/lib/ext/sunec.jar:/opt/public/common/jdk1.7.0_80/jre/lib/ext/sunjce_provider.jar:/opt/public/common/jdk1.7.0_80/jre/lib/ext/localedata.jar:/jobs/genie.ajdt/ajdt-on-eclipse-45/workspace/org.aspectj.runtime/target/org.aspectj.runtime-1.8.9-SNAPSHOT.jar:
Timer event: 5ms: Pre compile
Compiler configuration for project AnotherSimpleAJProject has been read by compiler.  Resetting.
     Configuration was [PROJECTSOURCEFILES_CHANGED, JAVAOPTIONS_CHANGED, ASPECTPATH_CHANGED, CLASSPATH_CHANGED, INPATH_CHANGED, NONSTANDARDOPTIONS_CHANGED, OUTJAR_CHANGED, PROJECTSOURCERESOURCES_CHANGED, OUTPUTDESTINATIONS_CHANGED, INJARS_CHANGED]
Resetting list of modified source files.  Was null
Preparing for build: not going to be incremental because no successful previous full build
AJC: compiling source files
Timer event: 36ms: Time to first compiled message
AJC: compiled: /jobs/genie.ajdt/ajdt-on-eclipse-45/workspace/org.eclipse.ajdt.ui.tests/target/work/data/AnotherSimpleAJProject/src/p2/Aspect.aj
AJC: compiled: /jobs/genie.ajdt/ajdt-on-eclipse-45/workspace/org.eclipse.ajdt.ui.tests/target/work/data/AnotherSimpleAJProject/src/AspectInDefaultPackage.aj
Timer event: 40ms: Time to first woven message
AJC: woven aspect p2.Aspect (from /jobs/genie.ajdt/ajdt-on-eclipse-45/workspace/org.eclipse.ajdt.ui.tests/target/work/data/AnotherSimpleAJProject/src/p2/Aspect.aj)
AJC: woven aspect p2.AspectInDefaultPackage (from /jobs/genie.ajdt/ajdt-on-eclipse-45/workspace/org.eclipse.ajdt.ui.tests/target/work/data/AnotherSimpleAJProject/src/AspectInDefaultPackage.aj)
AJC: compiled: /jobs/genie.ajdt/ajdt-on-eclipse-45/workspace/org.eclipse.ajdt.ui.tests/target/work/data/AnotherSimpleAJProject/src/p1/Main.java
AJC: woven class p1.Main (from /jobs/genie.ajdt/ajdt-on-eclipse-45/workspace/org.eclipse.ajdt.ui.tests/target/work/data/AnotherSimpleAJProject/src/p1/Main.java)
AJC: compiled: /jobs/genie.ajdt/ajdt-on-eclipse-45/workspace/org.eclipse.ajdt.ui.tests/target/work/data/AnotherSimpleAJProject/src/ClassInDefaultPackage.java
AJC: woven class ClassInDefaultPackage (from /jobs/genie.ajdt/ajdt-on-eclipse-45/workspace/org.eclipse.ajdt.ui.tests/target/work/data/AnotherSimpleAJProject/src/ClassInDefaultPackage.java)
AspectJ reports build successful, build was: FULL
AJDE Callback: finish. Was full build: true
Timer event: 48ms: Total time spent in AJDE
Timer event: 0ms: Refresh after build
Types affected during build = 4
>> scheduled a build
Timer event: 0ms: Delete markers: AnotherSimpleAJProject (Finished deleting markers for AnotherSimpleAJProject)
Timer event: 4ms: Create markers: AnotherSimpleAJProject (Finished creating markers for AnotherSimpleAJProject)
Created 3 markers in 4 files
>> finished a build
Crosscutting model sanity checked.  The following problems found:
Java Element does not exist: =AnotherSimpleAJProject/src<p2*AspectInDefaultPackage.aj'AspectInDefaultPackage&after
	It is the source relationship of =AnotherSimpleAJProject/src<p1{Main.java[Main~main~\[QString; --advised by--> =AnotherSimpleAJProject/src<p2*AspectInDefaultPackage.aj'AspectInDefaultPackage&after,   =AnotherSimpleAJProject/src<p2*Aspect.aj'Aspect&after
	This may not actually be a problem if compiling broken code or advising static initializers.
Java Element does not exist: =AnotherSimpleAJProject/src<p2*AspectInDefaultPackage.aj'AspectInDefaultPackage&after
	It is the source relationship of =AnotherSimpleAJProject/src<p2*AspectInDefaultPackage.aj'AspectInDefaultPackage&after --advises--> =AnotherSimpleAJProject/src<p1{Main.java[Main~main~\[QString;,   =AnotherSimpleAJProject/src<{ClassInDefaultPackage.java[ClassInDefaultPackage~main~\[QString;
	This may not actually be a problem if compiling broken code or advising static initializers.
Java Element does not exist: =AnotherSimpleAJProject/src<p2*AspectInDefaultPackage.aj'AspectInDefaultPackage&after
	It is the source relationship of =AnotherSimpleAJProject/src<{ClassInDefaultPackage.java[ClassInDefaultPackage~main~\[QString; --advised by--> =AnotherSimpleAJProject/src<p2*AspectInDefaultPackage.aj'AspectInDefaultPackage&after,   =AnotherSimpleAJProject/src<p2*Aspect.aj'Aspect&after
	This may not actually be a problem if compiling broken code or advising static initializers.

Timer event: 6ms: Model sanity check for: AnotherSimpleAJProject
Timer event: 60ms: Total time spent in AJBuilder.build()
Timer event: 1ms: Update visualizer, xref, advice listeners for (separate thread): AnotherSimpleAJProject
===========================================================================================
Build kind = AUTOBUILD
Project=DefaultEmptyProject, kind of build requested=Incremental AspectJ compilation
Timer event: 0ms: Flush included source file cache
Timer event: 0ms: Check delta
CoreCompilerConfiguration for project DefaultEmptyProject registered a configuration change: [ASPECTPATH_CHANGED, CLASSPATH_CHANGED, INPATH_CHANGED, OUTPUTDESTINATIONS_CHANGED]
Timer event: 1ms: Looking for and marking configuration changes in DefaultEmptyProject
	Configuration changes found: true
Timer event: 1ms: Look for source/resource changes
Setting list of classpath elements with modified contents:
      []
Classpath = /jobs/genie.ajdt/ajdt-on-eclipse-45/workspace/org.eclipse.ajdt.ui.tests/target/work/data/DefaultEmptyProject/bin:/jobs/genie.ajdt/ajdt-on-eclipse-45/workspace/org.aspectj.runtime/target/org.aspectj.runtime-1.8.9-SNAPSHOT.jar:/opt/public/common/jdk1.7.0_80/jre/lib/resources.jar:/opt/public/common/jdk1.7.0_80/jre/lib/rt.jar:/opt/public/common/jdk1.7.0_80/jre/lib/jsse.jar:/opt/public/common/jdk1.7.0_80/jre/lib/jce.jar:/opt/public/common/jdk1.7.0_80/jre/lib/charsets.jar:/opt/public/common/jdk1.7.0_80/jre/lib/jfr.jar:/opt/public/common/jdk1.7.0_80/jre/lib/ext/dnsns.jar:/opt/public/common/jdk1.7.0_80/jre/lib/ext/sunpkcs11.jar:/opt/public/common/jdk1.7.0_80/jre/lib/ext/zipfs.jar:/opt/public/common/jdk1.7.0_80/jre/lib/ext/sunec.jar:/opt/public/common/jdk1.7.0_80/jre/lib/ext/sunjce_provider.jar:/opt/public/common/jdk1.7.0_80/jre/lib/ext/localedata.jar:/jobs/genie.ajdt/ajdt-on-eclipse-45/workspace/org.eclipse.ajdt.ui.tests/target/work/configuration/org.eclipse.osgi/40/0/.cp/junit.jar:/jobs/genie.ajdt/ajdt-on-eclipse-45/workspace/org.eclipse.ajdt.ui.tests/target/work/configuration/org.eclipse.osgi/223/0/.cp:
Timer event: 9ms: Pre compile
Sending the following configuration changes to the compiler: [ASPECTPATH_CHANGED, CLASSPATH_CHANGED, INPATH_CHANGED, OUTPUTDESTINATIONS_CHANGED]
Compiler configuration for project DefaultEmptyProject has been read by compiler.  Resetting.
     Configuration was [ASPECTPATH_CHANGED, CLASSPATH_CHANGED, INPATH_CHANGED, OUTPUTDESTINATIONS_CHANGED]
Resetting list of modified source files.  Was []
ClassFileChangeChecking: failed to find a state instance managing output location : /jobs/genie.ajdt/ajdt-on-eclipse-45/workspace/org.eclipse.ajdt.ui.tests/target/work/configuration/org.eclipse.osgi/223/0/.cp (could be getting managed by JDT)
Timer event: 0ms: OutputLocationManager: binary folder to declaring project map creation: P/DefaultEmptyProject
Preparing for build: planning to be an incremental build
AspectJ reports build successful, build was: INCREMENTAL
AJDE Callback: finish. Was full build: false
Timer event: 6ms: Total time spent in AJDE
Timer event: 0ms: Refresh after build
Crosscutting model sanity checked with no problems
Timer event: 0ms: Model sanity check for: DefaultEmptyProject
Timer event: 15ms: Total time spent in AJBuilder.build()
>> finished a build
>> scheduled a build
Timer event: 0ms: Update visualizer, xref, advice listeners for (separate thread): DefaultEmptyProject
>> finished a build
>> scheduled a build
===========================================================================================
Build kind = AUTOBUILD
Project=AnotherSimpleAJProject, kind of build requested=Incremental AspectJ compilation
Timer event: 0ms: Flush included source file cache
Timer event: 1ms: Check delta
Timer event: 0ms: Looking for and marking configuration changes in AnotherSimpleAJProject
	Configuration changes found: false
build: Examined delta - no source file or classpath changes for project AnotherSimpleAJProject
Compiler configuration for project AnotherSimpleAJProject has been read by compiler.  Resetting.
     Configuration was []
Resetting list of modified source files.  Was []
Timer event: 0ms: Look for source/resource changes
No source/resource changes found, exiting build
Timer event: 1ms: Total time spent in AJBuilder.build()
>> finished a build
>> scheduled a build
>> finished a build
>> scheduled a build
===========================================================================================
Build kind = AUTOBUILD
Project=AnotherSimpleAJProject, kind of build requested=Incremental AspectJ compilation
Timer event: 0ms: Flush included source file cache
Timer event: 0ms: Check delta
Timer event: 0ms: Looking for and marking configuration changes in AnotherSimpleAJProject
	Configuration changes found: false
build: Examined delta - no source file or classpath changes for project AnotherSimpleAJProject
Compiler configuration for project AnotherSimpleAJProject has been read by compiler.  Resetting.
     Configuration was []
Resetting list of modified source files.  Was []
Timer event: 1ms: Look for source/resource changes
No source/resource changes found, exiting build
Timer event: 2ms: Total time spent in AJBuilder.build()
>> finished a build
>> scheduled a build
>> finished a build
>> scheduled a build
>> finished a build
>> scheduled a build
------------------------
Starting testIncrementalBuildWithoutSrcFolder
>> scheduled a build
>> finished a build
>> finished a build
>> scheduled a build
>> finished a build
>> scheduled a build
>> finished a build
>> scheduled a build
------------------------
Starting testCopyAndRemoveNewNonSrcFile
Compiler configuration for project AnotherSimpleAJProject doesn't know previous state, so assuming EVERYTHING has changed.
===========================================================================================
Build kind = FULLBUILD
Project=AnotherSimpleAJProject, kind of build requested=Full AspectJ compilation
Timer event: 0ms: Flush included source file cache
Timer event: 0ms: Check delta
Builder: Tidied output folder(s), removed class files and derived resources
Classpath = /jobs/genie.ajdt/ajdt-on-eclipse-45/workspace/org.eclipse.ajdt.ui.tests/target/work/data/AnotherSimpleAJProject/bin:/opt/public/common/jdk1.7.0_80/jre/lib/resources.jar:/opt/public/common/jdk1.7.0_80/jre/lib/rt.jar:/opt/public/common/jdk1.7.0_80/jre/lib/jsse.jar:/opt/public/common/jdk1.7.0_80/jre/lib/jce.jar:/opt/public/common/jdk1.7.0_80/jre/lib/charsets.jar:/opt/public/common/jdk1.7.0_80/jre/lib/jfr.jar:/opt/public/common/jdk1.7.0_80/jre/lib/ext/dnsns.jar:/opt/public/common/jdk1.7.0_80/jre/lib/ext/sunpkcs11.jar:/opt/public/common/jdk1.7.0_80/jre/lib/ext/zipfs.jar:/opt/public/common/jdk1.7.0_80/jre/lib/ext/sunec.jar:/opt/public/common/jdk1.7.0_80/jre/lib/ext/sunjce_provider.jar:/opt/public/common/jdk1.7.0_80/jre/lib/ext/localedata.jar:/jobs/genie.ajdt/ajdt-on-eclipse-45/workspace/org.aspectj.runtime/target/org.aspectj.runtime-1.8.9-SNAPSHOT.jar:
Timer event: 6ms: Pre compile
Compiler configuration for project AnotherSimpleAJProject has been read by compiler.  Resetting.
     Configuration was [PROJECTSOURCEFILES_CHANGED, JAVAOPTIONS_CHANGED, ASPECTPATH_CHANGED, CLASSPATH_CHANGED, INPATH_CHANGED, NONSTANDARDOPTIONS_CHANGED, OUTJAR_CHANGED, PROJECTSOURCERESOURCES_CHANGED, OUTPUTDESTINATIONS_CHANGED, INJARS_CHANGED]
Resetting list of modified source files.  Was null
Preparing for build: not going to be incremental because no successful previous full build
AJC: compiling source files
Timer event: 36ms: Time to first compiled message
AJC: compiled: /jobs/genie.ajdt/ajdt-on-eclipse-45/workspace/org.eclipse.ajdt.ui.tests/target/work/data/AnotherSimpleAJProject/src/p2/Aspect.aj
AJC: compiled: /jobs/genie.ajdt/ajdt-on-eclipse-45/workspace/org.eclipse.ajdt.ui.tests/target/work/data/AnotherSimpleAJProject/src/AspectInDefaultPackage.aj
Timer event: 40ms: Time to first woven message
AJC: woven aspect p2.Aspect (from /jobs/genie.ajdt/ajdt-on-eclipse-45/workspace/org.eclipse.ajdt.ui.tests/target/work/data/AnotherSimpleAJProject/src/p2/Aspect.aj)
AJC: woven aspect p2.AspectInDefaultPackage (from /jobs/genie.ajdt/ajdt-on-eclipse-45/workspace/org.eclipse.ajdt.ui.tests/target/work/data/AnotherSimpleAJProject/src/AspectInDefaultPackage.aj)
AJC: compiled: /jobs/genie.ajdt/ajdt-on-eclipse-45/workspace/org.eclipse.ajdt.ui.tests/target/work/data/AnotherSimpleAJProject/src/p1/Main.java
AJC: woven class p1.Main (from /jobs/genie.ajdt/ajdt-on-eclipse-45/workspace/org.eclipse.ajdt.ui.tests/target/work/data/AnotherSimpleAJProject/src/p1/Main.java)
AJC: compiled: /jobs/genie.ajdt/ajdt-on-eclipse-45/workspace/org.eclipse.ajdt.ui.tests/target/work/data/AnotherSimpleAJProject/src/ClassInDefaultPackage.java
AJC: woven class ClassInDefaultPackage (from /jobs/genie.ajdt/ajdt-on-eclipse-45/workspace/org.eclipse.ajdt.ui.tests/target/work/data/AnotherSimpleAJProject/src/ClassInDefaultPackage.java)
AspectJ reports build successful, build was: FULL
AJDE Callback: finish. Was full build: true
Timer event: 47ms: Total time spent in AJDE
Timer event: 0ms: Refresh after build
Types affected during build = 4
>> scheduled a build
Timer event: 0ms: Delete markers: AnotherSimpleAJProject (Finished deleting markers for AnotherSimpleAJProject)
Timer event: 2ms: Create markers: AnotherSimpleAJProject (Finished creating markers for AnotherSimpleAJProject)
Created 3 markers in 4 files
>> finished a build
Crosscutting model sanity checked.  The following problems found:
Java Element does not exist: =AnotherSimpleAJProject/src<p2*AspectInDefaultPackage.aj'AspectInDefaultPackage&after
	It is the source relationship of =AnotherSimpleAJProject/src<p1{Main.java[Main~main~\[QString; --advised by--> =AnotherSimpleAJProject/src<p2*AspectInDefaultPackage.aj'AspectInDefaultPackage&after,   =AnotherSimpleAJProject/src<p2*Aspect.aj'Aspect&after
	This may not actually be a problem if compiling broken code or advising static initializers.
Java Element does not exist: =AnotherSimpleAJProject/src<p2*AspectInDefaultPackage.aj'AspectInDefaultPackage&after
	It is the source relationship of =AnotherSimpleAJProject/src<p2*AspectInDefaultPackage.aj'AspectInDefaultPackage&after --advises--> =AnotherSimpleAJProject/src<p1{Main.java[Main~main~\[QString;,   =AnotherSimpleAJProject/src<{ClassInDefaultPackage.java[ClassInDefaultPackage~main~\[QString;
	This may not actually be a problem if compiling broken code or advising static initializers.
Java Element does not exist: =AnotherSimpleAJProject/src<p2*AspectInDefaultPackage.aj'AspectInDefaultPackage&after
	It is the source relationship of =AnotherSimpleAJProject/src<{ClassInDefaultPackage.java[ClassInDefaultPackage~main~\[QString; --advised by--> =AnotherSimpleAJProject/src<p2*AspectInDefaultPackage.aj'AspectInDefaultPackage&after,   =AnotherSimpleAJProject/src<p2*Aspect.aj'Aspect&after
	This may not actually be a problem if compiling broken code or advising static initializers.

Timer event: 5ms: Model sanity check for: AnotherSimpleAJProject
Timer event: 59ms: Total time spent in AJBuilder.build()
Timer event: 0ms: Update visualizer, xref, advice listeners for (separate thread): AnotherSimpleAJProject
===========================================================================================
Build kind = AUTOBUILD
Project=DefaultEmptyProject, kind of build requested=Incremental AspectJ compilation
Timer event: 0ms: Flush included source file cache
Timer event: 0ms: Check delta
CoreCompilerConfiguration for project DefaultEmptyProject registered a configuration change: [ASPECTPATH_CHANGED, CLASSPATH_CHANGED, INPATH_CHANGED, OUTPUTDESTINATIONS_CHANGED]
Timer event: 0ms: Looking for and marking configuration changes in DefaultEmptyProject
	Configuration changes found: true
Timer event: 0ms: Look for source/resource changes
Setting list of classpath elements with modified contents:
      []
Classpath = /jobs/genie.ajdt/ajdt-on-eclipse-45/workspace/org.eclipse.ajdt.ui.tests/target/work/data/DefaultEmptyProject/bin:/jobs/genie.ajdt/ajdt-on-eclipse-45/workspace/org.aspectj.runtime/target/org.aspectj.runtime-1.8.9-SNAPSHOT.jar:/opt/public/common/jdk1.7.0_80/jre/lib/resources.jar:/opt/public/common/jdk1.7.0_80/jre/lib/rt.jar:/opt/public/common/jdk1.7.0_80/jre/lib/jsse.jar:/opt/public/common/jdk1.7.0_80/jre/lib/jce.jar:/opt/public/common/jdk1.7.0_80/jre/lib/charsets.jar:/opt/public/common/jdk1.7.0_80/jre/lib/jfr.jar:/opt/public/common/jdk1.7.0_80/jre/lib/ext/dnsns.jar:/opt/public/common/jdk1.7.0_80/jre/lib/ext/sunpkcs11.jar:/opt/public/common/jdk1.7.0_80/jre/lib/ext/zipfs.jar:/opt/public/common/jdk1.7.0_80/jre/lib/ext/sunec.jar:/opt/public/common/jdk1.7.0_80/jre/lib/ext/sunjce_provider.jar:/opt/public/common/jdk1.7.0_80/jre/lib/ext/localedata.jar:/jobs/genie.ajdt/ajdt-on-eclipse-45/workspace/org.eclipse.ajdt.ui.tests/target/work/configuration/org.eclipse.osgi/40/0/.cp/junit.jar:/jobs/genie.ajdt/ajdt-on-eclipse-45/workspace/org.eclipse.ajdt.ui.tests/target/work/configuration/org.eclipse.osgi/223/0/.cp:
Timer event: 8ms: Pre compile
Sending the following configuration changes to the compiler: [ASPECTPATH_CHANGED, CLASSPATH_CHANGED, INPATH_CHANGED, OUTPUTDESTINATIONS_CHANGED]
Compiler configuration for project DefaultEmptyProject has been read by compiler.  Resetting.
     Configuration was [ASPECTPATH_CHANGED, CLASSPATH_CHANGED, INPATH_CHANGED, OUTPUTDESTINATIONS_CHANGED]
Resetting list of modified source files.  Was []
ClassFileChangeChecking: failed to find a state instance managing output location : /jobs/genie.ajdt/ajdt-on-eclipse-45/workspace/org.eclipse.ajdt.ui.tests/target/work/configuration/org.eclipse.osgi/223/0/.cp (could be getting managed by JDT)
Timer event: 0ms: OutputLocationManager: binary folder to declaring project map creation: P/DefaultEmptyProject
Preparing for build: planning to be an incremental build
AspectJ reports build successful, build was: INCREMENTAL
AJDE Callback: finish. Was full build: false
Timer event: 5ms: Total time spent in AJDE
Timer event: 0ms: Refresh after build
Crosscutting model sanity checked with no problems
Timer event: 0ms: Model sanity check for: DefaultEmptyProject
Timer event: 13ms: Total time spent in AJBuilder.build()
>> finished a build
>> scheduled a build
Timer event: 1ms: Update visualizer, xref, advice listeners for (separate thread): DefaultEmptyProject
>> finished a build
>> scheduled a build
===========================================================================================
Build kind = AUTOBUILD
Project=AnotherSimpleAJProject, kind of build requested=Incremental AspectJ compilation
Timer event: 0ms: Flush included source file cache
Copying added file p1/newFile.txt
CoreCompilerConfiguration for project AnotherSimpleAJProject registered a configuration change: [PROJECTSOURCERESOURCES_CHANGED]
Timer event: 1ms: Check delta
Timer event: 0ms: Looking for and marking configuration changes in AnotherSimpleAJProject
	Configuration changes found: false
build: Examined delta - no source file or classpath changes for project AnotherSimpleAJProject
Compiler configuration for project AnotherSimpleAJProject has been read by compiler.  Resetting.
     Configuration was [PROJECTSOURCERESOURCES_CHANGED]
Resetting list of modified source files.  Was []
Timer event: 1ms: Look for source/resource changes
No source/resource changes found, exiting build
Timer event: 2ms: Total time spent in AJBuilder.build()
>> finished a build
>> scheduled a build
>> finished a build
>> scheduled a build
>> finished a build
>> scheduled a build
===========================================================================================
Build kind = AUTOBUILD
Project=AnotherSimpleAJProject, kind of build requested=Incremental AspectJ compilation
Timer event: 0ms: Flush included source file cache
Deleting removed file p1/newFile.txt
CoreCompilerConfiguration for project AnotherSimpleAJProject registered a configuration change: [PROJECTSOURCERESOURCES_CHANGED]
Timer event: 1ms: Check delta
Timer event: 0ms: Looking for and marking configuration changes in AnotherSimpleAJProject
	Configuration changes found: false
build: Examined delta - no source file or classpath changes for project AnotherSimpleAJProject
Compiler configuration for project AnotherSimpleAJProject has been read by compiler.  Resetting.
     Configuration was [PROJECTSOURCERESOURCES_CHANGED]
Resetting list of modified source files.  Was []
Timer event: 0ms: Look for source/resource changes
No source/resource changes found, exiting build
Timer event: 1ms: Total time spent in AJBuilder.build()
>> finished a build
>> scheduled a build
>> finished a build
>> scheduled a build
>> finished a build
>> scheduled a build
>> finished a build
>> scheduled a build
------------------------
Starting testUpdateNonSrcFile
Compiler configuration for project AnotherSimpleAJProject doesn't know previous state, so assuming EVERYTHING has changed.
===========================================================================================
Build kind = FULLBUILD
Project=AnotherSimpleAJProject, kind of build requested=Full AspectJ compilation
Timer event: 0ms: Flush included source file cache
Timer event: 0ms: Check delta
Builder: Tidied output folder(s), removed class files and derived resources
Classpath = /jobs/genie.ajdt/ajdt-on-eclipse-45/workspace/org.eclipse.ajdt.ui.tests/target/work/data/AnotherSimpleAJProject/bin:/opt/public/common/jdk1.7.0_80/jre/lib/resources.jar:/opt/public/common/jdk1.7.0_80/jre/lib/rt.jar:/opt/public/common/jdk1.7.0_80/jre/lib/jsse.jar:/opt/public/common/jdk1.7.0_80/jre/lib/jce.jar:/opt/public/common/jdk1.7.0_80/jre/lib/charsets.jar:/opt/public/common/jdk1.7.0_80/jre/lib/jfr.jar:/opt/public/common/jdk1.7.0_80/jre/lib/ext/dnsns.jar:/opt/public/common/jdk1.7.0_80/jre/lib/ext/sunpkcs11.jar:/opt/public/common/jdk1.7.0_80/jre/lib/ext/zipfs.jar:/opt/public/common/jdk1.7.0_80/jre/lib/ext/sunec.jar:/opt/public/common/jdk1.7.0_80/jre/lib/ext/sunjce_provider.jar:/opt/public/common/jdk1.7.0_80/jre/lib/ext/localedata.jar:/jobs/genie.ajdt/ajdt-on-eclipse-45/workspace/org.aspectj.runtime/target/org.aspectj.runtime-1.8.9-SNAPSHOT.jar:
Timer event: 9ms: Pre compile
Compiler configuration for project AnotherSimpleAJProject has been read by compiler.  Resetting.
     Configuration was [PROJECTSOURCEFILES_CHANGED, JAVAOPTIONS_CHANGED, ASPECTPATH_CHANGED, CLASSPATH_CHANGED, INPATH_CHANGED, NONSTANDARDOPTIONS_CHANGED, OUTJAR_CHANGED, PROJECTSOURCERESOURCES_CHANGED, OUTPUTDESTINATIONS_CHANGED, INJARS_CHANGED]
Resetting list of modified source files.  Was null
Preparing for build: not going to be incremental because no successful previous full build
AJC: compiling source files
Timer event: 41ms: Time to first compiled message
AJC: compiled: /jobs/genie.ajdt/ajdt-on-eclipse-45/workspace/org.eclipse.ajdt.ui.tests/target/work/data/AnotherSimpleAJProject/src/p2/Aspect.aj
AJC: compiled: /jobs/genie.ajdt/ajdt-on-eclipse-45/workspace/org.eclipse.ajdt.ui.tests/target/work/data/AnotherSimpleAJProject/src/AspectInDefaultPackage.aj
Timer event: 45ms: Time to first woven message
AJC: woven aspect p2.Aspect (from /jobs/genie.ajdt/ajdt-on-eclipse-45/workspace/org.eclipse.ajdt.ui.tests/target/work/data/AnotherSimpleAJProject/src/p2/Aspect.aj)
AJC: woven aspect p2.AspectInDefaultPackage (from /jobs/genie.ajdt/ajdt-on-eclipse-45/workspace/org.eclipse.ajdt.ui.tests/target/work/data/AnotherSimpleAJProject/src/AspectInDefaultPackage.aj)
AJC: compiled: /jobs/genie.ajdt/ajdt-on-eclipse-45/workspace/org.eclipse.ajdt.ui.tests/target/work/data/AnotherSimpleAJProject/src/p1/Main.java
AJC: woven class p1.Main (from /jobs/genie.ajdt/ajdt-on-eclipse-45/workspace/org.eclipse.ajdt.ui.tests/target/work/data/AnotherSimpleAJProject/src/p1/Main.java)
AJC: compiled: /jobs/genie.ajdt/ajdt-on-eclipse-45/workspace/org.eclipse.ajdt.ui.tests/target/work/data/AnotherSimpleAJProject/src/ClassInDefaultPackage.java
AJC: woven class ClassInDefaultPackage (from /jobs/genie.ajdt/ajdt-on-eclipse-45/workspace/org.eclipse.ajdt.ui.tests/target/work/data/AnotherSimpleAJProject/src/ClassInDefaultPackage.java)
AspectJ reports build successful, build was: FULL
AJDE Callback: finish. Was full build: true
Timer event: 52ms: Total time spent in AJDE
Timer event: 0ms: Refresh after build
Types affected during build = 4
>> scheduled a build
Timer event: 1ms: Delete markers: AnotherSimpleAJProject (Finished deleting markers for AnotherSimpleAJProject)
Timer event: 2ms: Create markers: AnotherSimpleAJProject (Finished creating markers for AnotherSimpleAJProject)
Created 3 markers in 4 files
>> finished a build
Crosscutting model sanity checked.  The following problems found:
Java Element does not exist: =AnotherSimpleAJProject/src<p2*AspectInDefaultPackage.aj'AspectInDefaultPackage&after
	It is the source relationship of =AnotherSimpleAJProject/src<p1{Main.java[Main~main~\[QString; --advised by--> =AnotherSimpleAJProject/src<p2*AspectInDefaultPackage.aj'AspectInDefaultPackage&after,   =AnotherSimpleAJProject/src<p2*Aspect.aj'Aspect&after
	This may not actually be a problem if compiling broken code or advising static initializers.
Java Element does not exist: =AnotherSimpleAJProject/src<p2*AspectInDefaultPackage.aj'AspectInDefaultPackage&after
	It is the source relationship of =AnotherSimpleAJProject/src<p2*AspectInDefaultPackage.aj'AspectInDefaultPackage&after --advises--> =AnotherSimpleAJProject/src<p1{Main.java[Main~main~\[QString;,   =AnotherSimpleAJProject/src<{ClassInDefaultPackage.java[ClassInDefaultPackage~main~\[QString;
	This may not actually be a problem if compiling broken code or advising static initializers.
Java Element does not exist: =AnotherSimpleAJProject/src<p2*AspectInDefaultPackage.aj'AspectInDefaultPackage&after
	It is the source relationship of =AnotherSimpleAJProject/src<{ClassInDefaultPackage.java[ClassInDefaultPackage~main~\[QString; --advised by--> =AnotherSimpleAJProject/src<p2*AspectInDefaultPackage.aj'AspectInDefaultPackage&after,   =AnotherSimpleAJProject/src<p2*Aspect.aj'Aspect&after
	This may not actually be a problem if compiling broken code or advising static initializers.

Timer event: 6ms: Model sanity check for: AnotherSimpleAJProject
Timer event: 68ms: Total time spent in AJBuilder.build()
Timer event: 0ms: Update visualizer, xref, advice listeners for (separate thread): AnotherSimpleAJProject
===========================================================================================
Build kind = AUTOBUILD
Project=DefaultEmptyProject, kind of build requested=Incremental AspectJ compilation
Timer event: 0ms: Flush included source file cache
Timer event: 0ms: Check delta
CoreCompilerConfiguration for project DefaultEmptyProject registered a configuration change: [ASPECTPATH_CHANGED, CLASSPATH_CHANGED, INPATH_CHANGED, OUTPUTDESTINATIONS_CHANGED]
Timer event: 0ms: Looking for and marking configuration changes in DefaultEmptyProject
	Configuration changes found: true
Timer event: 0ms: Look for source/resource changes
Setting list of classpath elements with modified contents:
      []
Classpath = /jobs/genie.ajdt/ajdt-on-eclipse-45/workspace/org.eclipse.ajdt.ui.tests/target/work/data/DefaultEmptyProject/bin:/jobs/genie.ajdt/ajdt-on-eclipse-45/workspace/org.aspectj.runtime/target/org.aspectj.runtime-1.8.9-SNAPSHOT.jar:/opt/public/common/jdk1.7.0_80/jre/lib/resources.jar:/opt/public/common/jdk1.7.0_80/jre/lib/rt.jar:/opt/public/common/jdk1.7.0_80/jre/lib/jsse.jar:/opt/public/common/jdk1.7.0_80/jre/lib/jce.jar:/opt/public/common/jdk1.7.0_80/jre/lib/charsets.jar:/opt/public/common/jdk1.7.0_80/jre/lib/jfr.jar:/opt/public/common/jdk1.7.0_80/jre/lib/ext/dnsns.jar:/opt/public/common/jdk1.7.0_80/jre/lib/ext/sunpkcs11.jar:/opt/public/common/jdk1.7.0_80/jre/lib/ext/zipfs.jar:/opt/public/common/jdk1.7.0_80/jre/lib/ext/sunec.jar:/opt/public/common/jdk1.7.0_80/jre/lib/ext/sunjce_provider.jar:/opt/public/common/jdk1.7.0_80/jre/lib/ext/localedata.jar:/jobs/genie.ajdt/ajdt-on-eclipse-45/workspace/org.eclipse.ajdt.ui.tests/target/work/configuration/org.eclipse.osgi/40/0/.cp/junit.jar:/jobs/genie.ajdt/ajdt-on-eclipse-45/workspace/org.eclipse.ajdt.ui.tests/target/work/configuration/org.eclipse.osgi/223/0/.cp:
Timer event: 9ms: Pre compile
Sending the following configuration changes to the compiler: [ASPECTPATH_CHANGED, CLASSPATH_CHANGED, INPATH_CHANGED, OUTPUTDESTINATIONS_CHANGED]
Compiler configuration for project DefaultEmptyProject has been read by compiler.  Resetting.
     Configuration was [ASPECTPATH_CHANGED, CLASSPATH_CHANGED, INPATH_CHANGED, OUTPUTDESTINATIONS_CHANGED]
Resetting list of modified source files.  Was []
ClassFileChangeChecking: failed to find a state instance managing output location : /jobs/genie.ajdt/ajdt-on-eclipse-45/workspace/org.eclipse.ajdt.ui.tests/target/work/configuration/org.eclipse.osgi/223/0/.cp (could be getting managed by JDT)
Timer event: 0ms: OutputLocationManager: binary folder to declaring project map creation: P/DefaultEmptyProject
Preparing for build: planning to be an incremental build
AspectJ reports build successful, build was: INCREMENTAL
AJDE Callback: finish. Was full build: false
Timer event: 6ms: Total time spent in AJDE
Timer event: 0ms: Refresh after build
Crosscutting model sanity checked with no problems
Timer event: 0ms: Model sanity check for: DefaultEmptyProject
Timer event: 15ms: Total time spent in AJBuilder.build()
>> finished a build
>> scheduled a build
Timer event: 1ms: Update visualizer, xref, advice listeners for (separate thread): DefaultEmptyProject
>> finished a build
>> scheduled a build
===========================================================================================
Build kind = AUTOBUILD
Project=AnotherSimpleAJProject, kind of build requested=Incremental AspectJ compilation
Timer event: 0ms: Flush included source file cache
Copying added file p1/newFile4.txt
CoreCompilerConfiguration for project AnotherSimpleAJProject registered a configuration change: [PROJECTSOURCERESOURCES_CHANGED]
Timer event: 1ms: Check delta
Timer event: 0ms: Looking for and marking configuration changes in AnotherSimpleAJProject
	Configuration changes found: false
build: Examined delta - no source file or classpath changes for project AnotherSimpleAJProject
Compiler configuration for project AnotherSimpleAJProject has been read by compiler.  Resetting.
     Configuration was [PROJECTSOURCERESOURCES_CHANGED]
Resetting list of modified source files.  Was []
Timer event: 0ms: Look for source/resource changes
No source/resource changes found, exiting build
Timer event: 2ms: Total time spent in AJBuilder.build()
>> finished a build
>> scheduled a build
===========================================================================================
Build kind = AUTOBUILD
Project=AnotherSimpleAJProject, kind of build requested=Incremental AspectJ compilation
Timer event: 0ms: Flush included source file cache
Deleting existing file p1/newFile4.txt
Copying changed file p1/newFile4.txt
Timer event: 2ms: Check delta
Timer event: 0ms: Looking for and marking configuration changes in AnotherSimpleAJProject
	Configuration changes found: false
build: Examined delta - no source file or classpath changes for project AnotherSimpleAJProject
Compiler configuration for project AnotherSimpleAJProject has been read by compiler.  Resetting.
     Configuration was []
Resetting list of modified source files.  Was []
Timer event: 0ms: Look for source/resource changes
No source/resource changes found, exiting build
Timer event: 3ms: Total time spent in AJBuilder.build()
>> finished a build
>> scheduled a build
===========================================================================================
Build kind = AUTOBUILD
Project=AnotherSimpleAJProject, kind of build requested=Incremental AspectJ compilation
Timer event: 0ms: Flush included source file cache
Deleting removed file p1/newFile4.txt
CoreCompilerConfiguration for project AnotherSimpleAJProject registered a configuration change: [PROJECTSOURCERESOURCES_CHANGED]
Timer event: 0ms: Check delta
Timer event: 1ms: Looking for and marking configuration changes in AnotherSimpleAJProject
	Configuration changes found: false
build: Examined delta - no source file or classpath changes for project AnotherSimpleAJProject
Compiler configuration for project AnotherSimpleAJProject has been read by compiler.  Resetting.
     Configuration was [PROJECTSOURCERESOURCES_CHANGED]
Resetting list of modified source files.  Was []
Timer event: 1ms: Look for source/resource changes
No source/resource changes found, exiting build
Timer event: 2ms: Total time spent in AJBuilder.build()
>> finished a build
>> scheduled a build
>> finished a build
>> scheduled a build
------------------------
Starting testCreateAndRemoveNewNonSrcFileFromDefaultPackage
Compiler configuration for project AnotherSimpleAJProject doesn't know previous state, so assuming EVERYTHING has changed.
===========================================================================================
Build kind = FULLBUILD
Project=AnotherSimpleAJProject, kind of build requested=Full AspectJ compilation
Timer event: 0ms: Flush included source file cache
Timer event: 0ms: Check delta
Builder: Tidied output folder(s), removed class files and derived resources
Classpath = /jobs/genie.ajdt/ajdt-on-eclipse-45/workspace/org.eclipse.ajdt.ui.tests/target/work/data/AnotherSimpleAJProject/bin:/opt/public/common/jdk1.7.0_80/jre/lib/resources.jar:/opt/public/common/jdk1.7.0_80/jre/lib/rt.jar:/opt/public/common/jdk1.7.0_80/jre/lib/jsse.jar:/opt/public/common/jdk1.7.0_80/jre/lib/jce.jar:/opt/public/common/jdk1.7.0_80/jre/lib/charsets.jar:/opt/public/common/jdk1.7.0_80/jre/lib/jfr.jar:/opt/public/common/jdk1.7.0_80/jre/lib/ext/dnsns.jar:/opt/public/common/jdk1.7.0_80/jre/lib/ext/sunpkcs11.jar:/opt/public/common/jdk1.7.0_80/jre/lib/ext/zipfs.jar:/opt/public/common/jdk1.7.0_80/jre/lib/ext/sunec.jar:/opt/public/common/jdk1.7.0_80/jre/lib/ext/sunjce_provider.jar:/opt/public/common/jdk1.7.0_80/jre/lib/ext/localedata.jar:/jobs/genie.ajdt/ajdt-on-eclipse-45/workspace/org.aspectj.runtime/target/org.aspectj.runtime-1.8.9-SNAPSHOT.jar:
Timer event: 7ms: Pre compile
Compiler configuration for project AnotherSimpleAJProject has been read by compiler.  Resetting.
     Configuration was [PROJECTSOURCEFILES_CHANGED, JAVAOPTIONS_CHANGED, ASPECTPATH_CHANGED, CLASSPATH_CHANGED, INPATH_CHANGED, NONSTANDARDOPTIONS_CHANGED, OUTJAR_CHANGED, PROJECTSOURCERESOURCES_CHANGED, OUTPUTDESTINATIONS_CHANGED, INJARS_CHANGED]
Resetting list of modified source files.  Was null
Preparing for build: not going to be incremental because no successful previous full build
AJC: compiling source files
Timer event: 39ms: Time to first compiled message
AJC: compiled: /jobs/genie.ajdt/ajdt-on-eclipse-45/workspace/org.eclipse.ajdt.ui.tests/target/work/data/AnotherSimpleAJProject/src/p2/Aspect.aj
AJC: compiled: /jobs/genie.ajdt/ajdt-on-eclipse-45/workspace/org.eclipse.ajdt.ui.tests/target/work/data/AnotherSimpleAJProject/src/AspectInDefaultPackage.aj
Timer event: 44ms: Time to first woven message
AJC: woven aspect p2.Aspect (from /jobs/genie.ajdt/ajdt-on-eclipse-45/workspace/org.eclipse.ajdt.ui.tests/target/work/data/AnotherSimpleAJProject/src/p2/Aspect.aj)
AJC: woven aspect p2.AspectInDefaultPackage (from /jobs/genie.ajdt/ajdt-on-eclipse-45/workspace/org.eclipse.ajdt.ui.tests/target/work/data/AnotherSimpleAJProject/src/AspectInDefaultPackage.aj)
AJC: compiled: /jobs/genie.ajdt/ajdt-on-eclipse-45/workspace/org.eclipse.ajdt.ui.tests/target/work/data/AnotherSimpleAJProject/src/p1/Main.java
AJC: woven class p1.Main (from /jobs/genie.ajdt/ajdt-on-eclipse-45/workspace/org.eclipse.ajdt.ui.tests/target/work/data/AnotherSimpleAJProject/src/p1/Main.java)
AJC: compiled: /jobs/genie.ajdt/ajdt-on-eclipse-45/workspace/org.eclipse.ajdt.ui.tests/target/work/data/AnotherSimpleAJProject/src/ClassInDefaultPackage.java
AJC: woven class ClassInDefaultPackage (from /jobs/genie.ajdt/ajdt-on-eclipse-45/workspace/org.eclipse.ajdt.ui.tests/target/work/data/AnotherSimpleAJProject/src/ClassInDefaultPackage.java)
AspectJ reports build successful, build was: FULL
AJDE Callback: finish. Was full build: true
Timer event: 51ms: Total time spent in AJDE
Timer event: 0ms: Refresh after build
Types affected during build = 4
>> scheduled a build
Timer event: 0ms: Delete markers: AnotherSimpleAJProject (Finished deleting markers for AnotherSimpleAJProject)
Timer event: 2ms: Create markers: AnotherSimpleAJProject (Finished creating markers for AnotherSimpleAJProject)
Created 3 markers in 4 files
>> finished a build
Crosscutting model sanity checked.  The following problems found:
Java Element does not exist: =AnotherSimpleAJProject/src<p2*AspectInDefaultPackage.aj'AspectInDefaultPackage&after
	It is the source relationship of =AnotherSimpleAJProject/src<p1{Main.java[Main~main~\[QString; --advised by--> =AnotherSimpleAJProject/src<p2*AspectInDefaultPackage.aj'AspectInDefaultPackage&after,   =AnotherSimpleAJProject/src<p2*Aspect.aj'Aspect&after
	This may not actually be a problem if compiling broken code or advising static initializers.
Java Element does not exist: =AnotherSimpleAJProject/src<p2*AspectInDefaultPackage.aj'AspectInDefaultPackage&after
	It is the source relationship of =AnotherSimpleAJProject/src<p2*AspectInDefaultPackage.aj'AspectInDefaultPackage&after --advises--> =AnotherSimpleAJProject/src<p1{Main.java[Main~main~\[QString;,   =AnotherSimpleAJProject/src<{ClassInDefaultPackage.java[ClassInDefaultPackage~main~\[QString;
	This may not actually be a problem if compiling broken code or advising static initializers.
Java Element does not exist: =AnotherSimpleAJProject/src<p2*AspectInDefaultPackage.aj'AspectInDefaultPackage&after
	It is the source relationship of =AnotherSimpleAJProject/src<{ClassInDefaultPackage.java[ClassInDefaultPackage~main~\[QString; --advised by--> =AnotherSimpleAJProject/src<p2*AspectInDefaultPackage.aj'AspectInDefaultPackage&after,   =AnotherSimpleAJProject/src<p2*Aspect.aj'Aspect&after
	This may not actually be a problem if compiling broken code or advising static initializers.

Timer event: 7ms: Model sanity check for: AnotherSimpleAJProject
Timer event: 65ms: Total time spent in AJBuilder.build()
Timer event: 1ms: Update visualizer, xref, advice listeners for (separate thread): AnotherSimpleAJProject
===========================================================================================
Build kind = AUTOBUILD
Project=DefaultEmptyProject, kind of build requested=Incremental AspectJ compilation
Timer event: 0ms: Flush included source file cache
Timer event: 0ms: Check delta
CoreCompilerConfiguration for project DefaultEmptyProject registered a configuration change: [ASPECTPATH_CHANGED, CLASSPATH_CHANGED, INPATH_CHANGED, OUTPUTDESTINATIONS_CHANGED]
Timer event: 0ms: Looking for and marking configuration changes in DefaultEmptyProject
	Configuration changes found: true
Timer event: 0ms: Look for source/resource changes
Setting list of classpath elements with modified contents:
      []
Classpath = /jobs/genie.ajdt/ajdt-on-eclipse-45/workspace/org.eclipse.ajdt.ui.tests/target/work/data/DefaultEmptyProject/bin:/jobs/genie.ajdt/ajdt-on-eclipse-45/workspace/org.aspectj.runtime/target/org.aspectj.runtime-1.8.9-SNAPSHOT.jar:/opt/public/common/jdk1.7.0_80/jre/lib/resources.jar:/opt/public/common/jdk1.7.0_80/jre/lib/rt.jar:/opt/public/common/jdk1.7.0_80/jre/lib/jsse.jar:/opt/public/common/jdk1.7.0_80/jre/lib/jce.jar:/opt/public/common/jdk1.7.0_80/jre/lib/charsets.jar:/opt/public/common/jdk1.7.0_80/jre/lib/jfr.jar:/opt/public/common/jdk1.7.0_80/jre/lib/ext/dnsns.jar:/opt/public/common/jdk1.7.0_80/jre/lib/ext/sunpkcs11.jar:/opt/public/common/jdk1.7.0_80/jre/lib/ext/zipfs.jar:/opt/public/common/jdk1.7.0_80/jre/lib/ext/sunec.jar:/opt/public/common/jdk1.7.0_80/jre/lib/ext/sunjce_provider.jar:/opt/public/common/jdk1.7.0_80/jre/lib/ext/localedata.jar:/jobs/genie.ajdt/ajdt-on-eclipse-45/workspace/org.eclipse.ajdt.ui.tests/target/work/configuration/org.eclipse.osgi/40/0/.cp/junit.jar:/jobs/genie.ajdt/ajdt-on-eclipse-45/workspace/org.eclipse.ajdt.ui.tests/target/work/configuration/org.eclipse.osgi/223/0/.cp:
Timer event: 9ms: Pre compile
Sending the following configuration changes to the compiler: [ASPECTPATH_CHANGED, CLASSPATH_CHANGED, INPATH_CHANGED, OUTPUTDESTINATIONS_CHANGED]
Compiler configuration for project DefaultEmptyProject has been read by compiler.  Resetting.
     Configuration was [ASPECTPATH_CHANGED, CLASSPATH_CHANGED, INPATH_CHANGED, OUTPUTDESTINATIONS_CHANGED]
Resetting list of modified source files.  Was []
ClassFileChangeChecking: failed to find a state instance managing output location : /jobs/genie.ajdt/ajdt-on-eclipse-45/workspace/org.eclipse.ajdt.ui.tests/target/work/configuration/org.eclipse.osgi/223/0/.cp (could be getting managed by JDT)
Timer event: 0ms: OutputLocationManager: binary folder to declaring project map creation: P/DefaultEmptyProject
Preparing for build: planning to be an incremental build
AspectJ reports build successful, build was: INCREMENTAL
AJDE Callback: finish. Was full build: false
Timer event: 8ms: Total time spent in AJDE
Timer event: 0ms: Refresh after build
Crosscutting model sanity checked with no problems
Timer event: 0ms: Model sanity check for: DefaultEmptyProject
Timer event: 17ms: Total time spent in AJBuilder.build()
>> finished a build
>> scheduled a build
Timer event: 1ms: Update visualizer, xref, advice listeners for (separate thread): DefaultEmptyProject
>> finished a build
>> scheduled a build
===========================================================================================
Build kind = AUTOBUILD
Project=AnotherSimpleAJProject, kind of build requested=Incremental AspectJ compilation
Timer event: 0ms: Flush included source file cache
Copying added file newFile2.txt
CoreCompilerConfiguration for project AnotherSimpleAJProject registered a configuration change: [PROJECTSOURCERESOURCES_CHANGED]
Timer event: 1ms: Check delta
Timer event: 1ms: Looking for and marking configuration changes in AnotherSimpleAJProject
	Configuration changes found: false
build: Examined delta - no source file or classpath changes for project AnotherSimpleAJProject
Compiler configuration for project AnotherSimpleAJProject has been read by compiler.  Resetting.
     Configuration was [PROJECTSOURCERESOURCES_CHANGED]
Resetting list of modified source files.  Was []
Timer event: 1ms: Look for source/resource changes
No source/resource changes found, exiting build
Timer event: 2ms: Total time spent in AJBuilder.build()
>> finished a build
>> scheduled a build
>> finished a build
>> scheduled a build
===========================================================================================
Build kind = AUTOBUILD
Project=AnotherSimpleAJProject, kind of build requested=Incremental AspectJ compilation
Timer event: 0ms: Flush included source file cache
Deleting removed file newFile2.txt
CoreCompilerConfiguration for project AnotherSimpleAJProject registered a configuration change: [PROJECTSOURCERESOURCES_CHANGED]
Timer event: 0ms: Check delta
Timer event: 0ms: Looking for and marking configuration changes in AnotherSimpleAJProject
	Configuration changes found: false
build: Examined delta - no source file or classpath changes for project AnotherSimpleAJProject
Compiler configuration for project AnotherSimpleAJProject has been read by compiler.  Resetting.
     Configuration was [PROJECTSOURCERESOURCES_CHANGED]
Resetting list of modified source files.  Was []
Timer event: 0ms: Look for source/resource changes
No source/resource changes found, exiting build
Timer event: 1ms: Total time spent in AJBuilder.build()
>> finished a build
>> scheduled a build
>> finished a build
>> scheduled a build
------------------------
Starting testAspectPath
>> finished a build
>> scheduled a build
>> finished a build
>> scheduled a build
>> finished a build
>> scheduled a build
>> finished a build
>> scheduled a build
>> finished a build
>> scheduled a build
>> finished a build
>> scheduled a build
>> finished a build
>> scheduled a build
>> finished a build
>> scheduled a build
>> finished a build
>> scheduled a build
>> finished a build
>> scheduled a build
>> finished a build
>> scheduled a build
>> finished a build
>> scheduled a build
Compiler configuration for project PathTesting-ContainerOnAspectPath doesn't know previous state, so assuming EVERYTHING has changed.
===========================================================================================
Build kind = FULLBUILD
Project=PathTesting-ContainerOnAspectPath, kind of build requested=Full AspectJ compilation
Timer event: 0ms: Flush included source file cache
Timer event: 0ms: Check delta
Builder: Tidied output folder(s), removed class files and derived resources
Classpath = /jobs/genie.ajdt/ajdt-on-eclipse-45/workspace/org.eclipse.ajdt.ui.tests/target/work/data/PathTesting-ContainerOnAspectPath/bin:/opt/public/common/jdk1.7.0_80/jre/lib/resources.jar:/opt/public/common/jdk1.7.0_80/jre/lib/rt.jar:/opt/public/common/jdk1.7.0_80/jre/lib/jsse.jar:/opt/public/common/jdk1.7.0_80/jre/lib/jce.jar:/opt/public/common/jdk1.7.0_80/jre/lib/charsets.jar:/opt/public/common/jdk1.7.0_80/jre/lib/jfr.jar:/opt/public/common/jdk1.7.0_80/jre/lib/ext/dnsns.jar:/opt/public/common/jdk1.7.0_80/jre/lib/ext/sunpkcs11.jar:/opt/public/common/jdk1.7.0_80/jre/lib/ext/zipfs.jar:/opt/public/common/jdk1.7.0_80/jre/lib/ext/sunec.jar:/opt/public/common/jdk1.7.0_80/jre/lib/ext/sunjce_provider.jar:/opt/public/common/jdk1.7.0_80/jre/lib/ext/localedata.jar:/jobs/genie.ajdt/ajdt-on-eclipse-45/workspace/org.aspectj.runtime/target/org.aspectj.runtime-1.8.9-SNAPSHOT.jar:/jobs/genie.ajdt/ajdt-on-eclipse-45/workspace/org.eclipse.ajdt.ui.tests/target/work/configuration/org.eclipse.osgi/40/0/.cp/junit.jar:
Timer event: 2ms: Pre compile
Compiler configuration for project PathTesting-ContainerOnAspectPath has been read by compiler.  Resetting.
     Configuration was [PROJECTSOURCEFILES_CHANGED, JAVAOPTIONS_CHANGED, ASPECTPATH_CHANGED, CLASSPATH_CHANGED, INPATH_CHANGED, NONSTANDARDOPTIONS_CHANGED, OUTJAR_CHANGED, PROJECTSOURCERESOURCES_CHANGED, OUTPUTDESTINATIONS_CHANGED, INJARS_CHANGED]
Resetting list of modified source files.  Was null
Preparing for build: not going to be incremental because no successful previous full build
AJC: compiling source files
Timer event: 37ms: Time to first compiled message
AJC: compiled: /jobs/genie.ajdt/ajdt-on-eclipse-45/workspace/org.eclipse.ajdt.ui.tests/target/work/data/PathTesting-ContainerOnAspectPath/src/aspectPath/ContainerAspect.aj
Timer event: 39ms: Time to first woven message
AJC: woven aspect aspectPath.ContainerAspect (from /jobs/genie.ajdt/ajdt-on-eclipse-45/workspace/org.eclipse.ajdt.ui.tests/target/work/data/PathTesting-ContainerOnAspectPath/src/aspectPath/ContainerAspect.aj)
no match for this type name: main.Main [Xlint:invalidAbsoluteTypeName]
AJC: compiled: /jobs/genie.ajdt/ajdt-on-eclipse-45/workspace/org.eclipse.ajdt.ui.tests/target/work/data/PathTesting-ContainerOnAspectPath/src/aspectPath/ContainerInpath.java
AJC: woven class aspectPath.ContainerInpath (from /jobs/genie.ajdt/ajdt-on-eclipse-45/workspace/org.eclipse.ajdt.ui.tests/target/work/data/PathTesting-ContainerOnAspectPath/src/aspectPath/ContainerInpath.java)
advice defined in aspectPath.ContainerAspect has not been applied [Xlint:adviceDidNotMatch]
AspectJ reports build successful, build was: FULL
AJDE Callback: finish. Was full build: true
Timer event: 42ms: Total time spent in AJDE
Timer event: 0ms: Refresh after build
Types affected during build = 2
>> scheduled a build
Crosscutting model sanity checked with no problems
Timer event: 0ms: Model sanity check for: PathTesting-ContainerOnAspectPath
Timer event: 46ms: Total time spent in AJBuilder.build()
Timer event: 3ms: Delete markers: PathTesting-ContainerOnAspectPath (Finished deleting markers for PathTesting-ContainerOnAspectPath)
Compiler configuration for project PathTesting-VariableOnAspectPath doesn't know previous state, so assuming EVERYTHING has changed.
===========================================================================================
Build kind = FULLBUILD
Timer event: 1ms: Create markers: PathTesting-ContainerOnAspectPath (Finished creating markers for PathTesting-ContainerOnAspectPath)
Created 0 markers in 2 files
>> finished a build
Project=PathTesting-VariableOnAspectPath, kind of build requested=Full AspectJ compilation
Timer event: 0ms: Flush included source file cache
Timer event: 0ms: Check delta
Builder: Tidied output folder(s), removed class files and derived resources
Classpath = /jobs/genie.ajdt/ajdt-on-eclipse-45/workspace/org.eclipse.ajdt.ui.tests/target/work/data/PathTesting-VariableOnAspectPath/bin:/opt/public/common/jdk1.7.0_80/jre/lib/resources.jar:/opt/public/common/jdk1.7.0_80/jre/lib/rt.jar:/opt/public/common/jdk1.7.0_80/jre/lib/jsse.jar:/opt/public/common/jdk1.7.0_80/jre/lib/jce.jar:/opt/public/common/jdk1.7.0_80/jre/lib/charsets.jar:/opt/public/common/jdk1.7.0_80/jre/lib/jfr.jar:/opt/public/common/jdk1.7.0_80/jre/lib/ext/dnsns.jar:/opt/public/common/jdk1.7.0_80/jre/lib/ext/sunpkcs11.jar:/opt/public/common/jdk1.7.0_80/jre/lib/ext/zipfs.jar:/opt/public/common/jdk1.7.0_80/jre/lib/ext/sunec.jar:/opt/public/common/jdk1.7.0_80/jre/lib/ext/sunjce_provider.jar:/opt/public/common/jdk1.7.0_80/jre/lib/ext/localedata.jar:/jobs/genie.ajdt/ajdt-on-eclipse-45/workspace/org.aspectj.runtime/target/org.aspectj.runtime-1.8.9-SNAPSHOT.jar:/jobs/genie.ajdt/ajdt-on-eclipse-45/workspace/org.eclipse.ajdt.ui.tests/target/work/configuration/org.eclipse.osgi/40/0/.cp/junit.jar:
Timer event: 2ms: Pre compile
Compiler configuration for project PathTesting-VariableOnAspectPath has been read by compiler.  Resetting.
     Configuration was [PROJECTSOURCEFILES_CHANGED, JAVAOPTIONS_CHANGED, ASPECTPATH_CHANGED, CLASSPATH_CHANGED, INPATH_CHANGED, NONSTANDARDOPTIONS_CHANGED, OUTJAR_CHANGED, PROJECTSOURCERESOURCES_CHANGED, OUTPUTDESTINATIONS_CHANGED, INJARS_CHANGED]
Resetting list of modified source files.  Was null
Preparing for build: not going to be incremental because no successful previous full build
AJC: compiling source files
Timer event: 33ms: Time to first compiled message
AJC: compiled: /jobs/genie.ajdt/ajdt-on-eclipse-45/workspace/org.eclipse.ajdt.ui.tests/target/work/data/PathTesting-VariableOnAspectPath/src/aspectPath/VariableAspect.java
Timer event: 35ms: Time to first woven message
AJC: woven aspect aspectPath.VariableAspect (from /jobs/genie.ajdt/ajdt-on-eclipse-45/workspace/org.eclipse.ajdt.ui.tests/target/work/data/PathTesting-VariableOnAspectPath/src/aspectPath/VariableAspect.java)
AJC: compiled: /jobs/genie.ajdt/ajdt-on-eclipse-45/workspace/org.eclipse.ajdt.ui.tests/target/work/data/PathTesting-VariableOnAspectPath/src/aspectPath/VariableInpath.java
AJC: woven class aspectPath.VariableInpath (from /jobs/genie.ajdt/ajdt-on-eclipse-45/workspace/org.eclipse.ajdt.ui.tests/target/work/data/PathTesting-VariableOnAspectPath/src/aspectPath/VariableInpath.java)
advice defined in aspectPath.VariableAspect has not been applied [Xlint:adviceDidNotMatch]
AspectJ reports build successful, build was: FULL
AJDE Callback: finish. Was full build: true
Timer event: 37ms: Total time spent in AJDE
Timer event: 0ms: Refresh after build
Types affected during build = 2
>> scheduled a build
Crosscutting model sanity checked with no problems
Timer event: 0ms: Model sanity check for: PathTesting-VariableOnAspectPath
Timer event: 40ms: Total time spent in AJBuilder.build()
Timer event: 2ms: Delete markers: PathTesting-VariableOnAspectPath (Finished deleting markers for PathTesting-VariableOnAspectPath)
Compiler configuration for project PathTesting-ProjectOnAspectPath doesn't know previous state, so assuming EVERYTHING has changed.
===========================================================================================
Build kind = FULLBUILD
Project=PathTesting-ProjectOnAspectPath, kind of build requested=Full AspectJ compilation
Timer event: 0ms: Create markers: PathTesting-VariableOnAspectPath (Finished creating markers for PathTesting-VariableOnAspectPath)
Created 0 markers in 2 files
>> finished a build
Timer event: 0ms: Flush included source file cache
Timer event: 0ms: Check delta
Builder: Tidied output folder(s), removed class files and derived resources
Classpath = /jobs/genie.ajdt/ajdt-on-eclipse-45/workspace/org.eclipse.ajdt.ui.tests/target/work/data/PathTesting-ProjectOnAspectPath/otherOutLocation:/opt/public/common/jdk1.7.0_80/jre/lib/resources.jar:/opt/public/common/jdk1.7.0_80/jre/lib/rt.jar:/opt/public/common/jdk1.7.0_80/jre/lib/jsse.jar:/opt/public/common/jdk1.7.0_80/jre/lib/jce.jar:/opt/public/common/jdk1.7.0_80/jre/lib/charsets.jar:/opt/public/common/jdk1.7.0_80/jre/lib/jfr.jar:/opt/public/common/jdk1.7.0_80/jre/lib/ext/dnsns.jar:/opt/public/common/jdk1.7.0_80/jre/lib/ext/sunpkcs11.jar:/opt/public/common/jdk1.7.0_80/jre/lib/ext/zipfs.jar:/opt/public/common/jdk1.7.0_80/jre/lib/ext/sunec.jar:/opt/public/common/jdk1.7.0_80/jre/lib/ext/sunjce_provider.jar:/opt/public/common/jdk1.7.0_80/jre/lib/ext/localedata.jar:/jobs/genie.ajdt/ajdt-on-eclipse-45/workspace/org.aspectj.runtime/target/org.aspectj.runtime-1.8.9-SNAPSHOT.jar:/jobs/genie.ajdt/ajdt-on-eclipse-45/workspace/org.eclipse.ajdt.ui.tests/target/work/configuration/org.eclipse.osgi/40/0/.cp/junit.jar:
Timer event: 1ms: Pre compile
Compiler configuration for project PathTesting-ProjectOnAspectPath has been read by compiler.  Resetting.
     Configuration was [PROJECTSOURCEFILES_CHANGED, JAVAOPTIONS_CHANGED, ASPECTPATH_CHANGED, CLASSPATH_CHANGED, INPATH_CHANGED, NONSTANDARDOPTIONS_CHANGED, OUTJAR_CHANGED, PROJECTSOURCERESOURCES_CHANGED, OUTPUTDESTINATIONS_CHANGED, INJARS_CHANGED]
Resetting list of modified source files.  Was null
Preparing for build: not going to be incremental because no successful previous full build
AJC: compiling source files
Timer event: 37ms: Time to first compiled message
AJC: compiled: /jobs/genie.ajdt/ajdt-on-eclipse-45/workspace/org.eclipse.ajdt.ui.tests/target/work/data/PathTesting-ProjectOnAspectPath/src/aspectPath/ProjectAspect.java
Timer event: 39ms: Time to first woven message
AJC: woven aspect aspectPath.ProjectAspect (from /jobs/genie.ajdt/ajdt-on-eclipse-45/workspace/org.eclipse.ajdt.ui.tests/target/work/data/PathTesting-ProjectOnAspectPath/src/aspectPath/ProjectAspect.java)
AJC: compiled: /jobs/genie.ajdt/ajdt-on-eclipse-45/workspace/org.eclipse.ajdt.ui.tests/target/work/data/PathTesting-ProjectOnAspectPath/src/aspectPath/ProjectInpath.java
AJC: woven class aspectPath.ProjectInpath (from /jobs/genie.ajdt/ajdt-on-eclipse-45/workspace/org.eclipse.ajdt.ui.tests/target/work/data/PathTesting-ProjectOnAspectPath/src/aspectPath/ProjectInpath.java)
advice defined in aspectPath.ProjectAspect has not been applied [Xlint:adviceDidNotMatch]
AspectJ reports build successful, build was: FULL
AJDE Callback: finish. Was full build: true
Timer event: 42ms: Total time spent in AJDE
Timer event: 0ms: Refresh after build
Types affected during build = 2
>> scheduled a build
Crosscutting model sanity checked with no problems
Timer event: 0ms: Model sanity check for: PathTesting-ProjectOnAspectPath
Timer event: 44ms: Total time spent in AJBuilder.build()
Timer event: 2ms: Delete markers: PathTesting-ProjectOnAspectPath (Finished deleting markers for PathTesting-ProjectOnAspectPath)
Compiler configuration for project PathTesting-JarOnAspectPath doesn't know previous state, so assuming EVERYTHING has changed.
===========================================================================================
Build kind = FULLBUILD
Project=PathTesting-JarOnAspectPath, kind of build requested=Full AspectJ compilation
Timer event: 0ms: Create markers: PathTesting-ProjectOnAspectPath (Finished creating markers for PathTesting-ProjectOnAspectPath)
Created 0 markers in 2 files
Timer event: 1ms: Flush included source file cache
Timer event: 0ms: Check delta
Builder: Tidied output folder(s), removed class files and derived resources
>> finished a build
Classpath = /jobs/genie.ajdt/ajdt-on-eclipse-45/workspace/org.eclipse.ajdt.ui.tests/target/work/data/PathTesting-JarOnAspectPath/bin:/opt/public/common/jdk1.7.0_80/jre/lib/resources.jar:/opt/public/common/jdk1.7.0_80/jre/lib/rt.jar:/opt/public/common/jdk1.7.0_80/jre/lib/jsse.jar:/opt/public/common/jdk1.7.0_80/jre/lib/jce.jar:/opt/public/common/jdk1.7.0_80/jre/lib/charsets.jar:/opt/public/common/jdk1.7.0_80/jre/lib/jfr.jar:/opt/public/common/jdk1.7.0_80/jre/lib/ext/dnsns.jar:/opt/public/common/jdk1.7.0_80/jre/lib/ext/sunpkcs11.jar:/opt/public/common/jdk1.7.0_80/jre/lib/ext/zipfs.jar:/opt/public/common/jdk1.7.0_80/jre/lib/ext/sunec.jar:/opt/public/common/jdk1.7.0_80/jre/lib/ext/sunjce_provider.jar:/opt/public/common/jdk1.7.0_80/jre/lib/ext/localedata.jar:/jobs/genie.ajdt/ajdt-on-eclipse-45/workspace/org.aspectj.runtime/target/org.aspectj.runtime-1.8.9-SNAPSHOT.jar:
Timer event: 1ms: Pre compile
Compiler configuration for project PathTesting-JarOnAspectPath has been read by compiler.  Resetting.
     Configuration was [PROJECTSOURCEFILES_CHANGED, JAVAOPTIONS_CHANGED, ASPECTPATH_CHANGED, CLASSPATH_CHANGED, INPATH_CHANGED, NONSTANDARDOPTIONS_CHANGED, OUTJAR_CHANGED, PROJECTSOURCERESOURCES_CHANGED, OUTPUTDESTINATIONS_CHANGED, INJARS_CHANGED]
Resetting list of modified source files.  Was null
Preparing for build: not going to be incremental because no successful previous full build
AJC: compiling source files
Timer event: 37ms: Time to first compiled message
AJC: compiled: /jobs/genie.ajdt/ajdt-on-eclipse-45/workspace/org.eclipse.ajdt.ui.tests/target/work/data/PathTesting-JarOnAspectPath/src/aspectPath/JarAspect.java
Timer event: 39ms: Time to first woven message
AJC: woven aspect aspectPath.JarAspect (from /jobs/genie.ajdt/ajdt-on-eclipse-45/workspace/org.eclipse.ajdt.ui.tests/target/work/data/PathTesting-JarOnAspectPath/src/aspectPath/JarAspect.java)
AJC: compiled: /jobs/genie.ajdt/ajdt-on-eclipse-45/workspace/org.eclipse.ajdt.ui.tests/target/work/data/PathTesting-JarOnAspectPath/src/aspectPath/JarInpath.java
AJC: woven class aspectPath.JarInpath (from /jobs/genie.ajdt/ajdt-on-eclipse-45/workspace/org.eclipse.ajdt.ui.tests/target/work/data/PathTesting-JarOnAspectPath/src/aspectPath/JarInpath.java)
advice defined in aspectPath.JarAspect has not been applied [Xlint:adviceDidNotMatch]
AspectJ reports build successful, build was: FULL
AJDE Callback: finish. Was full build: true
Timer event: 41ms: Total time spent in AJDE
Timer event: 1ms: Refresh after build
Types affected during build = 2
>> scheduled a build
Crosscutting model sanity checked with no problems
Timer event: 0ms: Model sanity check for: PathTesting-JarOnAspectPath
Timer event: 43ms: Total time spent in AJBuilder.build()
Timer event: 3ms: Delete markers: PathTesting-JarOnAspectPath (Finished deleting markers for PathTesting-JarOnAspectPath)
Timer event: 1ms: Create markers: PathTesting-JarOnAspectPath (Finished creating markers for PathTesting-JarOnAspectPath)
Created 0 markers in 2 files
>> finished a build
===========================================================================================
Build kind = AUTOBUILD
Project=DefaultEmptyProject, kind of build requested=Incremental AspectJ compilation
Timer event: 0ms: Flush included source file cache
Timer event: 0ms: Check delta
Timer event: 1ms: Update visualizer, xref, advice listeners for (separate thread): PathTesting-ContainerOnAspectPath
CoreCompilerConfiguration for project DefaultEmptyProject registered a configuration change: [ASPECTPATH_CHANGED, CLASSPATH_CHANGED, INPATH_CHANGED, OUTPUTDESTINATIONS_CHANGED]
Timer event: 0ms: Looking for and marking configuration changes in DefaultEmptyProject
	Configuration changes found: true
Timer event: 0ms: Look for source/resource changes
Setting list of classpath elements with modified contents:
      []
Classpath = /jobs/genie.ajdt/ajdt-on-eclipse-45/workspace/org.eclipse.ajdt.ui.tests/target/work/data/DefaultEmptyProject/bin:/jobs/genie.ajdt/ajdt-on-eclipse-45/workspace/org.aspectj.runtime/target/org.aspectj.runtime-1.8.9-SNAPSHOT.jar:/opt/public/common/jdk1.7.0_80/jre/lib/resources.jar:/opt/public/common/jdk1.7.0_80/jre/lib/rt.jar:/opt/public/common/jdk1.7.0_80/jre/lib/jsse.jar:/opt/public/common/jdk1.7.0_80/jre/lib/jce.jar:/opt/public/common/jdk1.7.0_80/jre/lib/charsets.jar:/opt/public/common/jdk1.7.0_80/jre/lib/jfr.jar:/opt/public/common/jdk1.7.0_80/jre/lib/ext/dnsns.jar:/opt/public/common/jdk1.7.0_80/jre/lib/ext/sunpkcs11.jar:/opt/public/common/jdk1.7.0_80/jre/lib/ext/zipfs.jar:/opt/public/common/jdk1.7.0_80/jre/lib/ext/sunec.jar:/opt/public/common/jdk1.7.0_80/jre/lib/ext/sunjce_provider.jar:/opt/public/common/jdk1.7.0_80/jre/lib/ext/localedata.jar:/jobs/genie.ajdt/ajdt-on-eclipse-45/workspace/org.eclipse.ajdt.ui.tests/target/work/configuration/org.eclipse.osgi/40/0/.cp/junit.jar:/jobs/genie.ajdt/ajdt-on-eclipse-45/workspace/org.eclipse.ajdt.ui.tests/target/work/configuration/org.eclipse.osgi/223/0/.cp:
Timer event: 6ms: Pre compile
Sending the following configuration changes to the compiler: [ASPECTPATH_CHANGED, CLASSPATH_CHANGED, INPATH_CHANGED, OUTPUTDESTINATIONS_CHANGED]
Timer event: 1ms: Update visualizer, xref, advice listeners for (separate thread): PathTesting-VariableOnAspectPath
Compiler configuration for project DefaultEmptyProject has been read by compiler.  Resetting.
     Configuration was [ASPECTPATH_CHANGED, CLASSPATH_CHANGED, INPATH_CHANGED, OUTPUTDESTINATIONS_CHANGED]
Resetting list of modified source files.  Was []
ClassFileChangeChecking: failed to find a state instance managing output location : /jobs/genie.ajdt/ajdt-on-eclipse-45/workspace/org.eclipse.ajdt.ui.tests/target/work/configuration/org.eclipse.osgi/223/0/.cp (could be getting managed by JDT)
Timer event: 0ms: OutputLocationManager: binary folder to declaring project map creation: P/DefaultEmptyProject
Preparing for build: planning to be an incremental build
AspectJ reports build successful, build was: INCREMENTAL
AJDE Callback: finish. Was full build: false
Timer event: 7ms: Total time spent in AJDE
Timer event: 0ms: Refresh after build
Crosscutting model sanity checked with no problems
Timer event: 0ms: Model sanity check for: DefaultEmptyProject
Timer event: 13ms: Total time spent in AJBuilder.build()
Compiler configuration for project PathTesting-HasInpath doesn't know previous state, so assuming EVERYTHING has changed.
===========================================================================================
Build kind = FULLBUILD
Project=PathTesting-HasInpath, kind of build requested=Full AspectJ compilation
build: Abort due to missing inpath/aspectpath/classpath entries
Timer event: 1ms: Total time spent in AJBuilder.build()
Removed problems and tasks for project PathTesting-HasInpath
Bug 288395---logging build path problems, found 4
  /PathTesting-HasAspectPath : Archive for required library: '/jobs/genie.ajdt/ajdt-on-eclipse-45/workspace/org.eclipse.ajdt.ui.tests/target/work/data/PathTesting-VariableOnAspectPath/variable.jar' in project 'PathTesting-HasAspectPath' cannot be read or is not a valid ZIP file
  /PathTesting-HasAspectPath : Archive for required library: '/PathTesting-JarOnAspectPath/j.jar' in project 'PathTesting-HasAspectPath' cannot be read or is not a valid ZIP file
  /PathTesting-HasInpath : Archive for required library: '/jobs/genie.ajdt/ajdt-on-eclipse-45/workspace/org.eclipse.ajdt.ui.tests/target/work/data/PathTesting-VariableOnAspectPath/variable.jar' in project 'PathTesting-HasInpath' cannot be read or is not a valid ZIP file
  /PathTesting-HasInpath : Archive for required library: '/PathTesting-JarOnAspectPath/j.jar' in project 'PathTesting-HasInpath' cannot be read or is not a valid ZIP file
Bug 288395---logging build path problems, found 6
  /PathTesting-ContainerOnAspectPath/src/aspectPath/ContainerAspect.aj : no match for this type name: main.Main [Xlint:invalidAbsoluteTypeName]
  /PathTesting-ContainerOnAspectPath/src/aspectPath/ContainerAspect.aj : advice defined in aspectPath.ContainerAspect has not been applied [Xlint:adviceDidNotMatch]
  /PathTesting-HasInpath : The project was not built since it depends on PathTesting-HasInpath, which has build path errors
  /PathTesting-JarOnAspectPath/src/aspectPath/JarAspect.java : advice defined in aspectPath.JarAspect has not been applied [Xlint:adviceDidNotMatch]
  /PathTesting-ProjectOnAspectPath/src/aspectPath/ProjectAspect.java : advice defined in aspectPath.ProjectAspect has not been applied [Xlint:adviceDidNotMatch]
  /PathTesting-VariableOnAspectPath/src/aspectPath/VariableAspect.java : advice defined in aspectPath.VariableAspect has not been applied [Xlint:adviceDidNotMatch]
build: Abort due to missing classpath/inpath/aspectpath entries
Compiler configuration for project PathTesting-HasAspectPath doesn't know previous state, so assuming EVERYTHING has changed.
===========================================================================================
Build kind = FULLBUILD
Project=PathTesting-HasAspectPath, kind of build requested=Full AspectJ compilation
build: Abort due to missing inpath/aspectpath/classpath entries
Timer event: 1ms: Total time spent in AJBuilder.build()
Removed problems and tasks for project PathTesting-HasAspectPath
Bug 288395---logging build path problems, found 4
  /PathTesting-HasAspectPath : Archive for required library: '/jobs/genie.ajdt/ajdt-on-eclipse-45/workspace/org.eclipse.ajdt.ui.tests/target/work/data/PathTesting-VariableOnAspectPath/variable.jar' in project 'PathTesting-HasAspectPath' cannot be read or is not a valid ZIP file
  /PathTesting-HasAspectPath : Archive for required library: '/PathTesting-JarOnAspectPath/j.jar' in project 'PathTesting-HasAspectPath' cannot be read or is not a valid ZIP file
  /PathTesting-HasInpath : Archive for required library: '/jobs/genie.ajdt/ajdt-on-eclipse-45/workspace/org.eclipse.ajdt.ui.tests/target/work/data/PathTesting-VariableOnAspectPath/variable.jar' in project 'PathTesting-HasInpath' cannot be read or is not a valid ZIP file
  /PathTesting-HasInpath : Archive for required library: '/PathTesting-JarOnAspectPath/j.jar' in project 'PathTesting-HasInpath' cannot be read or is not a valid ZIP file
Bug 288395---logging build path problems, found 7
  /PathTesting-ContainerOnAspectPath/src/aspectPath/ContainerAspect.aj : no match for this type name: main.Main [Xlint:invalidAbsoluteTypeName]
  /PathTesting-ContainerOnAspectPath/src/aspectPath/ContainerAspect.aj : advice defined in aspectPath.ContainerAspect has not been applied [Xlint:adviceDidNotMatch]
  /PathTesting-HasAspectPath : The project was not built since it depends on PathTesting-HasAspectPath, which has build path errors
  /PathTesting-HasInpath : The project was not built since it depends on PathTesting-HasInpath, which has build path errors
  /PathTesting-JarOnAspectPath/src/aspectPath/JarAspect.java : advice defined in aspectPath.JarAspect has not been applied [Xlint:adviceDidNotMatch]
  /PathTesting-ProjectOnAspectPath/src/aspectPath/ProjectAspect.java : advice defined in aspectPath.ProjectAspect has not been applied [Xlint:adviceDidNotMatch]
  /PathTesting-VariableOnAspectPath/src/aspectPath/VariableAspect.java : advice defined in aspectPath.VariableAspect has not been applied [Xlint:adviceDidNotMatch]
build: Abort due to missing classpath/inpath/aspectpath entries
Timer event: 0ms: Update visualizer, xref, advice listeners for (separate thread): PathTesting-ProjectOnAspectPath
>> finished a build
Timer event: 1ms: Update visualizer, xref, advice listeners for (separate thread): PathTesting-JarOnAspectPath
Timer event: 1ms: Update visualizer, xref, advice listeners for (separate thread): DefaultEmptyProject
>> scheduled a build
>> finished a build
>> scheduled a build
>> finished a build
>> scheduled a build
>> finished a build
>> scheduled a build
>> finished a build
>> scheduled a build
>> finished a build
>> scheduled a build
>> finished a build
>> scheduled a build
>> finished a build
>> scheduled a build
------------------------
Starting testInpath
>> finished a build
>> scheduled a build
>> finished a build
>> scheduled a build
>> finished a build
>> scheduled a build
>> finished a build
>> scheduled a build
>> finished a build
>> scheduled a build
>> finished a build
>> scheduled a build
>> finished a build
>> scheduled a build
>> finished a build
>> scheduled a build
>> finished a build
>> scheduled a build
>> finished a build
>> scheduled a build
>> finished a build
>> scheduled a build
Compiler configuration for project PathTesting-ContainerOnAspectPath doesn't know previous state, so assuming EVERYTHING has changed.
===========================================================================================
Build kind = FULLBUILD
Project=PathTesting-ContainerOnAspectPath, kind of build requested=Full AspectJ compilation
Timer event: 0ms: Flush included source file cache
Timer event: 0ms: Check delta
Builder: Tidied output folder(s), removed class files and derived resources
Classpath = /jobs/genie.ajdt/ajdt-on-eclipse-45/workspace/org.eclipse.ajdt.ui.tests/target/work/data/PathTesting-ContainerOnAspectPath/bin:/opt/public/common/jdk1.7.0_80/jre/lib/resources.jar:/opt/public/common/jdk1.7.0_80/jre/lib/rt.jar:/opt/public/common/jdk1.7.0_80/jre/lib/jsse.jar:/opt/public/common/jdk1.7.0_80/jre/lib/jce.jar:/opt/public/common/jdk1.7.0_80/jre/lib/charsets.jar:/opt/public/common/jdk1.7.0_80/jre/lib/jfr.jar:/opt/public/common/jdk1.7.0_80/jre/lib/ext/dnsns.jar:/opt/public/common/jdk1.7.0_80/jre/lib/ext/sunpkcs11.jar:/opt/public/common/jdk1.7.0_80/jre/lib/ext/zipfs.jar:/opt/public/common/jdk1.7.0_80/jre/lib/ext/sunec.jar:/opt/public/common/jdk1.7.0_80/jre/lib/ext/sunjce_provider.jar:/opt/public/common/jdk1.7.0_80/jre/lib/ext/localedata.jar:/jobs/genie.ajdt/ajdt-on-eclipse-45/workspace/org.aspectj.runtime/target/org.aspectj.runtime-1.8.9-SNAPSHOT.jar:/jobs/genie.ajdt/ajdt-on-eclipse-45/workspace/org.eclipse.ajdt.ui.tests/target/work/configuration/org.eclipse.osgi/40/0/.cp/junit.jar:
Timer event: 3ms: Pre compile
Compiler configuration for project PathTesting-ContainerOnAspectPath has been read by compiler.  Resetting.
     Configuration was [PROJECTSOURCEFILES_CHANGED, JAVAOPTIONS_CHANGED, ASPECTPATH_CHANGED, CLASSPATH_CHANGED, INPATH_CHANGED, NONSTANDARDOPTIONS_CHANGED, OUTJAR_CHANGED, PROJECTSOURCERESOURCES_CHANGED, OUTPUTDESTINATIONS_CHANGED, INJARS_CHANGED]
Resetting list of modified source files.  Was null
Preparing for build: not going to be incremental because no successful previous full build
AJC: compiling source files
Timer event: 36ms: Time to first compiled message
AJC: compiled: /jobs/genie.ajdt/ajdt-on-eclipse-45/workspace/org.eclipse.ajdt.ui.tests/target/work/data/PathTesting-ContainerOnAspectPath/src/aspectPath/ContainerAspect.aj
Timer event: 39ms: Time to first woven message
AJC: woven aspect aspectPath.ContainerAspect (from /jobs/genie.ajdt/ajdt-on-eclipse-45/workspace/org.eclipse.ajdt.ui.tests/target/work/data/PathTesting-ContainerOnAspectPath/src/aspectPath/ContainerAspect.aj)
no match for this type name: main.Main [Xlint:invalidAbsoluteTypeName]
AJC: compiled: /jobs/genie.ajdt/ajdt-on-eclipse-45/workspace/org.eclipse.ajdt.ui.tests/target/work/data/PathTesting-ContainerOnAspectPath/src/aspectPath/ContainerInpath.java
AJC: woven class aspectPath.ContainerInpath (from /jobs/genie.ajdt/ajdt-on-eclipse-45/workspace/org.eclipse.ajdt.ui.tests/target/work/data/PathTesting-ContainerOnAspectPath/src/aspectPath/ContainerInpath.java)
advice defined in aspectPath.ContainerAspect has not been applied [Xlint:adviceDidNotMatch]
AspectJ reports build successful, build was: FULL
AJDE Callback: finish. Was full build: true
Timer event: 41ms: Total time spent in AJDE
Timer event: 0ms: Refresh after build
Types affected during build = 2
>> scheduled a build
Crosscutting model sanity checked with no problems
Timer event: 0ms: Model sanity check for: PathTesting-ContainerOnAspectPath
Timer event: 45ms: Total time spent in AJBuilder.build()
Timer event: 2ms: Delete markers: PathTesting-ContainerOnAspectPath (Finished deleting markers for PathTesting-ContainerOnAspectPath)
Compiler configuration for project PathTesting-VariableOnAspectPath doesn't know previous state, so assuming EVERYTHING has changed.
===========================================================================================
Build kind = FULLBUILD
Project=PathTesting-VariableOnAspectPath, kind of build requested=Full AspectJ compilation
Timer event: 0ms: Flush included source file cache
Timer event: 1ms: Create markers: PathTesting-ContainerOnAspectPath (Finished creating markers for PathTesting-ContainerOnAspectPath)
Created 0 markers in 2 files
Timer event: 0ms: Check delta
Builder: Tidied output folder(s), removed class files and derived resources
>> finished a build
Classpath = /jobs/genie.ajdt/ajdt-on-eclipse-45/workspace/org.eclipse.ajdt.ui.tests/target/work/data/PathTesting-VariableOnAspectPath/bin:/opt/public/common/jdk1.7.0_80/jre/lib/resources.jar:/opt/public/common/jdk1.7.0_80/jre/lib/rt.jar:/opt/public/common/jdk1.7.0_80/jre/lib/jsse.jar:/opt/public/common/jdk1.7.0_80/jre/lib/jce.jar:/opt/public/common/jdk1.7.0_80/jre/lib/charsets.jar:/opt/public/common/jdk1.7.0_80/jre/lib/jfr.jar:/opt/public/common/jdk1.7.0_80/jre/lib/ext/dnsns.jar:/opt/public/common/jdk1.7.0_80/jre/lib/ext/sunpkcs11.jar:/opt/public/common/jdk1.7.0_80/jre/lib/ext/zipfs.jar:/opt/public/common/jdk1.7.0_80/jre/lib/ext/sunec.jar:/opt/public/common/jdk1.7.0_80/jre/lib/ext/sunjce_provider.jar:/opt/public/common/jdk1.7.0_80/jre/lib/ext/localedata.jar:/jobs/genie.ajdt/ajdt-on-eclipse-45/workspace/org.aspectj.runtime/target/org.aspectj.runtime-1.8.9-SNAPSHOT.jar:/jobs/genie.ajdt/ajdt-on-eclipse-45/workspace/org.eclipse.ajdt.ui.tests/target/work/configuration/org.eclipse.osgi/40/0/.cp/junit.jar:
Timer event: 1ms: Pre compile
Compiler configuration for project PathTesting-VariableOnAspectPath has been read by compiler.  Resetting.
     Configuration was [PROJECTSOURCEFILES_CHANGED, JAVAOPTIONS_CHANGED, ASPECTPATH_CHANGED, CLASSPATH_CHANGED, INPATH_CHANGED, NONSTANDARDOPTIONS_CHANGED, OUTJAR_CHANGED, PROJECTSOURCERESOURCES_CHANGED, OUTPUTDESTINATIONS_CHANGED, INJARS_CHANGED]
Resetting list of modified source files.  Was null
Preparing for build: not going to be incremental because no successful previous full build
AJC: compiling source files
Timer event: 35ms: Time to first compiled message
AJC: compiled: /jobs/genie.ajdt/ajdt-on-eclipse-45/workspace/org.eclipse.ajdt.ui.tests/target/work/data/PathTesting-VariableOnAspectPath/src/aspectPath/VariableAspect.java
Timer event: 37ms: Time to first woven message
AJC: woven aspect aspectPath.VariableAspect (from /jobs/genie.ajdt/ajdt-on-eclipse-45/workspace/org.eclipse.ajdt.ui.tests/target/work/data/PathTesting-VariableOnAspectPath/src/aspectPath/VariableAspect.java)
AJC: compiled: /jobs/genie.ajdt/ajdt-on-eclipse-45/workspace/org.eclipse.ajdt.ui.tests/target/work/data/PathTesting-VariableOnAspectPath/src/aspectPath/VariableInpath.java
AJC: woven class aspectPath.VariableInpath (from /jobs/genie.ajdt/ajdt-on-eclipse-45/workspace/org.eclipse.ajdt.ui.tests/target/work/data/PathTesting-VariableOnAspectPath/src/aspectPath/VariableInpath.java)
advice defined in aspectPath.VariableAspect has not been applied [Xlint:adviceDidNotMatch]
AspectJ reports build successful, build was: FULL
AJDE Callback: finish. Was full build: true
Timer event: 39ms: Total time spent in AJDE
Timer event: 1ms: Refresh after build
Types affected during build = 2
>> scheduled a build
Crosscutting model sanity checked with no problems
Timer event: 0ms: Model sanity check for: PathTesting-VariableOnAspectPath
Timer event: 41ms: Total time spent in AJBuilder.build()
Timer event: 2ms: Delete markers: PathTesting-VariableOnAspectPath (Finished deleting markers for PathTesting-VariableOnAspectPath)
Compiler configuration for project PathTesting-ProjectOnAspectPath doesn't know previous state, so assuming EVERYTHING has changed.
===========================================================================================
Build kind = FULLBUILD
Timer event: 1ms: Create markers: PathTesting-VariableOnAspectPath (Finished creating markers for PathTesting-VariableOnAspectPath)
Created 0 markers in 2 files
Project=PathTesting-ProjectOnAspectPath, kind of build requested=Full AspectJ compilation
>> finished a build
Timer event: 0ms: Flush included source file cache
Timer event: 0ms: Check delta
Builder: Tidied output folder(s), removed class files and derived resources
Classpath = /jobs/genie.ajdt/ajdt-on-eclipse-45/workspace/org.eclipse.ajdt.ui.tests/target/work/data/PathTesting-ProjectOnAspectPath/otherOutLocation:/opt/public/common/jdk1.7.0_80/jre/lib/resources.jar:/opt/public/common/jdk1.7.0_80/jre/lib/rt.jar:/opt/public/common/jdk1.7.0_80/jre/lib/jsse.jar:/opt/public/common/jdk1.7.0_80/jre/lib/jce.jar:/opt/public/common/jdk1.7.0_80/jre/lib/charsets.jar:/opt/public/common/jdk1.7.0_80/jre/lib/jfr.jar:/opt/public/common/jdk1.7.0_80/jre/lib/ext/dnsns.jar:/opt/public/common/jdk1.7.0_80/jre/lib/ext/sunpkcs11.jar:/opt/public/common/jdk1.7.0_80/jre/lib/ext/zipfs.jar:/opt/public/common/jdk1.7.0_80/jre/lib/ext/sunec.jar:/opt/public/common/jdk1.7.0_80/jre/lib/ext/sunjce_provider.jar:/opt/public/common/jdk1.7.0_80/jre/lib/ext/localedata.jar:/jobs/genie.ajdt/ajdt-on-eclipse-45/workspace/org.aspectj.runtime/target/org.aspectj.runtime-1.8.9-SNAPSHOT.jar:/jobs/genie.ajdt/ajdt-on-eclipse-45/workspace/org.eclipse.ajdt.ui.tests/target/work/configuration/org.eclipse.osgi/40/0/.cp/junit.jar:
Timer event: 1ms: Pre compile
Compiler configuration for project PathTesting-ProjectOnAspectPath has been read by compiler.  Resetting.
     Configuration was [PROJECTSOURCEFILES_CHANGED, JAVAOPTIONS_CHANGED, ASPECTPATH_CHANGED, CLASSPATH_CHANGED, INPATH_CHANGED, NONSTANDARDOPTIONS_CHANGED, OUTJAR_CHANGED, PROJECTSOURCERESOURCES_CHANGED, OUTPUTDESTINATIONS_CHANGED, INJARS_CHANGED]
Resetting list of modified source files.  Was null
Preparing for build: not going to be incremental because no successful previous full build
AJC: compiling source files
Timer event: 35ms: Time to first compiled message
AJC: compiled: /jobs/genie.ajdt/ajdt-on-eclipse-45/workspace/org.eclipse.ajdt.ui.tests/target/work/data/PathTesting-ProjectOnAspectPath/src/aspectPath/ProjectAspect.java
Timer event: 37ms: Time to first woven message
AJC: woven aspect aspectPath.ProjectAspect (from /jobs/genie.ajdt/ajdt-on-eclipse-45/workspace/org.eclipse.ajdt.ui.tests/target/work/data/PathTesting-ProjectOnAspectPath/src/aspectPath/ProjectAspect.java)
AJC: compiled: /jobs/genie.ajdt/ajdt-on-eclipse-45/workspace/org.eclipse.ajdt.ui.tests/target/work/data/PathTesting-ProjectOnAspectPath/src/aspectPath/ProjectInpath.java
AJC: woven class aspectPath.ProjectInpath (from /jobs/genie.ajdt/ajdt-on-eclipse-45/workspace/org.eclipse.ajdt.ui.tests/target/work/data/PathTesting-ProjectOnAspectPath/src/aspectPath/ProjectInpath.java)
advice defined in aspectPath.ProjectAspect has not been applied [Xlint:adviceDidNotMatch]
AspectJ reports build successful, build was: FULL
AJDE Callback: finish. Was full build: true
Timer event: 40ms: Total time spent in AJDE
Timer event: 0ms: Refresh after build
Types affected during build = 2
>> scheduled a build
Crosscutting model sanity checked with no problems
Timer event: 0ms: Model sanity check for: PathTesting-ProjectOnAspectPath
Timer event: 42ms: Total time spent in AJBuilder.build()
Timer event: 2ms: Delete markers: PathTesting-ProjectOnAspectPath (Finished deleting markers for PathTesting-ProjectOnAspectPath)
Compiler configuration for project PathTesting-JarOnAspectPath doesn't know previous state, so assuming EVERYTHING has changed.
===========================================================================================
Build kind = FULLBUILD
Project=PathTesting-JarOnAspectPath, kind of build requested=Full AspectJ compilation
Timer event: 0ms: Flush included source file cache
Timer event: 0ms: Check delta
Builder: Tidied output folder(s), removed class files and derived resources
Timer event: 1ms: Create markers: PathTesting-ProjectOnAspectPath (Finished creating markers for PathTesting-ProjectOnAspectPath)
Created 0 markers in 2 files
>> finished a build
Classpath = /jobs/genie.ajdt/ajdt-on-eclipse-45/workspace/org.eclipse.ajdt.ui.tests/target/work/data/PathTesting-JarOnAspectPath/bin:/opt/public/common/jdk1.7.0_80/jre/lib/resources.jar:/opt/public/common/jdk1.7.0_80/jre/lib/rt.jar:/opt/public/common/jdk1.7.0_80/jre/lib/jsse.jar:/opt/public/common/jdk1.7.0_80/jre/lib/jce.jar:/opt/public/common/jdk1.7.0_80/jre/lib/charsets.jar:/opt/public/common/jdk1.7.0_80/jre/lib/jfr.jar:/opt/public/common/jdk1.7.0_80/jre/lib/ext/dnsns.jar:/opt/public/common/jdk1.7.0_80/jre/lib/ext/sunpkcs11.jar:/opt/public/common/jdk1.7.0_80/jre/lib/ext/zipfs.jar:/opt/public/common/jdk1.7.0_80/jre/lib/ext/sunec.jar:/opt/public/common/jdk1.7.0_80/jre/lib/ext/sunjce_provider.jar:/opt/public/common/jdk1.7.0_80/jre/lib/ext/localedata.jar:/jobs/genie.ajdt/ajdt-on-eclipse-45/workspace/org.aspectj.runtime/target/org.aspectj.runtime-1.8.9-SNAPSHOT.jar:
Timer event: 2ms: Pre compile
Compiler configuration for project PathTesting-JarOnAspectPath has been read by compiler.  Resetting.
     Configuration was [PROJECTSOURCEFILES_CHANGED, JAVAOPTIONS_CHANGED, ASPECTPATH_CHANGED, CLASSPATH_CHANGED, INPATH_CHANGED, NONSTANDARDOPTIONS_CHANGED, OUTJAR_CHANGED, PROJECTSOURCERESOURCES_CHANGED, OUTPUTDESTINATIONS_CHANGED, INJARS_CHANGED]
Resetting list of modified source files.  Was null
Preparing for build: not going to be incremental because no successful previous full build
AJC: compiling source files
Timer event: 34ms: Time to first compiled message
AJC: compiled: /jobs/genie.ajdt/ajdt-on-eclipse-45/workspace/org.eclipse.ajdt.ui.tests/target/work/data/PathTesting-JarOnAspectPath/src/aspectPath/JarAspect.java
Timer event: 36ms: Time to first woven message
AJC: woven aspect aspectPath.JarAspect (from /jobs/genie.ajdt/ajdt-on-eclipse-45/workspace/org.eclipse.ajdt.ui.tests/target/work/data/PathTesting-JarOnAspectPath/src/aspectPath/JarAspect.java)
AJC: compiled: /jobs/genie.ajdt/ajdt-on-eclipse-45/workspace/org.eclipse.ajdt.ui.tests/target/work/data/PathTesting-JarOnAspectPath/src/aspectPath/JarInpath.java
AJC: woven class aspectPath.JarInpath (from /jobs/genie.ajdt/ajdt-on-eclipse-45/workspace/org.eclipse.ajdt.ui.tests/target/work/data/PathTesting-JarOnAspectPath/src/aspectPath/JarInpath.java)
advice defined in aspectPath.JarAspect has not been applied [Xlint:adviceDidNotMatch]
AspectJ reports build successful, build was: FULL
AJDE Callback: finish. Was full build: true
Timer event: 39ms: Total time spent in AJDE
Timer event: 0ms: Refresh after build
Types affected during build = 2
>> scheduled a build
Crosscutting model sanity checked with no problems
Timer event: 0ms: Model sanity check for: PathTesting-JarOnAspectPath
Timer event: 42ms: Total time spent in AJBuilder.build()
Timer event: 4ms: Delete markers: PathTesting-JarOnAspectPath (Finished deleting markers for PathTesting-JarOnAspectPath)
Timer event: 1ms: Create markers: PathTesting-JarOnAspectPath (Finished creating markers for PathTesting-JarOnAspectPath)
Created 0 markers in 2 files
>> finished a build
Timer event: 1ms: Update visualizer, xref, advice listeners for (separate thread): PathTesting-ContainerOnAspectPath
Timer event: 1ms: Update visualizer, xref, advice listeners for (separate thread): PathTesting-VariableOnAspectPath
Timer event: 0ms: Update visualizer, xref, advice listeners for (separate thread): PathTesting-ProjectOnAspectPath
Timer event: 0ms: Update visualizer, xref, advice listeners for (separate thread): PathTesting-JarOnAspectPath
===========================================================================================
Build kind = AUTOBUILD
Project=DefaultEmptyProject, kind of build requested=Incremental AspectJ compilation
Timer event: 0ms: Flush included source file cache
Timer event: 0ms: Check delta
CoreCompilerConfiguration for project DefaultEmptyProject registered a configuration change: [ASPECTPATH_CHANGED, CLASSPATH_CHANGED, INPATH_CHANGED, OUTPUTDESTINATIONS_CHANGED]
Timer event: 0ms: Looking for and marking configuration changes in DefaultEmptyProject
	Configuration changes found: true
Timer event: 0ms: Look for source/resource changes
Setting list of classpath elements with modified contents:
      []
Classpath = /jobs/genie.ajdt/ajdt-on-eclipse-45/workspace/org.eclipse.ajdt.ui.tests/target/work/data/DefaultEmptyProject/bin:/jobs/genie.ajdt/ajdt-on-eclipse-45/workspace/org.aspectj.runtime/target/org.aspectj.runtime-1.8.9-SNAPSHOT.jar:/opt/public/common/jdk1.7.0_80/jre/lib/resources.jar:/opt/public/common/jdk1.7.0_80/jre/lib/rt.jar:/opt/public/common/jdk1.7.0_80/jre/lib/jsse.jar:/opt/public/common/jdk1.7.0_80/jre/lib/jce.jar:/opt/public/common/jdk1.7.0_80/jre/lib/charsets.jar:/opt/public/common/jdk1.7.0_80/jre/lib/jfr.jar:/opt/public/common/jdk1.7.0_80/jre/lib/ext/dnsns.jar:/opt/public/common/jdk1.7.0_80/jre/lib/ext/sunpkcs11.jar:/opt/public/common/jdk1.7.0_80/jre/lib/ext/zipfs.jar:/opt/public/common/jdk1.7.0_80/jre/lib/ext/sunec.jar:/opt/public/common/jdk1.7.0_80/jre/lib/ext/sunjce_provider.jar:/opt/public/common/jdk1.7.0_80/jre/lib/ext/localedata.jar:/jobs/genie.ajdt/ajdt-on-eclipse-45/workspace/org.eclipse.ajdt.ui.tests/target/work/configuration/org.eclipse.osgi/40/0/.cp/junit.jar:/jobs/genie.ajdt/ajdt-on-eclipse-45/workspace/org.eclipse.ajdt.ui.tests/target/work/configuration/org.eclipse.osgi/223/0/.cp:
Timer event: 7ms: Pre compile
Sending the following configuration changes to the compiler: [ASPECTPATH_CHANGED, CLASSPATH_CHANGED, INPATH_CHANGED, OUTPUTDESTINATIONS_CHANGED]
Compiler configuration for project DefaultEmptyProject has been read by compiler.  Resetting.
     Configuration was [ASPECTPATH_CHANGED, CLASSPATH_CHANGED, INPATH_CHANGED, OUTPUTDESTINATIONS_CHANGED]
Resetting list of modified source files.  Was []
ClassFileChangeChecking: failed to find a state instance managing output location : /jobs/genie.ajdt/ajdt-on-eclipse-45/workspace/org.eclipse.ajdt.ui.tests/target/work/configuration/org.eclipse.osgi/223/0/.cp (could be getting managed by JDT)
Timer event: 0ms: OutputLocationManager: binary folder to declaring project map creation: P/DefaultEmptyProject
Preparing for build: planning to be an incremental build
AspectJ reports build successful, build was: INCREMENTAL
AJDE Callback: finish. Was full build: false
Timer event: 5ms: Total time spent in AJDE
Timer event: 0ms: Refresh after build
Crosscutting model sanity checked with no problems
Timer event: 0ms: Model sanity check for: DefaultEmptyProject
Timer event: 12ms: Total time spent in AJBuilder.build()
Compiler configuration for project PathTesting-HasInpath doesn't know previous state, so assuming EVERYTHING has changed.
===========================================================================================
Build kind = FULLBUILD
Project=PathTesting-HasInpath, kind of build requested=Full AspectJ compilation
build: Abort due to missing inpath/aspectpath/classpath entries
Timer event: 0ms: Total time spent in AJBuilder.build()
Removed problems and tasks for project PathTesting-HasInpath
Bug 288395---logging build path problems, found 4
  /PathTesting-HasAspectPath : Archive for required library: '/jobs/genie.ajdt/ajdt-on-eclipse-45/workspace/org.eclipse.ajdt.ui.tests/target/work/data/PathTesting-VariableOnAspectPath/variable.jar' in project 'PathTesting-HasAspectPath' cannot be read or is not a valid ZIP file
  /PathTesting-HasAspectPath : Archive for required library: '/PathTesting-JarOnAspectPath/j.jar' in project 'PathTesting-HasAspectPath' cannot be read or is not a valid ZIP file
  /PathTesting-HasInpath : Archive for required library: '/jobs/genie.ajdt/ajdt-on-eclipse-45/workspace/org.eclipse.ajdt.ui.tests/target/work/data/PathTesting-VariableOnAspectPath/variable.jar' in project 'PathTesting-HasInpath' cannot be read or is not a valid ZIP file
  /PathTesting-HasInpath : Archive for required library: '/PathTesting-JarOnAspectPath/j.jar' in project 'PathTesting-HasInpath' cannot be read or is not a valid ZIP file
Bug 288395---logging build path problems, found 6
  /PathTesting-ContainerOnAspectPath/src/aspectPath/ContainerAspect.aj : no match for this type name: main.Main [Xlint:invalidAbsoluteTypeName]
  /PathTesting-ContainerOnAspectPath/src/aspectPath/ContainerAspect.aj : advice defined in aspectPath.ContainerAspect has not been applied [Xlint:adviceDidNotMatch]
  /PathTesting-HasInpath : The project was not built since it depends on PathTesting-HasInpath, which has build path errors
  /PathTesting-JarOnAspectPath/src/aspectPath/JarAspect.java : advice defined in aspectPath.JarAspect has not been applied [Xlint:adviceDidNotMatch]
  /PathTesting-ProjectOnAspectPath/src/aspectPath/ProjectAspect.java : advice defined in aspectPath.ProjectAspect has not been applied [Xlint:adviceDidNotMatch]
  /PathTesting-VariableOnAspectPath/src/aspectPath/VariableAspect.java : advice defined in aspectPath.VariableAspect has not been applied [Xlint:adviceDidNotMatch]
build: Abort due to missing classpath/inpath/aspectpath entries
Compiler configuration for project PathTesting-HasAspectPath doesn't know previous state, so assuming EVERYTHING has changed.
===========================================================================================
Build kind = FULLBUILD
Project=PathTesting-HasAspectPath, kind of build requested=Full AspectJ compilation
build: Abort due to missing inpath/aspectpath/classpath entries
Timer event: 1ms: Total time spent in AJBuilder.build()
Removed problems and tasks for project PathTesting-HasAspectPath
Bug 288395---logging build path problems, found 4
  /PathTesting-HasAspectPath : Archive for required library: '/jobs/genie.ajdt/ajdt-on-eclipse-45/workspace/org.eclipse.ajdt.ui.tests/target/work/data/PathTesting-VariableOnAspectPath/variable.jar' in project 'PathTesting-HasAspectPath' cannot be read or is not a valid ZIP file
  /PathTesting-HasAspectPath : Archive for required library: '/PathTesting-JarOnAspectPath/j.jar' in project 'PathTesting-HasAspectPath' cannot be read or is not a valid ZIP file
  /PathTesting-HasInpath : Archive for required library: '/jobs/genie.ajdt/ajdt-on-eclipse-45/workspace/org.eclipse.ajdt.ui.tests/target/work/data/PathTesting-VariableOnAspectPath/variable.jar' in project 'PathTesting-HasInpath' cannot be read or is not a valid ZIP file
  /PathTesting-HasInpath : Archive for required library: '/PathTesting-JarOnAspectPath/j.jar' in project 'PathTesting-HasInpath' cannot be read or is not a valid ZIP file
Bug 288395---logging build path problems, found 7
  /PathTesting-ContainerOnAspectPath/src/aspectPath/ContainerAspect.aj : no match for this type name: main.Main [Xlint:invalidAbsoluteTypeName]
  /PathTesting-ContainerOnAspectPath/src/aspectPath/ContainerAspect.aj : advice defined in aspectPath.ContainerAspect has not been applied [Xlint:adviceDidNotMatch]
  /PathTesting-HasAspectPath : The project was not built since it depends on PathTesting-HasAspectPath, which has build path errors
  /PathTesting-HasInpath : The project was not built since it depends on PathTesting-HasInpath, which has build path errors
  /PathTesting-JarOnAspectPath/src/aspectPath/JarAspect.java : advice defined in aspectPath.JarAspect has not been applied [Xlint:adviceDidNotMatch]
  /PathTesting-ProjectOnAspectPath/src/aspectPath/ProjectAspect.java : advice defined in aspectPath.ProjectAspect has not been applied [Xlint:adviceDidNotMatch]
  /PathTesting-VariableOnAspectPath/src/aspectPath/VariableAspect.java : advice defined in aspectPath.VariableAspect has not been applied [Xlint:adviceDidNotMatch]
build: Abort due to missing classpath/inpath/aspectpath entries
>> finished a build
Timer event: 1ms: Update visualizer, xref, advice listeners for (separate thread): DefaultEmptyProject
>> scheduled a build
===========================================================================================
Build kind = AUTOBUILD
Project=PathTesting-HasInpath, kind of build requested=Incremental AspectJ compilation
Timer event: 0ms: Flush included source file cache
Timer event: 0ms: Check delta
Timer event: 0ms: Looking for and marking configuration changes in PathTesting-HasInpath
	Configuration changes found: false
build: Examined delta - no source file or classpath changes for project PathTesting-HasInpath
Timer event: 0ms: Looking for and marking configuration changes in PathTesting-ProjectOnAspectPath
	Configuration changes found: false
Timer event: 0ms: Looking for and marking configuration changes in PathTesting-JarOnAspectPath
	Configuration changes found: false
Compiler configuration for project PathTesting-HasInpath has been read by compiler.  Resetting.
     Configuration was [PROJECTSOURCEFILES_CHANGED, JAVAOPTIONS_CHANGED, ASPECTPATH_CHANGED, CLASSPATH_CHANGED, INPATH_CHANGED, NONSTANDARDOPTIONS_CHANGED, OUTJAR_CHANGED, PROJECTSOURCERESOURCES_CHANGED, OUTPUTDESTINATIONS_CHANGED, INJARS_CHANGED]
Resetting list of modified source files.  Was null
Timer event: 0ms: Look for source/resource changes
No source/resource changes found, exiting build
Timer event: 1ms: Total time spent in AJBuilder.build()
===========================================================================================
Build kind = AUTOBUILD
Project=PathTesting-HasAspectPath, kind of build requested=Incremental AspectJ compilation
Timer event: 0ms: Flush included source file cache
Timer event: 0ms: Check delta
Timer event: 0ms: Looking for and marking configuration changes in PathTesting-HasAspectPath
	Configuration changes found: false
build: Examined delta - no source file or classpath changes for project PathTesting-HasAspectPath
Timer event: 0ms: Looking for and marking configuration changes in PathTesting-ProjectOnAspectPath
	Configuration changes found: false
Timer event: 0ms: Looking for and marking configuration changes in PathTesting-JarOnAspectPath
	Configuration changes found: false
Compiler configuration for project PathTesting-HasAspectPath has been read by compiler.  Resetting.
     Configuration was [PROJECTSOURCEFILES_CHANGED, JAVAOPTIONS_CHANGED, ASPECTPATH_CHANGED, CLASSPATH_CHANGED, INPATH_CHANGED, NONSTANDARDOPTIONS_CHANGED, OUTJAR_CHANGED, PROJECTSOURCERESOURCES_CHANGED, OUTPUTDESTINATIONS_CHANGED, INJARS_CHANGED]
Resetting list of modified source files.  Was null
Timer event: 0ms: Look for source/resource changes
No source/resource changes found, exiting build
Timer event: 1ms: Total time spent in AJBuilder.build()
>> finished a build
>> scheduled a build
>> finished a build
===========================================================================================
Build kind = FULLBUILD
Project=PathTesting-HasInpath, kind of build requested=Full AspectJ compilation
Timer event: 0ms: Flush included source file cache
Timer event: 0ms: Check delta
Builder: Tidied output folder(s), removed class files and derived resources
Classpath = /jobs/genie.ajdt/ajdt-on-eclipse-45/workspace/org.eclipse.ajdt.ui.tests/target/work/data/PathTesting-HasInpath/bin:/opt/public/common/jdk1.7.0_80/jre/lib/resources.jar:/opt/public/common/jdk1.7.0_80/jre/lib/rt.jar:/opt/public/common/jdk1.7.0_80/jre/lib/jsse.jar:/opt/public/common/jdk1.7.0_80/jre/lib/jce.jar:/opt/public/common/jdk1.7.0_80/jre/lib/charsets.jar:/opt/public/common/jdk1.7.0_80/jre/lib/jfr.jar:/opt/public/common/jdk1.7.0_80/jre/lib/ext/dnsns.jar:/opt/public/common/jdk1.7.0_80/jre/lib/ext/sunpkcs11.jar:/opt/public/common/jdk1.7.0_80/jre/lib/ext/zipfs.jar:/opt/public/common/jdk1.7.0_80/jre/lib/ext/sunec.jar:/opt/public/common/jdk1.7.0_80/jre/lib/ext/sunjce_provider.jar:/opt/public/common/jdk1.7.0_80/jre/lib/ext/localedata.jar:/jobs/genie.ajdt/ajdt-on-eclipse-45/workspace/org.aspectj.runtime/target/org.aspectj.runtime-1.8.9-SNAPSHOT.jar:/jobs/genie.ajdt/ajdt-on-eclipse-45/workspace/org.eclipse.ajdt.ui.tests/target/work/data/PathTesting-VariableOnAspectPath/variable.jar:/jobs/genie.ajdt/ajdt-on-eclipse-45/workspace/org.eclipse.ajdt.ui.tests/target/work/data/PathTesting-ContainerOnAspectPath/container.jar:/jobs/genie.ajdt/ajdt-on-eclipse-45/workspace/org.eclipse.ajdt.ui.tests/target/work/data/PathTesting-ProjectOnAspectPath/otherOutLocation:/jobs/genie.ajdt/ajdt-on-eclipse-45/workspace/org.eclipse.ajdt.ui.tests/target/work/configuration/org.eclipse.osgi/40/0/.cp/junit.jar:/jobs/genie.ajdt/ajdt-on-eclipse-45/workspace/org.eclipse.ajdt.ui.tests/target/work/data/PathTesting-JarOnAspectPath/j.jar:
Timer event: 3ms: Pre compile
Compiler configuration for project PathTesting-HasInpath has been read by compiler.  Resetting.
     Configuration was []
Resetting list of modified source files.  Was []
Preparing for build: not going to be incremental because no successful previous full build
AJC: compiling source files
Timer event: 41ms: Time to first compiled message
AJC: compiled: /jobs/genie.ajdt/ajdt-on-eclipse-45/workspace/org.eclipse.ajdt.ui.tests/target/work/data/PathTesting-HasInpath/src/aspects/AdviseClassOnInpath.aj
Timer event: 45ms: Time to first woven message
AJC: woven aspect aspects.AdviseClassOnInpath (from /jobs/genie.ajdt/ajdt-on-eclipse-45/workspace/org.eclipse.ajdt.ui.tests/target/work/data/PathTesting-HasInpath/src/aspects/AdviseClassOnInpath.aj)
AJC: woven aspect aspectPath.ContainerAspect (from /jobs/genie.ajdt/ajdt-on-eclipse-45/workspace/org.eclipse.ajdt.ui.tests/target/work/data/PathTesting-ContainerOnAspectPath/container.jar)
AJC: woven aspect aspectPath.ProjectAspect (from /jobs/genie.ajdt/ajdt-on-eclipse-45/workspace/org.eclipse.ajdt.ui.tests/target/work/data/PathTesting-ProjectOnAspectPath/otherOutLocation/aspectPath/ProjectAspect.class)
AJC: woven aspect aspectPath.VariableAspect (from /jobs/genie.ajdt/ajdt-on-eclipse-45/workspace/org.eclipse.ajdt.ui.tests/target/work/data/PathTesting-VariableOnAspectPath/variable.jar)
AJC: woven aspect aspectPath.JarAspect (from /jobs/genie.ajdt/ajdt-on-eclipse-45/workspace/org.eclipse.ajdt.ui.tests/target/work/data/PathTesting-JarOnAspectPath/j.jar)
AJC: woven class aspectPath.ContainerInpath (from /jobs/genie.ajdt/ajdt-on-eclipse-45/workspace/org.eclipse.ajdt.ui.tests/target/work/data/PathTesting-ContainerOnAspectPath/container.jar)
AJC: woven class aspectPath.VariableInpath (from /jobs/genie.ajdt/ajdt-on-eclipse-45/workspace/org.eclipse.ajdt.ui.tests/target/work/data/PathTesting-VariableOnAspectPath/variable.jar)
AJC: woven class aspectPath.ProjectInpath (from /jobs/genie.ajdt/ajdt-on-eclipse-45/workspace/org.eclipse.ajdt.ui.tests/target/work/data/PathTesting-ProjectOnAspectPath/otherOutLocation/aspectPath/ProjectInpath.class)
AJC: woven class aspectPath.JarInpath (from /jobs/genie.ajdt/ajdt-on-eclipse-45/workspace/org.eclipse.ajdt.ui.tests/target/work/data/PathTesting-JarOnAspectPath/j.jar)
advice defined in aspectPath.ContainerAspect has not been applied [Xlint:adviceDidNotMatch]
advice defined in aspectPath.JarAspect has not been applied [Xlint:adviceDidNotMatch]
advice defined in aspectPath.VariableAspect has not been applied [Xlint:adviceDidNotMatch]
advice defined in aspectPath.ProjectAspect has not been applied [Xlint:adviceDidNotMatch]
AspectJ reports build successful, build was: FULL
AJDE Callback: finish. Was full build: true
Timer event: 57ms: Total time spent in AJDE
Timer event: 0ms: Refresh after build
Types affected during build = 1
>> scheduled a build
Crosscutting model sanity checked with no problems
Timer event: 0ms: Model sanity check for: PathTesting-HasInpath
Timer event: 64ms: Total time spent in AJBuilder.build()
>> scheduled a build
Timer event: 2ms: Delete markers: PathTesting-HasInpath (Finished deleting markers for PathTesting-HasInpath)
Timer event: 1ms: Create markers: PathTesting-HasInpath (Finished creating markers for PathTesting-HasInpath)
Created 0 markers in 1 files
>> finished a build
Timer event: 1ms: Update visualizer, xref, advice listeners for (separate thread): PathTesting-HasInpath
>> finished a build
Building AJ code scanner
Editor opened on AdviseClassOnInpath.aj
>> scheduled a build
>> finished a build
[ERROR] Timeout 7200 s exceeded. Process was killed.
[INFO] ------------------------------------------------------------------------
[INFO] Reactor Summary:
[INFO] 
[INFO] parent ............................................. SUCCESS [  0.238 s]
[INFO] org.aspectj.runtime ................................ SUCCESS [  4.744 s]
[INFO] org.aspectj.weaver ................................. SUCCESS [  4.969 s]
[INFO] org.aspectj.ajde ................................... SUCCESS [  7.671 s]
[INFO] org.aspectj ........................................ SUCCESS [  6.167 s]
[INFO] org.eclipse.contribution.weaving.jdt ............... SUCCESS [  6.195 s]
[INFO] org.eclipse.ajdt.core .............................. SUCCESS [ 10.905 s]
[INFO] org.eclipse.ajdt.doc.user .......................... SUCCESS [  8.041 s]
[INFO] org.eclipse.ajdt.examples .......................... SUCCESS [ 19.728 s]
[INFO] org.eclipse.contribution.visualiser ................ SUCCESS [ 10.199 s]
[INFO] org.eclipse.contribution.xref.core ................. SUCCESS [  3.304 s]
[INFO] org.eclipse.contribution.xref.ui ................... SUCCESS [  3.472 s]
[INFO] org.eclipse.ajdt.ui ................................ SUCCESS [ 12.621 s]
[INFO] org.eclipse.aspectj ................................ SUCCESS [  1.520 s]
[INFO] org.eclipse.ajdt.mylyn.ui .......................... SUCCESS [  3.274 s]
[INFO] org.eclipse.equinox.weaving.aspectj ................ SUCCESS [  9.896 s]
[INFO] org.eclipse.equinox.weaving.sdk .................... SUCCESS [  1.577 s]
[INFO] org.eclipse.ajdt ................................... SUCCESS [  4.072 s]
[INFO] org.eclipse.contribution.weaving ................... SUCCESS [ 13.635 s]
[INFO] org.eclipse.contribution.xref ...................... SUCCESS [  7.006 s]
[INFO] org.eclipse.ajdt.sdk ............................... SUCCESS [  1.947 s]
[INFO] org.eclipse.ajdt.core.tests ........................ SUCCESS [36:09 min]
[INFO] org.eclipse.contribution.visualiser.tests .......... SUCCESS [ 22.442 s]
[INFO] org.eclipse.ajdt.ui.tests .......................... FAILURE [  02:00 h]
[INFO] org.eclipse.ajdt.mylyn.ui.tests .................... SKIPPED
[INFO] org.eclipse.contribution.weaving.jdt.tests ......... SKIPPED
[INFO] org.eclipse.contribution.xref.core.tests ........... SKIPPED
[INFO] org.eclipse.contribution.xref.ui.tests ............. SKIPPED
[INFO] org.eclipse.aspectj.feature_tests .................. SKIPPED
[INFO] org.eclipse.ajdt.releng ............................ SKIPPED
[INFO] ------------------------------------------------------------------------
[INFO] BUILD FAILURE
[INFO] ------------------------------------------------------------------------
[INFO] Total time: 02:39 h
[INFO] Finished at: 2016-03-15T16:42:13-04:00
[INFO] Final Memory: 355M/7932M
[INFO] ------------------------------------------------------------------------
[INFO] o.h.m.e.h.MavenExecutionResultHandler - Build failed with exception(s)
[INFO] o.h.m.e.h.MavenExecutionResultHandler - [1] org.apache.maven.lifecycle.LifecycleExecutionException: Failed to execute goal org.eclipse.tycho:tycho-surefire-plugin:0.23.1:test (default-test) on project org.eclipse.ajdt.ui.tests: An unexpected error occured while launching the test runtime (return code 143). See log for details.
[DEBUG] Closing connection to remote
[ERROR] Failed to execute goal org.eclipse.tycho:tycho-surefire-plugin:0.23.1:test (default-test) on project org.eclipse.ajdt.ui.tests: An unexpected error occured while launching the test runtime (return code 143). See log for details. -> [Help 1]
org.apache.maven.lifecycle.LifecycleExecutionException: Failed to execute goal org.eclipse.tycho:tycho-surefire-plugin:0.23.1:test (default-test) on project org.eclipse.ajdt.ui.tests: An unexpected error occured while launching the test runtime (return code 143). See log for details.
	at org.apache.maven.lifecycle.internal.MojoExecutor.execute(MojoExecutor.java:212)
	at org.apache.maven.lifecycle.internal.MojoExecutor.execute(MojoExecutor.java:153)
	at org.apache.maven.lifecycle.internal.MojoExecutor.execute(MojoExecutor.java:145)
	at org.apache.maven.lifecycle.internal.LifecycleModuleBuilder.buildProject(LifecycleModuleBuilder.java:116)
	at org.apache.maven.lifecycle.internal.LifecycleModuleBuilder.buildProject(LifecycleModuleBuilder.java:80)
	at org.apache.maven.lifecycle.internal.builder.singlethreaded.SingleThreadedBuilder.build(SingleThreadedBuilder.java:51)
	at org.apache.maven.lifecycle.internal.LifecycleStarter.execute(LifecycleStarter.java:128)
	at org.apache.maven.DefaultMaven.doExecute(DefaultMaven.java:307)
	at org.apache.maven.DefaultMaven.doExecute(DefaultMaven.java:193)
	at org.apache.maven.DefaultMaven.execute(DefaultMaven.java:106)
	at org.apache.maven.cli.MavenCli.execute(MavenCli.java:863)
	at org.apache.maven.cli.MavenCli.doMain(MavenCli.java:288)
	at org.apache.maven.cli.MavenCli.main(MavenCli.java:199)
	at sun.reflect.NativeMethodAccessorImpl.invoke0(Native Method)
	at sun.reflect.NativeMethodAccessorImpl.invoke(NativeMethodAccessorImpl.java:57)
	at sun.reflect.DelegatingMethodAccessorImpl.invoke(DelegatingMethodAccessorImpl.java:43)
	at java.lang.reflect.Method.invoke(Method.java:606)
	at org.codehaus.plexus.classworlds.launcher.Launcher.launchEnhanced(Launcher.java:289)
	at org.codehaus.plexus.classworlds.launcher.Launcher.launch(Launcher.java:229)
	at org.codehaus.plexus.classworlds.launcher.Launcher.mainWithExitCode(Launcher.java:415)
	at org.codehaus.plexus.classworlds.launcher.Launcher.main(Launcher.java:356)
Caused by: org.apache.maven.plugin.MojoFailureException: An unexpected error occured while launching the test runtime (return code 143). See log for details.
	at org.eclipse.tycho.surefire.TestMojo.runTest(TestMojo.java:950)
	at org.eclipse.tycho.surefire.TestMojo.execute(TestMojo.java:630)
	at org.apache.maven.plugin.DefaultBuildPluginManager.executeMojo(DefaultBuildPluginManager.java:134)
	at org.apache.maven.lifecycle.internal.MojoExecutor.execute(MojoExecutor.java:207)
	... 20 more
[ERROR] 
[ERROR] Re-run Maven using the -X switch to enable full debug logging.
[ERROR] 
[ERROR] For more information about the errors and possible solutions, please read the following articles:
[ERROR] [Help 1] http://cwiki.apache.org/confluence/display/MAVEN/MojoFailureException
[ERROR] 
[ERROR] After correcting the problems, you can resume the build with the command
[ERROR]   mvn <goals> -rf :org.eclipse.ajdt.ui.tests
[DEBUG] Waiting for process to finish
[DEBUG] Result: 1
Terminating xvnc.
Recording test results
Finished: FAILURE