FailedConsole Output

Skipping 5,896 KB.. Full Log
ui.tests/target/work/data/ITDContentAssist/src/uses/UsesITDs.aj)
The import java.util.List is never used
AJC: compiled: /jobs/genie.ajdt/ajdt-on-eclipse-45/workspace/org.eclipse.ajdt.ui.tests/target/work/data/ITDContentAssist/src/injavafiles/uses/UsesITDs.java
AJC: woven class injavafiles.uses.UsesITDs (from /jobs/genie.ajdt/ajdt-on-eclipse-45/workspace/org.eclipse.ajdt.ui.tests/target/work/data/ITDContentAssist/src/injavafiles/uses/UsesITDs.java)
The import java.util.List is never used
AspectJ reports build successful, build was: FULL
AJDE Callback: finish. Was full build: true
Timer event: 90ms: Total time spent in AJDE
Timer event: 0ms: Refresh after build
Types affected during build = 7
Timer event: 0ms: Delete markers: ITDContentAssist (Finished deleting markers for ITDContentAssist)
Timer event: 7ms: Create markers: ITDContentAssist (Finished creating markers for ITDContentAssist)
Created 16 markers in 7 files
Crosscutting model sanity checked with no problems
Timer event: 11ms: Model sanity check for: ITDContentAssist
Timer event: 108ms: Total time spent in AJBuilder.build()
Timer event: 1ms: Update visualizer, xref, advice listeners for (separate thread): ITDContentAssist
===========================================================================================
Build kind = AUTOBUILD
Project=DefaultEmptyProject, kind of build requested=Incremental AspectJ compilation
Timer event: 0ms: Flush included source file cache
Timer event: 0ms: Check delta
CoreCompilerConfiguration for project DefaultEmptyProject registered a configuration change: [ASPECTPATH_CHANGED, CLASSPATH_CHANGED, INPATH_CHANGED, OUTPUTDESTINATIONS_CHANGED]
Timer event: 0ms: Looking for and marking configuration changes in DefaultEmptyProject
	Configuration changes found: true
Timer event: 0ms: Look for source/resource changes
Setting list of classpath elements with modified contents:
      []
Classpath = /jobs/genie.ajdt/ajdt-on-eclipse-45/workspace/org.eclipse.ajdt.ui.tests/target/work/data/DefaultEmptyProject/bin:/jobs/genie.ajdt/ajdt-on-eclipse-45/workspace/org.aspectj.runtime/target/org.aspectj.runtime-1.8.9-SNAPSHOT.jar:/opt/public/common/jdk1.7.0_80/jre/lib/resources.jar:/opt/public/common/jdk1.7.0_80/jre/lib/rt.jar:/opt/public/common/jdk1.7.0_80/jre/lib/jsse.jar:/opt/public/common/jdk1.7.0_80/jre/lib/jce.jar:/opt/public/common/jdk1.7.0_80/jre/lib/charsets.jar:/opt/public/common/jdk1.7.0_80/jre/lib/jfr.jar:/opt/public/common/jdk1.7.0_80/jre/lib/ext/dnsns.jar:/opt/public/common/jdk1.7.0_80/jre/lib/ext/sunpkcs11.jar:/opt/public/common/jdk1.7.0_80/jre/lib/ext/zipfs.jar:/opt/public/common/jdk1.7.0_80/jre/lib/ext/sunec.jar:/opt/public/common/jdk1.7.0_80/jre/lib/ext/sunjce_provider.jar:/opt/public/common/jdk1.7.0_80/jre/lib/ext/localedata.jar:/jobs/genie.ajdt/ajdt-on-eclipse-45/workspace/org.eclipse.ajdt.ui.tests/target/work/configuration/org.eclipse.osgi/40/0/.cp/junit.jar:/jobs/genie.ajdt/ajdt-on-eclipse-45/workspace/org.eclipse.ajdt.ui.tests/target/work/configuration/org.eclipse.osgi/223/0/.cp:
Timer event: 10ms: Pre compile
Sending the following configuration changes to the compiler: [ASPECTPATH_CHANGED, CLASSPATH_CHANGED, INPATH_CHANGED, OUTPUTDESTINATIONS_CHANGED]
Compiler configuration for project DefaultEmptyProject has been read by compiler.  Resetting.
     Configuration was [ASPECTPATH_CHANGED, CLASSPATH_CHANGED, INPATH_CHANGED, OUTPUTDESTINATIONS_CHANGED]
Resetting list of modified source files.  Was []
ClassFileChangeChecking: failed to find a state instance managing output location : /jobs/genie.ajdt/ajdt-on-eclipse-45/workspace/org.eclipse.ajdt.ui.tests/target/work/configuration/org.eclipse.osgi/223/0/.cp (could be getting managed by JDT)
Timer event: 0ms: OutputLocationManager: binary folder to declaring project map creation: P/DefaultEmptyProject
Preparing for build: planning to be an incremental build
AspectJ reports build successful, build was: INCREMENTAL
AJDE Callback: finish. Was full build: false
Timer event: 5ms: Total time spent in AJDE
Timer event: 0ms: Refresh after build
Crosscutting model sanity checked with no problems
Timer event: 0ms: Model sanity check for: DefaultEmptyProject
Timer event: 15ms: Total time spent in AJBuilder.build()
Timer event: 1ms: Update visualizer, xref, advice listeners for (separate thread): DefaultEmptyProject
------------------------
Starting testITDConstructorInOtherClass
Compiler configuration for project ITDContentAssist doesn't know previous state, so assuming EVERYTHING has changed.
===========================================================================================
Build kind = FULLBUILD
Project=ITDContentAssist, kind of build requested=Full AspectJ compilation
Timer event: 0ms: Flush included source file cache
Timer event: 0ms: Check delta
Builder: Tidied output folder(s), removed class files and derived resources
Classpath = /jobs/genie.ajdt/ajdt-on-eclipse-45/workspace/org.eclipse.ajdt.ui.tests/target/work/data/ITDContentAssist/bin:/opt/public/common/jdk1.7.0_80/jre/lib/resources.jar:/opt/public/common/jdk1.7.0_80/jre/lib/rt.jar:/opt/public/common/jdk1.7.0_80/jre/lib/jsse.jar:/opt/public/common/jdk1.7.0_80/jre/lib/jce.jar:/opt/public/common/jdk1.7.0_80/jre/lib/charsets.jar:/opt/public/common/jdk1.7.0_80/jre/lib/jfr.jar:/opt/public/common/jdk1.7.0_80/jre/lib/ext/dnsns.jar:/opt/public/common/jdk1.7.0_80/jre/lib/ext/sunpkcs11.jar:/opt/public/common/jdk1.7.0_80/jre/lib/ext/zipfs.jar:/opt/public/common/jdk1.7.0_80/jre/lib/ext/sunec.jar:/opt/public/common/jdk1.7.0_80/jre/lib/ext/sunjce_provider.jar:/opt/public/common/jdk1.7.0_80/jre/lib/ext/localedata.jar:/jobs/genie.ajdt/ajdt-on-eclipse-45/workspace/org.aspectj.runtime/target/org.aspectj.runtime-1.8.9-SNAPSHOT.jar:
Timer event: 3ms: Pre compile
Compiler configuration for project ITDContentAssist has been read by compiler.  Resetting.
     Configuration was [PROJECTSOURCEFILES_CHANGED, JAVAOPTIONS_CHANGED, ASPECTPATH_CHANGED, CLASSPATH_CHANGED, INPATH_CHANGED, NONSTANDARDOPTIONS_CHANGED, OUTJAR_CHANGED, PROJECTSOURCERESOURCES_CHANGED, OUTPUTDESTINATIONS_CHANGED, INJARS_CHANGED]
Resetting list of modified source files.  Was null
Preparing for build: not going to be incremental because no successful previous full build
AJC: compiling source files
Timer event: 53ms: Time to first compiled message
AJC: compiled: /jobs/genie.ajdt/ajdt-on-eclipse-45/workspace/org.eclipse.ajdt.ui.tests/target/work/data/ITDContentAssist/src/injavafiles/itds/ITDAspect.aj
AJC: compiled: /jobs/genie.ajdt/ajdt-on-eclipse-45/workspace/org.eclipse.ajdt.ui.tests/target/work/data/ITDContentAssist/src/itds/ITDAspect.aj
Timer event: 63ms: Time to first woven message
AJC: woven aspect injavafiles.itds.ITDAspect (from /jobs/genie.ajdt/ajdt-on-eclipse-45/workspace/org.eclipse.ajdt.ui.tests/target/work/data/ITDContentAssist/src/injavafiles/itds/ITDAspect.aj)
AJC: woven aspect itds.ITDAspect (from /jobs/genie.ajdt/ajdt-on-eclipse-45/workspace/org.eclipse.ajdt.ui.tests/target/work/data/ITDContentAssist/src/itds/ITDAspect.aj)
AJC: woven aspect itds.ITDAspect$AjcClosure1 (from /jobs/genie.ajdt/ajdt-on-eclipse-45/workspace/org.eclipse.ajdt.ui.tests/target/work/data/ITDContentAssist/src/itds/ITDAspect.aj)
AJC: woven class injavafiles.itds.ITDAspect$Super (from /jobs/genie.ajdt/ajdt-on-eclipse-45/workspace/org.eclipse.ajdt.ui.tests/target/work/data/ITDContentAssist/src/injavafiles/itds/ITDAspect.aj)
AJC: woven class itds.ITDAspect$Super (from /jobs/genie.ajdt/ajdt-on-eclipse-45/workspace/org.eclipse.ajdt.ui.tests/target/work/data/ITDContentAssist/src/itds/ITDAspect.aj)
The value of the local variable x is not used
AJC: compiled: /jobs/genie.ajdt/ajdt-on-eclipse-45/workspace/org.eclipse.ajdt.ui.tests/target/work/data/ITDContentAssist/src/hasitds/HasITDs.aj
AJC: woven class hasitds.HasITDs (from /jobs/genie.ajdt/ajdt-on-eclipse-45/workspace/org.eclipse.ajdt.ui.tests/target/work/data/ITDContentAssist/src/hasitds/HasITDs.aj)
The import itds.ITDAspect is never used
The import java.util.List is never used
AJC: compiled: /jobs/genie.ajdt/ajdt-on-eclipse-45/workspace/org.eclipse.ajdt.ui.tests/target/work/data/ITDContentAssist/src/other/Gen.java
AJC: woven class other.Gen (from /jobs/genie.ajdt/ajdt-on-eclipse-45/workspace/org.eclipse.ajdt.ui.tests/target/work/data/ITDContentAssist/src/other/Gen.java)
AJC: compiled: /jobs/genie.ajdt/ajdt-on-eclipse-45/workspace/org.eclipse.ajdt.ui.tests/target/work/data/ITDContentAssist/src/injavafiles/hasitds/HasITDs.java
AJC: woven class injavafiles.hasitds.HasITDs (from /jobs/genie.ajdt/ajdt-on-eclipse-45/workspace/org.eclipse.ajdt.ui.tests/target/work/data/ITDContentAssist/src/injavafiles/hasitds/HasITDs.java)
The import injavafiles.itds.ITDAspect is never used
The import java.util.List is never used
AJC: compiled: /jobs/genie.ajdt/ajdt-on-eclipse-45/workspace/org.eclipse.ajdt.ui.tests/target/work/data/ITDContentAssist/src/uses/UsesITDs.aj
AJC: woven class uses.UsesITDs (from /jobs/genie.ajdt/ajdt-on-eclipse-45/workspace/org.eclipse.ajdt.ui.tests/target/work/data/ITDContentAssist/src/uses/UsesITDs.aj)
The import java.util.List is never used
AJC: compiled: /jobs/genie.ajdt/ajdt-on-eclipse-45/workspace/org.eclipse.ajdt.ui.tests/target/work/data/ITDContentAssist/src/injavafiles/uses/UsesITDs.java
AJC: woven class injavafiles.uses.UsesITDs (from /jobs/genie.ajdt/ajdt-on-eclipse-45/workspace/org.eclipse.ajdt.ui.tests/target/work/data/ITDContentAssist/src/injavafiles/uses/UsesITDs.java)
The import java.util.List is never used
AspectJ reports build successful, build was: FULL
AJDE Callback: finish. Was full build: true
Timer event: 94ms: Total time spent in AJDE
Timer event: 0ms: Refresh after build
Types affected during build = 7
Timer event: 1ms: Delete markers: ITDContentAssist (Finished deleting markers for ITDContentAssist)
Timer event: 8ms: Create markers: ITDContentAssist (Finished creating markers for ITDContentAssist)
Created 16 markers in 7 files
Crosscutting model sanity checked with no problems
Timer event: 10ms: Model sanity check for: ITDContentAssist
Timer event: 110ms: Total time spent in AJBuilder.build()
Timer event: 0ms: Update visualizer, xref, advice listeners for (separate thread): ITDContentAssist
===========================================================================================
Build kind = AUTOBUILD
Project=DefaultEmptyProject, kind of build requested=Incremental AspectJ compilation
Timer event: 0ms: Flush included source file cache
Timer event: 0ms: Check delta
CoreCompilerConfiguration for project DefaultEmptyProject registered a configuration change: [ASPECTPATH_CHANGED, CLASSPATH_CHANGED, INPATH_CHANGED, OUTPUTDESTINATIONS_CHANGED]
Timer event: 0ms: Looking for and marking configuration changes in DefaultEmptyProject
	Configuration changes found: true
Timer event: 0ms: Look for source/resource changes
Setting list of classpath elements with modified contents:
      []
Classpath = /jobs/genie.ajdt/ajdt-on-eclipse-45/workspace/org.eclipse.ajdt.ui.tests/target/work/data/DefaultEmptyProject/bin:/jobs/genie.ajdt/ajdt-on-eclipse-45/workspace/org.aspectj.runtime/target/org.aspectj.runtime-1.8.9-SNAPSHOT.jar:/opt/public/common/jdk1.7.0_80/jre/lib/resources.jar:/opt/public/common/jdk1.7.0_80/jre/lib/rt.jar:/opt/public/common/jdk1.7.0_80/jre/lib/jsse.jar:/opt/public/common/jdk1.7.0_80/jre/lib/jce.jar:/opt/public/common/jdk1.7.0_80/jre/lib/charsets.jar:/opt/public/common/jdk1.7.0_80/jre/lib/jfr.jar:/opt/public/common/jdk1.7.0_80/jre/lib/ext/dnsns.jar:/opt/public/common/jdk1.7.0_80/jre/lib/ext/sunpkcs11.jar:/opt/public/common/jdk1.7.0_80/jre/lib/ext/zipfs.jar:/opt/public/common/jdk1.7.0_80/jre/lib/ext/sunec.jar:/opt/public/common/jdk1.7.0_80/jre/lib/ext/sunjce_provider.jar:/opt/public/common/jdk1.7.0_80/jre/lib/ext/localedata.jar:/jobs/genie.ajdt/ajdt-on-eclipse-45/workspace/org.eclipse.ajdt.ui.tests/target/work/configuration/org.eclipse.osgi/40/0/.cp/junit.jar:/jobs/genie.ajdt/ajdt-on-eclipse-45/workspace/org.eclipse.ajdt.ui.tests/target/work/configuration/org.eclipse.osgi/223/0/.cp:
Timer event: 7ms: Pre compile
Sending the following configuration changes to the compiler: [ASPECTPATH_CHANGED, CLASSPATH_CHANGED, INPATH_CHANGED, OUTPUTDESTINATIONS_CHANGED]
Compiler configuration for project DefaultEmptyProject has been read by compiler.  Resetting.
     Configuration was [ASPECTPATH_CHANGED, CLASSPATH_CHANGED, INPATH_CHANGED, OUTPUTDESTINATIONS_CHANGED]
Resetting list of modified source files.  Was []
ClassFileChangeChecking: failed to find a state instance managing output location : /jobs/genie.ajdt/ajdt-on-eclipse-45/workspace/org.eclipse.ajdt.ui.tests/target/work/configuration/org.eclipse.osgi/223/0/.cp (could be getting managed by JDT)
Timer event: 0ms: OutputLocationManager: binary folder to declaring project map creation: P/DefaultEmptyProject
Preparing for build: planning to be an incremental build
AspectJ reports build successful, build was: INCREMENTAL
AJDE Callback: finish. Was full build: false
Timer event: 7ms: Total time spent in AJDE
Timer event: 0ms: Refresh after build
Crosscutting model sanity checked with no problems
Timer event: 0ms: Model sanity check for: DefaultEmptyProject
Timer event: 14ms: Total time spent in AJBuilder.build()
Timer event: 1ms: Update visualizer, xref, advice listeners for (separate thread): DefaultEmptyProject
------------------------
Starting testITDMethodInOtherClass
Compiler configuration for project ITDContentAssist doesn't know previous state, so assuming EVERYTHING has changed.
===========================================================================================
Build kind = FULLBUILD
Project=ITDContentAssist, kind of build requested=Full AspectJ compilation
Timer event: 0ms: Flush included source file cache
Timer event: 0ms: Check delta
Builder: Tidied output folder(s), removed class files and derived resources
Classpath = /jobs/genie.ajdt/ajdt-on-eclipse-45/workspace/org.eclipse.ajdt.ui.tests/target/work/data/ITDContentAssist/bin:/opt/public/common/jdk1.7.0_80/jre/lib/resources.jar:/opt/public/common/jdk1.7.0_80/jre/lib/rt.jar:/opt/public/common/jdk1.7.0_80/jre/lib/jsse.jar:/opt/public/common/jdk1.7.0_80/jre/lib/jce.jar:/opt/public/common/jdk1.7.0_80/jre/lib/charsets.jar:/opt/public/common/jdk1.7.0_80/jre/lib/jfr.jar:/opt/public/common/jdk1.7.0_80/jre/lib/ext/dnsns.jar:/opt/public/common/jdk1.7.0_80/jre/lib/ext/sunpkcs11.jar:/opt/public/common/jdk1.7.0_80/jre/lib/ext/zipfs.jar:/opt/public/common/jdk1.7.0_80/jre/lib/ext/sunec.jar:/opt/public/common/jdk1.7.0_80/jre/lib/ext/sunjce_provider.jar:/opt/public/common/jdk1.7.0_80/jre/lib/ext/localedata.jar:/jobs/genie.ajdt/ajdt-on-eclipse-45/workspace/org.aspectj.runtime/target/org.aspectj.runtime-1.8.9-SNAPSHOT.jar:
Timer event: 4ms: Pre compile
Compiler configuration for project ITDContentAssist has been read by compiler.  Resetting.
     Configuration was [PROJECTSOURCEFILES_CHANGED, JAVAOPTIONS_CHANGED, ASPECTPATH_CHANGED, CLASSPATH_CHANGED, INPATH_CHANGED, NONSTANDARDOPTIONS_CHANGED, OUTJAR_CHANGED, PROJECTSOURCERESOURCES_CHANGED, OUTPUTDESTINATIONS_CHANGED, INJARS_CHANGED]
Resetting list of modified source files.  Was null
Preparing for build: not going to be incremental because no successful previous full build
AJC: compiling source files
Timer event: 49ms: Time to first compiled message
AJC: compiled: /jobs/genie.ajdt/ajdt-on-eclipse-45/workspace/org.eclipse.ajdt.ui.tests/target/work/data/ITDContentAssist/src/injavafiles/itds/ITDAspect.aj
AJC: compiled: /jobs/genie.ajdt/ajdt-on-eclipse-45/workspace/org.eclipse.ajdt.ui.tests/target/work/data/ITDContentAssist/src/itds/ITDAspect.aj
Timer event: 60ms: Time to first woven message
AJC: woven aspect injavafiles.itds.ITDAspect (from /jobs/genie.ajdt/ajdt-on-eclipse-45/workspace/org.eclipse.ajdt.ui.tests/target/work/data/ITDContentAssist/src/injavafiles/itds/ITDAspect.aj)
AJC: woven aspect itds.ITDAspect (from /jobs/genie.ajdt/ajdt-on-eclipse-45/workspace/org.eclipse.ajdt.ui.tests/target/work/data/ITDContentAssist/src/itds/ITDAspect.aj)
AJC: woven aspect itds.ITDAspect$AjcClosure1 (from /jobs/genie.ajdt/ajdt-on-eclipse-45/workspace/org.eclipse.ajdt.ui.tests/target/work/data/ITDContentAssist/src/itds/ITDAspect.aj)
AJC: woven class injavafiles.itds.ITDAspect$Super (from /jobs/genie.ajdt/ajdt-on-eclipse-45/workspace/org.eclipse.ajdt.ui.tests/target/work/data/ITDContentAssist/src/injavafiles/itds/ITDAspect.aj)
AJC: woven class itds.ITDAspect$Super (from /jobs/genie.ajdt/ajdt-on-eclipse-45/workspace/org.eclipse.ajdt.ui.tests/target/work/data/ITDContentAssist/src/itds/ITDAspect.aj)
The value of the local variable x is not used
AJC: compiled: /jobs/genie.ajdt/ajdt-on-eclipse-45/workspace/org.eclipse.ajdt.ui.tests/target/work/data/ITDContentAssist/src/hasitds/HasITDs.aj
AJC: woven class hasitds.HasITDs (from /jobs/genie.ajdt/ajdt-on-eclipse-45/workspace/org.eclipse.ajdt.ui.tests/target/work/data/ITDContentAssist/src/hasitds/HasITDs.aj)
The import itds.ITDAspect is never used
The import java.util.List is never used
AJC: compiled: /jobs/genie.ajdt/ajdt-on-eclipse-45/workspace/org.eclipse.ajdt.ui.tests/target/work/data/ITDContentAssist/src/other/Gen.java
AJC: woven class other.Gen (from /jobs/genie.ajdt/ajdt-on-eclipse-45/workspace/org.eclipse.ajdt.ui.tests/target/work/data/ITDContentAssist/src/other/Gen.java)
AJC: compiled: /jobs/genie.ajdt/ajdt-on-eclipse-45/workspace/org.eclipse.ajdt.ui.tests/target/work/data/ITDContentAssist/src/injavafiles/hasitds/HasITDs.java
AJC: woven class injavafiles.hasitds.HasITDs (from /jobs/genie.ajdt/ajdt-on-eclipse-45/workspace/org.eclipse.ajdt.ui.tests/target/work/data/ITDContentAssist/src/injavafiles/hasitds/HasITDs.java)
The import injavafiles.itds.ITDAspect is never used
The import java.util.List is never used
AJC: compiled: /jobs/genie.ajdt/ajdt-on-eclipse-45/workspace/org.eclipse.ajdt.ui.tests/target/work/data/ITDContentAssist/src/uses/UsesITDs.aj
AJC: woven class uses.UsesITDs (from /jobs/genie.ajdt/ajdt-on-eclipse-45/workspace/org.eclipse.ajdt.ui.tests/target/work/data/ITDContentAssist/src/uses/UsesITDs.aj)
The import java.util.List is never used
AJC: compiled: /jobs/genie.ajdt/ajdt-on-eclipse-45/workspace/org.eclipse.ajdt.ui.tests/target/work/data/ITDContentAssist/src/injavafiles/uses/UsesITDs.java
AJC: woven class injavafiles.uses.UsesITDs (from /jobs/genie.ajdt/ajdt-on-eclipse-45/workspace/org.eclipse.ajdt.ui.tests/target/work/data/ITDContentAssist/src/injavafiles/uses/UsesITDs.java)
The import java.util.List is never used
AspectJ reports build successful, build was: FULL
AJDE Callback: finish. Was full build: true
Timer event: 114ms: Total time spent in AJDE
Timer event: 0ms: Refresh after build
Types affected during build = 7
Timer event: 1ms: Delete markers: ITDContentAssist (Finished deleting markers for ITDContentAssist)
Timer event: 8ms: Create markers: ITDContentAssist (Finished creating markers for ITDContentAssist)
Created 16 markers in 7 files
Crosscutting model sanity checked with no problems
Timer event: 10ms: Model sanity check for: ITDContentAssist
Timer event: 134ms: Total time spent in AJBuilder.build()
Timer event: 1ms: Update visualizer, xref, advice listeners for (separate thread): ITDContentAssist
===========================================================================================
Build kind = AUTOBUILD
Project=DefaultEmptyProject, kind of build requested=Incremental AspectJ compilation
Timer event: 0ms: Flush included source file cache
Timer event: 0ms: Check delta
CoreCompilerConfiguration for project DefaultEmptyProject registered a configuration change: [ASPECTPATH_CHANGED, CLASSPATH_CHANGED, INPATH_CHANGED, OUTPUTDESTINATIONS_CHANGED]
Timer event: 0ms: Looking for and marking configuration changes in DefaultEmptyProject
	Configuration changes found: true
Timer event: 0ms: Look for source/resource changes
Setting list of classpath elements with modified contents:
      []
Classpath = /jobs/genie.ajdt/ajdt-on-eclipse-45/workspace/org.eclipse.ajdt.ui.tests/target/work/data/DefaultEmptyProject/bin:/jobs/genie.ajdt/ajdt-on-eclipse-45/workspace/org.aspectj.runtime/target/org.aspectj.runtime-1.8.9-SNAPSHOT.jar:/opt/public/common/jdk1.7.0_80/jre/lib/resources.jar:/opt/public/common/jdk1.7.0_80/jre/lib/rt.jar:/opt/public/common/jdk1.7.0_80/jre/lib/jsse.jar:/opt/public/common/jdk1.7.0_80/jre/lib/jce.jar:/opt/public/common/jdk1.7.0_80/jre/lib/charsets.jar:/opt/public/common/jdk1.7.0_80/jre/lib/jfr.jar:/opt/public/common/jdk1.7.0_80/jre/lib/ext/dnsns.jar:/opt/public/common/jdk1.7.0_80/jre/lib/ext/sunpkcs11.jar:/opt/public/common/jdk1.7.0_80/jre/lib/ext/zipfs.jar:/opt/public/common/jdk1.7.0_80/jre/lib/ext/sunec.jar:/opt/public/common/jdk1.7.0_80/jre/lib/ext/sunjce_provider.jar:/opt/public/common/jdk1.7.0_80/jre/lib/ext/localedata.jar:/jobs/genie.ajdt/ajdt-on-eclipse-45/workspace/org.eclipse.ajdt.ui.tests/target/work/configuration/org.eclipse.osgi/40/0/.cp/junit.jar:/jobs/genie.ajdt/ajdt-on-eclipse-45/workspace/org.eclipse.ajdt.ui.tests/target/work/configuration/org.eclipse.osgi/223/0/.cp:
Timer event: 11ms: Pre compile
Sending the following configuration changes to the compiler: [ASPECTPATH_CHANGED, CLASSPATH_CHANGED, INPATH_CHANGED, OUTPUTDESTINATIONS_CHANGED]
Compiler configuration for project DefaultEmptyProject has been read by compiler.  Resetting.
     Configuration was [ASPECTPATH_CHANGED, CLASSPATH_CHANGED, INPATH_CHANGED, OUTPUTDESTINATIONS_CHANGED]
Resetting list of modified source files.  Was []
ClassFileChangeChecking: failed to find a state instance managing output location : /jobs/genie.ajdt/ajdt-on-eclipse-45/workspace/org.eclipse.ajdt.ui.tests/target/work/configuration/org.eclipse.osgi/223/0/.cp (could be getting managed by JDT)
Timer event: 0ms: OutputLocationManager: binary folder to declaring project map creation: P/DefaultEmptyProject
Preparing for build: planning to be an incremental build
AspectJ reports build successful, build was: INCREMENTAL
AJDE Callback: finish. Was full build: false
Timer event: 10ms: Total time spent in AJDE
Timer event: 0ms: Refresh after build
Crosscutting model sanity checked with no problems
Timer event: 0ms: Model sanity check for: DefaultEmptyProject
Timer event: 22ms: Total time spent in AJBuilder.build()
Timer event: 1ms: Update visualizer, xref, advice listeners for (separate thread): DefaultEmptyProject
------------------------
Starting testFromITDOnDeclareParentInOtherClass
Compiler configuration for project ITDContentAssist doesn't know previous state, so assuming EVERYTHING has changed.
===========================================================================================
Build kind = FULLBUILD
Project=ITDContentAssist, kind of build requested=Full AspectJ compilation
Timer event: 0ms: Flush included source file cache
Timer event: 0ms: Check delta
Builder: Tidied output folder(s), removed class files and derived resources
Classpath = /jobs/genie.ajdt/ajdt-on-eclipse-45/workspace/org.eclipse.ajdt.ui.tests/target/work/data/ITDContentAssist/bin:/opt/public/common/jdk1.7.0_80/jre/lib/resources.jar:/opt/public/common/jdk1.7.0_80/jre/lib/rt.jar:/opt/public/common/jdk1.7.0_80/jre/lib/jsse.jar:/opt/public/common/jdk1.7.0_80/jre/lib/jce.jar:/opt/public/common/jdk1.7.0_80/jre/lib/charsets.jar:/opt/public/common/jdk1.7.0_80/jre/lib/jfr.jar:/opt/public/common/jdk1.7.0_80/jre/lib/ext/dnsns.jar:/opt/public/common/jdk1.7.0_80/jre/lib/ext/sunpkcs11.jar:/opt/public/common/jdk1.7.0_80/jre/lib/ext/zipfs.jar:/opt/public/common/jdk1.7.0_80/jre/lib/ext/sunec.jar:/opt/public/common/jdk1.7.0_80/jre/lib/ext/sunjce_provider.jar:/opt/public/common/jdk1.7.0_80/jre/lib/ext/localedata.jar:/jobs/genie.ajdt/ajdt-on-eclipse-45/workspace/org.aspectj.runtime/target/org.aspectj.runtime-1.8.9-SNAPSHOT.jar:
Timer event: 4ms: Pre compile
Compiler configuration for project ITDContentAssist has been read by compiler.  Resetting.
     Configuration was [PROJECTSOURCEFILES_CHANGED, JAVAOPTIONS_CHANGED, ASPECTPATH_CHANGED, CLASSPATH_CHANGED, INPATH_CHANGED, NONSTANDARDOPTIONS_CHANGED, OUTJAR_CHANGED, PROJECTSOURCERESOURCES_CHANGED, OUTPUTDESTINATIONS_CHANGED, INJARS_CHANGED]
Resetting list of modified source files.  Was null
Preparing for build: not going to be incremental because no successful previous full build
AJC: compiling source files
Timer event: 49ms: Time to first compiled message
AJC: compiled: /jobs/genie.ajdt/ajdt-on-eclipse-45/workspace/org.eclipse.ajdt.ui.tests/target/work/data/ITDContentAssist/src/injavafiles/itds/ITDAspect.aj
AJC: compiled: /jobs/genie.ajdt/ajdt-on-eclipse-45/workspace/org.eclipse.ajdt.ui.tests/target/work/data/ITDContentAssist/src/itds/ITDAspect.aj
Timer event: 60ms: Time to first woven message
AJC: woven aspect injavafiles.itds.ITDAspect (from /jobs/genie.ajdt/ajdt-on-eclipse-45/workspace/org.eclipse.ajdt.ui.tests/target/work/data/ITDContentAssist/src/injavafiles/itds/ITDAspect.aj)
AJC: woven aspect itds.ITDAspect (from /jobs/genie.ajdt/ajdt-on-eclipse-45/workspace/org.eclipse.ajdt.ui.tests/target/work/data/ITDContentAssist/src/itds/ITDAspect.aj)
AJC: woven aspect itds.ITDAspect$AjcClosure1 (from /jobs/genie.ajdt/ajdt-on-eclipse-45/workspace/org.eclipse.ajdt.ui.tests/target/work/data/ITDContentAssist/src/itds/ITDAspect.aj)
AJC: woven class injavafiles.itds.ITDAspect$Super (from /jobs/genie.ajdt/ajdt-on-eclipse-45/workspace/org.eclipse.ajdt.ui.tests/target/work/data/ITDContentAssist/src/injavafiles/itds/ITDAspect.aj)
AJC: woven class itds.ITDAspect$Super (from /jobs/genie.ajdt/ajdt-on-eclipse-45/workspace/org.eclipse.ajdt.ui.tests/target/work/data/ITDContentAssist/src/itds/ITDAspect.aj)
The value of the local variable x is not used
AJC: compiled: /jobs/genie.ajdt/ajdt-on-eclipse-45/workspace/org.eclipse.ajdt.ui.tests/target/work/data/ITDContentAssist/src/hasitds/HasITDs.aj
AJC: woven class hasitds.HasITDs (from /jobs/genie.ajdt/ajdt-on-eclipse-45/workspace/org.eclipse.ajdt.ui.tests/target/work/data/ITDContentAssist/src/hasitds/HasITDs.aj)
The import itds.ITDAspect is never used
The import java.util.List is never used
AJC: compiled: /jobs/genie.ajdt/ajdt-on-eclipse-45/workspace/org.eclipse.ajdt.ui.tests/target/work/data/ITDContentAssist/src/other/Gen.java
AJC: woven class other.Gen (from /jobs/genie.ajdt/ajdt-on-eclipse-45/workspace/org.eclipse.ajdt.ui.tests/target/work/data/ITDContentAssist/src/other/Gen.java)
AJC: compiled: /jobs/genie.ajdt/ajdt-on-eclipse-45/workspace/org.eclipse.ajdt.ui.tests/target/work/data/ITDContentAssist/src/injavafiles/hasitds/HasITDs.java
AJC: woven class injavafiles.hasitds.HasITDs (from /jobs/genie.ajdt/ajdt-on-eclipse-45/workspace/org.eclipse.ajdt.ui.tests/target/work/data/ITDContentAssist/src/injavafiles/hasitds/HasITDs.java)
The import injavafiles.itds.ITDAspect is never used
The import java.util.List is never used
AJC: compiled: /jobs/genie.ajdt/ajdt-on-eclipse-45/workspace/org.eclipse.ajdt.ui.tests/target/work/data/ITDContentAssist/src/uses/UsesITDs.aj
AJC: woven class uses.UsesITDs (from /jobs/genie.ajdt/ajdt-on-eclipse-45/workspace/org.eclipse.ajdt.ui.tests/target/work/data/ITDContentAssist/src/uses/UsesITDs.aj)
The import java.util.List is never used
AJC: compiled: /jobs/genie.ajdt/ajdt-on-eclipse-45/workspace/org.eclipse.ajdt.ui.tests/target/work/data/ITDContentAssist/src/injavafiles/uses/UsesITDs.java
AJC: woven class injavafiles.uses.UsesITDs (from /jobs/genie.ajdt/ajdt-on-eclipse-45/workspace/org.eclipse.ajdt.ui.tests/target/work/data/ITDContentAssist/src/injavafiles/uses/UsesITDs.java)
The import java.util.List is never used
AspectJ reports build successful, build was: FULL
AJDE Callback: finish. Was full build: true
Timer event: 91ms: Total time spent in AJDE
Timer event: 0ms: Refresh after build
Types affected during build = 7
Timer event: 1ms: Delete markers: ITDContentAssist (Finished deleting markers for ITDContentAssist)
Timer event: 8ms: Create markers: ITDContentAssist (Finished creating markers for ITDContentAssist)
Created 16 markers in 7 files
Crosscutting model sanity checked with no problems
Timer event: 10ms: Model sanity check for: ITDContentAssist
Timer event: 108ms: Total time spent in AJBuilder.build()
Timer event: 0ms: Update visualizer, xref, advice listeners for (separate thread): ITDContentAssist
===========================================================================================
Build kind = AUTOBUILD
Project=DefaultEmptyProject, kind of build requested=Incremental AspectJ compilation
Timer event: 0ms: Flush included source file cache
Timer event: 0ms: Check delta
CoreCompilerConfiguration for project DefaultEmptyProject registered a configuration change: [ASPECTPATH_CHANGED, CLASSPATH_CHANGED, INPATH_CHANGED, OUTPUTDESTINATIONS_CHANGED]
Timer event: 0ms: Looking for and marking configuration changes in DefaultEmptyProject
	Configuration changes found: true
Timer event: 0ms: Look for source/resource changes
Setting list of classpath elements with modified contents:
      []
Classpath = /jobs/genie.ajdt/ajdt-on-eclipse-45/workspace/org.eclipse.ajdt.ui.tests/target/work/data/DefaultEmptyProject/bin:/jobs/genie.ajdt/ajdt-on-eclipse-45/workspace/org.aspectj.runtime/target/org.aspectj.runtime-1.8.9-SNAPSHOT.jar:/opt/public/common/jdk1.7.0_80/jre/lib/resources.jar:/opt/public/common/jdk1.7.0_80/jre/lib/rt.jar:/opt/public/common/jdk1.7.0_80/jre/lib/jsse.jar:/opt/public/common/jdk1.7.0_80/jre/lib/jce.jar:/opt/public/common/jdk1.7.0_80/jre/lib/charsets.jar:/opt/public/common/jdk1.7.0_80/jre/lib/jfr.jar:/opt/public/common/jdk1.7.0_80/jre/lib/ext/dnsns.jar:/opt/public/common/jdk1.7.0_80/jre/lib/ext/sunpkcs11.jar:/opt/public/common/jdk1.7.0_80/jre/lib/ext/zipfs.jar:/opt/public/common/jdk1.7.0_80/jre/lib/ext/sunec.jar:/opt/public/common/jdk1.7.0_80/jre/lib/ext/sunjce_provider.jar:/opt/public/common/jdk1.7.0_80/jre/lib/ext/localedata.jar:/jobs/genie.ajdt/ajdt-on-eclipse-45/workspace/org.eclipse.ajdt.ui.tests/target/work/configuration/org.eclipse.osgi/40/0/.cp/junit.jar:/jobs/genie.ajdt/ajdt-on-eclipse-45/workspace/org.eclipse.ajdt.ui.tests/target/work/configuration/org.eclipse.osgi/223/0/.cp:
Timer event: 7ms: Pre compile
Sending the following configuration changes to the compiler: [ASPECTPATH_CHANGED, CLASSPATH_CHANGED, INPATH_CHANGED, OUTPUTDESTINATIONS_CHANGED]
Compiler configuration for project DefaultEmptyProject has been read by compiler.  Resetting.
     Configuration was [ASPECTPATH_CHANGED, CLASSPATH_CHANGED, INPATH_CHANGED, OUTPUTDESTINATIONS_CHANGED]
Resetting list of modified source files.  Was []
ClassFileChangeChecking: failed to find a state instance managing output location : /jobs/genie.ajdt/ajdt-on-eclipse-45/workspace/org.eclipse.ajdt.ui.tests/target/work/configuration/org.eclipse.osgi/223/0/.cp (could be getting managed by JDT)
Timer event: 0ms: OutputLocationManager: binary folder to declaring project map creation: P/DefaultEmptyProject
Preparing for build: planning to be an incremental build
AspectJ reports build successful, build was: INCREMENTAL
AJDE Callback: finish. Was full build: false
Timer event: 5ms: Total time spent in AJDE
Timer event: 0ms: Refresh after build
Crosscutting model sanity checked with no problems
Timer event: 0ms: Model sanity check for: DefaultEmptyProject
Timer event: 12ms: Total time spent in AJBuilder.build()
Timer event: 1ms: Update visualizer, xref, advice listeners for (separate thread): DefaultEmptyProject
------------------------
Starting testFromDeclareParentInOtherClass
Compiler configuration for project ITDContentAssist doesn't know previous state, so assuming EVERYTHING has changed.
===========================================================================================
Build kind = FULLBUILD
Project=ITDContentAssist, kind of build requested=Full AspectJ compilation
Timer event: 0ms: Flush included source file cache
Timer event: 0ms: Check delta
Builder: Tidied output folder(s), removed class files and derived resources
Classpath = /jobs/genie.ajdt/ajdt-on-eclipse-45/workspace/org.eclipse.ajdt.ui.tests/target/work/data/ITDContentAssist/bin:/opt/public/common/jdk1.7.0_80/jre/lib/resources.jar:/opt/public/common/jdk1.7.0_80/jre/lib/rt.jar:/opt/public/common/jdk1.7.0_80/jre/lib/jsse.jar:/opt/public/common/jdk1.7.0_80/jre/lib/jce.jar:/opt/public/common/jdk1.7.0_80/jre/lib/charsets.jar:/opt/public/common/jdk1.7.0_80/jre/lib/jfr.jar:/opt/public/common/jdk1.7.0_80/jre/lib/ext/dnsns.jar:/opt/public/common/jdk1.7.0_80/jre/lib/ext/sunpkcs11.jar:/opt/public/common/jdk1.7.0_80/jre/lib/ext/zipfs.jar:/opt/public/common/jdk1.7.0_80/jre/lib/ext/sunec.jar:/opt/public/common/jdk1.7.0_80/jre/lib/ext/sunjce_provider.jar:/opt/public/common/jdk1.7.0_80/jre/lib/ext/localedata.jar:/jobs/genie.ajdt/ajdt-on-eclipse-45/workspace/org.aspectj.runtime/target/org.aspectj.runtime-1.8.9-SNAPSHOT.jar:
Timer event: 4ms: Pre compile
Compiler configuration for project ITDContentAssist has been read by compiler.  Resetting.
     Configuration was [PROJECTSOURCEFILES_CHANGED, JAVAOPTIONS_CHANGED, ASPECTPATH_CHANGED, CLASSPATH_CHANGED, INPATH_CHANGED, NONSTANDARDOPTIONS_CHANGED, OUTJAR_CHANGED, PROJECTSOURCERESOURCES_CHANGED, OUTPUTDESTINATIONS_CHANGED, INJARS_CHANGED]
Resetting list of modified source files.  Was null
Preparing for build: not going to be incremental because no successful previous full build
AJC: compiling source files
Timer event: 49ms: Time to first compiled message
AJC: compiled: /jobs/genie.ajdt/ajdt-on-eclipse-45/workspace/org.eclipse.ajdt.ui.tests/target/work/data/ITDContentAssist/src/injavafiles/itds/ITDAspect.aj
AJC: compiled: /jobs/genie.ajdt/ajdt-on-eclipse-45/workspace/org.eclipse.ajdt.ui.tests/target/work/data/ITDContentAssist/src/itds/ITDAspect.aj
Timer event: 59ms: Time to first woven message
AJC: woven aspect injavafiles.itds.ITDAspect (from /jobs/genie.ajdt/ajdt-on-eclipse-45/workspace/org.eclipse.ajdt.ui.tests/target/work/data/ITDContentAssist/src/injavafiles/itds/ITDAspect.aj)
AJC: woven aspect itds.ITDAspect (from /jobs/genie.ajdt/ajdt-on-eclipse-45/workspace/org.eclipse.ajdt.ui.tests/target/work/data/ITDContentAssist/src/itds/ITDAspect.aj)
AJC: woven aspect itds.ITDAspect$AjcClosure1 (from /jobs/genie.ajdt/ajdt-on-eclipse-45/workspace/org.eclipse.ajdt.ui.tests/target/work/data/ITDContentAssist/src/itds/ITDAspect.aj)
AJC: woven class injavafiles.itds.ITDAspect$Super (from /jobs/genie.ajdt/ajdt-on-eclipse-45/workspace/org.eclipse.ajdt.ui.tests/target/work/data/ITDContentAssist/src/injavafiles/itds/ITDAspect.aj)
AJC: woven class itds.ITDAspect$Super (from /jobs/genie.ajdt/ajdt-on-eclipse-45/workspace/org.eclipse.ajdt.ui.tests/target/work/data/ITDContentAssist/src/itds/ITDAspect.aj)
The value of the local variable x is not used
AJC: compiled: /jobs/genie.ajdt/ajdt-on-eclipse-45/workspace/org.eclipse.ajdt.ui.tests/target/work/data/ITDContentAssist/src/hasitds/HasITDs.aj
AJC: woven class hasitds.HasITDs (from /jobs/genie.ajdt/ajdt-on-eclipse-45/workspace/org.eclipse.ajdt.ui.tests/target/work/data/ITDContentAssist/src/hasitds/HasITDs.aj)
The import itds.ITDAspect is never used
The import java.util.List is never used
AJC: compiled: /jobs/genie.ajdt/ajdt-on-eclipse-45/workspace/org.eclipse.ajdt.ui.tests/target/work/data/ITDContentAssist/src/other/Gen.java
AJC: woven class other.Gen (from /jobs/genie.ajdt/ajdt-on-eclipse-45/workspace/org.eclipse.ajdt.ui.tests/target/work/data/ITDContentAssist/src/other/Gen.java)
AJC: compiled: /jobs/genie.ajdt/ajdt-on-eclipse-45/workspace/org.eclipse.ajdt.ui.tests/target/work/data/ITDContentAssist/src/injavafiles/hasitds/HasITDs.java
AJC: woven class injavafiles.hasitds.HasITDs (from /jobs/genie.ajdt/ajdt-on-eclipse-45/workspace/org.eclipse.ajdt.ui.tests/target/work/data/ITDContentAssist/src/injavafiles/hasitds/HasITDs.java)
The import injavafiles.itds.ITDAspect is never used
The import java.util.List is never used
AJC: compiled: /jobs/genie.ajdt/ajdt-on-eclipse-45/workspace/org.eclipse.ajdt.ui.tests/target/work/data/ITDContentAssist/src/uses/UsesITDs.aj
AJC: woven class uses.UsesITDs (from /jobs/genie.ajdt/ajdt-on-eclipse-45/workspace/org.eclipse.ajdt.ui.tests/target/work/data/ITDContentAssist/src/uses/UsesITDs.aj)
The import java.util.List is never used
AJC: compiled: /jobs/genie.ajdt/ajdt-on-eclipse-45/workspace/org.eclipse.ajdt.ui.tests/target/work/data/ITDContentAssist/src/injavafiles/uses/UsesITDs.java
AJC: woven class injavafiles.uses.UsesITDs (from /jobs/genie.ajdt/ajdt-on-eclipse-45/workspace/org.eclipse.ajdt.ui.tests/target/work/data/ITDContentAssist/src/injavafiles/uses/UsesITDs.java)
The import java.util.List is never used
AspectJ reports build successful, build was: FULL
AJDE Callback: finish. Was full build: true
Timer event: 92ms: Total time spent in AJDE
Timer event: 0ms: Refresh after build
Types affected during build = 7
Timer event: 0ms: Delete markers: ITDContentAssist (Finished deleting markers for ITDContentAssist)
Timer event: 10ms: Create markers: ITDContentAssist (Finished creating markers for ITDContentAssist)
Created 16 markers in 7 files
Crosscutting model sanity checked with no problems
Timer event: 14ms: Model sanity check for: ITDContentAssist
Timer event: 113ms: Total time spent in AJBuilder.build()
Timer event: 1ms: Update visualizer, xref, advice listeners for (separate thread): ITDContentAssist
===========================================================================================
Build kind = AUTOBUILD
Project=DefaultEmptyProject, kind of build requested=Incremental AspectJ compilation
Timer event: 0ms: Flush included source file cache
Timer event: 1ms: Check delta
CoreCompilerConfiguration for project DefaultEmptyProject registered a configuration change: [ASPECTPATH_CHANGED, CLASSPATH_CHANGED, INPATH_CHANGED, OUTPUTDESTINATIONS_CHANGED]
Timer event: 0ms: Looking for and marking configuration changes in DefaultEmptyProject
	Configuration changes found: true
Timer event: 0ms: Look for source/resource changes
Setting list of classpath elements with modified contents:
      []
Classpath = /jobs/genie.ajdt/ajdt-on-eclipse-45/workspace/org.eclipse.ajdt.ui.tests/target/work/data/DefaultEmptyProject/bin:/jobs/genie.ajdt/ajdt-on-eclipse-45/workspace/org.aspectj.runtime/target/org.aspectj.runtime-1.8.9-SNAPSHOT.jar:/opt/public/common/jdk1.7.0_80/jre/lib/resources.jar:/opt/public/common/jdk1.7.0_80/jre/lib/rt.jar:/opt/public/common/jdk1.7.0_80/jre/lib/jsse.jar:/opt/public/common/jdk1.7.0_80/jre/lib/jce.jar:/opt/public/common/jdk1.7.0_80/jre/lib/charsets.jar:/opt/public/common/jdk1.7.0_80/jre/lib/jfr.jar:/opt/public/common/jdk1.7.0_80/jre/lib/ext/dnsns.jar:/opt/public/common/jdk1.7.0_80/jre/lib/ext/sunpkcs11.jar:/opt/public/common/jdk1.7.0_80/jre/lib/ext/zipfs.jar:/opt/public/common/jdk1.7.0_80/jre/lib/ext/sunec.jar:/opt/public/common/jdk1.7.0_80/jre/lib/ext/sunjce_provider.jar:/opt/public/common/jdk1.7.0_80/jre/lib/ext/localedata.jar:/jobs/genie.ajdt/ajdt-on-eclipse-45/workspace/org.eclipse.ajdt.ui.tests/target/work/configuration/org.eclipse.osgi/40/0/.cp/junit.jar:/jobs/genie.ajdt/ajdt-on-eclipse-45/workspace/org.eclipse.ajdt.ui.tests/target/work/configuration/org.eclipse.osgi/223/0/.cp:
Timer event: 8ms: Pre compile
Sending the following configuration changes to the compiler: [ASPECTPATH_CHANGED, CLASSPATH_CHANGED, INPATH_CHANGED, OUTPUTDESTINATIONS_CHANGED]
Compiler configuration for project DefaultEmptyProject has been read by compiler.  Resetting.
     Configuration was [ASPECTPATH_CHANGED, CLASSPATH_CHANGED, INPATH_CHANGED, OUTPUTDESTINATIONS_CHANGED]
Resetting list of modified source files.  Was []
ClassFileChangeChecking: failed to find a state instance managing output location : /jobs/genie.ajdt/ajdt-on-eclipse-45/workspace/org.eclipse.ajdt.ui.tests/target/work/configuration/org.eclipse.osgi/223/0/.cp (could be getting managed by JDT)
Timer event: 0ms: OutputLocationManager: binary folder to declaring project map creation: P/DefaultEmptyProject
Preparing for build: planning to be an incremental build
AspectJ reports build successful, build was: INCREMENTAL
AJDE Callback: finish. Was full build: false
Timer event: 5ms: Total time spent in AJDE
Timer event: 0ms: Refresh after build
Crosscutting model sanity checked with no problems
Timer event: 0ms: Model sanity check for: DefaultEmptyProject
Timer event: 14ms: Total time spent in AJBuilder.build()
Timer event: 0ms: Update visualizer, xref, advice listeners for (separate thread): DefaultEmptyProject
------------------------
Starting testFromITDOnDeclareParent
Compiler configuration for project ITDContentAssist doesn't know previous state, so assuming EVERYTHING has changed.
===========================================================================================
Build kind = FULLBUILD
Project=ITDContentAssist, kind of build requested=Full AspectJ compilation
Timer event: 0ms: Flush included source file cache
Timer event: 0ms: Check delta
Builder: Tidied output folder(s), removed class files and derived resources
Classpath = /jobs/genie.ajdt/ajdt-on-eclipse-45/workspace/org.eclipse.ajdt.ui.tests/target/work/data/ITDContentAssist/bin:/opt/public/common/jdk1.7.0_80/jre/lib/resources.jar:/opt/public/common/jdk1.7.0_80/jre/lib/rt.jar:/opt/public/common/jdk1.7.0_80/jre/lib/jsse.jar:/opt/public/common/jdk1.7.0_80/jre/lib/jce.jar:/opt/public/common/jdk1.7.0_80/jre/lib/charsets.jar:/opt/public/common/jdk1.7.0_80/jre/lib/jfr.jar:/opt/public/common/jdk1.7.0_80/jre/lib/ext/dnsns.jar:/opt/public/common/jdk1.7.0_80/jre/lib/ext/sunpkcs11.jar:/opt/public/common/jdk1.7.0_80/jre/lib/ext/zipfs.jar:/opt/public/common/jdk1.7.0_80/jre/lib/ext/sunec.jar:/opt/public/common/jdk1.7.0_80/jre/lib/ext/sunjce_provider.jar:/opt/public/common/jdk1.7.0_80/jre/lib/ext/localedata.jar:/jobs/genie.ajdt/ajdt-on-eclipse-45/workspace/org.aspectj.runtime/target/org.aspectj.runtime-1.8.9-SNAPSHOT.jar:
Timer event: 4ms: Pre compile
Compiler configuration for project ITDContentAssist has been read by compiler.  Resetting.
     Configuration was [PROJECTSOURCEFILES_CHANGED, JAVAOPTIONS_CHANGED, ASPECTPATH_CHANGED, CLASSPATH_CHANGED, INPATH_CHANGED, NONSTANDARDOPTIONS_CHANGED, OUTJAR_CHANGED, PROJECTSOURCERESOURCES_CHANGED, OUTPUTDESTINATIONS_CHANGED, INJARS_CHANGED]
Resetting list of modified source files.  Was null
Preparing for build: not going to be incremental because no successful previous full build
AJC: compiling source files
Timer event: 49ms: Time to first compiled message
AJC: compiled: /jobs/genie.ajdt/ajdt-on-eclipse-45/workspace/org.eclipse.ajdt.ui.tests/target/work/data/ITDContentAssist/src/injavafiles/itds/ITDAspect.aj
AJC: compiled: /jobs/genie.ajdt/ajdt-on-eclipse-45/workspace/org.eclipse.ajdt.ui.tests/target/work/data/ITDContentAssist/src/itds/ITDAspect.aj
Timer event: 59ms: Time to first woven message
AJC: woven aspect injavafiles.itds.ITDAspect (from /jobs/genie.ajdt/ajdt-on-eclipse-45/workspace/org.eclipse.ajdt.ui.tests/target/work/data/ITDContentAssist/src/injavafiles/itds/ITDAspect.aj)
AJC: woven aspect itds.ITDAspect (from /jobs/genie.ajdt/ajdt-on-eclipse-45/workspace/org.eclipse.ajdt.ui.tests/target/work/data/ITDContentAssist/src/itds/ITDAspect.aj)
AJC: woven aspect itds.ITDAspect$AjcClosure1 (from /jobs/genie.ajdt/ajdt-on-eclipse-45/workspace/org.eclipse.ajdt.ui.tests/target/work/data/ITDContentAssist/src/itds/ITDAspect.aj)
AJC: woven class injavafiles.itds.ITDAspect$Super (from /jobs/genie.ajdt/ajdt-on-eclipse-45/workspace/org.eclipse.ajdt.ui.tests/target/work/data/ITDContentAssist/src/injavafiles/itds/ITDAspect.aj)
AJC: woven class itds.ITDAspect$Super (from /jobs/genie.ajdt/ajdt-on-eclipse-45/workspace/org.eclipse.ajdt.ui.tests/target/work/data/ITDContentAssist/src/itds/ITDAspect.aj)
The value of the local variable x is not used
AJC: compiled: /jobs/genie.ajdt/ajdt-on-eclipse-45/workspace/org.eclipse.ajdt.ui.tests/target/work/data/ITDContentAssist/src/hasitds/HasITDs.aj
AJC: woven class hasitds.HasITDs (from /jobs/genie.ajdt/ajdt-on-eclipse-45/workspace/org.eclipse.ajdt.ui.tests/target/work/data/ITDContentAssist/src/hasitds/HasITDs.aj)
The import itds.ITDAspect is never used
The import java.util.List is never used
AJC: compiled: /jobs/genie.ajdt/ajdt-on-eclipse-45/workspace/org.eclipse.ajdt.ui.tests/target/work/data/ITDContentAssist/src/other/Gen.java
AJC: woven class other.Gen (from /jobs/genie.ajdt/ajdt-on-eclipse-45/workspace/org.eclipse.ajdt.ui.tests/target/work/data/ITDContentAssist/src/other/Gen.java)
AJC: compiled: /jobs/genie.ajdt/ajdt-on-eclipse-45/workspace/org.eclipse.ajdt.ui.tests/target/work/data/ITDContentAssist/src/injavafiles/hasitds/HasITDs.java
AJC: woven class injavafiles.hasitds.HasITDs (from /jobs/genie.ajdt/ajdt-on-eclipse-45/workspace/org.eclipse.ajdt.ui.tests/target/work/data/ITDContentAssist/src/injavafiles/hasitds/HasITDs.java)
The import injavafiles.itds.ITDAspect is never used
The import java.util.List is never used
AJC: compiled: /jobs/genie.ajdt/ajdt-on-eclipse-45/workspace/org.eclipse.ajdt.ui.tests/target/work/data/ITDContentAssist/src/uses/UsesITDs.aj
AJC: woven class uses.UsesITDs (from /jobs/genie.ajdt/ajdt-on-eclipse-45/workspace/org.eclipse.ajdt.ui.tests/target/work/data/ITDContentAssist/src/uses/UsesITDs.aj)
The import java.util.List is never used
AJC: compiled: /jobs/genie.ajdt/ajdt-on-eclipse-45/workspace/org.eclipse.ajdt.ui.tests/target/work/data/ITDContentAssist/src/injavafiles/uses/UsesITDs.java
AJC: woven class injavafiles.uses.UsesITDs (from /jobs/genie.ajdt/ajdt-on-eclipse-45/workspace/org.eclipse.ajdt.ui.tests/target/work/data/ITDContentAssist/src/injavafiles/uses/UsesITDs.java)
The import java.util.List is never used
AspectJ reports build successful, build was: FULL
AJDE Callback: finish. Was full build: true
Timer event: 90ms: Total time spent in AJDE
Timer event: 0ms: Refresh after build
Types affected during build = 7
Timer event: 2ms: Delete markers: ITDContentAssist (Finished deleting markers for ITDContentAssist)
Crosscutting model sanity checked with no problems
Timer event: 11ms: Model sanity check for: ITDContentAssist
Timer event: 108ms: Total time spent in AJBuilder.build()
Timer event: 20ms: Create markers: ITDContentAssist (Finished creating markers for ITDContentAssist)
Created 16 markers in 7 files
Timer event: 0ms: Update visualizer, xref, advice listeners for (separate thread): ITDContentAssist
===========================================================================================
Build kind = AUTOBUILD
Project=DefaultEmptyProject, kind of build requested=Incremental AspectJ compilation
Timer event: 0ms: Flush included source file cache
Timer event: 0ms: Check delta
CoreCompilerConfiguration for project DefaultEmptyProject registered a configuration change: [ASPECTPATH_CHANGED, CLASSPATH_CHANGED, INPATH_CHANGED, OUTPUTDESTINATIONS_CHANGED]
Timer event: 0ms: Looking for and marking configuration changes in DefaultEmptyProject
	Configuration changes found: true
Timer event: 0ms: Look for source/resource changes
Setting list of classpath elements with modified contents:
      []
Classpath = /jobs/genie.ajdt/ajdt-on-eclipse-45/workspace/org.eclipse.ajdt.ui.tests/target/work/data/DefaultEmptyProject/bin:/jobs/genie.ajdt/ajdt-on-eclipse-45/workspace/org.aspectj.runtime/target/org.aspectj.runtime-1.8.9-SNAPSHOT.jar:/opt/public/common/jdk1.7.0_80/jre/lib/resources.jar:/opt/public/common/jdk1.7.0_80/jre/lib/rt.jar:/opt/public/common/jdk1.7.0_80/jre/lib/jsse.jar:/opt/public/common/jdk1.7.0_80/jre/lib/jce.jar:/opt/public/common/jdk1.7.0_80/jre/lib/charsets.jar:/opt/public/common/jdk1.7.0_80/jre/lib/jfr.jar:/opt/public/common/jdk1.7.0_80/jre/lib/ext/dnsns.jar:/opt/public/common/jdk1.7.0_80/jre/lib/ext/sunpkcs11.jar:/opt/public/common/jdk1.7.0_80/jre/lib/ext/zipfs.jar:/opt/public/common/jdk1.7.0_80/jre/lib/ext/sunec.jar:/opt/public/common/jdk1.7.0_80/jre/lib/ext/sunjce_provider.jar:/opt/public/common/jdk1.7.0_80/jre/lib/ext/localedata.jar:/jobs/genie.ajdt/ajdt-on-eclipse-45/workspace/org.eclipse.ajdt.ui.tests/target/work/configuration/org.eclipse.osgi/40/0/.cp/junit.jar:/jobs/genie.ajdt/ajdt-on-eclipse-45/workspace/org.eclipse.ajdt.ui.tests/target/work/configuration/org.eclipse.osgi/223/0/.cp:
Timer event: 7ms: Pre compile
Sending the following configuration changes to the compiler: [ASPECTPATH_CHANGED, CLASSPATH_CHANGED, INPATH_CHANGED, OUTPUTDESTINATIONS_CHANGED]
Compiler configuration for project DefaultEmptyProject has been read by compiler.  Resetting.
     Configuration was [ASPECTPATH_CHANGED, CLASSPATH_CHANGED, INPATH_CHANGED, OUTPUTDESTINATIONS_CHANGED]
Resetting list of modified source files.  Was []
ClassFileChangeChecking: failed to find a state instance managing output location : /jobs/genie.ajdt/ajdt-on-eclipse-45/workspace/org.eclipse.ajdt.ui.tests/target/work/configuration/org.eclipse.osgi/223/0/.cp (could be getting managed by JDT)
Timer event: 0ms: OutputLocationManager: binary folder to declaring project map creation: P/DefaultEmptyProject
Preparing for build: planning to be an incremental build
AspectJ reports build successful, build was: INCREMENTAL
AJDE Callback: finish. Was full build: false
Timer event: 8ms: Total time spent in AJDE
Timer event: 0ms: Refresh after build
Crosscutting model sanity checked with no problems
Timer event: 0ms: Model sanity check for: DefaultEmptyProject
Timer event: 15ms: Total time spent in AJBuilder.build()
Timer event: 0ms: Update visualizer, xref, advice listeners for (separate thread): DefaultEmptyProject
------------------------
Starting testITDFieldInOtherClass
Compiler configuration for project ITDContentAssist doesn't know previous state, so assuming EVERYTHING has changed.
===========================================================================================
Build kind = FULLBUILD
Project=ITDContentAssist, kind of build requested=Full AspectJ compilation
Timer event: 0ms: Flush included source file cache
Timer event: 0ms: Check delta
Builder: Tidied output folder(s), removed class files and derived resources
Classpath = /jobs/genie.ajdt/ajdt-on-eclipse-45/workspace/org.eclipse.ajdt.ui.tests/target/work/data/ITDContentAssist/bin:/opt/public/common/jdk1.7.0_80/jre/lib/resources.jar:/opt/public/common/jdk1.7.0_80/jre/lib/rt.jar:/opt/public/common/jdk1.7.0_80/jre/lib/jsse.jar:/opt/public/common/jdk1.7.0_80/jre/lib/jce.jar:/opt/public/common/jdk1.7.0_80/jre/lib/charsets.jar:/opt/public/common/jdk1.7.0_80/jre/lib/jfr.jar:/opt/public/common/jdk1.7.0_80/jre/lib/ext/dnsns.jar:/opt/public/common/jdk1.7.0_80/jre/lib/ext/sunpkcs11.jar:/opt/public/common/jdk1.7.0_80/jre/lib/ext/zipfs.jar:/opt/public/common/jdk1.7.0_80/jre/lib/ext/sunec.jar:/opt/public/common/jdk1.7.0_80/jre/lib/ext/sunjce_provider.jar:/opt/public/common/jdk1.7.0_80/jre/lib/ext/localedata.jar:/jobs/genie.ajdt/ajdt-on-eclipse-45/workspace/org.aspectj.runtime/target/org.aspectj.runtime-1.8.9-SNAPSHOT.jar:
Timer event: 4ms: Pre compile
Compiler configuration for project ITDContentAssist has been read by compiler.  Resetting.
     Configuration was [PROJECTSOURCEFILES_CHANGED, JAVAOPTIONS_CHANGED, ASPECTPATH_CHANGED, CLASSPATH_CHANGED, INPATH_CHANGED, NONSTANDARDOPTIONS_CHANGED, OUTJAR_CHANGED, PROJECTSOURCERESOURCES_CHANGED, OUTPUTDESTINATIONS_CHANGED, INJARS_CHANGED]
Resetting list of modified source files.  Was null
Preparing for build: not going to be incremental because no successful previous full build
AJC: compiling source files
Timer event: 55ms: Time to first compiled message
AJC: compiled: /jobs/genie.ajdt/ajdt-on-eclipse-45/workspace/org.eclipse.ajdt.ui.tests/target/work/data/ITDContentAssist/src/injavafiles/itds/ITDAspect.aj
AJC: compiled: /jobs/genie.ajdt/ajdt-on-eclipse-45/workspace/org.eclipse.ajdt.ui.tests/target/work/data/ITDContentAssist/src/itds/ITDAspect.aj
Timer event: 65ms: Time to first woven message
AJC: woven aspect injavafiles.itds.ITDAspect (from /jobs/genie.ajdt/ajdt-on-eclipse-45/workspace/org.eclipse.ajdt.ui.tests/target/work/data/ITDContentAssist/src/injavafiles/itds/ITDAspect.aj)
AJC: woven aspect itds.ITDAspect (from /jobs/genie.ajdt/ajdt-on-eclipse-45/workspace/org.eclipse.ajdt.ui.tests/target/work/data/ITDContentAssist/src/itds/ITDAspect.aj)
AJC: woven aspect itds.ITDAspect$AjcClosure1 (from /jobs/genie.ajdt/ajdt-on-eclipse-45/workspace/org.eclipse.ajdt.ui.tests/target/work/data/ITDContentAssist/src/itds/ITDAspect.aj)
AJC: woven class injavafiles.itds.ITDAspect$Super (from /jobs/genie.ajdt/ajdt-on-eclipse-45/workspace/org.eclipse.ajdt.ui.tests/target/work/data/ITDContentAssist/src/injavafiles/itds/ITDAspect.aj)
AJC: woven class itds.ITDAspect$Super (from /jobs/genie.ajdt/ajdt-on-eclipse-45/workspace/org.eclipse.ajdt.ui.tests/target/work/data/ITDContentAssist/src/itds/ITDAspect.aj)
The value of the local variable x is not used
AJC: compiled: /jobs/genie.ajdt/ajdt-on-eclipse-45/workspace/org.eclipse.ajdt.ui.tests/target/work/data/ITDContentAssist/src/hasitds/HasITDs.aj
AJC: woven class hasitds.HasITDs (from /jobs/genie.ajdt/ajdt-on-eclipse-45/workspace/org.eclipse.ajdt.ui.tests/target/work/data/ITDContentAssist/src/hasitds/HasITDs.aj)
The import itds.ITDAspect is never used
The import java.util.List is never used
AJC: compiled: /jobs/genie.ajdt/ajdt-on-eclipse-45/workspace/org.eclipse.ajdt.ui.tests/target/work/data/ITDContentAssist/src/other/Gen.java
AJC: woven class other.Gen (from /jobs/genie.ajdt/ajdt-on-eclipse-45/workspace/org.eclipse.ajdt.ui.tests/target/work/data/ITDContentAssist/src/other/Gen.java)
AJC: compiled: /jobs/genie.ajdt/ajdt-on-eclipse-45/workspace/org.eclipse.ajdt.ui.tests/target/work/data/ITDContentAssist/src/injavafiles/hasitds/HasITDs.java
AJC: woven class injavafiles.hasitds.HasITDs (from /jobs/genie.ajdt/ajdt-on-eclipse-45/workspace/org.eclipse.ajdt.ui.tests/target/work/data/ITDContentAssist/src/injavafiles/hasitds/HasITDs.java)
The import injavafiles.itds.ITDAspect is never used
The import java.util.List is never used
AJC: compiled: /jobs/genie.ajdt/ajdt-on-eclipse-45/workspace/org.eclipse.ajdt.ui.tests/target/work/data/ITDContentAssist/src/uses/UsesITDs.aj
AJC: woven class uses.UsesITDs (from /jobs/genie.ajdt/ajdt-on-eclipse-45/workspace/org.eclipse.ajdt.ui.tests/target/work/data/ITDContentAssist/src/uses/UsesITDs.aj)
The import java.util.List is never used
AJC: compiled: /jobs/genie.ajdt/ajdt-on-eclipse-45/workspace/org.eclipse.ajdt.ui.tests/target/work/data/ITDContentAssist/src/injavafiles/uses/UsesITDs.java
AJC: woven class injavafiles.uses.UsesITDs (from /jobs/genie.ajdt/ajdt-on-eclipse-45/workspace/org.eclipse.ajdt.ui.tests/target/work/data/ITDContentAssist/src/injavafiles/uses/UsesITDs.java)
The import java.util.List is never used
AspectJ reports build successful, build was: FULL
AJDE Callback: finish. Was full build: true
Timer event: 94ms: Total time spent in AJDE
Timer event: 0ms: Refresh after build
Types affected during build = 7
Timer event: 1ms: Delete markers: ITDContentAssist (Finished deleting markers for ITDContentAssist)
Timer event: 8ms: Create markers: ITDContentAssist (Finished creating markers for ITDContentAssist)
Created 16 markers in 7 files
Crosscutting model sanity checked with no problems
Timer event: 10ms: Model sanity check for: ITDContentAssist
Timer event: 111ms: Total time spent in AJBuilder.build()
Timer event: 1ms: Update visualizer, xref, advice listeners for (separate thread): ITDContentAssist
===========================================================================================
Build kind = AUTOBUILD
Project=DefaultEmptyProject, kind of build requested=Incremental AspectJ compilation
Timer event: 0ms: Flush included source file cache
Timer event: 0ms: Check delta
CoreCompilerConfiguration for project DefaultEmptyProject registered a configuration change: [ASPECTPATH_CHANGED, CLASSPATH_CHANGED, INPATH_CHANGED, OUTPUTDESTINATIONS_CHANGED]
Timer event: 0ms: Looking for and marking configuration changes in DefaultEmptyProject
	Configuration changes found: true
Timer event: 0ms: Look for source/resource changes
Setting list of classpath elements with modified contents:
      []
Classpath = /jobs/genie.ajdt/ajdt-on-eclipse-45/workspace/org.eclipse.ajdt.ui.tests/target/work/data/DefaultEmptyProject/bin:/jobs/genie.ajdt/ajdt-on-eclipse-45/workspace/org.aspectj.runtime/target/org.aspectj.runtime-1.8.9-SNAPSHOT.jar:/opt/public/common/jdk1.7.0_80/jre/lib/resources.jar:/opt/public/common/jdk1.7.0_80/jre/lib/rt.jar:/opt/public/common/jdk1.7.0_80/jre/lib/jsse.jar:/opt/public/common/jdk1.7.0_80/jre/lib/jce.jar:/opt/public/common/jdk1.7.0_80/jre/lib/charsets.jar:/opt/public/common/jdk1.7.0_80/jre/lib/jfr.jar:/opt/public/common/jdk1.7.0_80/jre/lib/ext/dnsns.jar:/opt/public/common/jdk1.7.0_80/jre/lib/ext/sunpkcs11.jar:/opt/public/common/jdk1.7.0_80/jre/lib/ext/zipfs.jar:/opt/public/common/jdk1.7.0_80/jre/lib/ext/sunec.jar:/opt/public/common/jdk1.7.0_80/jre/lib/ext/sunjce_provider.jar:/opt/public/common/jdk1.7.0_80/jre/lib/ext/localedata.jar:/jobs/genie.ajdt/ajdt-on-eclipse-45/workspace/org.eclipse.ajdt.ui.tests/target/work/configuration/org.eclipse.osgi/40/0/.cp/junit.jar:/jobs/genie.ajdt/ajdt-on-eclipse-45/workspace/org.eclipse.ajdt.ui.tests/target/work/configuration/org.eclipse.osgi/223/0/.cp:
Timer event: 7ms: Pre compile
Sending the following configuration changes to the compiler: [ASPECTPATH_CHANGED, CLASSPATH_CHANGED, INPATH_CHANGED, OUTPUTDESTINATIONS_CHANGED]
Compiler configuration for project DefaultEmptyProject has been read by compiler.  Resetting.
     Configuration was [ASPECTPATH_CHANGED, CLASSPATH_CHANGED, INPATH_CHANGED, OUTPUTDESTINATIONS_CHANGED]
Resetting list of modified source files.  Was []
ClassFileChangeChecking: failed to find a state instance managing output location : /jobs/genie.ajdt/ajdt-on-eclipse-45/workspace/org.eclipse.ajdt.ui.tests/target/work/configuration/org.eclipse.osgi/223/0/.cp (could be getting managed by JDT)
Timer event: 0ms: OutputLocationManager: binary folder to declaring project map creation: P/DefaultEmptyProject
Preparing for build: planning to be an incremental build
AspectJ reports build successful, build was: INCREMENTAL
AJDE Callback: finish. Was full build: false
Timer event: 12ms: Total time spent in AJDE
Timer event: 0ms: Refresh after build
Crosscutting model sanity checked with no problems
Timer event: 0ms: Model sanity check for: DefaultEmptyProject
Timer event: 19ms: Total time spent in AJBuilder.build()
Timer event: 1ms: Update visualizer, xref, advice listeners for (separate thread): DefaultEmptyProject
------------------------
Starting testInITD
Compiler configuration for project ITDContentAssist doesn't know previous state, so assuming EVERYTHING has changed.
===========================================================================================
Build kind = FULLBUILD
Project=ITDContentAssist, kind of build requested=Full AspectJ compilation
Timer event: 0ms: Flush included source file cache
Timer event: 0ms: Check delta
Builder: Tidied output folder(s), removed class files and derived resources
Classpath = /jobs/genie.ajdt/ajdt-on-eclipse-45/workspace/org.eclipse.ajdt.ui.tests/target/work/data/ITDContentAssist/bin:/opt/public/common/jdk1.7.0_80/jre/lib/resources.jar:/opt/public/common/jdk1.7.0_80/jre/lib/rt.jar:/opt/public/common/jdk1.7.0_80/jre/lib/jsse.jar:/opt/public/common/jdk1.7.0_80/jre/lib/jce.jar:/opt/public/common/jdk1.7.0_80/jre/lib/charsets.jar:/opt/public/common/jdk1.7.0_80/jre/lib/jfr.jar:/opt/public/common/jdk1.7.0_80/jre/lib/ext/dnsns.jar:/opt/public/common/jdk1.7.0_80/jre/lib/ext/sunpkcs11.jar:/opt/public/common/jdk1.7.0_80/jre/lib/ext/zipfs.jar:/opt/public/common/jdk1.7.0_80/jre/lib/ext/sunec.jar:/opt/public/common/jdk1.7.0_80/jre/lib/ext/sunjce_provider.jar:/opt/public/common/jdk1.7.0_80/jre/lib/ext/localedata.jar:/jobs/genie.ajdt/ajdt-on-eclipse-45/workspace/org.aspectj.runtime/target/org.aspectj.runtime-1.8.9-SNAPSHOT.jar:
Timer event: 4ms: Pre compile
Compiler configuration for project ITDContentAssist has been read by compiler.  Resetting.
     Configuration was [PROJECTSOURCEFILES_CHANGED, JAVAOPTIONS_CHANGED, ASPECTPATH_CHANGED, CLASSPATH_CHANGED, INPATH_CHANGED, NONSTANDARDOPTIONS_CHANGED, OUTJAR_CHANGED, PROJECTSOURCERESOURCES_CHANGED, OUTPUTDESTINATIONS_CHANGED, INJARS_CHANGED]
Resetting list of modified source files.  Was null
Preparing for build: not going to be incremental because no successful previous full build
AJC: compiling source files
Timer event: 49ms: Time to first compiled message
AJC: compiled: /jobs/genie.ajdt/ajdt-on-eclipse-45/workspace/org.eclipse.ajdt.ui.tests/target/work/data/ITDContentAssist/src/injavafiles/itds/ITDAspect.aj
AJC: compiled: /jobs/genie.ajdt/ajdt-on-eclipse-45/workspace/org.eclipse.ajdt.ui.tests/target/work/data/ITDContentAssist/src/itds/ITDAspect.aj
Timer event: 59ms: Time to first woven message
AJC: woven aspect injavafiles.itds.ITDAspect (from /jobs/genie.ajdt/ajdt-on-eclipse-45/workspace/org.eclipse.ajdt.ui.tests/target/work/data/ITDContentAssist/src/injavafiles/itds/ITDAspect.aj)
AJC: woven aspect itds.ITDAspect (from /jobs/genie.ajdt/ajdt-on-eclipse-45/workspace/org.eclipse.ajdt.ui.tests/target/work/data/ITDContentAssist/src/itds/ITDAspect.aj)
AJC: woven aspect itds.ITDAspect$AjcClosure1 (from /jobs/genie.ajdt/ajdt-on-eclipse-45/workspace/org.eclipse.ajdt.ui.tests/target/work/data/ITDContentAssist/src/itds/ITDAspect.aj)
AJC: woven class injavafiles.itds.ITDAspect$Super (from /jobs/genie.ajdt/ajdt-on-eclipse-45/workspace/org.eclipse.ajdt.ui.tests/target/work/data/ITDContentAssist/src/injavafiles/itds/ITDAspect.aj)
AJC: woven class itds.ITDAspect$Super (from /jobs/genie.ajdt/ajdt-on-eclipse-45/workspace/org.eclipse.ajdt.ui.tests/target/work/data/ITDContentAssist/src/itds/ITDAspect.aj)
The value of the local variable x is not used
AJC: compiled: /jobs/genie.ajdt/ajdt-on-eclipse-45/workspace/org.eclipse.ajdt.ui.tests/target/work/data/ITDContentAssist/src/hasitds/HasITDs.aj
AJC: woven class hasitds.HasITDs (from /jobs/genie.ajdt/ajdt-on-eclipse-45/workspace/org.eclipse.ajdt.ui.tests/target/work/data/ITDContentAssist/src/hasitds/HasITDs.aj)
The import itds.ITDAspect is never used
The import java.util.List is never used
AJC: compiled: /jobs/genie.ajdt/ajdt-on-eclipse-45/workspace/org.eclipse.ajdt.ui.tests/target/work/data/ITDContentAssist/src/other/Gen.java
AJC: woven class other.Gen (from /jobs/genie.ajdt/ajdt-on-eclipse-45/workspace/org.eclipse.ajdt.ui.tests/target/work/data/ITDContentAssist/src/other/Gen.java)
AJC: compiled: /jobs/genie.ajdt/ajdt-on-eclipse-45/workspace/org.eclipse.ajdt.ui.tests/target/work/data/ITDContentAssist/src/injavafiles/hasitds/HasITDs.java
AJC: woven class injavafiles.hasitds.HasITDs (from /jobs/genie.ajdt/ajdt-on-eclipse-45/workspace/org.eclipse.ajdt.ui.tests/target/work/data/ITDContentAssist/src/injavafiles/hasitds/HasITDs.java)
The import injavafiles.itds.ITDAspect is never used
The import java.util.List is never used
AJC: compiled: /jobs/genie.ajdt/ajdt-on-eclipse-45/workspace/org.eclipse.ajdt.ui.tests/target/work/data/ITDContentAssist/src/uses/UsesITDs.aj
AJC: woven class uses.UsesITDs (from /jobs/genie.ajdt/ajdt-on-eclipse-45/workspace/org.eclipse.ajdt.ui.tests/target/work/data/ITDContentAssist/src/uses/UsesITDs.aj)
The import java.util.List is never used
AJC: compiled: /jobs/genie.ajdt/ajdt-on-eclipse-45/workspace/org.eclipse.ajdt.ui.tests/target/work/data/ITDContentAssist/src/injavafiles/uses/UsesITDs.java
AJC: woven class injavafiles.uses.UsesITDs (from /jobs/genie.ajdt/ajdt-on-eclipse-45/workspace/org.eclipse.ajdt.ui.tests/target/work/data/ITDContentAssist/src/injavafiles/uses/UsesITDs.java)
The import java.util.List is never used
AspectJ reports build successful, build was: FULL
AJDE Callback: finish. Was full build: true
Timer event: 89ms: Total time spent in AJDE
Timer event: 0ms: Refresh after build
Types affected during build = 7
Timer event: 1ms: Delete markers: ITDContentAssist (Finished deleting markers for ITDContentAssist)
Timer event: 10ms: Create markers: ITDContentAssist (Finished creating markers for ITDContentAssist)
Created 16 markers in 7 files
Crosscutting model sanity checked with no problems
Timer event: 13ms: Model sanity check for: ITDContentAssist
Timer event: 109ms: Total time spent in AJBuilder.build()
Timer event: 0ms: Update visualizer, xref, advice listeners for (separate thread): ITDContentAssist
===========================================================================================
Build kind = AUTOBUILD
Project=DefaultEmptyProject, kind of build requested=Incremental AspectJ compilation
Timer event: 0ms: Flush included source file cache
Timer event: 0ms: Check delta
CoreCompilerConfiguration for project DefaultEmptyProject registered a configuration change: [ASPECTPATH_CHANGED, CLASSPATH_CHANGED, INPATH_CHANGED, OUTPUTDESTINATIONS_CHANGED]
Timer event: 0ms: Looking for and marking configuration changes in DefaultEmptyProject
	Configuration changes found: true
Timer event: 0ms: Look for source/resource changes
Setting list of classpath elements with modified contents:
      []
Classpath = /jobs/genie.ajdt/ajdt-on-eclipse-45/workspace/org.eclipse.ajdt.ui.tests/target/work/data/DefaultEmptyProject/bin:/jobs/genie.ajdt/ajdt-on-eclipse-45/workspace/org.aspectj.runtime/target/org.aspectj.runtime-1.8.9-SNAPSHOT.jar:/opt/public/common/jdk1.7.0_80/jre/lib/resources.jar:/opt/public/common/jdk1.7.0_80/jre/lib/rt.jar:/opt/public/common/jdk1.7.0_80/jre/lib/jsse.jar:/opt/public/common/jdk1.7.0_80/jre/lib/jce.jar:/opt/public/common/jdk1.7.0_80/jre/lib/charsets.jar:/opt/public/common/jdk1.7.0_80/jre/lib/jfr.jar:/opt/public/common/jdk1.7.0_80/jre/lib/ext/dnsns.jar:/opt/public/common/jdk1.7.0_80/jre/lib/ext/sunpkcs11.jar:/opt/public/common/jdk1.7.0_80/jre/lib/ext/zipfs.jar:/opt/public/common/jdk1.7.0_80/jre/lib/ext/sunec.jar:/opt/public/common/jdk1.7.0_80/jre/lib/ext/sunjce_provider.jar:/opt/public/common/jdk1.7.0_80/jre/lib/ext/localedata.jar:/jobs/genie.ajdt/ajdt-on-eclipse-45/workspace/org.eclipse.ajdt.ui.tests/target/work/configuration/org.eclipse.osgi/40/0/.cp/junit.jar:/jobs/genie.ajdt/ajdt-on-eclipse-45/workspace/org.eclipse.ajdt.ui.tests/target/work/configuration/org.eclipse.osgi/223/0/.cp:
Timer event: 6ms: Pre compile
Sending the following configuration changes to the compiler: [ASPECTPATH_CHANGED, CLASSPATH_CHANGED, INPATH_CHANGED, OUTPUTDESTINATIONS_CHANGED]
Compiler configuration for project DefaultEmptyProject has been read by compiler.  Resetting.
     Configuration was [ASPECTPATH_CHANGED, CLASSPATH_CHANGED, INPATH_CHANGED, OUTPUTDESTINATIONS_CHANGED]
Resetting list of modified source files.  Was []
ClassFileChangeChecking: failed to find a state instance managing output location : /jobs/genie.ajdt/ajdt-on-eclipse-45/workspace/org.eclipse.ajdt.ui.tests/target/work/configuration/org.eclipse.osgi/223/0/.cp (could be getting managed by JDT)
Timer event: 0ms: OutputLocationManager: binary folder to declaring project map creation: P/DefaultEmptyProject
Preparing for build: planning to be an incremental build
AspectJ reports build successful, build was: INCREMENTAL
AJDE Callback: finish. Was full build: false
Timer event: 6ms: Total time spent in AJDE
Timer event: 0ms: Refresh after build
Crosscutting model sanity checked with no problems
Timer event: 0ms: Model sanity check for: DefaultEmptyProject
Timer event: 13ms: Total time spent in AJBuilder.build()
Timer event: 1ms: Update visualizer, xref, advice listeners for (separate thread): DefaultEmptyProject
------------------------
Starting testInMainMethod
Compiler configuration for project ITDContentAssist doesn't know previous state, so assuming EVERYTHING has changed.
===========================================================================================
Build kind = FULLBUILD
Project=ITDContentAssist, kind of build requested=Full AspectJ compilation
Timer event: 0ms: Flush included source file cache
Timer event: 0ms: Check delta
Builder: Tidied output folder(s), removed class files and derived resources
Classpath = /jobs/genie.ajdt/ajdt-on-eclipse-45/workspace/org.eclipse.ajdt.ui.tests/target/work/data/ITDContentAssist/bin:/opt/public/common/jdk1.7.0_80/jre/lib/resources.jar:/opt/public/common/jdk1.7.0_80/jre/lib/rt.jar:/opt/public/common/jdk1.7.0_80/jre/lib/jsse.jar:/opt/public/common/jdk1.7.0_80/jre/lib/jce.jar:/opt/public/common/jdk1.7.0_80/jre/lib/charsets.jar:/opt/public/common/jdk1.7.0_80/jre/lib/jfr.jar:/opt/public/common/jdk1.7.0_80/jre/lib/ext/dnsns.jar:/opt/public/common/jdk1.7.0_80/jre/lib/ext/sunpkcs11.jar:/opt/public/common/jdk1.7.0_80/jre/lib/ext/zipfs.jar:/opt/public/common/jdk1.7.0_80/jre/lib/ext/sunec.jar:/opt/public/common/jdk1.7.0_80/jre/lib/ext/sunjce_provider.jar:/opt/public/common/jdk1.7.0_80/jre/lib/ext/localedata.jar:/jobs/genie.ajdt/ajdt-on-eclipse-45/workspace/org.aspectj.runtime/target/org.aspectj.runtime-1.8.9-SNAPSHOT.jar:
Timer event: 4ms: Pre compile
Compiler configuration for project ITDContentAssist has been read by compiler.  Resetting.
     Configuration was [PROJECTSOURCEFILES_CHANGED, JAVAOPTIONS_CHANGED, ASPECTPATH_CHANGED, CLASSPATH_CHANGED, INPATH_CHANGED, NONSTANDARDOPTIONS_CHANGED, OUTJAR_CHANGED, PROJECTSOURCERESOURCES_CHANGED, OUTPUTDESTINATIONS_CHANGED, INJARS_CHANGED]
Resetting list of modified source files.  Was null
Preparing for build: not going to be incremental because no successful previous full build
AJC: compiling source files
Timer event: 48ms: Time to first compiled message
AJC: compiled: /jobs/genie.ajdt/ajdt-on-eclipse-45/workspace/org.eclipse.ajdt.ui.tests/target/work/data/ITDContentAssist/src/injavafiles/itds/ITDAspect.aj
AJC: compiled: /jobs/genie.ajdt/ajdt-on-eclipse-45/workspace/org.eclipse.ajdt.ui.tests/target/work/data/ITDContentAssist/src/itds/ITDAspect.aj
Timer event: 58ms: Time to first woven message
AJC: woven aspect injavafiles.itds.ITDAspect (from /jobs/genie.ajdt/ajdt-on-eclipse-45/workspace/org.eclipse.ajdt.ui.tests/target/work/data/ITDContentAssist/src/injavafiles/itds/ITDAspect.aj)
AJC: woven aspect itds.ITDAspect (from /jobs/genie.ajdt/ajdt-on-eclipse-45/workspace/org.eclipse.ajdt.ui.tests/target/work/data/ITDContentAssist/src/itds/ITDAspect.aj)
AJC: woven aspect itds.ITDAspect$AjcClosure1 (from /jobs/genie.ajdt/ajdt-on-eclipse-45/workspace/org.eclipse.ajdt.ui.tests/target/work/data/ITDContentAssist/src/itds/ITDAspect.aj)
AJC: woven class injavafiles.itds.ITDAspect$Super (from /jobs/genie.ajdt/ajdt-on-eclipse-45/workspace/org.eclipse.ajdt.ui.tests/target/work/data/ITDContentAssist/src/injavafiles/itds/ITDAspect.aj)
AJC: woven class itds.ITDAspect$Super (from /jobs/genie.ajdt/ajdt-on-eclipse-45/workspace/org.eclipse.ajdt.ui.tests/target/work/data/ITDContentAssist/src/itds/ITDAspect.aj)
The value of the local variable x is not used
AJC: compiled: /jobs/genie.ajdt/ajdt-on-eclipse-45/workspace/org.eclipse.ajdt.ui.tests/target/work/data/ITDContentAssist/src/hasitds/HasITDs.aj
AJC: woven class hasitds.HasITDs (from /jobs/genie.ajdt/ajdt-on-eclipse-45/workspace/org.eclipse.ajdt.ui.tests/target/work/data/ITDContentAssist/src/hasitds/HasITDs.aj)
The import itds.ITDAspect is never used
The import java.util.List is never used
AJC: compiled: /jobs/genie.ajdt/ajdt-on-eclipse-45/workspace/org.eclipse.ajdt.ui.tests/target/work/data/ITDContentAssist/src/other/Gen.java
AJC: woven class other.Gen (from /jobs/genie.ajdt/ajdt-on-eclipse-45/workspace/org.eclipse.ajdt.ui.tests/target/work/data/ITDContentAssist/src/other/Gen.java)
AJC: compiled: /jobs/genie.ajdt/ajdt-on-eclipse-45/workspace/org.eclipse.ajdt.ui.tests/target/work/data/ITDContentAssist/src/injavafiles/hasitds/HasITDs.java
AJC: woven class injavafiles.hasitds.HasITDs (from /jobs/genie.ajdt/ajdt-on-eclipse-45/workspace/org.eclipse.ajdt.ui.tests/target/work/data/ITDContentAssist/src/injavafiles/hasitds/HasITDs.java)
The import injavafiles.itds.ITDAspect is never used
The import java.util.List is never used
AJC: compiled: /jobs/genie.ajdt/ajdt-on-eclipse-45/workspace/org.eclipse.ajdt.ui.tests/target/work/data/ITDContentAssist/src/uses/UsesITDs.aj
AJC: woven class uses.UsesITDs (from /jobs/genie.ajdt/ajdt-on-eclipse-45/workspace/org.eclipse.ajdt.ui.tests/target/work/data/ITDContentAssist/src/uses/UsesITDs.aj)
The import java.util.List is never used
AJC: compiled: /jobs/genie.ajdt/ajdt-on-eclipse-45/workspace/org.eclipse.ajdt.ui.tests/target/work/data/ITDContentAssist/src/injavafiles/uses/UsesITDs.java
AJC: woven class injavafiles.uses.UsesITDs (from /jobs/genie.ajdt/ajdt-on-eclipse-45/workspace/org.eclipse.ajdt.ui.tests/target/work/data/ITDContentAssist/src/injavafiles/uses/UsesITDs.java)
The import java.util.List is never used
AspectJ reports build successful, build was: FULL
AJDE Callback: finish. Was full build: true
Timer event: 89ms: Total time spent in AJDE
Timer event: 0ms: Refresh after build
Types affected during build = 7
Timer event: 1ms: Delete markers: ITDContentAssist (Finished deleting markers for ITDContentAssist)
Timer event: 8ms: Create markers: ITDContentAssist (Finished creating markers for ITDContentAssist)
Created 16 markers in 7 files
Crosscutting model sanity checked with no problems
Timer event: 9ms: Model sanity check for: ITDContentAssist
Timer event: 105ms: Total time spent in AJBuilder.build()
Timer event: 1ms: Update visualizer, xref, advice listeners for (separate thread): ITDContentAssist
===========================================================================================
Build kind = AUTOBUILD
Project=DefaultEmptyProject, kind of build requested=Incremental AspectJ compilation
Timer event: 0ms: Flush included source file cache
Timer event: 0ms: Check delta
CoreCompilerConfiguration for project DefaultEmptyProject registered a configuration change: [ASPECTPATH_CHANGED, CLASSPATH_CHANGED, INPATH_CHANGED, OUTPUTDESTINATIONS_CHANGED]
Timer event: 0ms: Looking for and marking configuration changes in DefaultEmptyProject
	Configuration changes found: true
Timer event: 0ms: Look for source/resource changes
Setting list of classpath elements with modified contents:
      []
Classpath = /jobs/genie.ajdt/ajdt-on-eclipse-45/workspace/org.eclipse.ajdt.ui.tests/target/work/data/DefaultEmptyProject/bin:/jobs/genie.ajdt/ajdt-on-eclipse-45/workspace/org.aspectj.runtime/target/org.aspectj.runtime-1.8.9-SNAPSHOT.jar:/opt/public/common/jdk1.7.0_80/jre/lib/resources.jar:/opt/public/common/jdk1.7.0_80/jre/lib/rt.jar:/opt/public/common/jdk1.7.0_80/jre/lib/jsse.jar:/opt/public/common/jdk1.7.0_80/jre/lib/jce.jar:/opt/public/common/jdk1.7.0_80/jre/lib/charsets.jar:/opt/public/common/jdk1.7.0_80/jre/lib/jfr.jar:/opt/public/common/jdk1.7.0_80/jre/lib/ext/dnsns.jar:/opt/public/common/jdk1.7.0_80/jre/lib/ext/sunpkcs11.jar:/opt/public/common/jdk1.7.0_80/jre/lib/ext/zipfs.jar:/opt/public/common/jdk1.7.0_80/jre/lib/ext/sunec.jar:/opt/public/common/jdk1.7.0_80/jre/lib/ext/sunjce_provider.jar:/opt/public/common/jdk1.7.0_80/jre/lib/ext/localedata.jar:/jobs/genie.ajdt/ajdt-on-eclipse-45/workspace/org.eclipse.ajdt.ui.tests/target/work/configuration/org.eclipse.osgi/40/0/.cp/junit.jar:/jobs/genie.ajdt/ajdt-on-eclipse-45/workspace/org.eclipse.ajdt.ui.tests/target/work/configuration/org.eclipse.osgi/223/0/.cp:
Timer event: 8ms: Pre compile
Sending the following configuration changes to the compiler: [ASPECTPATH_CHANGED, CLASSPATH_CHANGED, INPATH_CHANGED, OUTPUTDESTINATIONS_CHANGED]
Compiler configuration for project DefaultEmptyProject has been read by compiler.  Resetting.
     Configuration was [ASPECTPATH_CHANGED, CLASSPATH_CHANGED, INPATH_CHANGED, OUTPUTDESTINATIONS_CHANGED]
Resetting list of modified source files.  Was []
ClassFileChangeChecking: failed to find a state instance managing output location : /jobs/genie.ajdt/ajdt-on-eclipse-45/workspace/org.eclipse.ajdt.ui.tests/target/work/configuration/org.eclipse.osgi/223/0/.cp (could be getting managed by JDT)
Timer event: 0ms: OutputLocationManager: binary folder to declaring project map creation: P/DefaultEmptyProject
Preparing for build: planning to be an incremental build
AspectJ reports build successful, build was: INCREMENTAL
AJDE Callback: finish. Was full build: false
Timer event: 5ms: Total time spent in AJDE
Timer event: 0ms: Refresh after build
Crosscutting model sanity checked with no problems
Timer event: 0ms: Model sanity check for: DefaultEmptyProject
Timer event: 14ms: Total time spent in AJBuilder.build()
Timer event: 1ms: Update visualizer, xref, advice listeners for (separate thread): DefaultEmptyProject
------------------------
Starting testInAdvice
Compiler configuration for project ITDContentAssist doesn't know previous state, so assuming EVERYTHING has changed.
===========================================================================================
Build kind = FULLBUILD
Project=ITDContentAssist, kind of build requested=Full AspectJ compilation
Timer event: 0ms: Flush included source file cache
Timer event: 0ms: Check delta
Builder: Tidied output folder(s), removed class files and derived resources
Classpath = /jobs/genie.ajdt/ajdt-on-eclipse-45/workspace/org.eclipse.ajdt.ui.tests/target/work/data/ITDContentAssist/bin:/opt/public/common/jdk1.7.0_80/jre/lib/resources.jar:/opt/public/common/jdk1.7.0_80/jre/lib/rt.jar:/opt/public/common/jdk1.7.0_80/jre/lib/jsse.jar:/opt/public/common/jdk1.7.0_80/jre/lib/jce.jar:/opt/public/common/jdk1.7.0_80/jre/lib/charsets.jar:/opt/public/common/jdk1.7.0_80/jre/lib/jfr.jar:/opt/public/common/jdk1.7.0_80/jre/lib/ext/dnsns.jar:/opt/public/common/jdk1.7.0_80/jre/lib/ext/sunpkcs11.jar:/opt/public/common/jdk1.7.0_80/jre/lib/ext/zipfs.jar:/opt/public/common/jdk1.7.0_80/jre/lib/ext/sunec.jar:/opt/public/common/jdk1.7.0_80/jre/lib/ext/sunjce_provider.jar:/opt/public/common/jdk1.7.0_80/jre/lib/ext/localedata.jar:/jobs/genie.ajdt/ajdt-on-eclipse-45/workspace/org.aspectj.runtime/target/org.aspectj.runtime-1.8.9-SNAPSHOT.jar:
Timer event: 4ms: Pre compile
Compiler configuration for project ITDContentAssist has been read by compiler.  Resetting.
     Configuration was [PROJECTSOURCEFILES_CHANGED, JAVAOPTIONS_CHANGED, ASPECTPATH_CHANGED, CLASSPATH_CHANGED, INPATH_CHANGED, NONSTANDARDOPTIONS_CHANGED, OUTJAR_CHANGED, PROJECTSOURCERESOURCES_CHANGED, OUTPUTDESTINATIONS_CHANGED, INJARS_CHANGED]
Resetting list of modified source files.  Was null
Preparing for build: not going to be incremental because no successful previous full build
AJC: compiling source files
Timer event: 52ms: Time to first compiled message
AJC: compiled: /jobs/genie.ajdt/ajdt-on-eclipse-45/workspace/org.eclipse.ajdt.ui.tests/target/work/data/ITDContentAssist/src/injavafiles/itds/ITDAspect.aj
AJC: compiled: /jobs/genie.ajdt/ajdt-on-eclipse-45/workspace/org.eclipse.ajdt.ui.tests/target/work/data/ITDContentAssist/src/itds/ITDAspect.aj
Timer event: 62ms: Time to first woven message
AJC: woven aspect injavafiles.itds.ITDAspect (from /jobs/genie.ajdt/ajdt-on-eclipse-45/workspace/org.eclipse.ajdt.ui.tests/target/work/data/ITDContentAssist/src/injavafiles/itds/ITDAspect.aj)
AJC: woven aspect itds.ITDAspect (from /jobs/genie.ajdt/ajdt-on-eclipse-45/workspace/org.eclipse.ajdt.ui.tests/target/work/data/ITDContentAssist/src/itds/ITDAspect.aj)
AJC: woven aspect itds.ITDAspect$AjcClosure1 (from /jobs/genie.ajdt/ajdt-on-eclipse-45/workspace/org.eclipse.ajdt.ui.tests/target/work/data/ITDContentAssist/src/itds/ITDAspect.aj)
AJC: woven class injavafiles.itds.ITDAspect$Super (from /jobs/genie.ajdt/ajdt-on-eclipse-45/workspace/org.eclipse.ajdt.ui.tests/target/work/data/ITDContentAssist/src/injavafiles/itds/ITDAspect.aj)
AJC: woven class itds.ITDAspect$Super (from /jobs/genie.ajdt/ajdt-on-eclipse-45/workspace/org.eclipse.ajdt.ui.tests/target/work/data/ITDContentAssist/src/itds/ITDAspect.aj)
The value of the local variable x is not used
AJC: compiled: /jobs/genie.ajdt/ajdt-on-eclipse-45/workspace/org.eclipse.ajdt.ui.tests/target/work/data/ITDContentAssist/src/hasitds/HasITDs.aj
AJC: woven class hasitds.HasITDs (from /jobs/genie.ajdt/ajdt-on-eclipse-45/workspace/org.eclipse.ajdt.ui.tests/target/work/data/ITDContentAssist/src/hasitds/HasITDs.aj)
The import itds.ITDAspect is never used
The import java.util.List is never used
AJC: compiled: /jobs/genie.ajdt/ajdt-on-eclipse-45/workspace/org.eclipse.ajdt.ui.tests/target/work/data/ITDContentAssist/src/other/Gen.java
AJC: woven class other.Gen (from /jobs/genie.ajdt/ajdt-on-eclipse-45/workspace/org.eclipse.ajdt.ui.tests/target/work/data/ITDContentAssist/src/other/Gen.java)
AJC: compiled: /jobs/genie.ajdt/ajdt-on-eclipse-45/workspace/org.eclipse.ajdt.ui.tests/target/work/data/ITDContentAssist/src/injavafiles/hasitds/HasITDs.java
AJC: woven class injavafiles.hasitds.HasITDs (from /jobs/genie.ajdt/ajdt-on-eclipse-45/workspace/org.eclipse.ajdt.ui.tests/target/work/data/ITDContentAssist/src/injavafiles/hasitds/HasITDs.java)
The import injavafiles.itds.ITDAspect is never used
The import java.util.List is never used
AJC: compiled: /jobs/genie.ajdt/ajdt-on-eclipse-45/workspace/org.eclipse.ajdt.ui.tests/target/work/data/ITDContentAssist/src/uses/UsesITDs.aj
AJC: woven class uses.UsesITDs (from /jobs/genie.ajdt/ajdt-on-eclipse-45/workspace/org.eclipse.ajdt.ui.tests/target/work/data/ITDContentAssist/src/uses/UsesITDs.aj)
The import java.util.List is never used
AJC: compiled: /jobs/genie.ajdt/ajdt-on-eclipse-45/workspace/org.eclipse.ajdt.ui.tests/target/work/data/ITDContentAssist/src/injavafiles/uses/UsesITDs.java
AJC: woven class injavafiles.uses.UsesITDs (from /jobs/genie.ajdt/ajdt-on-eclipse-45/workspace/org.eclipse.ajdt.ui.tests/target/work/data/ITDContentAssist/src/injavafiles/uses/UsesITDs.java)
The import java.util.List is never used
AspectJ reports build successful, build was: FULL
AJDE Callback: finish. Was full build: true
Timer event: 93ms: Total time spent in AJDE
Timer event: 0ms: Refresh after build
Types affected during build = 7
Timer event: 1ms: Delete markers: ITDContentAssist (Finished deleting markers for ITDContentAssist)
Crosscutting model sanity checked with no problems
Timer event: 9ms: Model sanity check for: ITDContentAssist
Timer event: 109ms: Total time spent in AJBuilder.build()
Timer event: 8ms: Create markers: ITDContentAssist (Finished creating markers for ITDContentAssist)
Created 16 markers in 7 files
Timer event: 0ms: Update visualizer, xref, advice listeners for (separate thread): ITDContentAssist
===========================================================================================
Build kind = AUTOBUILD
Project=DefaultEmptyProject, kind of build requested=Incremental AspectJ compilation
Timer event: 0ms: Flush included source file cache
Timer event: 0ms: Check delta
CoreCompilerConfiguration for project DefaultEmptyProject registered a configuration change: [ASPECTPATH_CHANGED, CLASSPATH_CHANGED, INPATH_CHANGED, OUTPUTDESTINATIONS_CHANGED]
Timer event: 0ms: Looking for and marking configuration changes in DefaultEmptyProject
	Configuration changes found: true
Timer event: 0ms: Look for source/resource changes
Setting list of classpath elements with modified contents:
      []
Classpath = /jobs/genie.ajdt/ajdt-on-eclipse-45/workspace/org.eclipse.ajdt.ui.tests/target/work/data/DefaultEmptyProject/bin:/jobs/genie.ajdt/ajdt-on-eclipse-45/workspace/org.aspectj.runtime/target/org.aspectj.runtime-1.8.9-SNAPSHOT.jar:/opt/public/common/jdk1.7.0_80/jre/lib/resources.jar:/opt/public/common/jdk1.7.0_80/jre/lib/rt.jar:/opt/public/common/jdk1.7.0_80/jre/lib/jsse.jar:/opt/public/common/jdk1.7.0_80/jre/lib/jce.jar:/opt/public/common/jdk1.7.0_80/jre/lib/charsets.jar:/opt/public/common/jdk1.7.0_80/jre/lib/jfr.jar:/opt/public/common/jdk1.7.0_80/jre/lib/ext/dnsns.jar:/opt/public/common/jdk1.7.0_80/jre/lib/ext/sunpkcs11.jar:/opt/public/common/jdk1.7.0_80/jre/lib/ext/zipfs.jar:/opt/public/common/jdk1.7.0_80/jre/lib/ext/sunec.jar:/opt/public/common/jdk1.7.0_80/jre/lib/ext/sunjce_provider.jar:/opt/public/common/jdk1.7.0_80/jre/lib/ext/localedata.jar:/jobs/genie.ajdt/ajdt-on-eclipse-45/workspace/org.eclipse.ajdt.ui.tests/target/work/configuration/org.eclipse.osgi/40/0/.cp/junit.jar:/jobs/genie.ajdt/ajdt-on-eclipse-45/workspace/org.eclipse.ajdt.ui.tests/target/work/configuration/org.eclipse.osgi/223/0/.cp:
Timer event: 7ms: Pre compile
Sending the following configuration changes to the compiler: [ASPECTPATH_CHANGED, CLASSPATH_CHANGED, INPATH_CHANGED, OUTPUTDESTINATIONS_CHANGED]
Compiler configuration for project DefaultEmptyProject has been read by compiler.  Resetting.
     Configuration was [ASPECTPATH_CHANGED, CLASSPATH_CHANGED, INPATH_CHANGED, OUTPUTDESTINATIONS_CHANGED]
Resetting list of modified source files.  Was []
ClassFileChangeChecking: failed to find a state instance managing output location : /jobs/genie.ajdt/ajdt-on-eclipse-45/workspace/org.eclipse.ajdt.ui.tests/target/work/configuration/org.eclipse.osgi/223/0/.cp (could be getting managed by JDT)
Timer event: 0ms: OutputLocationManager: binary folder to declaring project map creation: P/DefaultEmptyProject
Preparing for build: planning to be an incremental build
AspectJ reports build successful, build was: INCREMENTAL
AJDE Callback: finish. Was full build: false
Timer event: 8ms: Total time spent in AJDE
Timer event: 0ms: Refresh after build
Crosscutting model sanity checked with no problems
Timer event: 0ms: Model sanity check for: DefaultEmptyProject
Timer event: 15ms: Total time spent in AJBuilder.build()
Timer event: 1ms: Update visualizer, xref, advice listeners for (separate thread): DefaultEmptyProject
------------------------
Starting testGenericContentAssist
Compiler configuration for project ITDContentAssist doesn't know previous state, so assuming EVERYTHING has changed.
===========================================================================================
Build kind = FULLBUILD
Project=ITDContentAssist, kind of build requested=Full AspectJ compilation
Timer event: 0ms: Flush included source file cache
Timer event: 0ms: Check delta
Builder: Tidied output folder(s), removed class files and derived resources
Classpath = /jobs/genie.ajdt/ajdt-on-eclipse-45/workspace/org.eclipse.ajdt.ui.tests/target/work/data/ITDContentAssist/bin:/opt/public/common/jdk1.7.0_80/jre/lib/resources.jar:/opt/public/common/jdk1.7.0_80/jre/lib/rt.jar:/opt/public/common/jdk1.7.0_80/jre/lib/jsse.jar:/opt/public/common/jdk1.7.0_80/jre/lib/jce.jar:/opt/public/common/jdk1.7.0_80/jre/lib/charsets.jar:/opt/public/common/jdk1.7.0_80/jre/lib/jfr.jar:/opt/public/common/jdk1.7.0_80/jre/lib/ext/dnsns.jar:/opt/public/common/jdk1.7.0_80/jre/lib/ext/sunpkcs11.jar:/opt/public/common/jdk1.7.0_80/jre/lib/ext/zipfs.jar:/opt/public/common/jdk1.7.0_80/jre/lib/ext/sunec.jar:/opt/public/common/jdk1.7.0_80/jre/lib/ext/sunjce_provider.jar:/opt/public/common/jdk1.7.0_80/jre/lib/ext/localedata.jar:/jobs/genie.ajdt/ajdt-on-eclipse-45/workspace/org.aspectj.runtime/target/org.aspectj.runtime-1.8.9-SNAPSHOT.jar:
Timer event: 3ms: Pre compile
Compiler configuration for project ITDContentAssist has been read by compiler.  Resetting.
     Configuration was [PROJECTSOURCEFILES_CHANGED, JAVAOPTIONS_CHANGED, ASPECTPATH_CHANGED, CLASSPATH_CHANGED, INPATH_CHANGED, NONSTANDARDOPTIONS_CHANGED, OUTJAR_CHANGED, PROJECTSOURCERESOURCES_CHANGED, OUTPUTDESTINATIONS_CHANGED, INJARS_CHANGED]
Resetting list of modified source files.  Was null
Preparing for build: not going to be incremental because no successful previous full build
AJC: compiling source files
Timer event: 49ms: Time to first compiled message
AJC: compiled: /jobs/genie.ajdt/ajdt-on-eclipse-45/workspace/org.eclipse.ajdt.ui.tests/target/work/data/ITDContentAssist/src/injavafiles/itds/ITDAspect.aj
AJC: compiled: /jobs/genie.ajdt/ajdt-on-eclipse-45/workspace/org.eclipse.ajdt.ui.tests/target/work/data/ITDContentAssist/src/itds/ITDAspect.aj
Timer event: 59ms: Time to first woven message
AJC: woven aspect injavafiles.itds.ITDAspect (from /jobs/genie.ajdt/ajdt-on-eclipse-45/workspace/org.eclipse.ajdt.ui.tests/target/work/data/ITDContentAssist/src/injavafiles/itds/ITDAspect.aj)
AJC: woven aspect itds.ITDAspect (from /jobs/genie.ajdt/ajdt-on-eclipse-45/workspace/org.eclipse.ajdt.ui.tests/target/work/data/ITDContentAssist/src/itds/ITDAspect.aj)
AJC: woven aspect itds.ITDAspect$AjcClosure1 (from /jobs/genie.ajdt/ajdt-on-eclipse-45/workspace/org.eclipse.ajdt.ui.tests/target/work/data/ITDContentAssist/src/itds/ITDAspect.aj)
AJC: woven class injavafiles.itds.ITDAspect$Super (from /jobs/genie.ajdt/ajdt-on-eclipse-45/workspace/org.eclipse.ajdt.ui.tests/target/work/data/ITDContentAssist/src/injavafiles/itds/ITDAspect.aj)
AJC: woven class itds.ITDAspect$Super (from /jobs/genie.ajdt/ajdt-on-eclipse-45/workspace/org.eclipse.ajdt.ui.tests/target/work/data/ITDContentAssist/src/itds/ITDAspect.aj)
The value of the local variable x is not used
AJC: compiled: /jobs/genie.ajdt/ajdt-on-eclipse-45/workspace/org.eclipse.ajdt.ui.tests/target/work/data/ITDContentAssist/src/hasitds/HasITDs.aj
AJC: woven class hasitds.HasITDs (from /jobs/genie.ajdt/ajdt-on-eclipse-45/workspace/org.eclipse.ajdt.ui.tests/target/work/data/ITDContentAssist/src/hasitds/HasITDs.aj)
The import itds.ITDAspect is never used
The import java.util.List is never used
AJC: compiled: /jobs/genie.ajdt/ajdt-on-eclipse-45/workspace/org.eclipse.ajdt.ui.tests/target/work/data/ITDContentAssist/src/other/Gen.java
AJC: woven class other.Gen (from /jobs/genie.ajdt/ajdt-on-eclipse-45/workspace/org.eclipse.ajdt.ui.tests/target/work/data/ITDContentAssist/src/other/Gen.java)
AJC: compiled: /jobs/genie.ajdt/ajdt-on-eclipse-45/workspace/org.eclipse.ajdt.ui.tests/target/work/data/ITDContentAssist/src/injavafiles/hasitds/HasITDs.java
AJC: woven class injavafiles.hasitds.HasITDs (from /jobs/genie.ajdt/ajdt-on-eclipse-45/workspace/org.eclipse.ajdt.ui.tests/target/work/data/ITDContentAssist/src/injavafiles/hasitds/HasITDs.java)
The import injavafiles.itds.ITDAspect is never used
The import java.util.List is never used
AJC: compiled: /jobs/genie.ajdt/ajdt-on-eclipse-45/workspace/org.eclipse.ajdt.ui.tests/target/work/data/ITDContentAssist/src/uses/UsesITDs.aj
AJC: woven class uses.UsesITDs (from /jobs/genie.ajdt/ajdt-on-eclipse-45/workspace/org.eclipse.ajdt.ui.tests/target/work/data/ITDContentAssist/src/uses/UsesITDs.aj)
The import java.util.List is never used
AJC: compiled: /jobs/genie.ajdt/ajdt-on-eclipse-45/workspace/org.eclipse.ajdt.ui.tests/target/work/data/ITDContentAssist/src/injavafiles/uses/UsesITDs.java
AJC: woven class injavafiles.uses.UsesITDs (from /jobs/genie.ajdt/ajdt-on-eclipse-45/workspace/org.eclipse.ajdt.ui.tests/target/work/data/ITDContentAssist/src/injavafiles/uses/UsesITDs.java)
The import java.util.List is never used
AspectJ reports build successful, build was: FULL
AJDE Callback: finish. Was full build: true
Timer event: 90ms: Total time spent in AJDE
Timer event: 0ms: Refresh after build
Types affected during build = 7
Timer event: 1ms: Delete markers: ITDContentAssist (Finished deleting markers for ITDContentAssist)
Timer event: 11ms: Create markers: ITDContentAssist (Finished creating markers for ITDContentAssist)
Created 16 markers in 7 files
Crosscutting model sanity checked with no problems
Timer event: 12ms: Model sanity check for: ITDContentAssist
Timer event: 108ms: Total time spent in AJBuilder.build()
===========================================================================================
Build kind = AUTOBUILD
Project=DefaultEmptyProject, kind of build requested=Incremental AspectJ compilation
Timer event: 0ms: Flush included source file cache
Timer event: 0ms: Check delta
CoreCompilerConfiguration for project DefaultEmptyProject registered a configuration change: [ASPECTPATH_CHANGED, CLASSPATH_CHANGED, INPATH_CHANGED, OUTPUTDESTINATIONS_CHANGED]
Timer event: 0ms: Looking for and marking configuration changes in DefaultEmptyProject
	Configuration changes found: true
Timer event: 0ms: Look for source/resource changes
Setting list of classpath elements with modified contents:
      []
Classpath = /jobs/genie.ajdt/ajdt-on-eclipse-45/workspace/org.eclipse.ajdt.ui.tests/target/work/data/DefaultEmptyProject/bin:/jobs/genie.ajdt/ajdt-on-eclipse-45/workspace/org.aspectj.runtime/target/org.aspectj.runtime-1.8.9-SNAPSHOT.jar:/opt/public/common/jdk1.7.0_80/jre/lib/resources.jar:/opt/public/common/jdk1.7.0_80/jre/lib/rt.jar:/opt/public/common/jdk1.7.0_80/jre/lib/jsse.jar:/opt/public/common/jdk1.7.0_80/jre/lib/jce.jar:/opt/public/common/jdk1.7.0_80/jre/lib/charsets.jar:/opt/public/common/jdk1.7.0_80/jre/lib/jfr.jar:/opt/public/common/jdk1.7.0_80/jre/lib/ext/dnsns.jar:/opt/public/common/jdk1.7.0_80/jre/lib/ext/sunpkcs11.jar:/opt/public/common/jdk1.7.0_80/jre/lib/ext/zipfs.jar:/opt/public/common/jdk1.7.0_80/jre/lib/ext/sunec.jar:/opt/public/common/jdk1.7.0_80/jre/lib/ext/sunjce_provider.jar:/opt/public/common/jdk1.7.0_80/jre/lib/ext/localedata.jar:/jobs/genie.ajdt/ajdt-on-eclipse-45/workspace/org.eclipse.ajdt.ui.tests/target/work/configuration/org.eclipse.osgi/40/0/.cp/junit.jar:/jobs/genie.ajdt/ajdt-on-eclipse-45/workspace/org.eclipse.ajdt.ui.tests/target/work/configuration/org.eclipse.osgi/223/0/.cp:
Timer event: 12ms: Pre compile
Sending the following configuration changes to the compiler: [ASPECTPATH_CHANGED, CLASSPATH_CHANGED, INPATH_CHANGED, OUTPUTDESTINATIONS_CHANGED]
Compiler configuration for project DefaultEmptyProject has been read by compiler.  Resetting.
     Configuration was [ASPECTPATH_CHANGED, CLASSPATH_CHANGED, INPATH_CHANGED, OUTPUTDESTINATIONS_CHANGED]
Resetting list of modified source files.  Was []
ClassFileChangeChecking: failed to find a state instance managing output location : /jobs/genie.ajdt/ajdt-on-eclipse-45/workspace/org.eclipse.ajdt.ui.tests/target/work/configuration/org.eclipse.osgi/223/0/.cp (could be getting managed by JDT)
Timer event: 0ms: OutputLocationManager: binary folder to declaring project map creation: P/DefaultEmptyProject
Preparing for build: planning to be an incremental build
AspectJ reports build successful, build was: INCREMENTAL
AJDE Callback: finish. Was full build: false
Timer event: 10ms: Total time spent in AJDE
Timer event: 0ms: Refresh after build
Crosscutting model sanity checked with no problems
Timer event: 0ms: Model sanity check for: DefaultEmptyProject
Timer event: 22ms: Total time spent in AJBuilder.build()
Timer event: 1ms: Update visualizer, xref, advice listeners for (separate thread): ITDContentAssist
Timer event: 0ms: Update visualizer, xref, advice listeners for (separate thread): DefaultEmptyProject
------------------------
Starting testGenericContentAssist2
Compiler configuration for project ITDContentAssist doesn't know previous state, so assuming EVERYTHING has changed.
===========================================================================================
Build kind = FULLBUILD
Project=ITDContentAssist, kind of build requested=Full AspectJ compilation
Timer event: 0ms: Flush included source file cache
Timer event: 0ms: Check delta
Builder: Tidied output folder(s), removed class files and derived resources
Classpath = /jobs/genie.ajdt/ajdt-on-eclipse-45/workspace/org.eclipse.ajdt.ui.tests/target/work/data/ITDContentAssist/bin:/opt/public/common/jdk1.7.0_80/jre/lib/resources.jar:/opt/public/common/jdk1.7.0_80/jre/lib/rt.jar:/opt/public/common/jdk1.7.0_80/jre/lib/jsse.jar:/opt/public/common/jdk1.7.0_80/jre/lib/jce.jar:/opt/public/common/jdk1.7.0_80/jre/lib/charsets.jar:/opt/public/common/jdk1.7.0_80/jre/lib/jfr.jar:/opt/public/common/jdk1.7.0_80/jre/lib/ext/dnsns.jar:/opt/public/common/jdk1.7.0_80/jre/lib/ext/sunpkcs11.jar:/opt/public/common/jdk1.7.0_80/jre/lib/ext/zipfs.jar:/opt/public/common/jdk1.7.0_80/jre/lib/ext/sunec.jar:/opt/public/common/jdk1.7.0_80/jre/lib/ext/sunjce_provider.jar:/opt/public/common/jdk1.7.0_80/jre/lib/ext/localedata.jar:/jobs/genie.ajdt/ajdt-on-eclipse-45/workspace/org.aspectj.runtime/target/org.aspectj.runtime-1.8.9-SNAPSHOT.jar:
Timer event: 4ms: Pre compile
Compiler configuration for project ITDContentAssist has been read by compiler.  Resetting.
     Configuration was [PROJECTSOURCEFILES_CHANGED, JAVAOPTIONS_CHANGED, ASPECTPATH_CHANGED, CLASSPATH_CHANGED, INPATH_CHANGED, NONSTANDARDOPTIONS_CHANGED, OUTJAR_CHANGED, PROJECTSOURCERESOURCES_CHANGED, OUTPUTDESTINATIONS_CHANGED, INJARS_CHANGED]
Resetting list of modified source files.  Was null
Preparing for build: not going to be incremental because no successful previous full build
AJC: compiling source files
Timer event: 53ms: Time to first compiled message
AJC: compiled: /jobs/genie.ajdt/ajdt-on-eclipse-45/workspace/org.eclipse.ajdt.ui.tests/target/work/data/ITDContentAssist/src/injavafiles/itds/ITDAspect.aj
AJC: compiled: /jobs/genie.ajdt/ajdt-on-eclipse-45/workspace/org.eclipse.ajdt.ui.tests/target/work/data/ITDContentAssist/src/itds/ITDAspect.aj
Timer event: 63ms: Time to first woven message
AJC: woven aspect injavafiles.itds.ITDAspect (from /jobs/genie.ajdt/ajdt-on-eclipse-45/workspace/org.eclipse.ajdt.ui.tests/target/work/data/ITDContentAssist/src/injavafiles/itds/ITDAspect.aj)
AJC: woven aspect itds.ITDAspect (from /jobs/genie.ajdt/ajdt-on-eclipse-45/workspace/org.eclipse.ajdt.ui.tests/target/work/data/ITDContentAssist/src/itds/ITDAspect.aj)
AJC: woven aspect itds.ITDAspect$AjcClosure1 (from /jobs/genie.ajdt/ajdt-on-eclipse-45/workspace/org.eclipse.ajdt.ui.tests/target/work/data/ITDContentAssist/src/itds/ITDAspect.aj)
AJC: woven class injavafiles.itds.ITDAspect$Super (from /jobs/genie.ajdt/ajdt-on-eclipse-45/workspace/org.eclipse.ajdt.ui.tests/target/work/data/ITDContentAssist/src/injavafiles/itds/ITDAspect.aj)
AJC: woven class itds.ITDAspect$Super (from /jobs/genie.ajdt/ajdt-on-eclipse-45/workspace/org.eclipse.ajdt.ui.tests/target/work/data/ITDContentAssist/src/itds/ITDAspect.aj)
The value of the local variable x is not used
AJC: compiled: /jobs/genie.ajdt/ajdt-on-eclipse-45/workspace/org.eclipse.ajdt.ui.tests/target/work/data/ITDContentAssist/src/hasitds/HasITDs.aj
AJC: woven class hasitds.HasITDs (from /jobs/genie.ajdt/ajdt-on-eclipse-45/workspace/org.eclipse.ajdt.ui.tests/target/work/data/ITDContentAssist/src/hasitds/HasITDs.aj)
The import itds.ITDAspect is never used
The import java.util.List is never used
AJC: compiled: /jobs/genie.ajdt/ajdt-on-eclipse-45/workspace/org.eclipse.ajdt.ui.tests/target/work/data/ITDContentAssist/src/other/Gen.java
AJC: woven class other.Gen (from /jobs/genie.ajdt/ajdt-on-eclipse-45/workspace/org.eclipse.ajdt.ui.tests/target/work/data/ITDContentAssist/src/other/Gen.java)
AJC: compiled: /jobs/genie.ajdt/ajdt-on-eclipse-45/workspace/org.eclipse.ajdt.ui.tests/target/work/data/ITDContentAssist/src/injavafiles/hasitds/HasITDs.java
AJC: woven class injavafiles.hasitds.HasITDs (from /jobs/genie.ajdt/ajdt-on-eclipse-45/workspace/org.eclipse.ajdt.ui.tests/target/work/data/ITDContentAssist/src/injavafiles/hasitds/HasITDs.java)
The import injavafiles.itds.ITDAspect is never used
The import java.util.List is never used
AJC: compiled: /jobs/genie.ajdt/ajdt-on-eclipse-45/workspace/org.eclipse.ajdt.ui.tests/target/work/data/ITDContentAssist/src/uses/UsesITDs.aj
AJC: woven class uses.UsesITDs (from /jobs/genie.ajdt/ajdt-on-eclipse-45/workspace/org.eclipse.ajdt.ui.tests/target/work/data/ITDContentAssist/src/uses/UsesITDs.aj)
The import java.util.List is never used
AJC: compiled: /jobs/genie.ajdt/ajdt-on-eclipse-45/workspace/org.eclipse.ajdt.ui.tests/target/work/data/ITDContentAssist/src/injavafiles/uses/UsesITDs.java
AJC: woven class injavafiles.uses.UsesITDs (from /jobs/genie.ajdt/ajdt-on-eclipse-45/workspace/org.eclipse.ajdt.ui.tests/target/work/data/ITDContentAssist/src/injavafiles/uses/UsesITDs.java)
The import java.util.List is never used
AspectJ reports build successful, build was: FULL
AJDE Callback: finish. Was full build: true
Timer event: 93ms: Total time spent in AJDE
Timer event: 0ms: Refresh after build
Types affected during build = 7
Timer event: 0ms: Delete markers: ITDContentAssist (Finished deleting markers for ITDContentAssist)
Crosscutting model sanity checked with no problems
Timer event: 9ms: Model sanity check for: ITDContentAssist
Timer event: 109ms: Total time spent in AJBuilder.build()
Timer event: 7ms: Create markers: ITDContentAssist (Finished creating markers for ITDContentAssist)
Created 16 markers in 7 files
Timer event: 1ms: Update visualizer, xref, advice listeners for (separate thread): ITDContentAssist
===========================================================================================
Build kind = AUTOBUILD
Project=DefaultEmptyProject, kind of build requested=Incremental AspectJ compilation
Timer event: 0ms: Flush included source file cache
Timer event: 1ms: Check delta
CoreCompilerConfiguration for project DefaultEmptyProject registered a configuration change: [ASPECTPATH_CHANGED, CLASSPATH_CHANGED, INPATH_CHANGED, OUTPUTDESTINATIONS_CHANGED]
Timer event: 0ms: Looking for and marking configuration changes in DefaultEmptyProject
	Configuration changes found: true
Timer event: 0ms: Look for source/resource changes
Setting list of classpath elements with modified contents:
      []
Classpath = /jobs/genie.ajdt/ajdt-on-eclipse-45/workspace/org.eclipse.ajdt.ui.tests/target/work/data/DefaultEmptyProject/bin:/jobs/genie.ajdt/ajdt-on-eclipse-45/workspace/org.aspectj.runtime/target/org.aspectj.runtime-1.8.9-SNAPSHOT.jar:/opt/public/common/jdk1.7.0_80/jre/lib/resources.jar:/opt/public/common/jdk1.7.0_80/jre/lib/rt.jar:/opt/public/common/jdk1.7.0_80/jre/lib/jsse.jar:/opt/public/common/jdk1.7.0_80/jre/lib/jce.jar:/opt/public/common/jdk1.7.0_80/jre/lib/charsets.jar:/opt/public/common/jdk1.7.0_80/jre/lib/jfr.jar:/opt/public/common/jdk1.7.0_80/jre/lib/ext/dnsns.jar:/opt/public/common/jdk1.7.0_80/jre/lib/ext/sunpkcs11.jar:/opt/public/common/jdk1.7.0_80/jre/lib/ext/zipfs.jar:/opt/public/common/jdk1.7.0_80/jre/lib/ext/sunec.jar:/opt/public/common/jdk1.7.0_80/jre/lib/ext/sunjce_provider.jar:/opt/public/common/jdk1.7.0_80/jre/lib/ext/localedata.jar:/jobs/genie.ajdt/ajdt-on-eclipse-45/workspace/org.eclipse.ajdt.ui.tests/target/work/configuration/org.eclipse.osgi/40/0/.cp/junit.jar:/jobs/genie.ajdt/ajdt-on-eclipse-45/workspace/org.eclipse.ajdt.ui.tests/target/work/configuration/org.eclipse.osgi/223/0/.cp:
Timer event: 9ms: Pre compile
Sending the following configuration changes to the compiler: [ASPECTPATH_CHANGED, CLASSPATH_CHANGED, INPATH_CHANGED, OUTPUTDESTINATIONS_CHANGED]
Compiler configuration for project DefaultEmptyProject has been read by compiler.  Resetting.
     Configuration was [ASPECTPATH_CHANGED, CLASSPATH_CHANGED, INPATH_CHANGED, OUTPUTDESTINATIONS_CHANGED]
Resetting list of modified source files.  Was []
ClassFileChangeChecking: failed to find a state instance managing output location : /jobs/genie.ajdt/ajdt-on-eclipse-45/workspace/org.eclipse.ajdt.ui.tests/target/work/configuration/org.eclipse.osgi/223/0/.cp (could be getting managed by JDT)
Timer event: 0ms: OutputLocationManager: binary folder to declaring project map creation: P/DefaultEmptyProject
Preparing for build: planning to be an incremental build
AspectJ reports build successful, build was: INCREMENTAL
AJDE Callback: finish. Was full build: false
Timer event: 7ms: Total time spent in AJDE
Timer event: 0ms: Refresh after build
Crosscutting model sanity checked with no problems
Timer event: 0ms: Model sanity check for: DefaultEmptyProject
Timer event: 16ms: Total time spent in AJBuilder.build()
Timer event: 1ms: Update visualizer, xref, advice listeners for (separate thread): DefaultEmptyProject
------------------------
Starting testGenericContentAssist3
Compiler configuration for project ITDContentAssist doesn't know previous state, so assuming EVERYTHING has changed.
===========================================================================================
Build kind = FULLBUILD
Project=ITDContentAssist, kind of build requested=Full AspectJ compilation
Timer event: 0ms: Flush included source file cache
Timer event: 0ms: Check delta
Builder: Tidied output folder(s), removed class files and derived resources
Classpath = /jobs/genie.ajdt/ajdt-on-eclipse-45/workspace/org.eclipse.ajdt.ui.tests/target/work/data/ITDContentAssist/bin:/opt/public/common/jdk1.7.0_80/jre/lib/resources.jar:/opt/public/common/jdk1.7.0_80/jre/lib/rt.jar:/opt/public/common/jdk1.7.0_80/jre/lib/jsse.jar:/opt/public/common/jdk1.7.0_80/jre/lib/jce.jar:/opt/public/common/jdk1.7.0_80/jre/lib/charsets.jar:/opt/public/common/jdk1.7.0_80/jre/lib/jfr.jar:/opt/public/common/jdk1.7.0_80/jre/lib/ext/dnsns.jar:/opt/public/common/jdk1.7.0_80/jre/lib/ext/sunpkcs11.jar:/opt/public/common/jdk1.7.0_80/jre/lib/ext/zipfs.jar:/opt/public/common/jdk1.7.0_80/jre/lib/ext/sunec.jar:/opt/public/common/jdk1.7.0_80/jre/lib/ext/sunjce_provider.jar:/opt/public/common/jdk1.7.0_80/jre/lib/ext/localedata.jar:/jobs/genie.ajdt/ajdt-on-eclipse-45/workspace/org.aspectj.runtime/target/org.aspectj.runtime-1.8.9-SNAPSHOT.jar:
Timer event: 3ms: Pre compile
Compiler configuration for project ITDContentAssist has been read by compiler.  Resetting.
     Configuration was [PROJECTSOURCEFILES_CHANGED, JAVAOPTIONS_CHANGED, ASPECTPATH_CHANGED, CLASSPATH_CHANGED, INPATH_CHANGED, NONSTANDARDOPTIONS_CHANGED, OUTJAR_CHANGED, PROJECTSOURCERESOURCES_CHANGED, OUTPUTDESTINATIONS_CHANGED, INJARS_CHANGED]
Resetting list of modified source files.  Was null
Preparing for build: not going to be incremental because no successful previous full build
AJC: compiling source files
Timer event: 54ms: Time to first compiled message
AJC: compiled: /jobs/genie.ajdt/ajdt-on-eclipse-45/workspace/org.eclipse.ajdt.ui.tests/target/work/data/ITDContentAssist/src/injavafiles/itds/ITDAspect.aj
AJC: compiled: /jobs/genie.ajdt/ajdt-on-eclipse-45/workspace/org.eclipse.ajdt.ui.tests/target/work/data/ITDContentAssist/src/itds/ITDAspect.aj
Timer event: 64ms: Time to first woven message
AJC: woven aspect injavafiles.itds.ITDAspect (from /jobs/genie.ajdt/ajdt-on-eclipse-45/workspace/org.eclipse.ajdt.ui.tests/target/work/data/ITDContentAssist/src/injavafiles/itds/ITDAspect.aj)
AJC: woven aspect itds.ITDAspect (from /jobs/genie.ajdt/ajdt-on-eclipse-45/workspace/org.eclipse.ajdt.ui.tests/target/work/data/ITDContentAssist/src/itds/ITDAspect.aj)
AJC: woven aspect itds.ITDAspect$AjcClosure1 (from /jobs/genie.ajdt/ajdt-on-eclipse-45/workspace/org.eclipse.ajdt.ui.tests/target/work/data/ITDContentAssist/src/itds/ITDAspect.aj)
AJC: woven class injavafiles.itds.ITDAspect$Super (from /jobs/genie.ajdt/ajdt-on-eclipse-45/workspace/org.eclipse.ajdt.ui.tests/target/work/data/ITDContentAssist/src/injavafiles/itds/ITDAspect.aj)
AJC: woven class itds.ITDAspect$Super (from /jobs/genie.ajdt/ajdt-on-eclipse-45/workspace/org.eclipse.ajdt.ui.tests/target/work/data/ITDContentAssist/src/itds/ITDAspect.aj)
The value of the local variable x is not used
AJC: compiled: /jobs/genie.ajdt/ajdt-on-eclipse-45/workspace/org.eclipse.ajdt.ui.tests/target/work/data/ITDContentAssist/src/hasitds/HasITDs.aj
AJC: woven class hasitds.HasITDs (from /jobs/genie.ajdt/ajdt-on-eclipse-45/workspace/org.eclipse.ajdt.ui.tests/target/work/data/ITDContentAssist/src/hasitds/HasITDs.aj)
The import itds.ITDAspect is never used
The import java.util.List is never used
AJC: compiled: /jobs/genie.ajdt/ajdt-on-eclipse-45/workspace/org.eclipse.ajdt.ui.tests/target/work/data/ITDContentAssist/src/other/Gen.java
AJC: woven class other.Gen (from /jobs/genie.ajdt/ajdt-on-eclipse-45/workspace/org.eclipse.ajdt.ui.tests/target/work/data/ITDContentAssist/src/other/Gen.java)
AJC: compiled: /jobs/genie.ajdt/ajdt-on-eclipse-45/workspace/org.eclipse.ajdt.ui.tests/target/work/data/ITDContentAssist/src/injavafiles/hasitds/HasITDs.java
AJC: woven class injavafiles.hasitds.HasITDs (from /jobs/genie.ajdt/ajdt-on-eclipse-45/workspace/org.eclipse.ajdt.ui.tests/target/work/data/ITDContentAssist/src/injavafiles/hasitds/HasITDs.java)
The import injavafiles.itds.ITDAspect is never used
The import java.util.List is never used
AJC: compiled: /jobs/genie.ajdt/ajdt-on-eclipse-45/workspace/org.eclipse.ajdt.ui.tests/target/work/data/ITDContentAssist/src/uses/UsesITDs.aj
AJC: woven class uses.UsesITDs (from /jobs/genie.ajdt/ajdt-on-eclipse-45/workspace/org.eclipse.ajdt.ui.tests/target/work/data/ITDContentAssist/src/uses/UsesITDs.aj)
The import java.util.List is never used
AJC: compiled: /jobs/genie.ajdt/ajdt-on-eclipse-45/workspace/org.eclipse.ajdt.ui.tests/target/work/data/ITDContentAssist/src/injavafiles/uses/UsesITDs.java
AJC: woven class injavafiles.uses.UsesITDs (from /jobs/genie.ajdt/ajdt-on-eclipse-45/workspace/org.eclipse.ajdt.ui.tests/target/work/data/ITDContentAssist/src/injavafiles/uses/UsesITDs.java)
The import java.util.List is never used
AspectJ reports build successful, build was: FULL
AJDE Callback: finish. Was full build: true
Timer event: 95ms: Total time spent in AJDE
Timer event: 0ms: Refresh after build
Types affected during build = 7
Timer event: 0ms: Delete markers: ITDContentAssist (Finished deleting markers for ITDContentAssist)
Crosscutting model sanity checked with no problems
Timer event: 9ms: Model sanity check for: ITDContentAssist
Timer event: 8ms: Create markers: ITDContentAssist (Finished creating markers for ITDContentAssist)
Timer event: 110ms: Total time spent in AJBuilder.build()
Created 16 markers in 7 files
Timer event: 1ms: Update visualizer, xref, advice listeners for (separate thread): ITDContentAssist
===========================================================================================
Build kind = AUTOBUILD
Project=DefaultEmptyProject, kind of build requested=Incremental AspectJ compilation
Timer event: 0ms: Flush included source file cache
Timer event: 1ms: Check delta
CoreCompilerConfiguration for project DefaultEmptyProject registered a configuration change: [ASPECTPATH_CHANGED, CLASSPATH_CHANGED, INPATH_CHANGED, OUTPUTDESTINATIONS_CHANGED]
Timer event: 0ms: Looking for and marking configuration changes in DefaultEmptyProject
	Configuration changes found: true
Timer event: 0ms: Look for source/resource changes
Setting list of classpath elements with modified contents:
      []
Classpath = /jobs/genie.ajdt/ajdt-on-eclipse-45/workspace/org.eclipse.ajdt.ui.tests/target/work/data/DefaultEmptyProject/bin:/jobs/genie.ajdt/ajdt-on-eclipse-45/workspace/org.aspectj.runtime/target/org.aspectj.runtime-1.8.9-SNAPSHOT.jar:/opt/public/common/jdk1.7.0_80/jre/lib/resources.jar:/opt/public/common/jdk1.7.0_80/jre/lib/rt.jar:/opt/public/common/jdk1.7.0_80/jre/lib/jsse.jar:/opt/public/common/jdk1.7.0_80/jre/lib/jce.jar:/opt/public/common/jdk1.7.0_80/jre/lib/charsets.jar:/opt/public/common/jdk1.7.0_80/jre/lib/jfr.jar:/opt/public/common/jdk1.7.0_80/jre/lib/ext/dnsns.jar:/opt/public/common/jdk1.7.0_80/jre/lib/ext/sunpkcs11.jar:/opt/public/common/jdk1.7.0_80/jre/lib/ext/zipfs.jar:/opt/public/common/jdk1.7.0_80/jre/lib/ext/sunec.jar:/opt/public/common/jdk1.7.0_80/jre/lib/ext/sunjce_provider.jar:/opt/public/common/jdk1.7.0_80/jre/lib/ext/localedata.jar:/jobs/genie.ajdt/ajdt-on-eclipse-45/workspace/org.eclipse.ajdt.ui.tests/target/work/configuration/org.eclipse.osgi/40/0/.cp/junit.jar:/jobs/genie.ajdt/ajdt-on-eclipse-45/workspace/org.eclipse.ajdt.ui.tests/target/work/configuration/org.eclipse.osgi/223/0/.cp:
Timer event: 10ms: Pre compile
Sending the following configuration changes to the compiler: [ASPECTPATH_CHANGED, CLASSPATH_CHANGED, INPATH_CHANGED, OUTPUTDESTINATIONS_CHANGED]
Compiler configuration for project DefaultEmptyProject has been read by compiler.  Resetting.
     Configuration was [ASPECTPATH_CHANGED, CLASSPATH_CHANGED, INPATH_CHANGED, OUTPUTDESTINATIONS_CHANGED]
Resetting list of modified source files.  Was []
ClassFileChangeChecking: failed to find a state instance managing output location : /jobs/genie.ajdt/ajdt-on-eclipse-45/workspace/org.eclipse.ajdt.ui.tests/target/work/configuration/org.eclipse.osgi/223/0/.cp (could be getting managed by JDT)
Timer event: 0ms: OutputLocationManager: binary folder to declaring project map creation: P/DefaultEmptyProject
Preparing for build: planning to be an incremental build
AspectJ reports build successful, build was: INCREMENTAL
AJDE Callback: finish. Was full build: false
Timer event: 7ms: Total time spent in AJDE
Timer event: 0ms: Refresh after build
Crosscutting model sanity checked with no problems
Timer event: 0ms: Model sanity check for: DefaultEmptyProject
Timer event: 18ms: Total time spent in AJBuilder.build()
Timer event: 1ms: Update visualizer, xref, advice listeners for (separate thread): DefaultEmptyProject
------------------------
Starting testGenericContentAssist4
Compiler configuration for project ITDContentAssist doesn't know previous state, so assuming EVERYTHING has changed.
===========================================================================================
Build kind = FULLBUILD
Project=ITDContentAssist, kind of build requested=Full AspectJ compilation
Timer event: 0ms: Flush included source file cache
Timer event: 0ms: Check delta
Builder: Tidied output folder(s), removed class files and derived resources
Classpath = /jobs/genie.ajdt/ajdt-on-eclipse-45/workspace/org.eclipse.ajdt.ui.tests/target/work/data/ITDContentAssist/bin:/opt/public/common/jdk1.7.0_80/jre/lib/resources.jar:/opt/public/common/jdk1.7.0_80/jre/lib/rt.jar:/opt/public/common/jdk1.7.0_80/jre/lib/jsse.jar:/opt/public/common/jdk1.7.0_80/jre/lib/jce.jar:/opt/public/common/jdk1.7.0_80/jre/lib/charsets.jar:/opt/public/common/jdk1.7.0_80/jre/lib/jfr.jar:/opt/public/common/jdk1.7.0_80/jre/lib/ext/dnsns.jar:/opt/public/common/jdk1.7.0_80/jre/lib/ext/sunpkcs11.jar:/opt/public/common/jdk1.7.0_80/jre/lib/ext/zipfs.jar:/opt/public/common/jdk1.7.0_80/jre/lib/ext/sunec.jar:/opt/public/common/jdk1.7.0_80/jre/lib/ext/sunjce_provider.jar:/opt/public/common/jdk1.7.0_80/jre/lib/ext/localedata.jar:/jobs/genie.ajdt/ajdt-on-eclipse-45/workspace/org.aspectj.runtime/target/org.aspectj.runtime-1.8.9-SNAPSHOT.jar:
Timer event: 4ms: Pre compile
Compiler configuration for project ITDContentAssist has been read by compiler.  Resetting.
     Configuration was [PROJECTSOURCEFILES_CHANGED, JAVAOPTIONS_CHANGED, ASPECTPATH_CHANGED, CLASSPATH_CHANGED, INPATH_CHANGED, NONSTANDARDOPTIONS_CHANGED, OUTJAR_CHANGED, PROJECTSOURCERESOURCES_CHANGED, OUTPUTDESTINATIONS_CHANGED, INJARS_CHANGED]
Resetting list of modified source files.  Was null
Preparing for build: not going to be incremental because no successful previous full build
AJC: compiling source files
Timer event: 54ms: Time to first compiled message
AJC: compiled: /jobs/genie.ajdt/ajdt-on-eclipse-45/workspace/org.eclipse.ajdt.ui.tests/target/work/data/ITDContentAssist/src/injavafiles/itds/ITDAspect.aj
AJC: compiled: /jobs/genie.ajdt/ajdt-on-eclipse-45/workspace/org.eclipse.ajdt.ui.tests/target/work/data/ITDContentAssist/src/itds/ITDAspect.aj
Timer event: 65ms: Time to first woven message
AJC: woven aspect injavafiles.itds.ITDAspect (from /jobs/genie.ajdt/ajdt-on-eclipse-45/workspace/org.eclipse.ajdt.ui.tests/target/work/data/ITDContentAssist/src/injavafiles/itds/ITDAspect.aj)
AJC: woven aspect itds.ITDAspect (from /jobs/genie.ajdt/ajdt-on-eclipse-45/workspace/org.eclipse.ajdt.ui.tests/target/work/data/ITDContentAssist/src/itds/ITDAspect.aj)
AJC: woven aspect itds.ITDAspect$AjcClosure1 (from /jobs/genie.ajdt/ajdt-on-eclipse-45/workspace/org.eclipse.ajdt.ui.tests/target/work/data/ITDContentAssist/src/itds/ITDAspect.aj)
AJC: woven class injavafiles.itds.ITDAspect$Super (from /jobs/genie.ajdt/ajdt-on-eclipse-45/workspace/org.eclipse.ajdt.ui.tests/target/work/data/ITDContentAssist/src/injavafiles/itds/ITDAspect.aj)
AJC: woven class itds.ITDAspect$Super (from /jobs/genie.ajdt/ajdt-on-eclipse-45/workspace/org.eclipse.ajdt.ui.tests/target/work/data/ITDContentAssist/src/itds/ITDAspect.aj)
The value of the local variable x is not used
AJC: compiled: /jobs/genie.ajdt/ajdt-on-eclipse-45/workspace/org.eclipse.ajdt.ui.tests/target/work/data/ITDContentAssist/src/hasitds/HasITDs.aj
AJC: woven class hasitds.HasITDs (from /jobs/genie.ajdt/ajdt-on-eclipse-45/workspace/org.eclipse.ajdt.ui.tests/target/work/data/ITDContentAssist/src/hasitds/HasITDs.aj)
The import itds.ITDAspect is never used
The import java.util.List is never used
AJC: compiled: /jobs/genie.ajdt/ajdt-on-eclipse-45/workspace/org.eclipse.ajdt.ui.tests/target/work/data/ITDContentAssist/src/other/Gen.java
AJC: woven class other.Gen (from /jobs/genie.ajdt/ajdt-on-eclipse-45/workspace/org.eclipse.ajdt.ui.tests/target/work/data/ITDContentAssist/src/other/Gen.java)
AJC: compiled: /jobs/genie.ajdt/ajdt-on-eclipse-45/workspace/org.eclipse.ajdt.ui.tests/target/work/data/ITDContentAssist/src/injavafiles/hasitds/HasITDs.java
AJC: woven class injavafiles.hasitds.HasITDs (from /jobs/genie.ajdt/ajdt-on-eclipse-45/workspace/org.eclipse.ajdt.ui.tests/target/work/data/ITDContentAssist/src/injavafiles/hasitds/HasITDs.java)
The import injavafiles.itds.ITDAspect is never used
The import java.util.List is never used
AJC: compiled: /jobs/genie.ajdt/ajdt-on-eclipse-45/workspace/org.eclipse.ajdt.ui.tests/target/work/data/ITDContentAssist/src/uses/UsesITDs.aj
AJC: woven class uses.UsesITDs (from /jobs/genie.ajdt/ajdt-on-eclipse-45/workspace/org.eclipse.ajdt.ui.tests/target/work/data/ITDContentAssist/src/uses/UsesITDs.aj)
The import java.util.List is never used
AJC: compiled: /jobs/genie.ajdt/ajdt-on-eclipse-45/workspace/org.eclipse.ajdt.ui.tests/target/work/data/ITDContentAssist/src/injavafiles/uses/UsesITDs.java
AJC: woven class injavafiles.uses.UsesITDs (from /jobs/genie.ajdt/ajdt-on-eclipse-45/workspace/org.eclipse.ajdt.ui.tests/target/work/data/ITDContentAssist/src/injavafiles/uses/UsesITDs.java)
The import java.util.List is never used
AspectJ reports build successful, build was: FULL
AJDE Callback: finish. Was full build: true
Timer event: 95ms: Total time spent in AJDE
Timer event: 0ms: Refresh after build
Types affected during build = 7
Timer event: 1ms: Delete markers: ITDContentAssist (Finished deleting markers for ITDContentAssist)
Timer event: 7ms: Create markers: ITDContentAssist (Finished creating markers for ITDContentAssist)
Created 16 markers in 7 files
Crosscutting model sanity checked with no problems
Timer event: 8ms: Model sanity check for: ITDContentAssist
Timer event: 110ms: Total time spent in AJBuilder.build()
Timer event: 1ms: Update visualizer, xref, advice listeners for (separate thread): ITDContentAssist
===========================================================================================
Build kind = AUTOBUILD
Project=DefaultEmptyProject, kind of build requested=Incremental AspectJ compilation
Timer event: 0ms: Flush included source file cache
Timer event: 0ms: Check delta
CoreCompilerConfiguration for project DefaultEmptyProject registered a configuration change: [ASPECTPATH_CHANGED, CLASSPATH_CHANGED, INPATH_CHANGED, OUTPUTDESTINATIONS_CHANGED]
Timer event: 0ms: Looking for and marking configuration changes in DefaultEmptyProject
	Configuration changes found: true
Timer event: 0ms: Look for source/resource changes
Setting list of classpath elements with modified contents:
      []
Classpath = /jobs/genie.ajdt/ajdt-on-eclipse-45/workspace/org.eclipse.ajdt.ui.tests/target/work/data/DefaultEmptyProject/bin:/jobs/genie.ajdt/ajdt-on-eclipse-45/workspace/org.aspectj.runtime/target/org.aspectj.runtime-1.8.9-SNAPSHOT.jar:/opt/public/common/jdk1.7.0_80/jre/lib/resources.jar:/opt/public/common/jdk1.7.0_80/jre/lib/rt.jar:/opt/public/common/jdk1.7.0_80/jre/lib/jsse.jar:/opt/public/common/jdk1.7.0_80/jre/lib/jce.jar:/opt/public/common/jdk1.7.0_80/jre/lib/charsets.jar:/opt/public/common/jdk1.7.0_80/jre/lib/jfr.jar:/opt/public/common/jdk1.7.0_80/jre/lib/ext/dnsns.jar:/opt/public/common/jdk1.7.0_80/jre/lib/ext/sunpkcs11.jar:/opt/public/common/jdk1.7.0_80/jre/lib/ext/zipfs.jar:/opt/public/common/jdk1.7.0_80/jre/lib/ext/sunec.jar:/opt/public/common/jdk1.7.0_80/jre/lib/ext/sunjce_provider.jar:/opt/public/common/jdk1.7.0_80/jre/lib/ext/localedata.jar:/jobs/genie.ajdt/ajdt-on-eclipse-45/workspace/org.eclipse.ajdt.ui.tests/target/work/configuration/org.eclipse.osgi/40/0/.cp/junit.jar:/jobs/genie.ajdt/ajdt-on-eclipse-45/workspace/org.eclipse.ajdt.ui.tests/target/work/configuration/org.eclipse.osgi/223/0/.cp:
Timer event: 6ms: Pre compile
Sending the following configuration changes to the compiler: [ASPECTPATH_CHANGED, CLASSPATH_CHANGED, INPATH_CHANGED, OUTPUTDESTINATIONS_CHANGED]
Compiler configuration for project DefaultEmptyProject has been read by compiler.  Resetting.
     Configuration was [ASPECTPATH_CHANGED, CLASSPATH_CHANGED, INPATH_CHANGED, OUTPUTDESTINATIONS_CHANGED]
Resetting list of modified source files.  Was []
ClassFileChangeChecking: failed to find a state instance managing output location : /jobs/genie.ajdt/ajdt-on-eclipse-45/workspace/org.eclipse.ajdt.ui.tests/target/work/configuration/org.eclipse.osgi/223/0/.cp (could be getting managed by JDT)
Timer event: 1ms: OutputLocationManager: binary folder to declaring project map creation: P/DefaultEmptyProject
Preparing for build: planning to be an incremental build
AspectJ reports build successful, build was: INCREMENTAL
AJDE Callback: finish. Was full build: false
Timer event: 6ms: Total time spent in AJDE
Timer event: 0ms: Refresh after build
Crosscutting model sanity checked with no problems
Timer event: 0ms: Model sanity check for: DefaultEmptyProject
Timer event: 12ms: Total time spent in AJBuilder.build()
Timer event: 0ms: Update visualizer, xref, advice listeners for (separate thread): DefaultEmptyProject
------------------------
Starting testGenericContentAssist
Compiler configuration for project Bug273691 doesn't know previous state, so assuming EVERYTHING has changed.
===========================================================================================
Build kind = FULLBUILD
Project=Bug273691, kind of build requested=Full AspectJ compilation
Timer event: 0ms: Flush included source file cache
Timer event: 0ms: Check delta
Builder: Tidied output folder(s), removed class files and derived resources
Classpath = /jobs/genie.ajdt/ajdt-on-eclipse-45/workspace/org.eclipse.ajdt.ui.tests/target/work/data/Bug273691/bin:/opt/public/common/jdk1.7.0_80/jre/lib/resources.jar:/opt/public/common/jdk1.7.0_80/jre/lib/rt.jar:/opt/public/common/jdk1.7.0_80/jre/lib/jsse.jar:/opt/public/common/jdk1.7.0_80/jre/lib/jce.jar:/opt/public/common/jdk1.7.0_80/jre/lib/charsets.jar:/opt/public/common/jdk1.7.0_80/jre/lib/jfr.jar:/opt/public/common/jdk1.7.0_80/jre/lib/ext/dnsns.jar:/opt/public/common/jdk1.7.0_80/jre/lib/ext/sunpkcs11.jar:/opt/public/common/jdk1.7.0_80/jre/lib/ext/zipfs.jar:/opt/public/common/jdk1.7.0_80/jre/lib/ext/sunec.jar:/opt/public/common/jdk1.7.0_80/jre/lib/ext/sunjce_provider.jar:/opt/public/common/jdk1.7.0_80/jre/lib/ext/localedata.jar:/jobs/genie.ajdt/ajdt-on-eclipse-45/workspace/org.aspectj.runtime/target/org.aspectj.runtime-1.8.9-SNAPSHOT.jar:
Timer event: 1ms: Pre compile
Compiler configuration for project Bug273691 has been read by compiler.  Resetting.
     Configuration was [PROJECTSOURCEFILES_CHANGED, JAVAOPTIONS_CHANGED, ASPECTPATH_CHANGED, CLASSPATH_CHANGED, INPATH_CHANGED, NONSTANDARDOPTIONS_CHANGED, OUTJAR_CHANGED, PROJECTSOURCERESOURCES_CHANGED, OUTPUTDESTINATIONS_CHANGED, INJARS_CHANGED]
Resetting list of modified source files.  Was null
Preparing for build: not going to be incremental because no successful previous full build
AJC: compiling source files
Timer event: 41ms: Time to first compiled message
AJC: compiled: /jobs/genie.ajdt/ajdt-on-eclipse-45/workspace/org.eclipse.ajdt.ui.tests/target/work/data/Bug273691/src/AspectWithDotClass.aj
Timer event: 43ms: Time to first woven message
AJC: woven aspect AspectWithDotClass (from /jobs/genie.ajdt/ajdt-on-eclipse-45/workspace/org.eclipse.ajdt.ui.tests/target/work/data/Bug273691/src/AspectWithDotClass.aj)
The method method() from the type AspectWithDotClass is never used locally
AspectJ reports build successful, build was: FULL
AJDE Callback: finish. Was full build: true
Timer event: 44ms: Total time spent in AJDE
Timer event: 0ms: Refresh after build
Types affected during build = 1
Crosscutting model sanity checked with no problems
Timer event: 0ms: Model sanity check for: Bug273691
Timer event: 46ms: Total time spent in AJBuilder.build()
Timer event: 2ms: Delete markers: Bug273691 (Finished deleting markers for Bug273691)
Timer event: 1ms: Create markers: Bug273691 (Finished creating markers for Bug273691)
Created 0 markers in 1 files
Timer event: 0ms: Update visualizer, xref, advice listeners for (separate thread): Bug273691
===========================================================================================
Build kind = AUTOBUILD
Project=DefaultEmptyProject, kind of build requested=Incremental AspectJ compilation
Timer event: 0ms: Flush included source file cache
Timer event: 0ms: Check delta
CoreCompilerConfiguration for project DefaultEmptyProject registered a configuration change: [ASPECTPATH_CHANGED, CLASSPATH_CHANGED, INPATH_CHANGED, OUTPUTDESTINATIONS_CHANGED]
Timer event: 1ms: Looking for and marking configuration changes in DefaultEmptyProject
	Configuration changes found: true
Timer event: 1ms: Look for source/resource changes
Setting list of classpath elements with modified contents:
      []
Classpath = /jobs/genie.ajdt/ajdt-on-eclipse-45/workspace/org.eclipse.ajdt.ui.tests/target/work/data/DefaultEmptyProject/bin:/jobs/genie.ajdt/ajdt-on-eclipse-45/workspace/org.aspectj.runtime/target/org.aspectj.runtime-1.8.9-SNAPSHOT.jar:/opt/public/common/jdk1.7.0_80/jre/lib/resources.jar:/opt/public/common/jdk1.7.0_80/jre/lib/rt.jar:/opt/public/common/jdk1.7.0_80/jre/lib/jsse.jar:/opt/public/common/jdk1.7.0_80/jre/lib/jce.jar:/opt/public/common/jdk1.7.0_80/jre/lib/charsets.jar:/opt/public/common/jdk1.7.0_80/jre/lib/jfr.jar:/opt/public/common/jdk1.7.0_80/jre/lib/ext/dnsns.jar:/opt/public/common/jdk1.7.0_80/jre/lib/ext/sunpkcs11.jar:/opt/public/common/jdk1.7.0_80/jre/lib/ext/zipfs.jar:/opt/public/common/jdk1.7.0_80/jre/lib/ext/sunec.jar:/opt/public/common/jdk1.7.0_80/jre/lib/ext/sunjce_provider.jar:/opt/public/common/jdk1.7.0_80/jre/lib/ext/localedata.jar:/jobs/genie.ajdt/ajdt-on-eclipse-45/workspace/org.eclipse.ajdt.ui.tests/target/work/configuration/org.eclipse.osgi/40/0/.cp/junit.jar:/jobs/genie.ajdt/ajdt-on-eclipse-45/workspace/org.eclipse.ajdt.ui.tests/target/work/configuration/org.eclipse.osgi/223/0/.cp:
Timer event: 10ms: Pre compile
Sending the following configuration changes to the compiler: [ASPECTPATH_CHANGED, CLASSPATH_CHANGED, INPATH_CHANGED, OUTPUTDESTINATIONS_CHANGED]
Compiler configuration for project DefaultEmptyProject has been read by compiler.  Resetting.
     Configuration was [ASPECTPATH_CHANGED, CLASSPATH_CHANGED, INPATH_CHANGED, OUTPUTDESTINATIONS_CHANGED]
Resetting list of modified source files.  Was []
ClassFileChangeChecking: failed to find a state instance managing output location : /jobs/genie.ajdt/ajdt-on-eclipse-45/workspace/org.eclipse.ajdt.ui.tests/target/work/configuration/org.eclipse.osgi/223/0/.cp (could be getting managed by JDT)
Timer event: 0ms: OutputLocationManager: binary folder to declaring project map creation: P/DefaultEmptyProject
Preparing for build: planning to be an incremental build
AspectJ reports build successful, build was: INCREMENTAL
AJDE Callback: finish. Was full build: false
Timer event: 6ms: Total time spent in AJDE
Timer event: 0ms: Refresh after build
Crosscutting model sanity checked with no problems
Timer event: 0ms: Model sanity check for: DefaultEmptyProject
Timer event: 16ms: Total time spent in AJBuilder.build()
Timer event: 1ms: Update visualizer, xref, advice listeners for (separate thread): DefaultEmptyProject
------------------------
Starting testHasAspectInClass
Compiler configuration for project Bug280508AspectOf doesn't know previous state, so assuming EVERYTHING has changed.
===========================================================================================
Build kind = FULLBUILD
Project=Bug280508AspectOf, kind of build requested=Full AspectJ compilation
Timer event: 0ms: Flush included source file cache
Timer event: 0ms: Check delta
Builder: Tidied output folder(s), removed class files and derived resources
Classpath = /jobs/genie.ajdt/ajdt-on-eclipse-45/workspace/org.eclipse.ajdt.ui.tests/target/work/data/Bug280508AspectOf/bin:/opt/public/common/jdk1.7.0_80/jre/lib/resources.jar:/opt/public/common/jdk1.7.0_80/jre/lib/rt.jar:/opt/public/common/jdk1.7.0_80/jre/lib/jsse.jar:/opt/public/common/jdk1.7.0_80/jre/lib/jce.jar:/opt/public/common/jdk1.7.0_80/jre/lib/charsets.jar:/opt/public/common/jdk1.7.0_80/jre/lib/jfr.jar:/opt/public/common/jdk1.7.0_80/jre/lib/ext/dnsns.jar:/opt/public/common/jdk1.7.0_80/jre/lib/ext/sunpkcs11.jar:/opt/public/common/jdk1.7.0_80/jre/lib/ext/zipfs.jar:/opt/public/common/jdk1.7.0_80/jre/lib/ext/sunec.jar:/opt/public/common/jdk1.7.0_80/jre/lib/ext/sunjce_provider.jar:/opt/public/common/jdk1.7.0_80/jre/lib/ext/localedata.jar:/jobs/genie.ajdt/ajdt-on-eclipse-45/workspace/org.aspectj.runtime/target/org.aspectj.runtime-1.8.9-SNAPSHOT.jar:
Timer event: 2ms: Pre compile
Compiler configuration for project Bug280508AspectOf has been read by compiler.  Resetting.
     Configuration was [PROJECTSOURCEFILES_CHANGED, JAVAOPTIONS_CHANGED, ASPECTPATH_CHANGED, CLASSPATH_CHANGED, INPATH_CHANGED, NONSTANDARDOPTIONS_CHANGED, OUTJAR_CHANGED, PROJECTSOURCERESOURCES_CHANGED, OUTPUTDESTINATIONS_CHANGED, INJARS_CHANGED]
Resetting list of modified source files.  Was null
Preparing for build: not going to be incremental because no successful previous full build
AJC: compiling source files
Timer event: 52ms: Time to first compiled message
AJC: compiled: /jobs/genie.ajdt/ajdt-on-eclipse-45/workspace/org.eclipse.ajdt.ui.tests/target/work/data/Bug280508AspectOf/src/p/Aspect2.aj
AJC: compiled: /jobs/genie.ajdt/ajdt-on-eclipse-45/workspace/org.eclipse.ajdt.ui.tests/target/work/data/Bug280508AspectOf/src/Aspect.aj
Timer event: 57ms: Time to first woven message
AJC: woven aspect p.Aspect2 (from /jobs/genie.ajdt/ajdt-on-eclipse-45/workspace/org.eclipse.ajdt.ui.tests/target/work/data/Bug280508AspectOf/src/p/Aspect2.aj)
AJC: woven aspect Aspect (from /jobs/genie.ajdt/ajdt-on-eclipse-45/workspace/org.eclipse.ajdt.ui.tests/target/work/data/Bug280508AspectOf/src/Aspect.aj)
AJC: compiled: /jobs/genie.ajdt/ajdt-on-eclipse-45/workspace/org.eclipse.ajdt.ui.tests/target/work/data/Bug280508AspectOf/src/Class.java
The method getWithinTypeName() is undefined for the type Aspect
AspectJ reports build successful, build was: FULL
AJDE Callback: finish. Was full build: true
Timer event: 61ms: Total time spent in AJDE
Timer event: 0ms: Refresh after build
Types affected during build = 3
Crosscutting model sanity checked with no problems
Timer event: 0ms: Model sanity check for: Bug280508AspectOf
Timer event: 64ms: Total time spent in AJBuilder.build()
Timer event: 2ms: Delete markers: Bug280508AspectOf (Finished deleting markers for Bug280508AspectOf)
Timer event: 1ms: Create markers: Bug280508AspectOf (Finished creating markers for Bug280508AspectOf)
Created 0 markers in 3 files
Timer event: 1ms: Update visualizer, xref, advice listeners for (separate thread): Bug280508AspectOf
===========================================================================================
Build kind = AUTOBUILD
Project=DefaultEmptyProject, kind of build requested=Incremental AspectJ compilation
Timer event: 0ms: Flush included source file cache
Timer event: 0ms: Check delta
CoreCompilerConfiguration for project DefaultEmptyProject registered a configuration change: [ASPECTPATH_CHANGED, CLASSPATH_CHANGED, INPATH_CHANGED, OUTPUTDESTINATIONS_CHANGED]
Timer event: 0ms: Looking for and marking configuration changes in DefaultEmptyProject
	Configuration changes found: true
Timer event: 0ms: Look for source/resource changes
Setting list of classpath elements with modified contents:
      []
Classpath = /jobs/genie.ajdt/ajdt-on-eclipse-45/workspace/org.eclipse.ajdt.ui.tests/target/work/data/DefaultEmptyProject/bin:/jobs/genie.ajdt/ajdt-on-eclipse-45/workspace/org.aspectj.runtime/target/org.aspectj.runtime-1.8.9-SNAPSHOT.jar:/opt/public/common/jdk1.7.0_80/jre/lib/resources.jar:/opt/public/common/jdk1.7.0_80/jre/lib/rt.jar:/opt/public/common/jdk1.7.0_80/jre/lib/jsse.jar:/opt/public/common/jdk1.7.0_80/jre/lib/jce.jar:/opt/public/common/jdk1.7.0_80/jre/lib/charsets.jar:/opt/public/common/jdk1.7.0_80/jre/lib/jfr.jar:/opt/public/common/jdk1.7.0_80/jre/lib/ext/dnsns.jar:/opt/public/common/jdk1.7.0_80/jre/lib/ext/sunpkcs11.jar:/opt/public/common/jdk1.7.0_80/jre/lib/ext/zipfs.jar:/opt/public/common/jdk1.7.0_80/jre/lib/ext/sunec.jar:/opt/public/common/jdk1.7.0_80/jre/lib/ext/sunjce_provider.jar:/opt/public/common/jdk1.7.0_80/jre/lib/ext/localedata.jar:/jobs/genie.ajdt/ajdt-on-eclipse-45/workspace/org.eclipse.ajdt.ui.tests/target/work/configuration/org.eclipse.osgi/40/0/.cp/junit.jar:/jobs/genie.ajdt/ajdt-on-eclipse-45/workspace/org.eclipse.ajdt.ui.tests/target/work/configuration/org.eclipse.osgi/223/0/.cp:
Timer event: 8ms: Pre compile
Sending the following configuration changes to the compiler: [ASPECTPATH_CHANGED, CLASSPATH_CHANGED, INPATH_CHANGED, OUTPUTDESTINATIONS_CHANGED]
Compiler configuration for project DefaultEmptyProject has been read by compiler.  Resetting.
     Configuration was [ASPECTPATH_CHANGED, CLASSPATH_CHANGED, INPATH_CHANGED, OUTPUTDESTINATIONS_CHANGED]
Resetting list of modified source files.  Was []
ClassFileChangeChecking: failed to find a state instance managing output location : /jobs/genie.ajdt/ajdt-on-eclipse-45/workspace/org.eclipse.ajdt.ui.tests/target/work/configuration/org.eclipse.osgi/223/0/.cp (could be getting managed by JDT)
Timer event: 0ms: OutputLocationManager: binary folder to declaring project map creation: P/DefaultEmptyProject
Preparing for build: planning to be an incremental build
AspectJ reports build successful, build was: INCREMENTAL
AJDE Callback: finish. Was full build: false
Timer event: 10ms: Total time spent in AJDE
Timer event: 0ms: Refresh after build
Crosscutting model sanity checked with no problems
Timer event: 0ms: Model sanity check for: DefaultEmptyProject
Timer event: 18ms: Total time spent in AJBuilder.build()
Timer event: 1ms: Update visualizer, xref, advice listeners for (separate thread): DefaultEmptyProject
------------------------
Starting testAspectOfTypeInClass
Compiler configuration for project Bug280508AspectOf doesn't know previous state, so assuming EVERYTHING has changed.
===========================================================================================
Build kind = FULLBUILD
Project=Bug280508AspectOf, kind of build requested=Full AspectJ compilation
Timer event: 0ms: Flush included source file cache
Timer event: 0ms: Check delta
Builder: Tidied output folder(s), removed class files and derived resources
Classpath = /jobs/genie.ajdt/ajdt-on-eclipse-45/workspace/org.eclipse.ajdt.ui.tests/target/work/data/Bug280508AspectOf/bin:/opt/public/common/jdk1.7.0_80/jre/lib/resources.jar:/opt/public/common/jdk1.7.0_80/jre/lib/rt.jar:/opt/public/common/jdk1.7.0_80/jre/lib/jsse.jar:/opt/public/common/jdk1.7.0_80/jre/lib/jce.jar:/opt/public/common/jdk1.7.0_80/jre/lib/charsets.jar:/opt/public/common/jdk1.7.0_80/jre/lib/jfr.jar:/opt/public/common/jdk1.7.0_80/jre/lib/ext/dnsns.jar:/opt/public/common/jdk1.7.0_80/jre/lib/ext/sunpkcs11.jar:/opt/public/common/jdk1.7.0_80/jre/lib/ext/zipfs.jar:/opt/public/common/jdk1.7.0_80/jre/lib/ext/sunec.jar:/opt/public/common/jdk1.7.0_80/jre/lib/ext/sunjce_provider.jar:/opt/public/common/jdk1.7.0_80/jre/lib/ext/localedata.jar:/jobs/genie.ajdt/ajdt-on-eclipse-45/workspace/org.aspectj.runtime/target/org.aspectj.runtime-1.8.9-SNAPSHOT.jar:
Timer event: 2ms: Pre compile
Compiler configuration for project Bug280508AspectOf has been read by compiler.  Resetting.
     Configuration was [PROJECTSOURCEFILES_CHANGED, JAVAOPTIONS_CHANGED, ASPECTPATH_CHANGED, CLASSPATH_CHANGED, INPATH_CHANGED, NONSTANDARDOPTIONS_CHANGED, OUTJAR_CHANGED, PROJECTSOURCERESOURCES_CHANGED, OUTPUTDESTINATIONS_CHANGED, INJARS_CHANGED]
Resetting list of modified source files.  Was null
Preparing for build: not going to be incremental because no successful previous full build
AJC: compiling source files
Timer event: 39ms: Time to first compiled message
AJC: compiled: /jobs/genie.ajdt/ajdt-on-eclipse-45/workspace/org.eclipse.ajdt.ui.tests/target/work/data/Bug280508AspectOf/src/p/Aspect2.aj
AJC: compiled: /jobs/genie.ajdt/ajdt-on-eclipse-45/workspace/org.eclipse.ajdt.ui.tests/target/work/data/Bug280508AspectOf/src/Aspect.aj
Timer event: 43ms: Time to first woven message
AJC: woven aspect p.Aspect2 (from /jobs/genie.ajdt/ajdt-on-eclipse-45/workspace/org.eclipse.ajdt.ui.tests/target/work/data/Bug280508AspectOf/src/p/Aspect2.aj)
AJC: woven aspect Aspect (from /jobs/genie.ajdt/ajdt-on-eclipse-45/workspace/org.eclipse.ajdt.ui.tests/target/work/data/Bug280508AspectOf/src/Aspect.aj)
AJC: compiled: /jobs/genie.ajdt/ajdt-on-eclipse-45/workspace/org.eclipse.ajdt.ui.tests/target/work/data/Bug280508AspectOf/src/Class.java
The method getWithinTypeName() is undefined for the type Aspect
AspectJ reports build successful, build was: FULL
AJDE Callback: finish. Was full build: true
Timer event: 47ms: Total time spent in AJDE
Timer event: 0ms: Refresh after build
Types affected during build = 3
Crosscutting model sanity checked with no problems
Timer event: 0ms: Model sanity check for: Bug280508AspectOf
Timer event: 50ms: Total time spent in AJBuilder.build()
Timer event: 2ms: Delete markers: Bug280508AspectOf (Finished deleting markers for Bug280508AspectOf)
Timer event: 2ms: Create markers: Bug280508AspectOf (Finished creating markers for Bug280508AspectOf)
Created 0 markers in 3 files
Timer event: 0ms: Update visualizer, xref, advice listeners for (separate thread): Bug280508AspectOf
===========================================================================================
Build kind = AUTOBUILD
Project=DefaultEmptyProject, kind of build requested=Incremental AspectJ compilation
Timer event: 0ms: Flush included source file cache
Timer event: 0ms: Check delta
CoreCompilerConfiguration for project DefaultEmptyProject registered a configuration change: [ASPECTPATH_CHANGED, CLASSPATH_CHANGED, INPATH_CHANGED, OUTPUTDESTINATIONS_CHANGED]
Timer event: 0ms: Looking for and marking configuration changes in DefaultEmptyProject
	Configuration changes found: true
Timer event: 0ms: Look for source/resource changes
Setting list of classpath elements with modified contents:
      []
Classpath = /jobs/genie.ajdt/ajdt-on-eclipse-45/workspace/org.eclipse.ajdt.ui.tests/target/work/data/DefaultEmptyProject/bin:/jobs/genie.ajdt/ajdt-on-eclipse-45/workspace/org.aspectj.runtime/target/org.aspectj.runtime-1.8.9-SNAPSHOT.jar:/opt/public/common/jdk1.7.0_80/jre/lib/resources.jar:/opt/public/common/jdk1.7.0_80/jre/lib/rt.jar:/opt/public/common/jdk1.7.0_80/jre/lib/jsse.jar:/opt/public/common/jdk1.7.0_80/jre/lib/jce.jar:/opt/public/common/jdk1.7.0_80/jre/lib/charsets.jar:/opt/public/common/jdk1.7.0_80/jre/lib/jfr.jar:/opt/public/common/jdk1.7.0_80/jre/lib/ext/dnsns.jar:/opt/public/common/jdk1.7.0_80/jre/lib/ext/sunpkcs11.jar:/opt/public/common/jdk1.7.0_80/jre/lib/ext/zipfs.jar:/opt/public/common/jdk1.7.0_80/jre/lib/ext/sunec.jar:/opt/public/common/jdk1.7.0_80/jre/lib/ext/sunjce_provider.jar:/opt/public/common/jdk1.7.0_80/jre/lib/ext/localedata.jar:/jobs/genie.ajdt/ajdt-on-eclipse-45/workspace/org.eclipse.ajdt.ui.tests/target/work/configuration/org.eclipse.osgi/40/0/.cp/junit.jar:/jobs/genie.ajdt/ajdt-on-eclipse-45/workspace/org.eclipse.ajdt.ui.tests/target/work/configuration/org.eclipse.osgi/223/0/.cp:
Timer event: 7ms: Pre compile
Sending the following configuration changes to the compiler: [ASPECTPATH_CHANGED, CLASSPATH_CHANGED, INPATH_CHANGED, OUTPUTDESTINATIONS_CHANGED]
Compiler configuration for project DefaultEmptyProject has been read by compiler.  Resetting.
     Configuration was [ASPECTPATH_CHANGED, CLASSPATH_CHANGED, INPATH_CHANGED, OUTPUTDESTINATIONS_CHANGED]
Resetting list of modified source files.  Was []
ClassFileChangeChecking: failed to find a state instance managing output location : /jobs/genie.ajdt/ajdt-on-eclipse-45/workspace/org.eclipse.ajdt.ui.tests/target/work/configuration/org.eclipse.osgi/223/0/.cp (could be getting managed by JDT)
Timer event: 0ms: OutputLocationManager: binary folder to declaring project map creation: P/DefaultEmptyProject
Preparing for build: planning to be an incremental build
AspectJ reports build successful, build was: INCREMENTAL
AJDE Callback: finish. Was full build: false
Timer event: 7ms: Total time spent in AJDE
Timer event: 0ms: Refresh after build
Crosscutting model sanity checked with no problems
Timer event: 0ms: Model sanity check for: DefaultEmptyProject
Timer event: 14ms: Total time spent in AJBuilder.build()
Timer event: 0ms: Update visualizer, xref, advice listeners for (separate thread): DefaultEmptyProject
------------------------
Starting testGetWithinTypeName
Compiler configuration for project Bug280508AspectOf doesn't know previous state, so assuming EVERYTHING has changed.
===========================================================================================
Build kind = FULLBUILD
Project=Bug280508AspectOf, kind of build requested=Full AspectJ compilation
Timer event: 0ms: Flush included source file cache
Timer event: 0ms: Check delta
Builder: Tidied output folder(s), removed class files and derived resources
Classpath = /jobs/genie.ajdt/ajdt-on-eclipse-45/workspace/org.eclipse.ajdt.ui.tests/target/work/data/Bug280508AspectOf/bin:/opt/public/common/jdk1.7.0_80/jre/lib/resources.jar:/opt/public/common/jdk1.7.0_80/jre/lib/rt.jar:/opt/public/common/jdk1.7.0_80/jre/lib/jsse.jar:/opt/public/common/jdk1.7.0_80/jre/lib/jce.jar:/opt/public/common/jdk1.7.0_80/jre/lib/charsets.jar:/opt/public/common/jdk1.7.0_80/jre/lib/jfr.jar:/opt/public/common/jdk1.7.0_80/jre/lib/ext/dnsns.jar:/opt/public/common/jdk1.7.0_80/jre/lib/ext/sunpkcs11.jar:/opt/public/common/jdk1.7.0_80/jre/lib/ext/zipfs.jar:/opt/public/common/jdk1.7.0_80/jre/lib/ext/sunec.jar:/opt/public/common/jdk1.7.0_80/jre/lib/ext/sunjce_provider.jar:/opt/public/common/jdk1.7.0_80/jre/lib/ext/localedata.jar:/jobs/genie.ajdt/ajdt-on-eclipse-45/workspace/org.aspectj.runtime/target/org.aspectj.runtime-1.8.9-SNAPSHOT.jar:
Timer event: 2ms: Pre compile
Compiler configuration for project Bug280508AspectOf has been read by compiler.  Resetting.
     Configuration was [PROJECTSOURCEFILES_CHANGED, JAVAOPTIONS_CHANGED, ASPECTPATH_CHANGED, CLASSPATH_CHANGED, INPATH_CHANGED, NONSTANDARDOPTIONS_CHANGED, OUTJAR_CHANGED, PROJECTSOURCERESOURCES_CHANGED, OUTPUTDESTINATIONS_CHANGED, INJARS_CHANGED]
Resetting list of modified source files.  Was null
Preparing for build: not going to be incremental because no successful previous full build
AJC: compiling source files
Timer event: 38ms: Time to first compiled message
AJC: compiled: /jobs/genie.ajdt/ajdt-on-eclipse-45/workspace/org.eclipse.ajdt.ui.tests/target/work/data/Bug280508AspectOf/src/p/Aspect2.aj
AJC: compiled: /jobs/genie.ajdt/ajdt-on-eclipse-45/workspace/org.eclipse.ajdt.ui.tests/target/work/data/Bug280508AspectOf/src/Aspect.aj
Timer event: 43ms: Time to first woven message
AJC: woven aspect p.Aspect2 (from /jobs/genie.ajdt/ajdt-on-eclipse-45/workspace/org.eclipse.ajdt.ui.tests/target/work/data/Bug280508AspectOf/src/p/Aspect2.aj)
AJC: woven aspect Aspect (from /jobs/genie.ajdt/ajdt-on-eclipse-45/workspace/org.eclipse.ajdt.ui.tests/target/work/data/Bug280508AspectOf/src/Aspect.aj)
AJC: compiled: /jobs/genie.ajdt/ajdt-on-eclipse-45/workspace/org.eclipse.ajdt.ui.tests/target/work/data/Bug280508AspectOf/src/Class.java
The method getWithinTypeName() is undefined for the type Aspect
AspectJ reports build successful, build was: FULL
AJDE Callback: finish. Was full build: true
Timer event: 47ms: Total time spent in AJDE
Timer event: 0ms: Refresh after build
Types affected during build = 3
Crosscutting model sanity checked with no problems
Timer event: 0ms: Model sanity check for: Bug280508AspectOf
Timer event: 50ms: Total time spent in AJBuilder.build()
Timer event: 2ms: Delete markers: Bug280508AspectOf (Finished deleting markers for Bug280508AspectOf)
Timer event: 2ms: Create markers: Bug280508AspectOf (Finished creating markers for Bug280508AspectOf)
Created 0 markers in 3 files
Timer event: 1ms: Update visualizer, xref, advice listeners for (separate thread): Bug280508AspectOf
===========================================================================================
Build kind = AUTOBUILD
Project=DefaultEmptyProject, kind of build requested=Incremental AspectJ compilation
Timer event: 0ms: Flush included source file cache
Timer event: 0ms: Check delta
CoreCompilerConfiguration for project DefaultEmptyProject registered a configuration change: [ASPECTPATH_CHANGED, CLASSPATH_CHANGED, INPATH_CHANGED, OUTPUTDESTINATIONS_CHANGED]
Timer event: 1ms: Looking for and marking configuration changes in DefaultEmptyProject
	Configuration changes found: true
Timer event: 1ms: Look for source/resource changes
Setting list of classpath elements with modified contents:
      []
Classpath = /jobs/genie.ajdt/ajdt-on-eclipse-45/workspace/org.eclipse.ajdt.ui.tests/target/work/data/DefaultEmptyProject/bin:/jobs/genie.ajdt/ajdt-on-eclipse-45/workspace/org.aspectj.runtime/target/org.aspectj.runtime-1.8.9-SNAPSHOT.jar:/opt/public/common/jdk1.7.0_80/jre/lib/resources.jar:/opt/public/common/jdk1.7.0_80/jre/lib/rt.jar:/opt/public/common/jdk1.7.0_80/jre/lib/jsse.jar:/opt/public/common/jdk1.7.0_80/jre/lib/jce.jar:/opt/public/common/jdk1.7.0_80/jre/lib/charsets.jar:/opt/public/common/jdk1.7.0_80/jre/lib/jfr.jar:/opt/public/common/jdk1.7.0_80/jre/lib/ext/dnsns.jar:/opt/public/common/jdk1.7.0_80/jre/lib/ext/sunpkcs11.jar:/opt/public/common/jdk1.7.0_80/jre/lib/ext/zipfs.jar:/opt/public/common/jdk1.7.0_80/jre/lib/ext/sunec.jar:/opt/public/common/jdk1.7.0_80/jre/lib/ext/sunjce_provider.jar:/opt/public/common/jdk1.7.0_80/jre/lib/ext/localedata.jar:/jobs/genie.ajdt/ajdt-on-eclipse-45/workspace/org.eclipse.ajdt.ui.tests/target/work/configuration/org.eclipse.osgi/40/0/.cp/junit.jar:/jobs/genie.ajdt/ajdt-on-eclipse-45/workspace/org.eclipse.ajdt.ui.tests/target/work/configuration/org.eclipse.osgi/223/0/.cp:
Timer event: 6ms: Pre compile
Sending the following configuration changes to the compiler: [ASPECTPATH_CHANGED, CLASSPATH_CHANGED, INPATH_CHANGED, OUTPUTDESTINATIONS_CHANGED]
Compiler configuration for project DefaultEmptyProject has been read by compiler.  Resetting.
     Configuration was [ASPECTPATH_CHANGED, CLASSPATH_CHANGED, INPATH_CHANGED, OUTPUTDESTINATIONS_CHANGED]
Resetting list of modified source files.  Was []
ClassFileChangeChecking: failed to find a state instance managing output location : /jobs/genie.ajdt/ajdt-on-eclipse-45/workspace/org.eclipse.ajdt.ui.tests/target/work/configuration/org.eclipse.osgi/223/0/.cp (could be getting managed by JDT)
Timer event: 0ms: OutputLocationManager: binary folder to declaring project map creation: P/DefaultEmptyProject
Preparing for build: planning to be an incremental build
AspectJ reports build successful, build was: INCREMENTAL
AJDE Callback: finish. Was full build: false
Timer event: 8ms: Total time spent in AJDE
Timer event: 0ms: Refresh after build
Crosscutting model sanity checked with no problems
Timer event: 0ms: Model sanity check for: DefaultEmptyProject
Timer event: 14ms: Total time spent in AJBuilder.build()
Timer event: 0ms: Update visualizer, xref, advice listeners for (separate thread): DefaultEmptyProject
[INFO] ------------------------------------------------------------------------
[INFO] Reactor Summary:
[INFO] 
[INFO] parent ............................................. SUCCESS [  0.239 s]
[INFO] org.aspectj.runtime ................................ SUCCESS [  3.121 s]
[INFO] org.aspectj.weaver ................................. SUCCESS [  3.590 s]
[INFO] org.aspectj.ajde ................................... SUCCESS [  8.134 s]
[INFO] org.aspectj ........................................ SUCCESS [  2.609 s]
[INFO] org.eclipse.contribution.weaving.jdt ............... SUCCESS [  5.907 s]
[INFO] org.eclipse.ajdt.core .............................. SUCCESS [ 10.184 s]
[INFO] org.eclipse.ajdt.doc.user .......................... SUCCESS [  1.476 s]
[INFO] org.eclipse.ajdt.examples .......................... SUCCESS [  3.412 s]
[INFO] org.eclipse.contribution.visualiser ................ SUCCESS [  4.497 s]
[INFO] org.eclipse.contribution.xref.core ................. SUCCESS [  2.605 s]
[INFO] org.eclipse.contribution.xref.ui ................... SUCCESS [  3.274 s]
[INFO] org.eclipse.ajdt.ui ................................ SUCCESS [  9.365 s]
[INFO] org.eclipse.aspectj ................................ SUCCESS [  1.392 s]
[INFO] org.eclipse.ajdt.mylyn.ui .......................... SUCCESS [  2.904 s]
[INFO] org.eclipse.equinox.weaving.aspectj ................ SUCCESS [  2.828 s]
[INFO] org.eclipse.equinox.weaving.sdk .................... SUCCESS [  1.129 s]
[INFO] org.eclipse.ajdt ................................... SUCCESS [  4.043 s]
[INFO] org.eclipse.contribution.weaving ................... SUCCESS [  5.070 s]
[INFO] org.eclipse.contribution.xref ...................... SUCCESS [  3.720 s]
[INFO] org.eclipse.ajdt.sdk ............................... SUCCESS [  1.669 s]
[INFO] org.eclipse.ajdt.core.tests ........................ SUCCESS [35:26 min]
[INFO] org.eclipse.contribution.visualiser.tests .......... SUCCESS [ 15.790 s]
[INFO] org.eclipse.ajdt.ui.tests .......................... FAILURE [11:00 min]
[INFO] org.eclipse.ajdt.mylyn.ui.tests .................... SKIPPED
[INFO] org.eclipse.contribution.weaving.jdt.tests ......... SKIPPED
[INFO] org.eclipse.contribution.xref.core.tests ........... SKIPPED
[INFO] org.eclipse.contribution.xref.ui.tests ............. SKIPPED
[INFO] org.eclipse.aspectj.feature_tests .................. SKIPPED
[INFO] org.eclipse.ajdt.releng ............................ SKIPPED
[INFO] ------------------------------------------------------------------------
[INFO] BUILD FAILURE
[INFO] ------------------------------------------------------------------------
[INFO] Total time: 49:15 min
[INFO] Finished at: 2016-02-27T12:10:01-05:00
[INFO] Final Memory: 377M/7960M
[INFO] ------------------------------------------------------------------------
[INFO] o.h.m.e.h.MavenExecutionResultHandler - Build failed with exception(s)
[INFO] o.h.m.e.h.MavenExecutionResultHandler - [1] org.apache.maven.lifecycle.LifecycleExecutionException: Failed to execute goal org.eclipse.tycho:tycho-surefire-plugin:0.23.1:test (default-test) on project org.eclipse.ajdt.ui.tests: An unexpected error occured while launching the test runtime (return code 137). See log for details.
[DEBUG] Closing connection to remote
[ERROR] Failed to execute goal org.eclipse.tycho:tycho-surefire-plugin:0.23.1:test (default-test) on project org.eclipse.ajdt.ui.tests: An unexpected error occured while launching the test runtime (return code 137). See log for details. -> [Help 1]
org.apache.maven.lifecycle.LifecycleExecutionException: Failed to execute goal org.eclipse.tycho:tycho-surefire-plugin:0.23.1:test (default-test) on project org.eclipse.ajdt.ui.tests: An unexpected error occured while launching the test runtime (return code 137). See log for details.
	at org.apache.maven.lifecycle.internal.MojoExecutor.execute(MojoExecutor.java:212)
	at org.apache.maven.lifecycle.internal.MojoExecutor.execute(MojoExecutor.java:153)
	at org.apache.maven.lifecycle.internal.MojoExecutor.execute(MojoExecutor.java:145)
	at org.apache.maven.lifecycle.internal.LifecycleModuleBuilder.buildProject(LifecycleModuleBuilder.java:116)
	at org.apache.maven.lifecycle.internal.LifecycleModuleBuilder.buildProject(LifecycleModuleBuilder.java:80)
	at org.apache.maven.lifecycle.internal.builder.singlethreaded.SingleThreadedBuilder.build(SingleThreadedBuilder.java:51)
	at org.apache.maven.lifecycle.internal.LifecycleStarter.execute(LifecycleStarter.java:128)
	at org.apache.maven.DefaultMaven.doExecute(DefaultMaven.java:307)
	at org.apache.maven.DefaultMaven.doExecute(DefaultMaven.java:193)
	at org.apache.maven.DefaultMaven.execute(DefaultMaven.java:106)
	at org.apache.maven.cli.MavenCli.execute(MavenCli.java:863)
	at org.apache.maven.cli.MavenCli.doMain(MavenCli.java:288)
	at org.apache.maven.cli.MavenCli.main(MavenCli.java:199)
	at sun.reflect.NativeMethodAccessorImpl.invoke0(Native Method)
	at sun.reflect.NativeMethodAccessorImpl.invoke(NativeMethodAccessorImpl.java:57)
	at sun.reflect.DelegatingMethodAccessorImpl.invoke(DelegatingMethodAccessorImpl.java:43)
	at java.lang.reflect.Method.invoke(Method.java:606)
	at org.codehaus.plexus.classworlds.launcher.Launcher.launchEnhanced(Launcher.java:289)
	at org.codehaus.plexus.classworlds.launcher.Launcher.launch(Launcher.java:229)
	at org.codehaus.plexus.classworlds.launcher.Launcher.mainWithExitCode(Launcher.java:415)
	at org.codehaus.plexus.classworlds.launcher.Launcher.main(Launcher.java:356)
Caused by: org.apache.maven.plugin.MojoFailureException: An unexpected error occured while launching the test runtime (return code 137). See log for details.
	at org.eclipse.tycho.surefire.TestMojo.runTest(TestMojo.java:950)
	at org.eclipse.tycho.surefire.TestMojo.execute(TestMojo.java:630)
	at org.apache.maven.plugin.DefaultBuildPluginManager.executeMojo(DefaultBuildPluginManager.java:134)
	at org.apache.maven.lifecycle.internal.MojoExecutor.execute(MojoExecutor.java:207)
	... 20 more
[ERROR] 
[ERROR] Re-run Maven using the -X switch to enable full debug logging.
[ERROR] 
[ERROR] For more information about the errors and possible solutions, please read the following articles:
[ERROR] [Help 1] http://cwiki.apache.org/confluence/display/MAVEN/MojoFailureException
[ERROR] 
[ERROR] After correcting the problems, you can resume the build with the command
[ERROR]   mvn <goals> -rf :org.eclipse.ajdt.ui.tests
[DEBUG] Waiting for process to finish
[DEBUG] Result: 1
Terminating xvnc.
Recording test results
Finished: FAILURE