UnstableConsole Output

Skipping 10,122 KB.. Full Log
RulerActionTest)  Time elapsed: 8.562 sec
testSetBreakpointB(org.eclipse.ajdt.ui.tests.editor.AspectJBreakpointRulerActionTest)  Time elapsed: 9.198 sec
testSetBreakpointC(org.eclipse.ajdt.ui.tests.editor.AspectJBreakpointRulerActionTest)  Time elapsed: 9.163 sec
testEditorIcon(org.eclipse.ajdt.ui.tests.editor.AspectJEditorIconTest)  Time elapsed: 5.854 sec
testOrganizeImportITD1(org.eclipse.ajdt.ui.tests.editor.AJOrganizeImportsTests)  Time elapsed: 6.655 sec
testOrganizeImportITD2(org.eclipse.ajdt.ui.tests.editor.AJOrganizeImportsTests)  Time elapsed: 3.904 sec
testOrganizeImportITD3(org.eclipse.ajdt.ui.tests.editor.AJOrganizeImportsTests)  Time elapsed: 3.99 sec
testOrganizeImportITD4(org.eclipse.ajdt.ui.tests.editor.AJOrganizeImportsTests)  Time elapsed: 3.371 sec
testOrganizeImportITD5(org.eclipse.ajdt.ui.tests.editor.AJOrganizeImportsTests)  Time elapsed: 3.685 sec
testOrganizeImportITD6(org.eclipse.ajdt.ui.tests.editor.AJOrganizeImportsTests)  Time elapsed: 3.384 sec
testOnDemand1(org.eclipse.ajdt.ui.tests.editor.AJOrganizeImportsTests)  Time elapsed: 3.761 sec
testOnDemand2(org.eclipse.ajdt.ui.tests.editor.AJOrganizeImportsTests)  Time elapsed: 3.718 sec
testOrganizeImportsSimple1(org.eclipse.ajdt.ui.tests.editor.AJOrganizeImportsTests)  Time elapsed: 3.712 sec
testOrganizeImport2a(org.eclipse.ajdt.ui.tests.editor.AJOrganizeImportsTests)  Time elapsed: 3.699 sec
testOrganizeImport3a(org.eclipse.ajdt.ui.tests.editor.AJOrganizeImportsTests)  Time elapsed: 3.774 sec
testOrganizeImport2(org.eclipse.ajdt.ui.tests.editor.AJOrganizeImportsTests)  Time elapsed: 3.641 sec
testOrganizeImport3(org.eclipse.ajdt.ui.tests.editor.AJOrganizeImportsTests)  Time elapsed: 3.691 sec
testOrganizeImport4(org.eclipse.ajdt.ui.tests.editor.AJOrganizeImportsTests)  Time elapsed: 3.694 sec
testDeclare2(org.eclipse.ajdt.ui.tests.editor.AJOrganizeImportsTests)  Time elapsed: 3.698 sec
testDeclare4(org.eclipse.ajdt.ui.tests.editor.AJOrganizeImportsTests)  Time elapsed: 5.003 sec
testCodeFormat(org.eclipse.ajdt.ui.tests.editor.codeformat.CodeFormatTest)  Time elapsed: 4.837 sec
testGetNonStandardOptionsViaWorkbenchPreferences(org.eclipse.ajdt.ui.tests.ajde.BuildOptionsAdapterTest)  Time elapsed: 4.825 sec
testGetNonStandardOptionsViaProjectPreferences(org.eclipse.ajdt.ui.tests.ajde.BuildOptionsAdapterTest)  Time elapsed: 3.083 sec
testGetShowWeaveMessagesViaWorkbenchPreferences(org.eclipse.ajdt.ui.tests.ajde.BuildOptionsAdapterTest)  Time elapsed: 3.072 sec
testGetShowWeaveMessagesViaProjectPreferences(org.eclipse.ajdt.ui.tests.ajde.BuildOptionsAdapterTest)  Time elapsed: 3.212 sec
testClasspathOrder(org.eclipse.ajdt.ui.tests.ajde.ClasspathOrderTest)  Time elapsed: 5.324 sec
testBug148055(org.eclipse.ajdt.ui.tests.ajde.ProjectPropertiesTest)  Time elapsed: 5.385 sec
testHandleAJDTErrorWithMessageAndTitle(org.eclipse.ajdt.ui.tests.ajde.AJDTErrorHandlerTest)  Time elapsed: 1.543 sec
testHandleAJDTErrorWithMessage(org.eclipse.ajdt.ui.tests.ajde.AJDTErrorHandlerTest)  Time elapsed: 4.492 sec
testShowWeaveInfoMessagesAreNotIgnoredIProjectPreferenceAlreadySet(org.eclipse.ajdt.ui.tests.ajde.UIMessageHandlerTest)  Time elapsed: 4.808 sec
testShowWeaveInfoMessagesAreNotIgnoredIProjectPreferenceAlreadySet_2(org.eclipse.ajdt.ui.tests.ajde.UIMessageHandlerTest)  Time elapsed: 5.309 sec
testShowWeaveInfoMessagesAreNotIgnoredIfWorkbenchPreferenceAlreadySet_2(org.eclipse.ajdt.ui.tests.ajde.UIMessageHandlerTest)  Time elapsed: 5.401 sec
testShowWeaveInfoMessagesAreNotIgnoredIfWorkbenchPreferenceAlreadySet(org.eclipse.ajdt.ui.tests.ajde.UIMessageHandlerTest)  Time elapsed: 4.763 sec
testShowWeaveInfoMessagesAreNotIgnoredAfterWorkbenchPreferenceSet(org.eclipse.ajdt.ui.tests.ajde.UIMessageHandlerTest)  Time elapsed: 4.845 sec
testShowWeaveInfoMessagesAreNotIgnoredAfterProjectPreferenceSet(org.eclipse.ajdt.ui.tests.ajde.UIMessageHandlerTest)  Time elapsed: 5.192 sec
testHandleErrorWithMessageAndThrowable(org.eclipse.ajdt.ui.tests.ajde.UIMessageHandlerTest)  Time elapsed: 4.817 sec
testDefaultSettingsMessagesThatAreIgnored(org.eclipse.ajdt.ui.tests.ajde.UIMessageHandlerTest)  Time elapsed: 5.281 sec
testHandleAbortWithMessageAndThrowable(org.eclipse.ajdt.ui.tests.ajde.UIMessageHandlerTest)  Time elapsed: 4.77 sec
testJavaWithAspectQuickFixSetUp(org.eclipse.ajdt.ui.tests.editor.quickfix.AspectJQuickFixTest)  Time elapsed: 5.371 sec
testAspectQuickFixSetUp(org.eclipse.ajdt.ui.tests.editor.quickfix.AspectJQuickFixTest)  Time elapsed: 3.071 sec
testJavaQuickFixSetUp(org.eclipse.ajdt.ui.tests.editor.quickfix.AspectJQuickFixTest)  Time elapsed: 3.383 sec
testJavaWithAspectHasQuickFixes(org.eclipse.ajdt.ui.tests.editor.quickfix.AspectJQuickFixTest)  Time elapsed: 3.274 sec
testAspectHasQuickFixes(org.eclipse.ajdt.ui.tests.editor.quickfix.AspectJQuickFixTest)  Time elapsed: 1.953 sec
testJavaHasQuickFixes(org.eclipse.ajdt.ui.tests.editor.quickfix.AspectJQuickFixTest)  Time elapsed: 3.195 sec
testMainInAspect(org.eclipse.ajdt.ui.tests.launching.AJMainMethodSearchEngineTest)  Time elapsed: 1.997 sec
testMainInPackage(org.eclipse.ajdt.ui.tests.launching.AJMainMethodSearchEngineTest)  Time elapsed: 4.157 sec
testMainInClass(org.eclipse.ajdt.ui.tests.launching.AJMainMethodSearchEngineTest)  Time elapsed: 3.843 sec
testMainInPackageRoot(org.eclipse.ajdt.ui.tests.launching.AJMainMethodSearchEngineTest)  Time elapsed: 3.669 sec
testMainInProject(org.eclipse.ajdt.ui.tests.launching.AJMainMethodSearchEngineTest)  Time elapsed: 3.561 sec
testMainInClassWithAspect(org.eclipse.ajdt.ui.tests.launching.AJMainMethodSearchEngineTest)  Time elapsed: 3.652 sec
testWithTracingExample(org.eclipse.ajdt.ui.tests.launching.AJMainMethodSearchEngineTest)  Time elapsed: 9.361 sec
testMainInAspectInJavaFile(org.eclipse.ajdt.ui.tests.launching.AJMainMethodSearchEngineTest)  Time elapsed: 1.985 sec
testMainInNestedClassInAJFile(org.eclipse.ajdt.ui.tests.launching.AJMainMethodSearchEngineTest)  Time elapsed: 3.839 sec
testGenerateLTWConfigFile1(org.eclipse.ajdt.ui.tests.launching.LTWUtilsTest)  Time elapsed: 5.777 sec
testGenerateLTWConfigFile2(org.eclipse.ajdt.ui.tests.launching.LTWUtilsTest)  Time elapsed: 5.582 sec
testGenerateLTWConfigFile3(org.eclipse.ajdt.ui.tests.launching.LTWUtilsTest)  Time elapsed: 6.019 sec
testGenerateLTWConfigFile4(org.eclipse.ajdt.ui.tests.launching.LTWUtilsTest)  Time elapsed: 3.913 sec
testGenerateLTWConfigFile5(org.eclipse.ajdt.ui.tests.launching.LTWUtilsTest)  Time elapsed: 4.514 sec
testGenerateLTWConfigFile6(org.eclipse.ajdt.ui.tests.launching.LTWUtilsTest)  Time elapsed: 12.373 sec
testGenerateLTWConfigFile7(org.eclipse.ajdt.ui.tests.launching.LTWUtilsTest)  Time elapsed: 4.3 sec
testGetAspects(org.eclipse.ajdt.ui.tests.launching.LTWUtilsTest)  Time elapsed: 5.01 sec
testGenerateLTWConfigFile2(org.eclipse.ajdt.ui.tests.launching.LTWUtilsTest2)  Time elapsed: 5.778 sec
testGenerateLTWConfigFile3(org.eclipse.ajdt.ui.tests.launching.LTWUtilsTest2)  Time elapsed: 5.469 sec
testGenerateLTWConfigFile5(org.eclipse.ajdt.ui.tests.launching.LTWUtilsTest2)  Time elapsed: 4.312 sec
testGenerateLTWConfigFile6(org.eclipse.ajdt.ui.tests.launching.LTWUtilsTest2)  Time elapsed: 11.71 sec
testGenerateLTWConfigFile7(org.eclipse.ajdt.ui.tests.launching.LTWUtilsTest2)  Time elapsed: 4.601 sec
testGenerateLTWConfigFile8(org.eclipse.ajdt.ui.tests.launching.LTWUtilsTest2)  Time elapsed: 4.246 sec
testGetAspects(org.eclipse.ajdt.ui.tests.launching.LTWUtilsTest2)  Time elapsed: 4.904 sec
testBug158937(org.eclipse.ajdt.ui.tests.lazystart.ImageDecoratorTest)  Time elapsed: 3.053 sec
testBug159873(org.eclipse.ajdt.ui.tests.model.BinaryWeavingSupportTest)  Time elapsed: 4.238 sec
testIfAJCodeTemplatesAvailable(org.eclipse.ajdt.ui.tests.CodeTemplatesTest)  Time elapsed: 1.486 sec
testContentAssistA(org.eclipse.ajdt.ui.tests.editor.contentassist.ContentAssistTests)  Time elapsed: 5.096 sec
testContentAssistB(org.eclipse.ajdt.ui.tests.editor.contentassist.ContentAssistTests)  Time elapsed: 4.576 sec
testContentAssistC(org.eclipse.ajdt.ui.tests.editor.contentassist.ContentAssistTests)  Time elapsed: 4.215 sec
testContentAssistD(org.eclipse.ajdt.ui.tests.editor.contentassist.ContentAssistTests)  Time elapsed: 4.65 sec
testContentAssistE(org.eclipse.ajdt.ui.tests.editor.contentassist.ContentAssistTests)  Time elapsed: 4.44 sec
testContentAssistF(org.eclipse.ajdt.ui.tests.editor.contentassist.ContentAssistTests)  Time elapsed: 4.864 sec
testITDField(org.eclipse.ajdt.ui.tests.editor.contentassist.ContentAssistTests2)  Time elapsed: 4.738 sec
testITDMethod(org.eclipse.ajdt.ui.tests.editor.contentassist.ContentAssistTests2)  Time elapsed: 3.283 sec
testITDConstructor(org.eclipse.ajdt.ui.tests.editor.contentassist.ContentAssistTests2)  Time elapsed: 2.845 sec
testITDFieldInField(org.eclipse.ajdt.ui.tests.editor.contentassist.ContentAssistTests2)  Time elapsed: 3.064 sec
testITDFieldInFieldInOtherClass(org.eclipse.ajdt.ui.tests.editor.contentassist.ContentAssistTests2)  Time elapsed: 3.344 sec
testFromDeclareParent(org.eclipse.ajdt.ui.tests.editor.contentassist.ContentAssistTests2)  Time elapsed: 3.056 sec
testITDConstructorInOtherClass(org.eclipse.ajdt.ui.tests.editor.contentassist.ContentAssistTests2)  Time elapsed: 2.297 sec
testITDMethodInOtherClass(org.eclipse.ajdt.ui.tests.editor.contentassist.ContentAssistTests2)  Time elapsed: 2.992 sec
testFromITDOnDeclareParentInOtherClass(org.eclipse.ajdt.ui.tests.editor.contentassist.ContentAssistTests2)  Time elapsed: 2.104 sec
testFromDeclareParentInOtherClass(org.eclipse.ajdt.ui.tests.editor.contentassist.ContentAssistTests2)  Time elapsed: 3.22 sec
testFromITDOnDeclareParent(org.eclipse.ajdt.ui.tests.editor.contentassist.ContentAssistTests2)  Time elapsed: 2.862 sec
testITDFieldInOtherClass(org.eclipse.ajdt.ui.tests.editor.contentassist.ContentAssistTests2)  Time elapsed: 3.023 sec
testITDField(org.eclipse.ajdt.ui.tests.editor.contentassist.ContentAssistTests3)  Time elapsed: 3.329 sec
testITDMethod(org.eclipse.ajdt.ui.tests.editor.contentassist.ContentAssistTests3)  Time elapsed: 2.961 sec
testITDConstructor(org.eclipse.ajdt.ui.tests.editor.contentassist.ContentAssistTests3)  Time elapsed: 3.064 sec
testITDFieldInField(org.eclipse.ajdt.ui.tests.editor.contentassist.ContentAssistTests3)  Time elapsed: 2.092 sec
testITDFieldInFieldInOtherClass(org.eclipse.ajdt.ui.tests.editor.contentassist.ContentAssistTests3)  Time elapsed: 2.087 sec
testFromDeclareParent(org.eclipse.ajdt.ui.tests.editor.contentassist.ContentAssistTests3)  Time elapsed: 3.219 sec
testITDConstructorInOtherClass(org.eclipse.ajdt.ui.tests.editor.contentassist.ContentAssistTests3)  Time elapsed: 3.118 sec
testITDMethodInOtherClass(org.eclipse.ajdt.ui.tests.editor.contentassist.ContentAssistTests3)  Time elapsed: 3.121 sec
testFromITDOnDeclareParentInOtherClass(org.eclipse.ajdt.ui.tests.editor.contentassist.ContentAssistTests3)  Time elapsed: 3.091 sec
testFromDeclareParentInOtherClass(org.eclipse.ajdt.ui.tests.editor.contentassist.ContentAssistTests3)  Time elapsed: 3 sec
testFromITDOnDeclareParent(org.eclipse.ajdt.ui.tests.editor.contentassist.ContentAssistTests3)  Time elapsed: 3.028 sec
testITDFieldInOtherClass(org.eclipse.ajdt.ui.tests.editor.contentassist.ContentAssistTests3)  Time elapsed: 3.151 sec
testInITD(org.eclipse.ajdt.ui.tests.editor.contentassist.ContentAssistTests4)  Time elapsed: 2.147 sec
testInMainMethod(org.eclipse.ajdt.ui.tests.editor.contentassist.ContentAssistTests4)  Time elapsed: 3.984 sec
testInAdvice(org.eclipse.ajdt.ui.tests.editor.contentassist.ContentAssistTests4)  Time elapsed: 2.68 sec
testGenericContentAssist(org.eclipse.ajdt.ui.tests.editor.contentassist.ContentAssistTests5)  Time elapsed: 3.255 sec
testGenericContentAssist2(org.eclipse.ajdt.ui.tests.editor.contentassist.ContentAssistTests5)  Time elapsed: 2.985 sec
testGenericContentAssist3(org.eclipse.ajdt.ui.tests.editor.contentassist.ContentAssistTests5)  Time elapsed: 2.987 sec
testGenericContentAssist4(org.eclipse.ajdt.ui.tests.editor.contentassist.ContentAssistTests5)  Time elapsed: 3.297 sec
testGenericContentAssist(org.eclipse.ajdt.ui.tests.editor.contentassist.Bug273691ContentAssist)  Time elapsed: 2.072 sec
testHasAspectInClass(org.eclipse.ajdt.ui.tests.editor.contentassist.Bug280508ContentAssist)  Time elapsed: 4.741 sec
testAspectOfTypeInClass(org.eclipse.ajdt.ui.tests.editor.contentassist.Bug280508ContentAssist)  Time elapsed: 5.429 sec
testGetWithinTypeName(org.eclipse.ajdt.ui.tests.editor.contentassist.Bug280508ContentAssist)  Time elapsed: 4.45 sec
testAspectOfInClass(org.eclipse.ajdt.ui.tests.editor.contentassist.Bug280508ContentAssist)  Time elapsed: 4.45 sec
testAspectOfInAspect(org.eclipse.ajdt.ui.tests.editor.contentassist.Bug280508ContentAssist)  Time elapsed: 4.482 sec
testAspectOfTypeInAspect(org.eclipse.ajdt.ui.tests.editor.contentassist.Bug280508ContentAssist)  Time elapsed: 4.248 sec
testContentAssistInOtherType(org.eclipse.ajdt.ui.tests.editor.contentassist.ITITContentAssistTests)  Time elapsed: 6.899 sec
testContentAssistInAspect(org.eclipse.ajdt.ui.tests.editor.contentassist.ITITContentAssistTests)  Time elapsed: 6.352 sec
testContentAssistInTargetType(org.eclipse.ajdt.ui.tests.editor.contentassist.ITITContentAssistTests)  Time elapsed: 4.921 sec
testPrivateContentAssistShouldNotAppear(org.eclipse.ajdt.ui.tests.editor.contentassist.PetClinicTests)  Time elapsed: 12.332 sec
testPackageProtectedContentAssistShouldAppear(org.eclipse.ajdt.ui.tests.editor.contentassist.PetClinicTests)  Time elapsed: 7.143 sec
testPrivateContentAssistShouldAppear(org.eclipse.ajdt.ui.tests.editor.contentassist.PetClinicTests)  Time elapsed: 9.943 sec
testContentAssist(org.eclipse.ajdt.ui.tests.editor.contentassist.PetClinicTests)  Time elapsed: 9.268 sec
testPackageProtectedContentAssistShouldNotAppear(org.eclipse.ajdt.ui.tests.editor.contentassist.PetClinicTests)  Time elapsed: 8.223 sec
testPublicContentAssistShouldAppear(org.eclipse.ajdt.ui.tests.editor.contentassist.PetClinicTests)  Time elapsed: 7.298 sec
testModelCheck(org.eclipse.ajdt.ui.tests.editor.contentassist.PetClinicTests)  Time elapsed: 7.526 sec
testReconciling(org.eclipse.ajdt.ui.tests.editor.contentassist.PetClinicTests)  Time elapsed: 13.841 sec
testProjectWizardPerformFinish(org.eclipse.ajdt.ui.tests.wizards.AspectJProjectWizardTest)  Time elapsed: 5.6 sec
testProjectWizardPageAddition(org.eclipse.ajdt.ui.tests.wizards.AspectJProjectWizardTest)  Time elapsed: 1.264 sec
testHowDealingWithProjectDependencies(org.eclipse.ajdt.ui.tests.builder.ProjectDependenciesTest)  Time elapsed: 14.266 sec
testProjectDependencies1(org.eclipse.ajdt.ui.tests.builder.ProjectDependenciesTest)  Time elapsed: 25.698 sec
testProjectDependenciesWithPluginProjects(org.eclipse.ajdt.ui.tests.builder.ProjectDependenciesTest)  Time elapsed: 12.091 sec
testWithOutJarSwitch1(org.eclipse.ajdt.ui.tests.builder.ProjectDependenciesWithJarFilesTest)  Time elapsed: 26.839 sec
testWithOutJarSwitch2(org.eclipse.ajdt.ui.tests.builder.ProjectDependenciesWithJarFilesTest)  Time elapsed: 28.743 sec
testWithOutJarSwitch3(org.eclipse.ajdt.ui.tests.builder.ProjectDependenciesWithJarFilesTest)  Time elapsed: 24.74 sec
testWithExportedJarFile(org.eclipse.ajdt.ui.tests.builder.ProjectDependenciesWithJarFilesTest)  Time elapsed: 12.759 sec
testWithExportedJarFileAndBinaryProject(org.eclipse.ajdt.ui.tests.builder.ProjectDependenciesWithJarFilesTest)  Time elapsed: 15.36 sec
testBuildTwiceWithOutJar(org.eclipse.ajdt.ui.tests.builder.ProjectDependenciesWithJarFilesTest)  Time elapsed: 16.623 sec
testWithExportedJarFileAndNoSrcEntry(org.eclipse.ajdt.ui.tests.builder.ProjectDependenciesWithJarFilesTest)  Time elapsed: 10.667 sec
testDependingProjectBuiltWhenOutjarChanges(org.eclipse.ajdt.ui.tests.builder.ProjectDependenciesWithJarFilesTest)  Time elapsed: 11.928 sec
testMarkersAreAdded(org.eclipse.ajdt.ui.tests.builder.AdviceMarkersTest)  Time elapsed: 2.464 sec
testMarkers(org.eclipse.ajdt.ui.tests.builder.AdviceMarkersTest2)  Time elapsed: 2.97 sec
testMarkers(org.eclipse.ajdt.ui.tests.builder.AdviceMarkersTest3)  Time elapsed: 3.384 sec
testMarkers(org.eclipse.ajdt.ui.tests.builder.AdviceMarkersTest4)  Time elapsed: 3.358 sec
testMarkers(org.eclipse.ajdt.ui.tests.builder.AdviceMarkersTest5)  Time elapsed: 1.765 sec
testBug235204(org.eclipse.ajdt.ui.tests.builder.AdviceMarkersTest6)  Time elapsed: 3.497 sec
testChangeInProject(org.eclipse.ajdt.ui.tests.builder.AdviceMarkersTest7)  Time elapsed: 11.189 sec
testChangeOnAspectPath(org.eclipse.ajdt.ui.tests.builder.AdviceMarkersTest7)  Time elapsed: 8.659 sec
testDeclareErrorOnMultipleProjects(org.eclipse.ajdt.ui.tests.builder.Bug285188DecErrorTests)  Time elapsed: 5.228 sec
testBug128803(org.eclipse.ajdt.ui.tests.builder.Bug128803Test)  Time elapsed: 7.435 sec
testBug151818(org.eclipse.ajdt.ui.tests.builder.Bug151818Test)  Time elapsed: 2.988 sec
testnothing(org.eclipse.ajdt.ui.tests.builder.Bug243376Test)  Time elapsed: 2.575 sec
testCopyAndRemoveNewNonSrcFileWithNonStandardOutputDir(org.eclipse.ajdt.ui.tests.builder.BuilderTest)  Time elapsed: 10.043 sec
testCopyAndRemoveResourceWithoutSrcFolder(org.eclipse.ajdt.ui.tests.builder.BuilderTest)  Time elapsed: 5.433 sec
testCreateAndDeleteNewFolder(org.eclipse.ajdt.ui.tests.builder.BuilderTest)  Time elapsed: 9.482 sec
testIncrementalBuildWithSrcFolder(org.eclipse.ajdt.ui.tests.builder.BuilderTest)  Time elapsed: 6.014 sec
testCopyAndRemoveNewNonSrcFileWithMultipleSrcDirs(org.eclipse.ajdt.ui.tests.builder.BuilderTest)  Time elapsed: 7.137 sec
testCreateAndDeleteNewPackage(org.eclipse.ajdt.ui.tests.builder.BuilderTest)  Time elapsed: 9.157 sec
testIncrementalBuildWithoutSrcFolder(org.eclipse.ajdt.ui.tests.builder.BuilderTest)  Time elapsed: 6.004 sec
testCopyAndRemoveNewNonSrcFile(org.eclipse.ajdt.ui.tests.builder.BuilderTest)  Time elapsed: 9.707 sec
testUpdateNonSrcFile(org.eclipse.ajdt.ui.tests.builder.BuilderTest)  Time elapsed: 11.012 sec
testCreateAndRemoveNewNonSrcFileFromDefaultPackage(org.eclipse.ajdt.ui.tests.builder.BuilderTest)  Time elapsed: 9.456 sec
testAspectPath(org.eclipse.ajdt.ui.tests.builder.BuildPathTests)  Time elapsed: 22.23 sec
testInpath(org.eclipse.ajdt.ui.tests.builder.BuildPathTests)  Time elapsed: 22.832 sec
testMarkersUpdatedAfterChangedProject(org.eclipse.ajdt.ui.tests.builder.ChangingMarkersTest)  Time elapsed: 8.457 sec
testSavedMarkerPreferences(org.eclipse.ajdt.ui.tests.builder.CustomMarkersTest)  Time elapsed: 6.077 sec
testClean(org.eclipse.ajdt.ui.tests.builder.InpathOutFolderTest)  Time elapsed: 9.133 sec
testChangeInpathOutLocation(org.eclipse.ajdt.ui.tests.builder.InpathOutFolderTest)  Time elapsed: 6.538 sec
testJarOnInpath(org.eclipse.ajdt.ui.tests.builder.InpathOutFolderTest)  Time elapsed: 6.281 sec
testJarOnInpath(org.eclipse.ajdt.ui.tests.builder.InpathOutFolderTest2)  Time elapsed: 4.066 sec  <<< FAILURE!
junit.framework.AssertionFailedError: AspectJ RT should exist in the in path out folder
	at junit.framework.Assert.fail(Assert.java:57)
	at junit.framework.TestCase.fail(TestCase.java:227)
	at org.eclipse.ajdt.ui.tests.builder.InpathOutFolderTest2.testJarOnInpath_aroundBody0(InpathOutFolderTest2.java:63)
	at org.eclipse.ajdt.ui.tests.builder.InpathOutFolderTest2.testJarOnInpath_aroundBody1$advice(InpathOutFolderTest2.java:52)
	at org.eclipse.ajdt.ui.tests.builder.InpathOutFolderTest2.testJarOnInpath(InpathOutFolderTest2.java:1)

testBug121810(org.eclipse.ajdt.ui.tests.builder.ITDinSeparateProjects)  Time elapsed: 4.767 sec
testMarkerIsNotRemoved(org.eclipse.ajdt.ui.tests.builder.ProblemMarkerTest)  Time elapsed: 2.552 sec
testJavaNature(org.eclipse.ajdt.ui.tests.builder.EnsureAJBuilderTests)  Time elapsed: 3.315 sec
testAJBuilder(org.eclipse.ajdt.ui.tests.builder.EnsureAJBuilderTests)  Time elapsed: 5.331 sec
testNoRemoveJavaBuilder(org.eclipse.ajdt.ui.tests.builder.EnsureAJBuilderTests)  Time elapsed: 4.299 sec
testJavaBuilder(org.eclipse.ajdt.ui.tests.builder.EnsureAJBuilderTests)  Time elapsed: 4.313 sec
testNoBuilder(org.eclipse.ajdt.ui.tests.builder.EnsureAJBuilderTests)  Time elapsed: 4.291 sec
testBothBuilders(org.eclipse.ajdt.ui.tests.builder.EnsureAJBuilderTests)  Time elapsed: 4.296 sec
testDeletingAJCompilationUnits(org.eclipse.ajdt.ui.tests.javamodel.elements.AJCompilationUnitTest2)  Time elapsed: 6.656 sec
testWhenProjectIsConverted(org.eclipse.ajdt.ui.tests.javamodel.Bug154339Test)  Time elapsed: 6.183 sec
testWhenProjectIsDeleted(org.eclipse.ajdt.ui.tests.javamodel.Bug154339Test)  Time elapsed: 4.096 sec
testWhenProjectIsClosed(org.eclipse.ajdt.ui.tests.javamodel.Bug154339Test)  Time elapsed: 7.823 sec
testAspectInPackageDeclaration(org.eclipse.ajdt.ui.tests.reconciling.ProblemFinderTests4)  Time elapsed: 3.372 sec
testAspectFile(org.eclipse.ajdt.ui.tests.reconciling.ProblemFinderTests4)  Time elapsed: 3.117 sec
testJavaFile(org.eclipse.ajdt.ui.tests.reconciling.ProblemFinderTests4)  Time elapsed: 3.797 sec
testSwitchStatement(org.eclipse.ajdt.ui.tests.reconciling.ProblemFinderTests4)  Time elapsed: 3.036 sec
testProblemFindingAll(org.eclipse.ajdt.ui.tests.reconciling.ProblemFinderTests10)  Time elapsed: 3.921 sec
testProblemFindingErrors(org.eclipse.ajdt.ui.tests.reconciling.ProblemFinderTests10)  Time elapsed: 6.064 sec
testProblemFinding0(org.eclipse.ajdt.ui.tests.reconciling.ProblemFinderTests5)  Time elapsed: 5.078 sec
testProblemFinding1(org.eclipse.ajdt.ui.tests.reconciling.ProblemFinderTests5)  Time elapsed: 2.082 sec
testProblemFinding2(org.eclipse.ajdt.ui.tests.reconciling.ProblemFinderTests5)  Time elapsed: 2.023 sec
testProblemFinding3(org.eclipse.ajdt.ui.tests.reconciling.ProblemFinderTests5)  Time elapsed: 2.067 sec
testProblemFinding4(org.eclipse.ajdt.ui.tests.reconciling.ProblemFinderTests5)  Time elapsed: 2.063 sec
testProblemFinding5(org.eclipse.ajdt.ui.tests.reconciling.ProblemFinderTests5)  Time elapsed: 2.149 sec
testProblemFinding6(org.eclipse.ajdt.ui.tests.reconciling.ProblemFinderTests5)  Time elapsed: 2.773 sec
testProblemFinding0(org.eclipse.ajdt.ui.tests.reconciling.ProblemFinderTests6)  Time elapsed: 3.263 sec
testProblemFinding1(org.eclipse.ajdt.ui.tests.reconciling.ProblemFinderTests6)  Time elapsed: 2.819 sec
testProblemFinding2(org.eclipse.ajdt.ui.tests.reconciling.ProblemFinderTests6)  Time elapsed: 3.121 sec
testProblemFinding3(org.eclipse.ajdt.ui.tests.reconciling.ProblemFinderTests6)  Time elapsed: 3.239 sec
testProblemFinding4(org.eclipse.ajdt.ui.tests.reconciling.ProblemFinderTests6)  Time elapsed: 3.101 sec
testProblemFinding5(org.eclipse.ajdt.ui.tests.reconciling.ProblemFinderTests6)  Time elapsed: 2.801 sec
testProblemFinding0(org.eclipse.ajdt.ui.tests.reconciling.ProblemFinderTests8)  Time elapsed: 3.003 sec
testProblemFinding1(org.eclipse.ajdt.ui.tests.reconciling.ProblemFinderTests8)  Time elapsed: 4.981 sec
testProblemFinding2(org.eclipse.ajdt.ui.tests.reconciling.ProblemFinderTests8)  Time elapsed: 4.849 sec
testProblemFinding3(org.eclipse.ajdt.ui.tests.reconciling.ProblemFinderTests8)  Time elapsed: 4.798 sec
testProblemFinding4(org.eclipse.ajdt.ui.tests.reconciling.ProblemFinderTests8)  Time elapsed: 4.785 sec
testProblemFinding5(org.eclipse.ajdt.ui.tests.reconciling.ProblemFinderTests8)  Time elapsed: 5.209 sec
testProblemFinding6(org.eclipse.ajdt.ui.tests.reconciling.ProblemFinderTests8)  Time elapsed: 4.834 sec
testProblemFinding7(org.eclipse.ajdt.ui.tests.reconciling.ProblemFinderTests8)  Time elapsed: 4.797 sec
testProblemFindingAll(org.eclipse.ajdt.ui.tests.reconciling.ProblemFinderTests11)  Time elapsed: 5.577 sec
testProblemFindingErrors(org.eclipse.ajdt.ui.tests.reconciling.ProblemFinderTests11)  Time elapsed: 5.037 sec
testProblemFindingAll(org.eclipse.ajdt.ui.tests.reconciling.ProblemFinderTests12)  Time elapsed: 4.933 sec
testProblemFindingAll(org.eclipse.ajdt.ui.tests.reconciling.Bug279439Reconciling)  Time elapsed: 4.807 sec
testHyperlink(org.eclipse.ajdt.ui.tests.debug.JavaConsoleHyperlinkTest)  Time elapsed: 7.033 sec
testBreakpointInAJFile1(org.eclipse.ajdt.ui.tests.debug.DebugBreakpointsTests)  Time elapsed: 4.715 sec
testBreakpointInAJFile2(org.eclipse.ajdt.ui.tests.debug.DebugBreakpointsTests)  Time elapsed: 6.683 sec
testBreakpointInAJFile3(org.eclipse.ajdt.ui.tests.debug.DebugBreakpointsTests)  Time elapsed: 6.554 sec
testBreakpointInAJFile4(org.eclipse.ajdt.ui.tests.debug.DebugBreakpointsTests)  Time elapsed: 6.386 sec
testBreakpointInAJFile5(org.eclipse.ajdt.ui.tests.debug.DebugBreakpointsTests)  Time elapsed: 6.469 sec
testBreakpointInAJFile6(org.eclipse.ajdt.ui.tests.debug.DebugBreakpointsTests)  Time elapsed: 6.998 sec
testBreakpointInAJFile7(org.eclipse.ajdt.ui.tests.debug.DebugBreakpointsTests)  Time elapsed: 6.581 sec
testBreakpointInAJFile8(org.eclipse.ajdt.ui.tests.debug.DebugBreakpointsTests)  Time elapsed: 6.544 sec
testBreakpointInAJFile9(org.eclipse.ajdt.ui.tests.debug.DebugBreakpointsTests)  Time elapsed: 6.594 sec
testFFDC(org.eclipse.ajdt.ui.tests.ras.PluginFFDCTest)  Time elapsed: 4.581 sec
testRogueFFDC(org.eclipse.ajdt.ui.tests.ras.PluginFFDCTest)  Time elapsed: 4.708 sec
testRenamePackage(org.eclipse.ajdt.ui.tests.refactoring.RenamePackageTest)  Time elapsed: 5.991 sec
testBug106589(org.eclipse.ajdt.ui.tests.refactoring.OrganizeImportsTest)  Time elapsed: 6.125 sec
testBug188845(org.eclipse.ajdt.ui.tests.refactoring.OrganizeImportsTest)  Time elapsed: 6.501 sec
testBug236352(org.eclipse.ajdt.ui.tests.refactoring.OrganizeImportsTest)  Time elapsed: 5.511 sec
testCopyPasteAJ(org.eclipse.ajdt.ui.tests.refactoring.CopyPasteAJTest)  Time elapsed: 5.952 sec
testDeclareParents(org.eclipse.ajdt.ui.tests.refactoring.PushinRefactoringTests)  Time elapsed: 9.234 sec
testDeclareAnnotation(org.eclipse.ajdt.ui.tests.refactoring.PushinRefactoringTests)  Time elapsed: 6.331 sec
testDeclareAnnotationBig(org.eclipse.ajdt.ui.tests.refactoring.PushinRefactoringTests)  Time elapsed: 6.317 sec
testITDsWillDelete(org.eclipse.ajdt.ui.tests.refactoring.PushinRefactoringTests)  Time elapsed: 6.362 sec
testBug283657(org.eclipse.ajdt.ui.tests.refactoring.PushinRefactoringTests)  Time elapsed: 7.341 sec
testBug321065(org.eclipse.ajdt.ui.tests.refactoring.PushinRefactoringTests)  Time elapsed: 10.439 sec
testSimpleITDsNoDelete(org.eclipse.ajdt.ui.tests.refactoring.PushinRefactoringTests)  Time elapsed: 6.491 sec
testPushInRemoveFieldClassFullyQualified(org.eclipse.ajdt.ui.tests.refactoring.PushInRefactoringRemoveAnnotationTests)  Time elapsed: 5.287 sec
testPushInRemoveFieldAspectFullyQualified(org.eclipse.ajdt.ui.tests.refactoring.PushInRefactoringRemoveAnnotationTests)  Time elapsed: 4.096 sec
testPushInRemoveFieldMultiple(org.eclipse.ajdt.ui.tests.refactoring.PushInRefactoringRemoveAnnotationTests)  Time elapsed: 5.142 sec
testPushInRemoveFieldSimple(org.eclipse.ajdt.ui.tests.refactoring.PushInRefactoringRemoveAnnotationTests)  Time elapsed: 4.197 sec
testPushInRemoveFieldBothFullyQualified(org.eclipse.ajdt.ui.tests.refactoring.PushInRefactoringRemoveAnnotationTests)  Time elapsed: 4.178 sec
testPushInRemoveFieldMultiple2(org.eclipse.ajdt.ui.tests.refactoring.PushInRefactoringRemoveAnnotationTests)  Time elapsed: 5.101 sec
testPushInRemoveFieldDifferentPackages(org.eclipse.ajdt.ui.tests.refactoring.PushInRefactoringRemoveAnnotationTests)  Time elapsed: 4.281 sec
testPushInRemoveFieldClassFullyQualifiedMultiple1(org.eclipse.ajdt.ui.tests.refactoring.PushInRefactoringRemoveAnnotationTests)  Time elapsed: 4.914 sec
testPushInRemoveFieldClassFullyQualifiedMultiple2(org.eclipse.ajdt.ui.tests.refactoring.PushInRefactoringRemoveAnnotationTests)  Time elapsed: 5.105 sec
testImportRequired(org.eclipse.ajdt.ui.tests.refactoring.PushInRefactoringITITTests)  Time elapsed: 3.827 sec
testEmptyFullyQualifiedITIT(org.eclipse.ajdt.ui.tests.refactoring.PushInRefactoringITITTests)  Time elapsed: 3.641 sec
testOneFieldNoImports(org.eclipse.ajdt.ui.tests.refactoring.PushInRefactoringITITTests)  Time elapsed: 3.84 sec
testImportAlreadyThere(org.eclipse.ajdt.ui.tests.refactoring.PushInRefactoringITITTests)  Time elapsed: 3.599 sec
testEmptyITIT(org.eclipse.ajdt.ui.tests.refactoring.PushInRefactoringITITTests)  Time elapsed: 3.841 sec
testTwoITITsOneAspectDifferentTargets(org.eclipse.ajdt.ui.tests.refactoring.PushInRefactoringITITTests)  Time elapsed: 3.553 sec
testFullyQualifiedReference(org.eclipse.ajdt.ui.tests.refactoring.PushInRefactoringITITTests)  Time elapsed: 3.442 sec
testTwoITITsOneAspect(org.eclipse.ajdt.ui.tests.refactoring.PushInRefactoringITITTests)  Time elapsed: 3.319 sec
testTwoITITsOneAspectFirstOnly(org.eclipse.ajdt.ui.tests.refactoring.PushInRefactoringITITTests)  Time elapsed: 3.374 sec
testTwoFieldsNoImports(org.eclipse.ajdt.ui.tests.refactoring.PushInRefactoringITITTests)  Time elapsed: 3.541 sec
testAspectNotDeleted(org.eclipse.ajdt.ui.tests.refactoring.PushInRefactoringITITTests)  Time elapsed: 3.666 sec
testDefaultPackage1(org.eclipse.ajdt.ui.tests.refactoring.PushInRefactoringDeclareParentsTests)  Time elapsed: 4.061 sec
testDefaultPackage2(org.eclipse.ajdt.ui.tests.refactoring.PushInRefactoringDeclareParentsTests)  Time elapsed: 3.921 sec
testDefaultPackage3(org.eclipse.ajdt.ui.tests.refactoring.PushInRefactoringDeclareParentsTests)  Time elapsed: 5.028 sec
testDefaultPackage4(org.eclipse.ajdt.ui.tests.refactoring.PushInRefactoringDeclareParentsTests)  Time elapsed: 5.123 sec
testDefaultPackage5(org.eclipse.ajdt.ui.tests.refactoring.PushInRefactoringDeclareParentsTests)  Time elapsed: 5.342 sec
testDefaultPackage6(org.eclipse.ajdt.ui.tests.refactoring.PushInRefactoringDeclareParentsTests)  Time elapsed: 3.999 sec
testDefaultPackage7(org.eclipse.ajdt.ui.tests.refactoring.PushInRefactoringDeclareParentsTests)  Time elapsed: 5.169 sec
testDefaultPackage8(org.eclipse.ajdt.ui.tests.refactoring.PushInRefactoringDeclareParentsTests)  Time elapsed: 5.01 sec
testSamePackage1(org.eclipse.ajdt.ui.tests.refactoring.PushInRefactoringDeclareParentsTests)  Time elapsed: 5.185 sec
testSamePackage2(org.eclipse.ajdt.ui.tests.refactoring.PushInRefactoringDeclareParentsTests)  Time elapsed: 6.108 sec
testSamePackage3(org.eclipse.ajdt.ui.tests.refactoring.PushInRefactoringDeclareParentsTests)  Time elapsed: 6.387 sec
testGenerics1(org.eclipse.ajdt.ui.tests.refactoring.PushInRefactoringDeclareParentsTests)  Time elapsed: 4.321 sec
testOtherPackage1(org.eclipse.ajdt.ui.tests.refactoring.PushInRefactoringDeclareParentsTests)  Time elapsed: 5.847 sec
testOtherPackage2(org.eclipse.ajdt.ui.tests.refactoring.PushInRefactoringDeclareParentsTests)  Time elapsed: 6.141 sec
testPullProtected(org.eclipse.ajdt.ui.tests.refactoring.PullOutRefactoringTests)  Time elapsed: 4.463 sec
testPullSamePackage(org.eclipse.ajdt.ui.tests.refactoring.PullOutRefactoringTests)  Time elapsed: 4.466 sec
testGenericParamPrivateTypeRef(org.eclipse.ajdt.ui.tests.refactoring.PullOutRefactoringTests)  Time elapsed: 3.769 sec
testPullSameAspect(org.eclipse.ajdt.ui.tests.refactoring.PullOutRefactoringTests)  Time elapsed: 4.262 sec
testAddModifierWeirdComments(org.eclipse.ajdt.ui.tests.refactoring.PullOutRefactoringTests)  Time elapsed: 5.284 sec
testScaffolding(org.eclipse.ajdt.ui.tests.refactoring.PullOutRefactoringTests)  Time elapsed: 4.392 sec
testPullAbstractMethodWarnings(org.eclipse.ajdt.ui.tests.refactoring.PullOutRefactoringTests)  Time elapsed: 3.702 sec
testPullITDField(org.eclipse.ajdt.ui.tests.refactoring.PullOutRefactoringTests)  Time elapsed: 4.447 sec
testPullMultipleTargetsCanPrivate(org.eclipse.ajdt.ui.tests.refactoring.PullOutRefactoringTests)  Time elapsed: 4.281 sec
testPullWeirdComments(org.eclipse.ajdt.ui.tests.refactoring.PullOutRefactoringTests)  Time elapsed: 4.291 sec
testPrivateFieldReference2(org.eclipse.ajdt.ui.tests.refactoring.PullOutRefactoringTests)  Time elapsed: 4.579 sec
testPullMultipleTargetsSimple(org.eclipse.ajdt.ui.tests.refactoring.PullOutRefactoringTests)  Time elapsed: 4.887 sec
testPrivateMethodReference(org.eclipse.ajdt.ui.tests.refactoring.PullOutRefactoringTests)  Time elapsed: 4.646 sec
testPublicizeITDs(org.eclipse.ajdt.ui.tests.refactoring.PullOutRefactoringTests)  Time elapsed: 3.871 sec
testImportNameCollisionInDeclaringTypeRef(org.eclipse.ajdt.ui.tests.refactoring.PullOutRefactoringTests)  Time elapsed: 4.442 sec
testPrivateFieldReference(org.eclipse.ajdt.ui.tests.refactoring.PullOutRefactoringTests)  Time elapsed: 4.515 sec
testMakePrivilegedPrivileged(org.eclipse.ajdt.ui.tests.refactoring.PullOutRefactoringTests)  Time elapsed: 5.135 sec
testPullITDMethod(org.eclipse.ajdt.ui.tests.refactoring.PullOutRefactoringTests)  Time elapsed: 4.268 sec
testPrivilegedAspect(org.eclipse.ajdt.ui.tests.refactoring.PullOutRefactoringTests)  Time elapsed: 4.344 sec
testSimplePrivateTypeRef(org.eclipse.ajdt.ui.tests.refactoring.PullOutRefactoringTests)  Time elapsed: 3.818 sec
testPullSameCU(org.eclipse.ajdt.ui.tests.refactoring.PullOutRefactoringTests)  Time elapsed: 4.055 sec
testPullStatic(org.eclipse.ajdt.ui.tests.refactoring.PullOutRefactoringTests)  Time elapsed: 4.881 sec
testFieldPulling(org.eclipse.ajdt.ui.tests.refactoring.PullOutRefactoringTests)  Time elapsed: 4.601 sec
testPullInterfaceMethodWarning(org.eclipse.ajdt.ui.tests.refactoring.PullOutRefactoringTests)  Time elapsed: 4.636 sec
testGenericTypeParamUsed(org.eclipse.ajdt.ui.tests.refactoring.PullOutRefactoringTests)  Time elapsed: 4.073 sec
testPullITDConstructor(org.eclipse.ajdt.ui.tests.refactoring.PullOutRefactoringTests)  Time elapsed: 5.037 sec
testProtectedDropping(org.eclipse.ajdt.ui.tests.refactoring.PullOutRefactoringTests)  Time elapsed: 4.301 sec
testPullAspectMethod(org.eclipse.ajdt.ui.tests.refactoring.PullOutRefactoringTests)  Time elapsed: 4.369 sec
testPullAbstractStubMethods(org.eclipse.ajdt.ui.tests.refactoring.PullOutRefactoringTests)  Time elapsed: 4.506 sec
testPullPrivate(org.eclipse.ajdt.ui.tests.refactoring.PullOutRefactoringTests)  Time elapsed: 3.667 sec
testPullConstructorWithThisWarning(org.eclipse.ajdt.ui.tests.refactoring.PullOutRefactoringTests)  Time elapsed: 3.975 sec
testProtectedAndDefaulReference(org.eclipse.ajdt.ui.tests.refactoring.PullOutRefactoringTests)  Time elapsed: 4.384 sec
testImports(org.eclipse.ajdt.ui.tests.refactoring.PullOutRefactoringTests)  Time elapsed: 4.898 sec
testImportNameCollision(org.eclipse.ajdt.ui.tests.refactoring.PullOutRefactoringTests)  Time elapsed: 8.405 sec
testMakePrivilegedAspect(org.eclipse.ajdt.ui.tests.refactoring.PullOutRefactoringTests)  Time elapsed: 4.513 sec
testPullConstructor(org.eclipse.ajdt.ui.tests.refactoring.PullOutRefactoringTests)  Time elapsed: 5.044 sec
testSimple(org.eclipse.ajdt.ui.tests.refactoring.PullOutRefactoringTests)  Time elapsed: 4.279 sec
testArrayPrivateTypeRef(org.eclipse.ajdt.ui.tests.refactoring.PullOutRefactoringTests)  Time elapsed: 3.723 sec
testDifferentPackage(org.eclipse.ajdt.ui.tests.refactoring.PullOutRefactoringTests)  Time elapsed: 4.594 sec
testPullInterfaceVoidStubMethods(org.eclipse.ajdt.ui.tests.refactoring.PullOutRefactoringTests)  Time elapsed: 4.295 sec
testMultipleGenericTypeParamUsed(org.eclipse.ajdt.ui.tests.refactoring.PullOutRefactoringTests)  Time elapsed: 4.255 sec
testPullConstructorWithPrivateWarnings(org.eclipse.ajdt.ui.tests.refactoring.PullOutRefactoringTests)  Time elapsed: 3.959 sec
testRipple1(org.eclipse.ajdt.ui.tests.refactoring.ITDAwareRippleSearchTests)  Time elapsed: 3.559 sec
testRipple2(org.eclipse.ajdt.ui.tests.refactoring.ITDAwareRippleSearchTests)  Time elapsed: 3.769 sec
testRipple3(org.eclipse.ajdt.ui.tests.refactoring.ITDAwareRippleSearchTests)  Time elapsed: 4.263 sec
testRipple4(org.eclipse.ajdt.ui.tests.refactoring.ITDAwareRippleSearchTests)  Time elapsed: 6.242 sec
testRipple5(org.eclipse.ajdt.ui.tests.refactoring.ITDAwareRippleSearchTests)  Time elapsed: 4.004 sec
testRipple6(org.eclipse.ajdt.ui.tests.refactoring.ITDAwareRippleSearchTests)  Time elapsed: 5.824 sec
testRippleInterface1(org.eclipse.ajdt.ui.tests.refactoring.ITDAwareRippleSearchTests)  Time elapsed: 5.467 sec
testRippleInterface2(org.eclipse.ajdt.ui.tests.refactoring.ITDAwareRippleSearchTests)  Time elapsed: 4.5 sec
testRippleInterface3(org.eclipse.ajdt.ui.tests.refactoring.ITDAwareRippleSearchTests)  Time elapsed: 4.485 sec
testRippleInterface4(org.eclipse.ajdt.ui.tests.refactoring.ITDAwareRippleSearchTests)  Time elapsed: 5.889 sec
testRippleInterface5(org.eclipse.ajdt.ui.tests.refactoring.ITDAwareRippleSearchTests)  Time elapsed: 4.107 sec
testRippleInterface6(org.eclipse.ajdt.ui.tests.refactoring.ITDAwareRippleSearchTests)  Time elapsed: 7.884 sec
testPrivateRenameField1(org.eclipse.ajdt.ui.tests.refactoring.ITDRenameProcessorTests)  Time elapsed: 3.577 sec
testMethodRenameOnInterfaceWithDeclareParents1(org.eclipse.ajdt.ui.tests.refactoring.ITDRenameProcessorTests)  Time elapsed: 3.657 sec
testMethodRenameOnInterfaceWithDeclareParents2(org.eclipse.ajdt.ui.tests.refactoring.ITDRenameProcessorTests)  Time elapsed: 3.593 sec
testSimpleRenameField1(org.eclipse.ajdt.ui.tests.refactoring.ITDRenameProcessorTests)  Time elapsed: 3.501 sec
testSimpleRenameField2(org.eclipse.ajdt.ui.tests.refactoring.ITDRenameProcessorTests)  Time elapsed: 3.401 sec
testSimpleRenameField3(org.eclipse.ajdt.ui.tests.refactoring.ITDRenameProcessorTests)  Time elapsed: 3.465 sec
testRenameMethodTwoArgs1(org.eclipse.ajdt.ui.tests.refactoring.ITDRenameProcessorTests)  Time elapsed: 3.694 sec
testRenameMethodTwoArgs2(org.eclipse.ajdt.ui.tests.refactoring.ITDRenameProcessorTests)  Time elapsed: 3.638 sec
testRenameMethodTwoArgs3(org.eclipse.ajdt.ui.tests.refactoring.ITDRenameProcessorTests)  Time elapsed: 8.26 sec
testRenameMethodPrimitiveArg1(org.eclipse.ajdt.ui.tests.refactoring.ITDRenameProcessorTests)  Time elapsed: 4.149 sec
testRenameMethodPrimitiveArg2(org.eclipse.ajdt.ui.tests.refactoring.ITDRenameProcessorTests)  Time elapsed: 3.646 sec
testRenameMethodPrimitiveArg3(org.eclipse.ajdt.ui.tests.refactoring.ITDRenameProcessorTests)  Time elapsed: 7.763 sec
testRenameMethodStringArg1(org.eclipse.ajdt.ui.tests.refactoring.ITDRenameProcessorTests)  Time elapsed: 4.099 sec
testRenameMethodStringArg2(org.eclipse.ajdt.ui.tests.refactoring.ITDRenameProcessorTests)  Time elapsed: 3.612 sec
testRenameMethodStringArg3(org.eclipse.ajdt.ui.tests.refactoring.ITDRenameProcessorTests)  Time elapsed: 7.262 sec
testRenameMethodListOfStringArg1(org.eclipse.ajdt.ui.tests.refactoring.ITDRenameProcessorTests)  Time elapsed: 4.108 sec
testRenameMethodListOfStringArg2(org.eclipse.ajdt.ui.tests.refactoring.ITDRenameProcessorTests)  Time elapsed: 3.641 sec
testRenameMethodListOfStringArg3(org.eclipse.ajdt.ui.tests.refactoring.ITDRenameProcessorTests)  Time elapsed: 7.332 sec
testMultiFileRenameField1(org.eclipse.ajdt.ui.tests.refactoring.ITDRenameProcessorTests)  Time elapsed: 4.377 sec
testRenameMethodQualifiedListArg1(org.eclipse.ajdt.ui.tests.refactoring.ITDRenameProcessorTests)  Time elapsed: 3.577 sec
testRenameMethodQualifiedListArg2(org.eclipse.ajdt.ui.tests.refactoring.ITDRenameProcessorTests)  Time elapsed: 3.674 sec
testRenameMethodQualifiedListArg3(org.eclipse.ajdt.ui.tests.refactoring.ITDRenameProcessorTests)  Time elapsed: 7.368 sec
testRenameMethodNoArgs1(org.eclipse.ajdt.ui.tests.refactoring.ITDRenameProcessorTests)  Time elapsed: 4.063 sec
testRenameMethodNoArgs2(org.eclipse.ajdt.ui.tests.refactoring.ITDRenameProcessorTests)  Time elapsed: 3.62 sec
testRenameMethodNoArgs3(org.eclipse.ajdt.ui.tests.refactoring.ITDRenameProcessorTests)  Time elapsed: 7.255 sec
testExtractLocalSimple1(org.eclipse.ajdt.ui.tests.refactoring.ExtractLocalTests)  Time elapsed: 4.175 sec
testExtractLocalSimple2(org.eclipse.ajdt.ui.tests.refactoring.ExtractLocalTests)  Time elapsed: 4.129 sec
testExtractLocalAspect1(org.eclipse.ajdt.ui.tests.refactoring.ExtractLocalTests)  Time elapsed: 3.176 sec
testExtractLocalAspect2(org.eclipse.ajdt.ui.tests.refactoring.ExtractLocalTests)  Time elapsed: 3.469 sec
testExtractLocalAspect3(org.eclipse.ajdt.ui.tests.refactoring.ExtractLocalTests)  Time elapsed: 3.416 sec
testExtractLocalAspect4(org.eclipse.ajdt.ui.tests.refactoring.ExtractLocalTests)  Time elapsed: 3.73 sec
testExtractLocalAspect5(org.eclipse.ajdt.ui.tests.refactoring.ExtractLocalTests)  Time elapsed: 3.456 sec
testExtractConstantAspect1(org.eclipse.ajdt.ui.tests.refactoring.ExtractConstantTests)  Time elapsed: 3.244 sec
testExtractConstantAspect2(org.eclipse.ajdt.ui.tests.refactoring.ExtractConstantTests)  Time elapsed: 3.339 sec
testExtractConstantAspect3(org.eclipse.ajdt.ui.tests.refactoring.ExtractConstantTests)  Time elapsed: 3.523 sec
testExtractConstantAspect4(org.eclipse.ajdt.ui.tests.refactoring.ExtractConstantTests)  Time elapsed: 3.536 sec
testExtractConstantAspect5(org.eclipse.ajdt.ui.tests.refactoring.ExtractConstantTests)  Time elapsed: 3.445 sec
testExtractConstantSimple1(org.eclipse.ajdt.ui.tests.refactoring.ExtractConstantTests)  Time elapsed: 3.637 sec
testExtractConstantSimple2(org.eclipse.ajdt.ui.tests.refactoring.ExtractConstantTests)  Time elapsed: 3.437 sec
testConvertLocalToFieldSimple1(org.eclipse.ajdt.ui.tests.refactoring.ConvertLocalToFieldTests)  Time elapsed: 3.495 sec
testConvertLocalToFieldSimple2(org.eclipse.ajdt.ui.tests.refactoring.ConvertLocalToFieldTests)  Time elapsed: 3.738 sec
testConvertLocalToFieldAspect1(org.eclipse.ajdt.ui.tests.refactoring.ConvertLocalToFieldTests)  Time elapsed: 3.451 sec
testConvertLocalToFieldAspect2(org.eclipse.ajdt.ui.tests.refactoring.ConvertLocalToFieldTests)  Time elapsed: 3.406 sec
testConvertLocalToFieldAspect3(org.eclipse.ajdt.ui.tests.refactoring.ConvertLocalToFieldTests)  Time elapsed: 3.769 sec
testConvertLocalToFieldAspect4(org.eclipse.ajdt.ui.tests.refactoring.ConvertLocalToFieldTests)  Time elapsed: 3.436 sec
testConvertLocalToFieldAspect5(org.eclipse.ajdt.ui.tests.refactoring.ConvertLocalToFieldTests)  Time elapsed: 3.443 sec
testAspectWithITD1(org.eclipse.ajdt.ui.tests.refactoring.MoveTypeIntoAspectRefactoringTests)  Time elapsed: 4.517 sec
testAspectWithITD2(org.eclipse.ajdt.ui.tests.refactoring.MoveTypeIntoAspectRefactoringTests)  Time elapsed: 4.293 sec
testSimple1(org.eclipse.ajdt.ui.tests.refactoring.MoveTypeIntoAspectRefactoringTests)  Time elapsed: 3.715 sec
testSimple2(org.eclipse.ajdt.ui.tests.refactoring.MoveTypeIntoAspectRefactoringTests)  Time elapsed: 3.684 sec
testSimple3(org.eclipse.ajdt.ui.tests.refactoring.MoveTypeIntoAspectRefactoringTests)  Time elapsed: 3.825 sec
testSimple4(org.eclipse.ajdt.ui.tests.refactoring.MoveTypeIntoAspectRefactoringTests)  Time elapsed: 3.623 sec
testSuperTypeHierarchyOfNonFocusType(org.eclipse.ajdt.ui.tests.hierarchy.ITDAwareHierarchyTests)  Time elapsed: 5.664 sec
testSuperTypeHierarchyOfFocusType(org.eclipse.ajdt.ui.tests.hierarchy.ITDAwareHierarchyTests)  Time elapsed: 3.023 sec
testSubTypeHierarchy(org.eclipse.ajdt.ui.tests.hierarchy.ITDAwareHierarchyTests)  Time elapsed: 3.079 sec
testAbstractAspectWithDeclare(org.eclipse.ajdt.ui.tests.hierarchy.ITDAwareHierarchyTests2)  Time elapsed: 3.611 sec
testAbstractGenericAspectWithDeclare(org.eclipse.ajdt.ui.tests.hierarchy.ITDAwareHierarchyTests2)  Time elapsed: 5.158 sec
testDisabled(org.eclipse.ajdt.ui.tests.ErrorLogTest)  Time elapsed: 4.258 sec
testViewsAreValid(org.eclipse.ajdt.ui.tests.VerificationTest)  Time elapsed: 4.915 sec
testAbsentNavigatorView(org.eclipse.ajdt.ui.tests.VerificationTest)  Time elapsed: 4.591 sec
testAbsentStructureModelView(org.eclipse.ajdt.ui.tests.VerificationTest)  Time elapsed: 4.492 sec
testBug106813(org.eclipse.ajdt.ui.tests.Bug106813Test)  Time elapsed: 5.88 sec
testPredefinedProjectsTool(org.eclipse.ajdt.ui.tests.testutils.TestForPredefinedProjectsTool)  Time elapsed: 4.636 sec
testProjectsToolWithClosedProjects(org.eclipse.ajdt.ui.tests.testutils.TestForPredefinedProjectsTool)  Time elapsed: 4.826 sec
testBug93532(org.eclipse.ajdt.ui.tests.utils.AJDTUtilsTest)  Time elapsed: 3.316 sec
testCaseInsensitiveNoSrcFolder(org.eclipse.ajdt.ui.tests.utils.AJDTUtilsTest)  Time elapsed: 2.113 sec
testCaseInsensitive(org.eclipse.ajdt.ui.tests.utils.AJDTUtilsTest)  Time elapsed: 1.998 sec
testAddAndRemoveAjrtToBuildPath(org.eclipse.ajdt.ui.tests.utils.AJDTUtilsTest)  Time elapsed: 4.29 sec
testAddAndRemoveWithExcludes(org.eclipse.ajdt.ui.tests.utils.AJDTUtilsTest)  Time elapsed: 3.043 sec
testAddAndRemoveAspectJNature(org.eclipse.ajdt.ui.tests.utils.AJDTUtilsTest)  Time elapsed: 4.213 sec
testCaseInsensitiveDriveLetters(org.eclipse.ajdt.ui.tests.utils.AJDTUtilsTest)  Time elapsed: 2.253 sec
testAddAndRemoveWithExcludes2(org.eclipse.ajdt.ui.tests.utils.AJDTUtilsTest)  Time elapsed: 3.143 sec
testAddAndRemoveAspectJNatureWithBundleProject(org.eclipse.ajdt.ui.tests.utils.AJDTUtilsTest)  Time elapsed: 7.202 sec

Results :

Failed tests: 
  AspectJEditorTest.testOpenAJFile:1->testOpenAJFile_aroundBody1$advice:72 The test added errors to the log:
FrameworkEvent ERROR
org.osgi.framework.BundleException: Could not resolve module: org.eclipse.jdt.launching.macosx [224]
  Unresolved requirement: Require-Capability: eclipse.platform; filter:="(osgi.os=macosx)"

	at org.eclipse.osgi.container.Module.start(Module.java:434)
	at org.eclipse.osgi.container.ModuleContainer$ContainerStartLevel.incStartLevel(ModuleContainer.java:1582)
	at org.eclipse.osgi.container.ModuleContainer$ContainerStartLevel.incStartLevel(ModuleContainer.java:1561)
	at org.eclipse.osgi.container.ModuleContainer$ContainerStartLevel.doContainerStartLevel(ModuleContainer.java:1533)
	at org.eclipse.osgi.container.ModuleContainer$ContainerStartLevel.dispatchEvent(ModuleContainer.java:1476)
	at org.eclipse.osgi.container.ModuleContainer$ContainerStartLevel.dispatchEvent(ModuleContainer.java:1)
	at org.eclipse.osgi.framework.eventmgr.EventManager.dispatchEvent(EventManager.java:230)
	at org.eclipse.osgi.framework.eventmgr.EventManager$EventThread.run(EventManager.java:340)


The test added errors to the log:
FrameworkEvent ERROR
org.osgi.framework.BundleException: Could not resolve module: org.eclipse.jdt.launching.ui.macosx [225]
  Unresolved requirement: Require-Capability: eclipse.platform; filter:="(osgi.os=macosx)"

	at org.eclipse.osgi.container.Module.start(Module.java:434)
	at org.eclipse.osgi.container.ModuleContainer$ContainerStartLevel.incStartLevel(ModuleContainer.java:1582)
	at org.eclipse.osgi.container.ModuleContainer$ContainerStartLevel.incStartLevel(ModuleContainer.java:1561)
	at org.eclipse.osgi.container.ModuleContainer$ContainerStartLevel.doContainerStartLevel(ModuleContainer.java:1533)
	at org.eclipse.osgi.container.ModuleContainer$ContainerStartLevel.dispatchEvent(ModuleContainer.java:1476)
	at org.eclipse.osgi.container.ModuleContainer$ContainerStartLevel.dispatchEvent(ModuleContainer.java:1)
	at org.eclipse.osgi.framework.eventmgr.EventManager.dispatchEvent(EventManager.java:230)
	at org.eclipse.osgi.framework.eventmgr.EventManager$EventThread.run(EventManager.java:340)



  InpathOutFolderTest2.testJarOnInpath:1->testJarOnInpath_aroundBody1$advice:52->testJarOnInpath_aroundBody0:63 AspectJ RT should exist in the in path out folder

Tests run: 436, Failures: 2, Errors: 0, Skipped: 0

>> finished a build

!ENTRY org.eclipse.core.resources 2 10035 2016-02-04 17:02:23.691
!MESSAGE The workspace will exit with unsaved changes in this session.
[ERROR] There are test failures.

Please refer to /jobs/genie.ajdt/ajdt-on-eclipse-45/workspace/org.eclipse.ajdt.ui.tests/target/surefire-reports for the individual test results.
[INFO] 
[INFO] --- eclipse-jarsigner-plugin:1.0.4:sign (sign) @ org.eclipse.ajdt.ui.tests ---
[INFO] Signed org.eclipse.ajdt:org.eclipse.ajdt.ui.tests:eclipse-test-plugin:2.2.4-SNAPSHOT in 2 seconds.
[INFO] Signed org.eclipse.ajdt:org.eclipse.ajdt.ui.tests:java-source:sources:2.2.4-SNAPSHOT in 1 seconds.
[INFO] 
[INFO] --- tycho-p2-plugin:0.23.1:p2-metadata (p2-metadata) @ org.eclipse.ajdt.ui.tests ---
[INFO]                                                                         
[INFO] ------------------------------------------------------------------------
[INFO] Building org.eclipse.ajdt.mylyn.ui.tests 2.2.4-SNAPSHOT
[INFO] ------------------------------------------------------------------------
[INFO] 
[INFO] --- maven-clean-plugin:2.5:clean (default-clean) @ org.eclipse.ajdt.mylyn.ui.tests ---
[INFO] Deleting /jobs/genie.ajdt/ajdt-on-eclipse-45/workspace/org.eclipse.ajdt.mylyn.ui.tests/target
[INFO] 
[INFO] --- tycho-packaging-plugin:0.23.1:build-qualifier (default-build-qualifier) @ org.eclipse.ajdt.mylyn.ui.tests ---
[INFO] The project's OSGi version is 2.2.4.201602042048
[INFO] 
[INFO] --- tycho-packaging-plugin:0.23.1:validate-id (default-validate-id) @ org.eclipse.ajdt.mylyn.ui.tests ---
[INFO] 
[INFO] --- tycho-packaging-plugin:0.23.1:validate-version (default-validate-version) @ org.eclipse.ajdt.mylyn.ui.tests ---
[INFO] 
[INFO] --- maven-resources-plugin:2.4.3:resources (default-resources) @ org.eclipse.ajdt.mylyn.ui.tests ---
[WARNING] Using platform encoding (UTF-8 actually) to copy filtered resources, i.e. build is platform dependent!
[INFO] skip non existing resourceDirectory /jobs/genie.ajdt/ajdt-on-eclipse-45/workspace/org.eclipse.ajdt.mylyn.ui.tests/src/main/resources
[INFO] 
[INFO] --- tycho-compiler-plugin:0.23.1:compile (default-compile) @ org.eclipse.ajdt.mylyn.ui.tests ---
[INFO] Compiling 1 source file to /jobs/genie.ajdt/ajdt-on-eclipse-45/workspace/org.eclipse.ajdt.mylyn.ui.tests/target/classes
[INFO] 
[INFO] --- maven-resources-plugin:2.4.3:testResources (default-testResources) @ org.eclipse.ajdt.mylyn.ui.tests ---
[WARNING] Using platform encoding (UTF-8 actually) to copy filtered resources, i.e. build is platform dependent!
[INFO] skip non existing resourceDirectory /jobs/genie.ajdt/ajdt-on-eclipse-45/workspace/org.eclipse.ajdt.mylyn.ui.tests/src/test/resources
[INFO] 
[INFO] --- target-platform-configuration:0.23.1:target-platform (default-target-platform) @ org.eclipse.ajdt.mylyn.ui.tests ---
[INFO] 
[INFO] --- tycho-packaging-plugin:0.23.1:package-plugin (default-package-plugin) @ org.eclipse.ajdt.mylyn.ui.tests ---
[INFO] Building jar: /jobs/genie.ajdt/ajdt-on-eclipse-45/workspace/org.eclipse.ajdt.mylyn.ui.tests/target/org.eclipse.ajdt.mylyn.ui.tests-2.2.4-SNAPSHOT.jar
[INFO] 
[INFO] --- tycho-p2-plugin:0.23.1:p2-metadata-default (default-p2-metadata-default) @ org.eclipse.ajdt.mylyn.ui.tests ---
[INFO] 
[INFO] --- eclipse-jarsigner-plugin:1.0.4:sign (sign) @ org.eclipse.ajdt.mylyn.ui.tests ---
[INFO] Signed org.eclipse.ajdt:org.eclipse.ajdt.mylyn.ui.tests:eclipse-plugin:2.2.4-SNAPSHOT in 0 seconds.
[INFO] 
[INFO] --- tycho-p2-plugin:0.23.1:p2-metadata (p2-metadata) @ org.eclipse.ajdt.mylyn.ui.tests ---
[INFO]                                                                         
[INFO] ------------------------------------------------------------------------
[INFO] Building org.eclipse.contribution.weaving.jdt.tests 2.2.4-SNAPSHOT
[INFO] ------------------------------------------------------------------------
[INFO] 
[INFO] --- maven-clean-plugin:2.5:clean (default-clean) @ org.eclipse.contribution.weaving.jdt.tests ---
[INFO] Deleting /jobs/genie.ajdt/ajdt-on-eclipse-45/workspace/org.eclipse.contribution.weaving.jdt.tests/target
[INFO] 
[INFO] --- tycho-packaging-plugin:0.23.1:build-qualifier (default-build-qualifier) @ org.eclipse.contribution.weaving.jdt.tests ---
[INFO] The project's OSGi version is 2.2.4.201602042048
[INFO] 
[INFO] --- tycho-packaging-plugin:0.23.1:validate-id (default-validate-id) @ org.eclipse.contribution.weaving.jdt.tests ---
[INFO] 
[INFO] --- tycho-packaging-plugin:0.23.1:validate-version (default-validate-version) @ org.eclipse.contribution.weaving.jdt.tests ---
[INFO] 
[INFO] --- maven-resources-plugin:2.4.3:resources (default-resources) @ org.eclipse.contribution.weaving.jdt.tests ---
[WARNING] Using platform encoding (UTF-8 actually) to copy filtered resources, i.e. build is platform dependent!
[INFO] skip non existing resourceDirectory /jobs/genie.ajdt/ajdt-on-eclipse-45/workspace/org.eclipse.contribution.weaving.jdt.tests/src/main/resources
[INFO] 
[INFO] --- tycho-compiler-plugin:0.23.1:compile (default-compile) @ org.eclipse.contribution.weaving.jdt.tests ---
[INFO] Compiling 20 source files to /jobs/genie.ajdt/ajdt-on-eclipse-45/workspace/org.eclipse.contribution.weaving.jdt.tests/target/classes
[INFO] 
[INFO] --- maven-resources-plugin:2.4.3:testResources (default-testResources) @ org.eclipse.contribution.weaving.jdt.tests ---
[WARNING] Using platform encoding (UTF-8 actually) to copy filtered resources, i.e. build is platform dependent!
[INFO] skip non existing resourceDirectory /jobs/genie.ajdt/ajdt-on-eclipse-45/workspace/org.eclipse.contribution.weaving.jdt.tests/src/test/resources
[INFO] 
[INFO] --- target-platform-configuration:0.23.1:target-platform (default-target-platform) @ org.eclipse.contribution.weaving.jdt.tests ---
[INFO] 
[INFO] --- tycho-packaging-plugin:0.23.1:package-plugin (default-package-plugin) @ org.eclipse.contribution.weaving.jdt.tests ---
[INFO] Building jar: /jobs/genie.ajdt/ajdt-on-eclipse-45/workspace/org.eclipse.contribution.weaving.jdt.tests/jdtweavingtests.jar
[INFO] Building jar: /jobs/genie.ajdt/ajdt-on-eclipse-45/workspace/org.eclipse.contribution.weaving.jdt.tests/target/org.eclipse.contribution.weaving.jdt.tests-2.2.4-SNAPSHOT.jar
[INFO] 
[INFO] --- tycho-p2-plugin:0.23.1:p2-metadata-default (default-p2-metadata-default) @ org.eclipse.contribution.weaving.jdt.tests ---
[INFO] 
[INFO] --- tycho-surefire-plugin:0.23.1:test (default-test) @ org.eclipse.contribution.weaving.jdt.tests ---
[INFO] Expected eclipse log file: /jobs/genie.ajdt/ajdt-on-eclipse-45/workspace/org.eclipse.contribution.weaving.jdt.tests/target/work/data/.metadata/.log
[INFO] Command line:
	[/opt/public/common/jdk1.7.0_80/jre/bin/java, -Dosgi.noShutdown=false, -Dosgi.os=linux, -Dosgi.ws=gtk, -Dosgi.arch=x86_64, -Xmx1024m, -XX:MaxPermSize=256m, -Dosgi.clean=true, -jar, /jobs/genie.ajdt/ajdt-on-eclipse-45/workspace/.maven/repo/p2/osgi/bundle/org.eclipse.equinox.launcher/1.3.100.v20150511-1540/org.eclipse.equinox.launcher-1.3.100.v20150511-1540.jar, -debug, -consolelog, -data, /jobs/genie.ajdt/ajdt-on-eclipse-45/workspace/org.eclipse.contribution.weaving.jdt.tests/target/work/data, -install, /jobs/genie.ajdt/ajdt-on-eclipse-45/workspace/org.eclipse.contribution.weaving.jdt.tests/target/work, -configuration, /jobs/genie.ajdt/ajdt-on-eclipse-45/workspace/org.eclipse.contribution.weaving.jdt.tests/target/work/configuration, -application, org.eclipse.tycho.surefire.osgibooter.uitest, -testproperties, /jobs/genie.ajdt/ajdt-on-eclipse-45/workspace/org.eclipse.contribution.weaving.jdt.tests/target/surefire.properties]
Configuration location:
    file:/jobs/genie.ajdt/ajdt-on-eclipse-45/workspace/org.eclipse.contribution.weaving.jdt.tests/target/work/configuration/
Configuration file:
    file:/jobs/genie.ajdt/ajdt-on-eclipse-45/workspace/org.eclipse.contribution.weaving.jdt.tests/target/work/configuration/config.ini loaded
Install location:
    file:/jobs/genie.ajdt/ajdt-on-eclipse-45/workspace/org.eclipse.contribution.weaving.jdt.tests/target/work/
Framework located:
    file:/jobs/genie.ajdt/ajdt-on-eclipse-45/workspace/org.eclipse.contribution.weaving.jdt.tests/target/work/plugins/org.eclipse.osgi-3.10.101.v20150820-1432.jar
Loading extension: org.eclipse.equinox.weaving.hook
	eclipse.properties not found
Framework classpath:
    file:/jobs/genie.ajdt/ajdt-on-eclipse-45/workspace/org.eclipse.contribution.weaving.jdt.tests/target/work/plugins/org.eclipse.osgi-3.10.101.v20150820-1432.jar
    file:/jobs/genie.ajdt/ajdt-on-eclipse-45/workspace/org.eclipse.contribution.weaving.jdt.tests/target/work/plugins/
    file:/jobs/genie.ajdt/ajdt-on-eclipse-45/workspace/org.eclipse.contribution.weaving.jdt.tests/target/work/plugins/org.eclipse.equinox.weaving.hook_1.1.100.v20140821-1915/
Debug options:
    file:/jobs/genie.ajdt/ajdt-on-eclipse-45/workspace/org.eclipse.contribution.weaving.jdt.tests/.options not found
Time to load bundles: 3221
!SESSION 2016-02-04 17:02:30.389 -----------------------------------------------
eclipse.buildId=unknown
java.version=1.7.0_80
java.vendor=Oracle Corporation
BootLoader constants: OS=linux, ARCH=x86_64, WS=gtk, NL=en_US
Framework arguments:  -application org.eclipse.tycho.surefire.osgibooter.uitest -testproperties /jobs/genie.ajdt/ajdt-on-eclipse-45/workspace/org.eclipse.contribution.weaving.jdt.tests/target/surefire.properties
Command-line arguments:  -debug -consolelog -data /jobs/genie.ajdt/ajdt-on-eclipse-45/workspace/org.eclipse.contribution.weaving.jdt.tests/target/work/data -application org.eclipse.tycho.surefire.osgibooter.uitest -testproperties /jobs/genie.ajdt/ajdt-on-eclipse-45/workspace/org.eclipse.contribution.weaving.jdt.tests/target/surefire.properties

!ENTRY org.eclipse.jdt.launching.macosx 4 0 2016-02-04 17:02:34.808
!MESSAGE FrameworkEvent ERROR
!STACK 0
org.osgi.framework.BundleException: Could not resolve module: org.eclipse.jdt.launching.macosx [219]
  Unresolved requirement: Require-Capability: eclipse.platform; filter:="(osgi.os=macosx)"

	at org.eclipse.osgi.container.Module.start(Module.java:434)
	at org.eclipse.osgi.container.ModuleContainer$ContainerStartLevel.incStartLevel(ModuleContainer.java:1582)
	at org.eclipse.osgi.container.ModuleContainer$ContainerStartLevel.incStartLevel(ModuleContainer.java:1561)
	at org.eclipse.osgi.container.ModuleContainer$ContainerStartLevel.doContainerStartLevel(ModuleContainer.java:1533)
	at org.eclipse.osgi.container.ModuleContainer$ContainerStartLevel.dispatchEvent(ModuleContainer.java:1476)
	at org.eclipse.osgi.container.ModuleContainer$ContainerStartLevel.dispatchEvent(ModuleContainer.java:1)
	at org.eclipse.osgi.framework.eventmgr.EventManager.dispatchEvent(EventManager.java:230)
	at org.eclipse.osgi.framework.eventmgr.EventManager$EventThread.run(EventManager.java:340)

!ENTRY org.eclipse.jdt.launching.ui.macosx 4 0 2016-02-04 17:02:34.809
!MESSAGE FrameworkEvent ERROR
!STACK 0
org.osgi.framework.BundleException: Could not resolve module: org.eclipse.jdt.launching.ui.macosx [220]
  Unresolved requirement: Require-Capability: eclipse.platform; filter:="(osgi.os=macosx)"

	at org.eclipse.osgi.container.Module.start(Module.java:434)
	at org.eclipse.osgi.container.ModuleContainer$ContainerStartLevel.incStartLevel(ModuleContainer.java:1582)
	at org.eclipse.osgi.container.ModuleContainer$ContainerStartLevel.incStartLevel(ModuleContainer.java:1561)
	at org.eclipse.osgi.container.ModuleContainer$ContainerStartLevel.doContainerStartLevel(ModuleContainer.java:1533)
	at org.eclipse.osgi.container.ModuleContainer$ContainerStartLevel.dispatchEvent(ModuleContainer.java:1476)
	at org.eclipse.osgi.container.ModuleContainer$ContainerStartLevel.dispatchEvent(ModuleContainer.java:1)
	at org.eclipse.osgi.framework.eventmgr.EventManager.dispatchEvent(EventManager.java:230)
	at org.eclipse.osgi.framework.eventmgr.EventManager$EventThread.run(EventManager.java:340)
Starting application: 5373
Xlib:  extension "RANDR" missing on display ":1423.0".
Application Started: 7519

-------------------------------------------------------
 T E S T S
-------------------------------------------------------
Running org.eclipse.contribution.weaving.jdt.tests.AllWeavingTests
Tests run: 34, Failures: 0, Errors: 0, Skipped: 0, Time elapsed: 56.152 sec - in org.eclipse.contribution.weaving.jdt.tests.AllWeavingTests
testCreateCompilationUnit(org.eclipse.contribution.weaving.jdt.tests.cuprovider.CompilationUnitProviderTests)  Time elapsed: 2.191 sec
testSourceMapping(org.eclipse.contribution.weaving.jdt.tests.sourceprovider.SourceTransformerTests)  Time elapsed: 0 sec
testFormatCleanUp(org.eclipse.contribution.weaving.jdt.tests.sourceprovider.SourceTransformerTests)  Time elapsed: 1.743 sec
testTransformCompilationUnit(org.eclipse.contribution.weaving.jdt.tests.sourceprovider.SourceTransformerTests)  Time elapsed: 1.072 sec
testSourceIndexerRequestor(org.eclipse.contribution.weaving.jdt.tests.sourceprovider.SourceTransformerTests)  Time elapsed: 2.062 sec
testImageSelectDebugger(org.eclipse.contribution.weaving.jdt.tests.imagedescriptor.ImageDescriptorSelectorTests)  Time elapsed: 4.465 sec
testImageSelectComputeImage(org.eclipse.contribution.weaving.jdt.tests.imagedescriptor.ImageDescriptorSelectorTests)  Time elapsed: 0.267 sec
testImageSelectDialog(org.eclipse.contribution.weaving.jdt.tests.imagedescriptor.ImageDescriptorSelectorTests)  Time elapsed: 1.025 sec
testImageSelectHierarchy(org.eclipse.contribution.weaving.jdt.tests.imagedescriptor.ImageDescriptorSelectorTests)  Time elapsed: 0.997 sec
testAddHook(org.eclipse.contribution.weaving.jdt.tests.preferences.WeavingStateTests)  Time elapsed: 0 sec
testRemoveHookAtMiddle(org.eclipse.contribution.weaving.jdt.tests.preferences.WeavingStateTests)  Time elapsed: 0.001 sec
testRemoveHookWithSecondHookAtEnd(org.eclipse.contribution.weaving.jdt.tests.preferences.WeavingStateTests)  Time elapsed: 0 sec
testAddHookWithSecondHookAtEnd(org.eclipse.contribution.weaving.jdt.tests.preferences.WeavingStateTests)  Time elapsed: 0.001 sec
testRemoveHookAtStart(org.eclipse.contribution.weaving.jdt.tests.preferences.WeavingStateTests)  Time elapsed: 0 sec
testRemoveHookWithSecondHookAtStart(org.eclipse.contribution.weaving.jdt.tests.preferences.WeavingStateTests)  Time elapsed: 0 sec
testAddHookWithSecondHookAtMiddle(org.eclipse.contribution.weaving.jdt.tests.preferences.WeavingStateTests)  Time elapsed: 0 sec
testRemoveHookAtEnd(org.eclipse.contribution.weaving.jdt.tests.preferences.WeavingStateTests)  Time elapsed: 0 sec
testRemoveHookWithSecondHookAtMiddle(org.eclipse.contribution.weaving.jdt.tests.preferences.WeavingStateTests)  Time elapsed: 0.001 sec
testAddHookWithSecondHookAtStart(org.eclipse.contribution.weaving.jdt.tests.preferences.WeavingStateTests)  Time elapsed: 0 sec
testAskToEnableWeaving(org.eclipse.contribution.weaving.jdt.tests.preferences.WeavingServiceEnablementTests)  Time elapsed: 2.339 sec
testFindProblemsInMockProject(org.eclipse.contribution.weaving.jdt.tests.itdawareness.ITDAwarenessTests)  Time elapsed: 1.96 sec
testCodeSelectInJavaProject(org.eclipse.contribution.weaving.jdt.tests.itdawareness.ITDAwarenessTests)  Time elapsed: 2.1 sec
testCodeSelectInMockProject(org.eclipse.contribution.weaving.jdt.tests.itdawareness.ITDAwarenessTests)  Time elapsed: 3.282 sec
testContentAssistInJavaProject(org.eclipse.contribution.weaving.jdt.tests.itdawareness.ITDAwarenessTests)  Time elapsed: 3.826 sec
testContentAssistInMockProject(org.eclipse.contribution.weaving.jdt.tests.itdawareness.ITDAwarenessTests)  Time elapsed: 1.998 sec
testFindProblemsInJavaProject(org.eclipse.contribution.weaving.jdt.tests.itdawareness.ITDAwarenessTests)  Time elapsed: 2.074 sec
testExtractConstantInJava(org.eclipse.contribution.weaving.jdt.tests.refactoring.RefactoringHooksTests)  Time elapsed: 4.034 sec
testExtractConstantInMock(org.eclipse.contribution.weaving.jdt.tests.refactoring.RefactoringHooksTests)  Time elapsed: 3.711 sec
testCreateSourceConvertedAST1(org.eclipse.contribution.weaving.jdt.tests.refactoring.RefactoringHooksTests)  Time elapsed: 2.145 sec
testCreateSourceConvertedAST2(org.eclipse.contribution.weaving.jdt.tests.refactoring.RefactoringHooksTests)  Time elapsed: 2.143 sec
testExtractLocalVariableInJava(org.eclipse.contribution.weaving.jdt.tests.refactoring.RefactoringHooksTests)  Time elapsed: 3.288 sec
testExtractLocalVariableInMock(org.eclipse.contribution.weaving.jdt.tests.refactoring.RefactoringHooksTests)  Time elapsed: 2.955 sec
testConvertLocalInJava(org.eclipse.contribution.weaving.jdt.tests.refactoring.RefactoringHooksTests)  Time elapsed: 3.138 sec
testConvertLocalInMock(org.eclipse.contribution.weaving.jdt.tests.refactoring.RefactoringHooksTests)  Time elapsed: 3.174 sec

Results :

Tests run: 34, Failures: 0, Errors: 0, Skipped: 0


!ENTRY org.eclipse.core.resources 2 10035 2016-02-04 17:03:42.382
!MESSAGE The workspace will exit with unsaved changes in this session.

!ENTRY org.eclipse.core.resources 2 10035 2016-02-04 17:03:42.385
!MESSAGE The workspace will exit with unsaved changes in this session.

!ENTRY org.eclipse.ui 4 0 2016-02-04 17:03:42.386
!MESSAGE Error occurred during status handling
!STACK 0
java.lang.NullPointerException
	at org.eclipse.ui.internal.statushandlers.StatusHandlerRegistry.<init>(StatusHandlerRegistry.java:72)
	at org.eclipse.ui.internal.statushandlers.StatusHandlerRegistry.getDefault(StatusHandlerRegistry.java:91)
	at org.eclipse.ui.statushandlers.StatusManager.getStatusHandler(StatusManager.java:135)
	at org.eclipse.ui.statushandlers.StatusManager.handle(StatusManager.java:189)
	at org.eclipse.ui.statushandlers.StatusManager.handle(StatusManager.java:231)
	at org.eclipse.ui.statushandlers.StatusManager$StatusManagerLogListener.logging(StatusManager.java:302)
	at org.eclipse.core.internal.runtime.RuntimeLog.logToListeners(RuntimeLog.java:161)
	at org.eclipse.core.internal.runtime.PlatformLogWriter.logged(PlatformLogWriter.java:103)
	at org.eclipse.osgi.internal.log.ExtendedLogReaderServiceFactory.safeLogged(ExtendedLogReaderServiceFactory.java:88)
	at org.eclipse.osgi.internal.log.ExtendedLogReaderServiceFactory.logPrivileged(ExtendedLogReaderServiceFactory.java:217)
	at org.eclipse.osgi.internal.log.ExtendedLogReaderServiceFactory.log(ExtendedLogReaderServiceFactory.java:189)
	at org.eclipse.osgi.internal.log.ExtendedLogServiceFactory.log(ExtendedLogServiceFactory.java:65)
	at org.eclipse.osgi.internal.log.ExtendedLogServiceImpl.log(ExtendedLogServiceImpl.java:87)
	at org.eclipse.osgi.internal.log.LoggerImpl.log(LoggerImpl.java:54)
	at org.eclipse.core.internal.runtime.Log.log(Log.java:65)
	at org.eclipse.core.internal.utils.Policy.log(Policy.java:159)
	at org.eclipse.core.internal.resources.SaveManager.reportSnapshotRequestor(SaveManager.java:655)
	at org.eclipse.core.internal.resources.Workspace.close(Workspace.java:576)
	at org.eclipse.core.resources.ResourcesPlugin.stop(ResourcesPlugin.java:433)
	at org.eclipse.osgi.internal.framework.BundleContextImpl$4.run(BundleContextImpl.java:827)
	at org.eclipse.osgi.internal.framework.BundleContextImpl$4.run(BundleContextImpl.java:1)
	at java.security.AccessController.doPrivileged(Native Method)
	at org.eclipse.osgi.internal.framework.BundleContextImpl.stop(BundleContextImpl.java:820)
	at org.eclipse.osgi.internal.framework.EquinoxBundle.stopWorker0(EquinoxBundle.java:955)
	at org.eclipse.osgi.internal.framework.EquinoxBundle$EquinoxModule.stopWorker(EquinoxBundle.java:323)
	at org.eclipse.osgi.container.Module.doStop(Module.java:626)
	at org.eclipse.osgi.container.Module.stop(Module.java:488)
	at org.eclipse.osgi.container.ModuleContainer$ContainerStartLevel.decStartLevel(ModuleContainer.java:1623)
	at org.eclipse.osgi.container.ModuleContainer$ContainerStartLevel.doContainerStartLevel(ModuleContainer.java:1542)
	at org.eclipse.osgi.container.SystemModule.stopWorker(SystemModule.java:248)
	at org.eclipse.osgi.internal.framework.EquinoxBundle$SystemBundle$EquinoxSystemModule.stopWorker(EquinoxBundle.java:144)
	at org.eclipse.osgi.container.Module.doStop(Module.java:626)
	at org.eclipse.osgi.container.Module.stop(Module.java:488)
	at org.eclipse.osgi.container.SystemModule.stop(SystemModule.java:186)
	at org.eclipse.osgi.internal.framework.EquinoxBundle$SystemBundle$EquinoxSystemModule$1.run(EquinoxBundle.java:159)
	at java.lang.Thread.run(Thread.java:745)
[INFO] All tests passed!
[INFO] 
[INFO] --- eclipse-jarsigner-plugin:1.0.4:sign (sign) @ org.eclipse.contribution.weaving.jdt.tests ---
[INFO] Signed org.eclipse.ajdt:org.eclipse.contribution.weaving.jdt.tests:eclipse-test-plugin:2.2.4-SNAPSHOT in 1 seconds.
[INFO] 
[INFO] --- tycho-p2-plugin:0.23.1:p2-metadata (p2-metadata) @ org.eclipse.contribution.weaving.jdt.tests ---
[INFO]                                                                         
[INFO] ------------------------------------------------------------------------
[INFO] Building org.eclipse.contribution.xref.core.tests 2.2.4-SNAPSHOT
[INFO] ------------------------------------------------------------------------
[INFO] 
[INFO] --- maven-clean-plugin:2.5:clean (default-clean) @ org.eclipse.contribution.xref.core.tests ---
[INFO] Deleting /jobs/genie.ajdt/ajdt-on-eclipse-45/workspace/org.eclipse.contribution.xref.core.tests/target
[INFO] 
[INFO] --- tycho-packaging-plugin:0.23.1:build-qualifier (default-build-qualifier) @ org.eclipse.contribution.xref.core.tests ---
[INFO] The project's OSGi version is 2.2.4.201602042048
[INFO] 
[INFO] --- tycho-packaging-plugin:0.23.1:validate-id (default-validate-id) @ org.eclipse.contribution.xref.core.tests ---
[INFO] 
[INFO] --- tycho-packaging-plugin:0.23.1:validate-version (default-validate-version) @ org.eclipse.contribution.xref.core.tests ---
[INFO] 
[INFO] --- maven-resources-plugin:2.4.3:resources (default-resources) @ org.eclipse.contribution.xref.core.tests ---
[WARNING] Using platform encoding (UTF-8 actually) to copy filtered resources, i.e. build is platform dependent!
[INFO] skip non existing resourceDirectory /jobs/genie.ajdt/ajdt-on-eclipse-45/workspace/org.eclipse.contribution.xref.core.tests/src/main/resources
[INFO] 
[INFO] --- tycho-compiler-plugin:0.23.1:compile (default-compile) @ org.eclipse.contribution.xref.core.tests ---
[INFO] Compiling 10 source files to /jobs/genie.ajdt/ajdt-on-eclipse-45/workspace/org.eclipse.contribution.xref.core.tests/target/classes
[INFO] 
[INFO] --- maven-resources-plugin:2.4.3:testResources (default-testResources) @ org.eclipse.contribution.xref.core.tests ---
[WARNING] Using platform encoding (UTF-8 actually) to copy filtered resources, i.e. build is platform dependent!
[INFO] skip non existing resourceDirectory /jobs/genie.ajdt/ajdt-on-eclipse-45/workspace/org.eclipse.contribution.xref.core.tests/src/test/resources
[INFO] 
[INFO] --- target-platform-configuration:0.23.1:target-platform (default-target-platform) @ org.eclipse.contribution.xref.core.tests ---
[INFO] 
[INFO] --- tycho-packaging-plugin:0.23.1:package-plugin (default-package-plugin) @ org.eclipse.contribution.xref.core.tests ---
[INFO] Building jar: /jobs/genie.ajdt/ajdt-on-eclipse-45/workspace/org.eclipse.contribution.xref.core.tests/xrefcoretests.jar
[INFO] Building jar: /jobs/genie.ajdt/ajdt-on-eclipse-45/workspace/org.eclipse.contribution.xref.core.tests/target/org.eclipse.contribution.xref.core.tests-2.2.4-SNAPSHOT.jar
[INFO] 
[INFO] --- tycho-p2-plugin:0.23.1:p2-metadata-default (default-p2-metadata-default) @ org.eclipse.contribution.xref.core.tests ---
[INFO] 
[INFO] --- tycho-surefire-plugin:0.23.1:test (default-test) @ org.eclipse.contribution.xref.core.tests ---
[INFO] Expected eclipse log file: /jobs/genie.ajdt/ajdt-on-eclipse-45/workspace/org.eclipse.contribution.xref.core.tests/target/work/data/.metadata/.log
[INFO] Command line:
	[/opt/public/common/jdk1.7.0_80/jre/bin/java, -Dosgi.noShutdown=false, -Dosgi.os=linux, -Dosgi.ws=gtk, -Dosgi.arch=x86_64, -Xmx1024m, -XX:MaxPermSize=256m, -Dosgi.clean=true, -jar, /jobs/genie.ajdt/ajdt-on-eclipse-45/workspace/.maven/repo/p2/osgi/bundle/org.eclipse.equinox.launcher/1.3.100.v20150511-1540/org.eclipse.equinox.launcher-1.3.100.v20150511-1540.jar, -debug, -consolelog, -data, /jobs/genie.ajdt/ajdt-on-eclipse-45/workspace/org.eclipse.contribution.xref.core.tests/target/work/data, -install, /jobs/genie.ajdt/ajdt-on-eclipse-45/workspace/org.eclipse.contribution.xref.core.tests/target/work, -configuration, /jobs/genie.ajdt/ajdt-on-eclipse-45/workspace/org.eclipse.contribution.xref.core.tests/target/work/configuration, -application, org.eclipse.tycho.surefire.osgibooter.uitest, -testproperties, /jobs/genie.ajdt/ajdt-on-eclipse-45/workspace/org.eclipse.contribution.xref.core.tests/target/surefire.properties]
Configuration location:
    file:/jobs/genie.ajdt/ajdt-on-eclipse-45/workspace/org.eclipse.contribution.xref.core.tests/target/work/configuration/
Configuration file:
    file:/jobs/genie.ajdt/ajdt-on-eclipse-45/workspace/org.eclipse.contribution.xref.core.tests/target/work/configuration/config.ini loaded
Install location:
    file:/jobs/genie.ajdt/ajdt-on-eclipse-45/workspace/org.eclipse.contribution.xref.core.tests/target/work/
Framework located:
    file:/home/hudson/genie.ajdt/.hudson/jobs/ajdt-on-eclipse-45/workspace/.maven/repo/p2/osgi/bundle/org.eclipse.osgi/3.10.101.v20150820-1432/org.eclipse.osgi-3.10.101.v20150820-1432.jar
Framework classpath:
    file:/home/hudson/genie.ajdt/.hudson/jobs/ajdt-on-eclipse-45/workspace/.maven/repo/p2/osgi/bundle/org.eclipse.osgi/3.10.101.v20150820-1432/org.eclipse.osgi-3.10.101.v20150820-1432.jar
Debug options:
    file:/jobs/genie.ajdt/ajdt-on-eclipse-45/workspace/org.eclipse.contribution.xref.core.tests/.options not found
Time to load bundles: 2604
!SESSION 2016-02-04 17:03:45.334 -----------------------------------------------
eclipse.buildId=unknown
java.version=1.7.0_80
java.vendor=Oracle Corporation
BootLoader constants: OS=linux, ARCH=x86_64, WS=gtk, NL=en_US
Framework arguments:  -application org.eclipse.tycho.surefire.osgibooter.uitest -testproperties /jobs/genie.ajdt/ajdt-on-eclipse-45/workspace/org.eclipse.contribution.xref.core.tests/target/surefire.properties
Command-line arguments:  -debug -consolelog -data /jobs/genie.ajdt/ajdt-on-eclipse-45/workspace/org.eclipse.contribution.xref.core.tests/target/work/data -application org.eclipse.tycho.surefire.osgibooter.uitest -testproperties /jobs/genie.ajdt/ajdt-on-eclipse-45/workspace/org.eclipse.contribution.xref.core.tests/target/surefire.properties

!ENTRY org.eclipse.jdt.launching.macosx 4 0 2016-02-04 17:03:48.925
!MESSAGE FrameworkEvent ERROR
!STACK 0
org.osgi.framework.BundleException: Could not resolve module: org.eclipse.jdt.launching.macosx [219]
  Unresolved requirement: Require-Capability: eclipse.platform; filter:="(osgi.os=macosx)"

	at org.eclipse.osgi.container.Module.start(Module.java:434)
	at org.eclipse.osgi.container.ModuleContainer$ContainerStartLevel.incStartLevel(ModuleContainer.java:1582)
	at org.eclipse.osgi.container.ModuleContainer$ContainerStartLevel.incStartLevel(ModuleContainer.java:1561)
	at org.eclipse.osgi.container.ModuleContainer$ContainerStartLevel.doContainerStartLevel(ModuleContainer.java:1533)
	at org.eclipse.osgi.container.ModuleContainer$ContainerStartLevel.dispatchEvent(ModuleContainer.java:1476)
	at org.eclipse.osgi.container.ModuleContainer$ContainerStartLevel.dispatchEvent(ModuleContainer.java:1)
	at org.eclipse.osgi.framework.eventmgr.EventManager.dispatchEvent(EventManager.java:230)
	at org.eclipse.osgi.framework.eventmgr.EventManager$EventThread.run(EventManager.java:340)

!ENTRY org.eclipse.jdt.launching.ui.macosx 4 0 2016-02-04 17:03:48.926
!MESSAGE FrameworkEvent ERROR
!STACK 0
org.osgi.framework.BundleException: Could not resolve module: org.eclipse.jdt.launching.ui.macosx [220]
  Unresolved requirement: Require-Capability: eclipse.platform; filter:="(osgi.os=macosx)"

	at org.eclipse.osgi.container.Module.start(Module.java:434)
	at org.eclipse.osgi.container.ModuleContainer$ContainerStartLevel.incStartLevel(ModuleContainer.java:1582)
	at org.eclipse.osgi.container.ModuleContainer$ContainerStartLevel.incStartLevel(ModuleContainer.java:1561)
	at org.eclipse.osgi.container.ModuleContainer$ContainerStartLevel.doContainerStartLevel(ModuleContainer.java:1533)
	at org.eclipse.osgi.container.ModuleContainer$ContainerStartLevel.dispatchEvent(ModuleContainer.java:1476)
	at org.eclipse.osgi.container.ModuleContainer$ContainerStartLevel.dispatchEvent(ModuleContainer.java:1)
	at org.eclipse.osgi.framework.eventmgr.EventManager.dispatchEvent(EventManager.java:230)
	at org.eclipse.osgi.framework.eventmgr.EventManager$EventThread.run(EventManager.java:340)
Starting application: 4533
Xlib:  extension "RANDR" missing on display ":1423.0".
Application Started: 6678

-------------------------------------------------------
 T E S T S
-------------------------------------------------------
Running org.eclipse.contribution.xref.core.tests.AllTests

!ENTRY org.eclipse.contribution.xref.core.tests 4 1 2016-02-04 17:03:54.080
!MESSAGE Testcase generated exception as expected
!STACK 0
java.lang.Throwable
	at org.eclipse.contribution.xref.core.tests.XReferencePluginTest.testLog(XReferencePluginTest.java:45)
	at sun.reflect.NativeMethodAccessorImpl.invoke0(Native Method)
	at sun.reflect.NativeMethodAccessorImpl.invoke(NativeMethodAccessorImpl.java:57)
	at sun.reflect.DelegatingMethodAccessorImpl.invoke(DelegatingMethodAccessorImpl.java:43)
	at java.lang.reflect.Method.invoke(Method.java:606)
	at junit.framework.TestCase.runTest(TestCase.java:176)
	at junit.framework.TestCase.runBare(TestCase.java:141)
	at junit.framework.TestResult$1.protect(TestResult.java:122)
	at junit.framework.TestResult.runProtected(TestResult.java:142)
	at junit.framework.TestResult.run(TestResult.java:125)
	at junit.framework.TestCase.run(TestCase.java:129)
	at junit.framework.TestSuite.runTest(TestSuite.java:252)
	at junit.framework.TestSuite.run(TestSuite.java:247)
	at junit.framework.TestSuite.runTest(TestSuite.java:252)
	at junit.framework.TestSuite.run(TestSuite.java:247)
	at org.junit.internal.runners.JUnit38ClassRunner.run(JUnit38ClassRunner.java:86)
	at org.apache.maven.surefire.junit4.JUnit4Provider.execute(JUnit4Provider.java:264)
	at org.apache.maven.surefire.junit4.JUnit4Provider.executeTestSet(JUnit4Provider.java:153)
	at org.apache.maven.surefire.junit4.JUnit4Provider.invoke(JUnit4Provider.java:124)
	at sun.reflect.NativeMethodAccessorImpl.invoke0(Native Method)
	at sun.reflect.NativeMethodAccessorImpl.invoke(NativeMethodAccessorImpl.java:57)
	at sun.reflect.DelegatingMethodAccessorImpl.invoke(DelegatingMethodAccessorImpl.java:43)
	at java.lang.reflect.Method.invoke(Method.java:606)
	at org.apache.maven.surefire.util.ReflectionUtils.invokeMethodWithArray2(ReflectionUtils.java:208)
	at org.apache.maven.surefire.booter.ProviderFactory$ProviderProxy.invoke(ProviderFactory.java:156)
	at org.apache.maven.surefire.booter.ProviderFactory.invokeProvider(ProviderFactory.java:82)
	at org.eclipse.tycho.surefire.osgibooter.OsgiSurefireBooter.run(OsgiSurefireBooter.java:91)
	at org.eclipse.tycho.surefire.osgibooter.AbstractUITestApplication$1.run(AbstractUITestApplication.java:35)
	at org.eclipse.swt.widgets.RunnableLock.run(RunnableLock.java:35)
	at org.eclipse.swt.widgets.Synchronizer.runAsyncMessages(Synchronizer.java:135)
	at org.eclipse.swt.widgets.Display.runAsyncMessages(Display.java:3794)
	at org.eclipse.swt.widgets.Display.readAndDispatch(Display.java:3433)
	at org.eclipse.e4.ui.internal.workbench.swt.PartRenderingEngine$4.run(PartRenderingEngine.java:1127)
	at org.eclipse.core.databinding.observable.Realm.runWithDefault(Realm.java:337)
	at org.eclipse.e4.ui.internal.workbench.swt.PartRenderingEngine.run(PartRenderingEngine.java:1018)
	at org.eclipse.e4.ui.internal.workbench.E4Workbench.createAndRunUI(E4Workbench.java:156)
	at org.eclipse.ui.internal.Workbench$5.run(Workbench.java:654)
	at org.eclipse.core.databinding.observable.Realm.runWithDefault(Realm.java:337)
	at org.eclipse.ui.internal.Workbench.createAndRunWorkbench(Workbench.java:598)
	at org.eclipse.ui.PlatformUI.createAndRunWorkbench(PlatformUI.java:150)
	at org.eclipse.ui.internal.ide.application.IDEApplication.start(IDEApplication.java:139)
	at org.eclipse.tycho.surefire.osgibooter.UITestApplication.runApplication(UITestApplication.java:31)
	at org.eclipse.tycho.surefire.osgibooter.AbstractUITestApplication.run(AbstractUITestApplication.java:120)
	at org.eclipse.tycho.surefire.osgibooter.UITestApplication.start(UITestApplication.java:37)
	at org.eclipse.equinox.internal.app.EclipseAppHandle.run(EclipseAppHandle.java:196)
	at org.eclipse.core.runtime.internal.adaptor.EclipseAppLauncher.runApplication(EclipseAppLauncher.java:134)
	at org.eclipse.core.runtime.internal.adaptor.EclipseAppLauncher.start(EclipseAppLauncher.java:104)
	at org.eclipse.core.runtime.adaptor.EclipseStarter.run(EclipseStarter.java:380)
	at org.eclipse.core.runtime.adaptor.EclipseStarter.run(EclipseStarter.java:235)
	at sun.reflect.NativeMethodAccessorImpl.invoke0(Native Method)
	at sun.reflect.NativeMethodAccessorImpl.invoke(NativeMethodAccessorImpl.java:57)
	at sun.reflect.DelegatingMethodAccessorImpl.invoke(DelegatingMethodAccessorImpl.java:43)
	at java.lang.reflect.Method.invoke(Method.java:606)
	at org.eclipse.equinox.launcher.Main.invokeFramework(Main.java:669)
	at org.eclipse.equinox.launcher.Main.basicRun(Main.java:608)
	at org.eclipse.equinox.launcher.Main.run(Main.java:1515)
	at org.eclipse.equinox.launcher.Main.main(Main.java:1488)

!ENTRY org.eclipse.contribution.xref.core 2 1 2016-02-04 17:03:54.102
!MESSAGE Could not load provider org.eclipse.contribution.xref.core.tests.unknownProvider
!STACK 1
org.eclipse.core.runtime.CoreException: Plug-in org.eclipse.contribution.xref.core.tests was unable to load class org.eclipse.contribution.xref.core.tests.UnknownProvider.
	at org.eclipse.core.internal.registry.osgi.RegistryStrategyOSGI.throwException(RegistryStrategyOSGI.java:194)
	at org.eclipse.core.internal.registry.osgi.RegistryStrategyOSGI.createExecutableExtension(RegistryStrategyOSGI.java:176)
	at org.eclipse.core.internal.registry.ExtensionRegistry.createExecutableExtension(ExtensionRegistry.java:905)
	at org.eclipse.core.internal.registry.ConfigurationElement.createExecutableExtension(ConfigurationElement.java:243)
	at org.eclipse.core.internal.registry.ConfigurationElementHandle.createExecutableExtension(ConfigurationElementHandle.java:55)
	at org.eclipse.contribution.xref.core.XReferenceProviderDefinition.<init>(XReferenceProviderDefinition.java:32)
	at org.eclipse.contribution.xref.core.XReferenceProviderManager.getRegisteredProviders(XReferenceProviderManager.java:95)
	at org.eclipse.contribution.xref.core.XReferenceProviderManager.getProvidersFor(XReferenceProviderManager.java:70)
	at org.eclipse.contribution.xref.core.XReferenceAdapter.getXReferences(XReferenceAdapter.java:67)
	at org.eclipse.contribution.xref.core.tests.XReferenceAdapterTest.testGetXReferences(XReferenceAdapterTest.java:41)
	at sun.reflect.NativeMethodAccessorImpl.invoke0(Native Method)
	at sun.reflect.NativeMethodAccessorImpl.invoke(NativeMethodAccessorImpl.java:57)
	at sun.reflect.DelegatingMethodAccessorImpl.invoke(DelegatingMethodAccessorImpl.java:43)
	at java.lang.reflect.Method.invoke(Method.java:606)
	at junit.framework.TestCase.runTest(TestCase.java:176)
	at junit.framework.TestCase.runBare(TestCase.java:141)
	at junit.framework.TestResult$1.protect(TestResult.java:122)
	at junit.framework.TestResult.runProtected(TestResult.java:142)
	at junit.framework.TestResult.run(TestResult.java:125)
	at junit.framework.TestCase.run(TestCase.java:129)
	at junit.framework.TestSuite.runTest(TestSuite.java:252)
	at junit.framework.TestSuite.run(TestSuite.java:247)
	at junit.framework.TestSuite.runTest(TestSuite.java:252)
	at junit.framework.TestSuite.run(TestSuite.java:247)
	at org.junit.internal.runners.JUnit38ClassRunner.run(JUnit38ClassRunner.java:86)
	at org.apache.maven.surefire.junit4.JUnit4Provider.execute(JUnit4Provider.java:264)
	at org.apache.maven.surefire.junit4.JUnit4Provider.executeTestSet(JUnit4Provider.java:153)
	at org.apache.maven.surefire.junit4.JUnit4Provider.invoke(JUnit4Provider.java:124)
	at sun.reflect.NativeMethodAccessorImpl.invoke0(Native Method)
	at sun.reflect.NativeMethodAccessorImpl.invoke(NativeMethodAccessorImpl.java:57)
	at sun.reflect.DelegatingMethodAccessorImpl.invoke(DelegatingMethodAccessorImpl.java:43)
	at java.lang.reflect.Method.invoke(Method.java:606)
	at org.apache.maven.surefire.util.ReflectionUtils.invokeMethodWithArray2(ReflectionUtils.java:208)
	at org.apache.maven.surefire.booter.ProviderFactory$ProviderProxy.invoke(ProviderFactory.java:156)
	at org.apache.maven.surefire.booter.ProviderFactory.invokeProvider(ProviderFactory.java:82)
	at org.eclipse.tycho.surefire.osgibooter.OsgiSurefireBooter.run(OsgiSurefireBooter.java:91)
	at org.eclipse.tycho.surefire.osgibooter.AbstractUITestApplication$1.run(AbstractUITestApplication.java:35)
	at org.eclipse.swt.widgets.RunnableLock.run(RunnableLock.java:35)
	at org.eclipse.swt.widgets.Synchronizer.runAsyncMessages(Synchronizer.java:135)
	at org.eclipse.swt.widgets.Display.runAsyncMessages(Display.java:3794)
	at org.eclipse.swt.widgets.Display.readAndDispatch(Display.java:3433)
	at org.eclipse.e4.ui.internal.workbench.swt.PartRenderingEngine$4.run(PartRenderingEngine.java:1127)
	at org.eclipse.core.databinding.observable.Realm.runWithDefault(Realm.java:337)
	at org.eclipse.e4.ui.internal.workbench.swt.PartRenderingEngine.run(PartRenderingEngine.java:1018)
	at org.eclipse.e4.ui.internal.workbench.E4Workbench.createAndRunUI(E4Workbench.java:156)
	at org.eclipse.ui.internal.Workbench$5.run(Workbench.java:654)
	at org.eclipse.core.databinding.observable.Realm.runWithDefault(Realm.java:337)
	at org.eclipse.ui.internal.Workbench.createAndRunWorkbench(Workbench.java:598)
	at org.eclipse.ui.PlatformUI.createAndRunWorkbench(PlatformUI.java:150)
	at org.eclipse.ui.internal.ide.application.IDEApplication.start(IDEApplication.java:139)
	at org.eclipse.tycho.surefire.osgibooter.UITestApplication.runApplication(UITestApplication.java:31)
	at org.eclipse.tycho.surefire.osgibooter.AbstractUITestApplication.run(AbstractUITestApplication.java:120)
	at org.eclipse.tycho.surefire.osgibooter.UITestApplication.start(UITestApplication.java:37)
	at org.eclipse.equinox.internal.app.EclipseAppHandle.run(EclipseAppHandle.java:196)
	at org.eclipse.core.runtime.internal.adaptor.EclipseAppLauncher.runApplication(EclipseAppLauncher.java:134)
	at org.eclipse.core.runtime.internal.adaptor.EclipseAppLauncher.start(EclipseAppLauncher.java:104)
	at org.eclipse.core.runtime.adaptor.EclipseStarter.run(EclipseStarter.java:380)
	at org.eclipse.core.runtime.adaptor.EclipseStarter.run(EclipseStarter.java:235)
	at sun.reflect.NativeMethodAccessorImpl.invoke0(Native Method)
	at sun.reflect.NativeMethodAccessorImpl.invoke(NativeMethodAccessorImpl.java:57)
	at sun.reflect.DelegatingMethodAccessorImpl.invoke(DelegatingMethodAccessorImpl.java:43)
	at java.lang.reflect.Method.invoke(Method.java:606)
	at org.eclipse.equinox.launcher.Main.invokeFramework(Main.java:669)
	at org.eclipse.equinox.launcher.Main.basicRun(Main.java:608)
	at org.eclipse.equinox.launcher.Main.run(Main.java:1515)
	at org.eclipse.equinox.launcher.Main.main(Main.java:1488)
Caused by: java.lang.ClassNotFoundException: org.eclipse.contribution.xref.core.tests.UnknownProvider cannot be found by org.eclipse.contribution.xref.core.tests_2.2.4.qualifier
	at org.eclipse.osgi.internal.loader.BundleLoader.findClassInternal(BundleLoader.java:439)
	at org.eclipse.osgi.internal.loader.BundleLoader.findClass(BundleLoader.java:352)
	at org.eclipse.osgi.internal.loader.BundleLoader.findClass(BundleLoader.java:344)
	at org.eclipse.osgi.internal.loader.ModuleClassLoader.loadClass(ModuleClassLoader.java:160)
	at java.lang.ClassLoader.loadClass(ClassLoader.java:358)
	at org.eclipse.osgi.internal.framework.EquinoxBundle.loadClass(EquinoxBundle.java:573)
	at org.eclipse.core.internal.registry.osgi.RegistryStrategyOSGI.createExecutableExtension(RegistryStrategyOSGI.java:174)
	... 64 more
!SUBENTRY 1 org.eclipse.equinox.registry 4 1 2016-02-04 17:03:54.104
!MESSAGE Plug-in org.eclipse.contribution.xref.core.tests was unable to load class org.eclipse.contribution.xref.core.tests.UnknownProvider.
!STACK 0
java.lang.ClassNotFoundException: org.eclipse.contribution.xref.core.tests.UnknownProvider cannot be found by org.eclipse.contribution.xref.core.tests_2.2.4.qualifier
	at org.eclipse.osgi.internal.loader.BundleLoader.findClassInternal(BundleLoader.java:439)
	at org.eclipse.osgi.internal.loader.BundleLoader.findClass(BundleLoader.java:352)
	at org.eclipse.osgi.internal.loader.BundleLoader.findClass(BundleLoader.java:344)
	at org.eclipse.osgi.internal.loader.ModuleClassLoader.loadClass(ModuleClassLoader.java:160)
	at java.lang.ClassLoader.loadClass(ClassLoader.java:358)
	at org.eclipse.osgi.internal.framework.EquinoxBundle.loadClass(EquinoxBundle.java:573)
	at org.eclipse.core.internal.registry.osgi.RegistryStrategyOSGI.createExecutableExtension(RegistryStrategyOSGI.java:174)
	at org.eclipse.core.internal.registry.ExtensionRegistry.createExecutableExtension(ExtensionRegistry.java:905)
	at org.eclipse.core.internal.registry.ConfigurationElement.createExecutableExtension(ConfigurationElement.java:243)
	at org.eclipse.core.internal.registry.ConfigurationElementHandle.createExecutableExtension(ConfigurationElementHandle.java:55)
	at org.eclipse.contribution.xref.core.XReferenceProviderDefinition.<init>(XReferenceProviderDefinition.java:32)
	at org.eclipse.contribution.xref.core.XReferenceProviderManager.getRegisteredProviders(XReferenceProviderManager.java:95)
	at org.eclipse.contribution.xref.core.XReferenceProviderManager.getProvidersFor(XReferenceProviderManager.java:70)
	at org.eclipse.contribution.xref.core.XReferenceAdapter.getXReferences(XReferenceAdapter.java:67)
	at org.eclipse.contribution.xref.core.tests.XReferenceAdapterTest.testGetXReferences(XReferenceAdapterTest.java:41)
	at sun.reflect.NativeMethodAccessorImpl.invoke0(Native Method)
	at sun.reflect.NativeMethodAccessorImpl.invoke(NativeMethodAccessorImpl.java:57)
	at sun.reflect.DelegatingMethodAccessorImpl.invoke(DelegatingMethodAccessorImpl.java:43)
	at java.lang.reflect.Method.invoke(Method.java:606)
	at junit.framework.TestCase.runTest(TestCase.java:176)
	at junit.framework.TestCase.runBare(TestCase.java:141)
	at junit.framework.TestResult$1.protect(TestResult.java:122)
	at junit.framework.TestResult.runProtected(TestResult.java:142)
	at junit.framework.TestResult.run(TestResult.java:125)
	at junit.framework.TestCase.run(TestCase.java:129)
	at junit.framework.TestSuite.runTest(TestSuite.java:252)
	at junit.framework.TestSuite.run(TestSuite.java:247)
	at junit.framework.TestSuite.runTest(TestSuite.java:252)
	at junit.framework.TestSuite.run(TestSuite.java:247)
	at org.junit.internal.runners.JUnit38ClassRunner.run(JUnit38ClassRunner.java:86)
	at org.apache.maven.surefire.junit4.JUnit4Provider.execute(JUnit4Provider.java:264)
	at org.apache.maven.surefire.junit4.JUnit4Provider.executeTestSet(JUnit4Provider.java:153)
	at org.apache.maven.surefire.junit4.JUnit4Provider.invoke(JUnit4Provider.java:124)
	at sun.reflect.NativeMethodAccessorImpl.invoke0(Native Method)
	at sun.reflect.NativeMethodAccessorImpl.invoke(NativeMethodAccessorImpl.java:57)
	at sun.reflect.DelegatingMethodAccessorImpl.invoke(DelegatingMethodAccessorImpl.java:43)
	at java.lang.reflect.Method.invoke(Method.java:606)
	at org.apache.maven.surefire.util.ReflectionUtils.invokeMethodWithArray2(ReflectionUtils.java:208)
	at org.apache.maven.surefire.booter.ProviderFactory$ProviderProxy.invoke(ProviderFactory.java:156)
	at org.apache.maven.surefire.booter.ProviderFactory.invokeProvider(ProviderFactory.java:82)
	at org.eclipse.tycho.surefire.osgibooter.OsgiSurefireBooter.run(OsgiSurefireBooter.java:91)
	at org.eclipse.tycho.surefire.osgibooter.AbstractUITestApplication$1.run(AbstractUITestApplication.java:35)
	at org.eclipse.swt.widgets.RunnableLock.run(RunnableLock.java:35)
	at org.eclipse.swt.widgets.Synchronizer.runAsyncMessages(Synchronizer.java:135)
	at org.eclipse.swt.widgets.Display.runAsyncMessages(Display.java:3794)
	at org.eclipse.swt.widgets.Display.readAndDispatch(Display.java:3433)
	at org.eclipse.e4.ui.internal.workbench.swt.PartRenderingEngine$4.run(PartRenderingEngine.java:1127)
	at org.eclipse.core.databinding.observable.Realm.runWithDefault(Realm.java:337)
	at org.eclipse.e4.ui.internal.workbench.swt.PartRenderingEngine.run(PartRenderingEngine.java:1018)
	at org.eclipse.e4.ui.internal.workbench.E4Workbench.createAndRunUI(E4Workbench.java:156)
	at org.eclipse.ui.internal.Workbench$5.run(Workbench.java:654)
	at org.eclipse.core.databinding.observable.Realm.runWithDefault(Realm.java:337)
	at org.eclipse.ui.internal.Workbench.createAndRunWorkbench(Workbench.java:598)
	at org.eclipse.ui.PlatformUI.createAndRunWorkbench(PlatformUI.java:150)
	at org.eclipse.ui.internal.ide.application.IDEApplication.start(IDEApplication.java:139)
	at org.eclipse.tycho.surefire.osgibooter.UITestApplication.runApplication(UITestApplication.java:31)
	at org.eclipse.tycho.surefire.osgibooter.AbstractUITestApplication.run(AbstractUITestApplication.java:120)
	at org.eclipse.tycho.surefire.osgibooter.UITestApplication.start(UITestApplication.java:37)
	at org.eclipse.equinox.internal.app.EclipseAppHandle.run(EclipseAppHandle.java:196)
	at org.eclipse.core.runtime.internal.adaptor.EclipseAppLauncher.runApplication(EclipseAppLauncher.java:134)
	at org.eclipse.core.runtime.internal.adaptor.EclipseAppLauncher.start(EclipseAppLauncher.java:104)
	at org.eclipse.core.runtime.adaptor.EclipseStarter.run(EclipseStarter.java:380)
	at org.eclipse.core.runtime.adaptor.EclipseStarter.run(EclipseStarter.java:235)
	at sun.reflect.NativeMethodAccessorImpl.invoke0(Native Method)
	at sun.reflect.NativeMethodAccessorImpl.invoke(NativeMethodAccessorImpl.java:57)
	at sun.reflect.DelegatingMethodAccessorImpl.invoke(DelegatingMethodAccessorImpl.java:43)
	at java.lang.reflect.Method.invoke(Method.java:606)
	at org.eclipse.equinox.launcher.Main.invokeFramework(Main.java:669)
	at org.eclipse.equinox.launcher.Main.basicRun(Main.java:608)
	at org.eclipse.equinox.launcher.Main.run(Main.java:1515)
	at org.eclipse.equinox.launcher.Main.main(Main.java:1488)

!ENTRY org.eclipse.contribution.xref.core 4 2 2016-02-04 17:03:54.112
!MESSAGE Problems occurred when invoking code from plug-in: "org.eclipse.contribution.xref.core".
!STACK 0
java.lang.RuntimeException: You should never trust a provider you know...
	at org.eclipse.contribution.xref.core.tests.TestProvider.getProviderDescription(TestProvider.java:81)
	at org.eclipse.contribution.xref.core.XReferenceProviderDefinition.getProviderDescription_aroundBody0(XReferenceProviderDefinition.java:75)
	at org.eclipse.contribution.xref.core.XReferenceProviderDefinition$AjcClosure1.run(XReferenceProviderDefinition.java:1)
	at org.eclipse.contribution.xref.core.IXReferenceProvider$SafeExecution.ajc$around$org_eclipse_contribution_xref_core_IXReferenceProvider$SafeExecution$1$b538bdbdproceed(IXReferenceProvider.aj:133)
	at org.eclipse.contribution.xref.core.IXReferenceProvider$SafeExecution$1.run(IXReferenceProvider.aj:140)
	at org.eclipse.core.runtime.SafeRunner.run(SafeRunner.java:42)
	at org.eclipse.contribution.xref.core.IXReferenceProvider$SafeExecution.ajc$around$org_eclipse_contribution_xref_core_IXReferenceProvider$SafeExecution$1$b538bdbd(IXReferenceProvider.aj:146)
	at org.eclipse.contribution.xref.core.XReferenceProviderDefinition.getDescription(XReferenceProviderDefinition.java:75)
	at org.eclipse.contribution.xref.core.tests.XReferenceProviderDefinitionTest.testSafeExecution(XReferenceProviderDefinitionTest.java:78)
	at sun.reflect.NativeMethodAccessorImpl.invoke0(Native Method)
	at sun.reflect.NativeMethodAccessorImpl.invoke(NativeMethodAccessorImpl.java:57)
	at sun.reflect.DelegatingMethodAccessorImpl.invoke(DelegatingMethodAccessorImpl.java:43)
	at java.lang.reflect.Method.invoke(Method.java:606)
	at junit.framework.TestCase.runTest(TestCase.java:176)
	at junit.framework.TestCase.runBare(TestCase.java:141)
	at junit.framework.TestResult$1.protect(TestResult.java:122)
	at junit.framework.TestResult.runProtected(TestResult.java:142)
	at junit.framework.TestResult.run(TestResult.java:125)
	at junit.framework.TestCase.run(TestCase.java:129)
	at junit.framework.TestSuite.runTest(TestSuite.java:252)
	at junit.framework.TestSuite.run(TestSuite.java:247)
	at junit.framework.TestSuite.runTest(TestSuite.java:252)
	at junit.framework.TestSuite.run(TestSuite.java:247)
	at org.junit.internal.runners.JUnit38ClassRunner.run(JUnit38ClassRunner.java:86)
	at org.apache.maven.surefire.junit4.JUnit4Provider.execute(JUnit4Provider.java:264)
	at org.apache.maven.surefire.junit4.JUnit4Provider.executeTestSet(JUnit4Provider.java:153)
	at org.apache.maven.surefire.junit4.JUnit4Provider.invoke(JUnit4Provider.java:124)
	at sun.reflect.NativeMethodAccessorImpl.invoke0(Native Method)
	at sun.reflect.NativeMethodAccessorImpl.invoke(NativeMethodAccessorImpl.java:57)
	at sun.reflect.DelegatingMethodAccessorImpl.invoke(DelegatingMethodAccessorImpl.java:43)
	at java.lang.reflect.Method.invoke(Method.java:606)
	at org.apache.maven.surefire.util.ReflectionUtils.invokeMethodWithArray2(ReflectionUtils.java:208)
	at org.apache.maven.surefire.booter.ProviderFactory$ProviderProxy.invoke(ProviderFactory.java:156)
	at org.apache.maven.surefire.booter.ProviderFactory.invokeProvider(ProviderFactory.java:82)
	at org.eclipse.tycho.surefire.osgibooter.OsgiSurefireBooter.run(OsgiSurefireBooter.java:91)
	at org.eclipse.tycho.surefire.osgibooter.AbstractUITestApplication$1.run(AbstractUITestApplication.java:35)
	at org.eclipse.swt.widgets.RunnableLock.run(RunnableLock.java:35)
	at org.eclipse.swt.widgets.Synchronizer.runAsyncMessages(Synchronizer.java:135)
	at org.eclipse.swt.widgets.Display.runAsyncMessages(Display.java:3794)
	at org.eclipse.swt.widgets.Display.readAndDispatch(Display.java:3433)
	at org.eclipse.e4.ui.internal.workbench.swt.PartRenderingEngine$4.run(PartRenderingEngine.java:1127)
	at org.eclipse.core.databinding.observable.Realm.runWithDefault(Realm.java:337)
	at org.eclipse.e4.ui.internal.workbench.swt.PartRenderingEngine.run(PartRenderingEngine.java:1018)
	at org.eclipse.e4.ui.internal.workbench.E4Workbench.createAndRunUI(E4Workbench.java:156)
	at org.eclipse.ui.internal.Workbench$5.run(Workbench.java:654)
	at org.eclipse.core.databinding.observable.Realm.runWithDefault(Realm.java:337)
	at org.eclipse.ui.internal.Workbench.createAndRunWorkbench(Workbench.java:598)
	at org.eclipse.ui.PlatformUI.createAndRunWorkbench(PlatformUI.java:150)
	at org.eclipse.ui.internal.ide.application.IDEApplication.start(IDEApplication.java:139)
	at org.eclipse.tycho.surefire.osgibooter.UITestApplication.runApplication(UITestApplication.java:31)
	at org.eclipse.tycho.surefire.osgibooter.AbstractUITestApplication.run(AbstractUITestApplication.java:120)
	at org.eclipse.tycho.surefire.osgibooter.UITestApplication.start(UITestApplication.java:37)
	at org.eclipse.equinox.internal.app.EclipseAppHandle.run(EclipseAppHandle.java:196)
	at org.eclipse.core.runtime.internal.adaptor.EclipseAppLauncher.runApplication(EclipseAppLauncher.java:134)
	at org.eclipse.core.runtime.internal.adaptor.EclipseAppLauncher.start(EclipseAppLauncher.java:104)
	at org.eclipse.core.runtime.adaptor.EclipseStarter.run(EclipseStarter.java:380)
	at org.eclipse.core.runtime.adaptor.EclipseStarter.run(EclipseStarter.java:235)
	at sun.reflect.NativeMethodAccessorImpl.invoke0(Native Method)
	at sun.reflect.NativeMethodAccessorImpl.invoke(NativeMethodAccessorImpl.java:57)
	at sun.reflect.DelegatingMethodAccessorImpl.invoke(DelegatingMethodAccessorImpl.java:43)
	at java.lang.reflect.Method.invoke(Method.java:606)
	at org.eclipse.equinox.launcher.Main.invokeFramework(Main.java:669)
	at org.eclipse.equinox.launcher.Main.basicRun(Main.java:608)
	at org.eclipse.equinox.launcher.Main.run(Main.java:1515)
	at org.eclipse.equinox.launcher.Main.main(Main.java:1488)
Tests run: 23, Failures: 4, Errors: 0, Skipped: 0, Time elapsed: 0.057 sec <<< FAILURE! - in org.eclipse.contribution.xref.core.tests.AllTests
testLog(org.eclipse.contribution.xref.core.tests.XReferencePluginTest)  Time elapsed: 0.007 sec
testPluginID(org.eclipse.contribution.xref.core.tests.XReferencePluginTest)  Time elapsed: 0 sec
testGetDefault(org.eclipse.contribution.xref.core.tests.XReferencePluginTest)  Time elapsed: 0 sec
testAddAssociate(org.eclipse.contribution.xref.core.tests.XReferenceTest)  Time elapsed: 0.001 sec
testRemoveAssociate(org.eclipse.contribution.xref.core.tests.XReferenceTest)  Time elapsed: 0 sec
testXReferenceString(org.eclipse.contribution.xref.core.tests.XReferenceTest)  Time elapsed: 0.001 sec
testXReferenceStringSet(org.eclipse.contribution.xref.core.tests.XReferenceTest)  Time elapsed: 0 sec
testGetAdapterList(org.eclipse.contribution.xref.core.tests.XReferenceAdapterFactoryTest)  Time elapsed: 0.001 sec
testGetWrongAdapter(org.eclipse.contribution.xref.core.tests.XReferenceAdapterFactoryTest)  Time elapsed: 0 sec
testGetAdapter(org.eclipse.contribution.xref.core.tests.XReferenceAdapterFactoryTest)  Time elapsed: 0.002 sec  <<< FAILURE!
junit.framework.AssertionFailedError: null
	at junit.framework.Assert.fail(Assert.java:55)
	at junit.framework.Assert.assertTrue(Assert.java:22)
	at junit.framework.Assert.assertNotNull(Assert.java:256)
	at junit.framework.Assert.assertNotNull(Assert.java:248)
	at junit.framework.TestCase.assertNotNull(TestCase.java:417)
	at org.eclipse.contribution.xref.core.tests.XReferenceAdapterFactoryTest.testGetAdapter(XReferenceAdapterFactoryTest.java:50)

testGetReferenceSource(org.eclipse.contribution.xref.core.tests.XReferenceAdapterTest)  Time elapsed: 0.002 sec
testGetXReferences(org.eclipse.contribution.xref.core.tests.XReferenceAdapterTest)  Time elapsed: 0.01 sec  <<< FAILURE!
junit.framework.AssertionFailedError: expected:<1> but was:<0>
	at junit.framework.Assert.fail(Assert.java:57)
	at junit.framework.Assert.failNotEquals(Assert.java:329)
	at junit.framework.Assert.assertEquals(Assert.java:78)
	at junit.framework.Assert.assertEquals(Assert.java:234)
	at junit.framework.Assert.assertEquals(Assert.java:241)
	at junit.framework.TestCase.assertEquals(TestCase.java:409)
	at org.eclipse.contribution.xref.core.tests.XReferenceAdapterTest.testGetXReferences(XReferenceAdapterTest.java:45)

testSettingOfIsInplace(org.eclipse.contribution.xref.core.tests.XReferenceProviderManagerTest)  Time elapsed: 0.001 sec
testGetRegisteredProviders(org.eclipse.contribution.xref.core.tests.XReferenceProviderManagerTest)  Time elapsed: 0 sec  <<< FAILURE!
junit.framework.AssertionFailedError: null
	at junit.framework.Assert.fail(Assert.java:55)
	at junit.framework.Assert.assertTrue(Assert.java:22)
	at junit.framework.Assert.assertTrue(Assert.java:31)
	at junit.framework.TestCase.assertTrue(TestCase.java:201)
	at org.eclipse.contribution.xref.core.tests.XReferenceProviderManagerTest.testGetRegisteredProviders(XReferenceProviderManagerTest.java:73)

testGetProvidersFor(org.eclipse.contribution.xref.core.tests.XReferenceProviderManagerTest)  Time elapsed: 0 sec  <<< FAILURE!
junit.framework.AssertionFailedError: expected:<1> but was:<0>
	at junit.framework.Assert.fail(Assert.java:57)
	at junit.framework.Assert.failNotEquals(Assert.java:329)
	at junit.framework.Assert.assertEquals(Assert.java:78)
	at junit.framework.Assert.assertEquals(Assert.java:234)
	at junit.framework.Assert.assertEquals(Assert.java:241)
	at junit.framework.TestCase.assertEquals(TestCase.java:409)
	at org.eclipse.contribution.xref.core.tests.XReferenceProviderManagerTest.testGetProvidersFor(XReferenceProviderManagerTest.java:58)

testGetManager(org.eclipse.contribution.xref.core.tests.XReferenceProviderManagerTest)  Time elapsed: 0 sec
testGetLabel(org.eclipse.contribution.xref.core.tests.XReferenceProviderDefinitionTest)  Time elapsed: 0 sec
testGetID(org.eclipse.contribution.xref.core.tests.XReferenceProviderDefinitionTest)  Time elapsed: 0 sec
testSetCheckedInplaceFilters(org.eclipse.contribution.xref.core.tests.XReferenceProviderDefinitionTest)  Time elapsed: 0 sec
testIsAndSetEnabled(org.eclipse.contribution.xref.core.tests.XReferenceProviderDefinitionTest)  Time elapsed: 0.001 sec
testGetDescription(org.eclipse.contribution.xref.core.tests.XReferenceProviderDefinitionTest)  Time elapsed: 0 sec
testSetCheckedFilters(org.eclipse.contribution.xref.core.tests.XReferenceProviderDefinitionTest)  Time elapsed: 0 sec
testSafeExecution(org.eclipse.contribution.xref.core.tests.XReferenceProviderDefinitionTest)  Time elapsed: 0.001 sec

Results :

Failed tests: 
  XReferenceAdapterFactoryTest.testGetAdapter:50 null
  XReferenceAdapterTest.testGetXReferences:45 expected:<1> but was:<0>
  XReferenceProviderManagerTest.testGetRegisteredProviders:73 null
  XReferenceProviderManagerTest.testGetProvidersFor:58 expected:<1> but was:<0>

Tests run: 23, Failures: 4, Errors: 0, Skipped: 0

[ERROR] There are test failures.

Please refer to /jobs/genie.ajdt/ajdt-on-eclipse-45/workspace/org.eclipse.contribution.xref.core.tests/target/surefire-reports for the individual test results.
[INFO] 
[INFO] --- eclipse-jarsigner-plugin:1.0.4:sign (sign) @ org.eclipse.contribution.xref.core.tests ---
[INFO] Signed org.eclipse.ajdt:org.eclipse.contribution.xref.core.tests:eclipse-test-plugin:2.2.4-SNAPSHOT in 0 seconds.
[INFO] 
[INFO] --- tycho-p2-plugin:0.23.1:p2-metadata (p2-metadata) @ org.eclipse.contribution.xref.core.tests ---
[INFO]                                                                         
[INFO] ------------------------------------------------------------------------
[INFO] Building org.eclipse.contribution.xref.ui.tests 2.2.4-SNAPSHOT
[INFO] ------------------------------------------------------------------------
[INFO] 
[INFO] --- maven-clean-plugin:2.5:clean (default-clean) @ org.eclipse.contribution.xref.ui.tests ---
[INFO] Deleting /jobs/genie.ajdt/ajdt-on-eclipse-45/workspace/org.eclipse.contribution.xref.ui.tests/target
[INFO] 
[INFO] --- tycho-packaging-plugin:0.23.1:build-qualifier (default-build-qualifier) @ org.eclipse.contribution.xref.ui.tests ---
[INFO] The project's OSGi version is 2.2.4.201602042048
[INFO] 
[INFO] --- tycho-packaging-plugin:0.23.1:validate-id (default-validate-id) @ org.eclipse.contribution.xref.ui.tests ---
[INFO] 
[INFO] --- tycho-packaging-plugin:0.23.1:validate-version (default-validate-version) @ org.eclipse.contribution.xref.ui.tests ---
[INFO] 
[INFO] --- maven-resources-plugin:2.4.3:resources (default-resources) @ org.eclipse.contribution.xref.ui.tests ---
[WARNING] Using platform encoding (UTF-8 actually) to copy filtered resources, i.e. build is platform dependent!
[INFO] skip non existing resourceDirectory /jobs/genie.ajdt/ajdt-on-eclipse-45/workspace/org.eclipse.contribution.xref.ui.tests/src/main/resources
[INFO] 
[INFO] --- tycho-compiler-plugin:0.23.1:compile (default-compile) @ org.eclipse.contribution.xref.ui.tests ---
[INFO] Compiling 7 source files to /jobs/genie.ajdt/ajdt-on-eclipse-45/workspace/org.eclipse.contribution.xref.ui.tests/target/classes
[INFO] 
[INFO] --- maven-resources-plugin:2.4.3:testResources (default-testResources) @ org.eclipse.contribution.xref.ui.tests ---
[WARNING] Using platform encoding (UTF-8 actually) to copy filtered resources, i.e. build is platform dependent!
[INFO] skip non existing resourceDirectory /jobs/genie.ajdt/ajdt-on-eclipse-45/workspace/org.eclipse.contribution.xref.ui.tests/src/test/resources
[INFO] 
[INFO] --- target-platform-configuration:0.23.1:target-platform (default-target-platform) @ org.eclipse.contribution.xref.ui.tests ---
[INFO] 
[INFO] --- tycho-packaging-plugin:0.23.1:package-plugin (default-package-plugin) @ org.eclipse.contribution.xref.ui.tests ---
[INFO] Building jar: /jobs/genie.ajdt/ajdt-on-eclipse-45/workspace/org.eclipse.contribution.xref.ui.tests/xrefuitests.jar
[INFO] Building jar: /jobs/genie.ajdt/ajdt-on-eclipse-45/workspace/org.eclipse.contribution.xref.ui.tests/target/org.eclipse.contribution.xref.ui.tests-2.2.4-SNAPSHOT.jar
[INFO] 
[INFO] --- tycho-p2-plugin:0.23.1:p2-metadata-default (default-p2-metadata-default) @ org.eclipse.contribution.xref.ui.tests ---
[INFO] 
[INFO] --- tycho-surefire-plugin:0.23.1:test (default-test) @ org.eclipse.contribution.xref.ui.tests ---
[INFO] Expected eclipse log file: /jobs/genie.ajdt/ajdt-on-eclipse-45/workspace/org.eclipse.contribution.xref.ui.tests/target/work/data/.metadata/.log
[INFO] Command line:
	[/opt/public/common/jdk1.7.0_80/jre/bin/java, -Dosgi.noShutdown=false, -Dosgi.os=linux, -Dosgi.ws=gtk, -Dosgi.arch=x86_64, -Xmx1024m, -XX:MaxPermSize=256m, -Dosgi.clean=true, -jar, /jobs/genie.ajdt/ajdt-on-eclipse-45/workspace/.maven/repo/p2/osgi/bundle/org.eclipse.equinox.launcher/1.3.100.v20150511-1540/org.eclipse.equinox.launcher-1.3.100.v20150511-1540.jar, -debug, -consolelog, -data, /jobs/genie.ajdt/ajdt-on-eclipse-45/workspace/org.eclipse.contribution.xref.ui.tests/target/work/data, -install, /jobs/genie.ajdt/ajdt-on-eclipse-45/workspace/org.eclipse.contribution.xref.ui.tests/target/work, -configuration, /jobs/genie.ajdt/ajdt-on-eclipse-45/workspace/org.eclipse.contribution.xref.ui.tests/target/work/configuration, -application, org.eclipse.tycho.surefire.osgibooter.uitest, -testproperties, /jobs/genie.ajdt/ajdt-on-eclipse-45/workspace/org.eclipse.contribution.xref.ui.tests/target/surefire.properties]
Configuration location:
    file:/jobs/genie.ajdt/ajdt-on-eclipse-45/workspace/org.eclipse.contribution.xref.ui.tests/target/work/configuration/
Configuration file:
    file:/jobs/genie.ajdt/ajdt-on-eclipse-45/workspace/org.eclipse.contribution.xref.ui.tests/target/work/configuration/config.ini loaded
Install location:
    file:/jobs/genie.ajdt/ajdt-on-eclipse-45/workspace/org.eclipse.contribution.xref.ui.tests/target/work/
Framework located:
    file:/home/hudson/genie.ajdt/.hudson/jobs/ajdt-on-eclipse-45/workspace/.maven/repo/p2/osgi/bundle/org.eclipse.osgi/3.10.101.v20150820-1432/org.eclipse.osgi-3.10.101.v20150820-1432.jar
Framework classpath:
    file:/home/hudson/genie.ajdt/.hudson/jobs/ajdt-on-eclipse-45/workspace/.maven/repo/p2/osgi/bundle/org.eclipse.osgi/3.10.101.v20150820-1432/org.eclipse.osgi-3.10.101.v20150820-1432.jar
Debug options:
    file:/jobs/genie.ajdt/ajdt-on-eclipse-45/workspace/org.eclipse.contribution.xref.ui.tests/.options not found
Time to load bundles: 3225
!SESSION 2016-02-04 17:03:58.954 -----------------------------------------------
eclipse.buildId=unknown
java.version=1.7.0_80
java.vendor=Oracle Corporation
BootLoader constants: OS=linux, ARCH=x86_64, WS=gtk, NL=en_US
Framework arguments:  -application org.eclipse.tycho.surefire.osgibooter.uitest -testproperties /jobs/genie.ajdt/ajdt-on-eclipse-45/workspace/org.eclipse.contribution.xref.ui.tests/target/surefire.properties
Command-line arguments:  -debug -consolelog -data /jobs/genie.ajdt/ajdt-on-eclipse-45/workspace/org.eclipse.contribution.xref.ui.tests/target/work/data -application org.eclipse.tycho.surefire.osgibooter.uitest -testproperties /jobs/genie.ajdt/ajdt-on-eclipse-45/workspace/org.eclipse.contribution.xref.ui.tests/target/surefire.properties

!ENTRY org.eclipse.jdt.launching.macosx 4 0 2016-02-04 17:04:03.232
!MESSAGE FrameworkEvent ERROR
!STACK 0
org.osgi.framework.BundleException: Could not resolve module: org.eclipse.jdt.launching.macosx [220]
  Unresolved requirement: Require-Capability: eclipse.platform; filter:="(osgi.os=macosx)"

	at org.eclipse.osgi.container.Module.start(Module.java:434)
	at org.eclipse.osgi.container.ModuleContainer$ContainerStartLevel.incStartLevel(ModuleContainer.java:1582)
	at org.eclipse.osgi.container.ModuleContainer$ContainerStartLevel.incStartLevel(ModuleContainer.java:1561)
	at org.eclipse.osgi.container.ModuleContainer$ContainerStartLevel.doContainerStartLevel(ModuleContainer.java:1533)
	at org.eclipse.osgi.container.ModuleContainer$ContainerStartLevel.dispatchEvent(ModuleContainer.java:1476)
	at org.eclipse.osgi.container.ModuleContainer$ContainerStartLevel.dispatchEvent(ModuleContainer.java:1)
	at org.eclipse.osgi.framework.eventmgr.EventManager.dispatchEvent(EventManager.java:230)
	at org.eclipse.osgi.framework.eventmgr.EventManager$EventThread.run(EventManager.java:340)

!ENTRY org.eclipse.jdt.launching.ui.macosx 4 0 2016-02-04 17:04:03.234
!MESSAGE FrameworkEvent ERROR
!STACK 0
org.osgi.framework.BundleException: Could not resolve module: org.eclipse.jdt.launching.ui.macosx [221]
  Unresolved requirement: Require-Capability: eclipse.platform; filter:="(osgi.os=macosx)"

	at org.eclipse.osgi.container.Module.start(Module.java:434)
	at org.eclipse.osgi.container.ModuleContainer$ContainerStartLevel.incStartLevel(ModuleContainer.java:1582)
	at org.eclipse.osgi.container.ModuleContainer$ContainerStartLevel.incStartLevel(ModuleContainer.java:1561)
	at org.eclipse.osgi.container.ModuleContainer$ContainerStartLevel.doContainerStartLevel(ModuleContainer.java:1533)
	at org.eclipse.osgi.container.ModuleContainer$ContainerStartLevel.dispatchEvent(ModuleContainer.java:1476)
	at org.eclipse.osgi.container.ModuleContainer$ContainerStartLevel.dispatchEvent(ModuleContainer.java:1)
	at org.eclipse.osgi.framework.eventmgr.EventManager.dispatchEvent(EventManager.java:230)
	at org.eclipse.osgi.framework.eventmgr.EventManager$EventThread.run(EventManager.java:340)
Starting application: 5230
Xlib:  extension "RANDR" missing on display ":1423.0".
Application Started: 7479

-------------------------------------------------------
 T E S T S
-------------------------------------------------------
Running org.eclipse.contribution.xref.ui.tests.AllTests

!ENTRY org.eclipse.contribution.xref.core 2 1 2016-02-04 17:04:08.605
!MESSAGE Could not load provider org.eclipse.contribution.xref.core.tests.unknownProvider
!STACK 1
org.eclipse.core.runtime.CoreException: Plug-in org.eclipse.contribution.xref.core.tests was unable to load class org.eclipse.contribution.xref.core.tests.UnknownProvider.
	at org.eclipse.core.internal.registry.osgi.RegistryStrategyOSGI.throwException(RegistryStrategyOSGI.java:194)
	at org.eclipse.core.internal.registry.osgi.RegistryStrategyOSGI.createExecutableExtension(RegistryStrategyOSGI.java:176)
	at org.eclipse.core.internal.registry.ExtensionRegistry.createExecutableExtension(ExtensionRegistry.java:905)
	at org.eclipse.core.internal.registry.ConfigurationElement.createExecutableExtension(ConfigurationElement.java:243)
	at org.eclipse.core.internal.registry.ConfigurationElementHandle.createExecutableExtension(ConfigurationElementHandle.java:55)
	at org.eclipse.contribution.xref.core.XReferenceProviderDefinition.<init>(XReferenceProviderDefinition.java:32)
	at org.eclipse.contribution.xref.core.XReferenceProviderManager.getRegisteredProviders(XReferenceProviderManager.java:95)
	at org.eclipse.contribution.xref.internal.ui.actions.XReferenceCustomFilterAction.<init>(XReferenceCustomFilterAction.java:58)
	at org.eclipse.contribution.xref.ui.views.XReferenceView.makeActions(XReferenceView.java:458)
	at org.eclipse.contribution.xref.ui.views.XReferenceView.createPartControl(XReferenceView.java:117)
	at org.eclipse.ui.internal.e4.compatibility.CompatibilityPart.createPartControl(CompatibilityPart.java:151)
	at org.eclipse.ui.internal.e4.compatibility.CompatibilityView.createPartControl(CompatibilityView.java:143)
	at org.eclipse.ui.internal.e4.compatibility.CompatibilityPart.create(CompatibilityPart.java:341)
	at sun.reflect.NativeMethodAccessorImpl.invoke0(Native Method)
	at sun.reflect.NativeMethodAccessorImpl.invoke(NativeMethodAccessorImpl.java:57)
	at sun.reflect.DelegatingMethodAccessorImpl.invoke(DelegatingMethodAccessorImpl.java:43)
	at java.lang.reflect.Method.invoke(Method.java:606)
	at org.eclipse.e4.core.internal.di.MethodRequestor.execute(MethodRequestor.java:56)
	at org.eclipse.e4.core.internal.di.InjectorImpl.processAnnotated(InjectorImpl.java:898)
	at org.eclipse.e4.core.internal.di.InjectorImpl.processAnnotated(InjectorImpl.java:879)
	at org.eclipse.e4.core.internal.di.InjectorImpl.inject(InjectorImpl.java:121)
	at org.eclipse.e4.core.internal.di.InjectorImpl.internalMake(InjectorImpl.java:345)
	at org.eclipse.e4.core.internal.di.InjectorImpl.make(InjectorImpl.java:264)
	at org.eclipse.e4.core.contexts.ContextInjectionFactory.make(ContextInjectionFactory.java:162)
	at org.eclipse.e4.ui.internal.workbench.ReflectionContributionFactory.createFromBundle(ReflectionContributionFactory.java:104)
	at org.eclipse.e4.ui.internal.workbench.ReflectionContributionFactory.doCreate(ReflectionContributionFactory.java:73)
	at org.eclipse.e4.ui.internal.workbench.ReflectionContributionFactory.create(ReflectionContributionFactory.java:55)
	at org.eclipse.e4.ui.workbench.renderers.swt.ContributedPartRenderer.createWidget(ContributedPartRenderer.java:129)
	at org.eclipse.e4.ui.internal.workbench.swt.PartRenderingEngine.createWidget(PartRenderingEngine.java:971)
	at org.eclipse.e4.ui.internal.workbench.swt.PartRenderingEngine.safeCreateGui(PartRenderingEngine.java:640)
	at org.eclipse.e4.ui.internal.workbench.swt.PartRenderingEngine$1.run(PartRenderingEngine.java:525)
	at org.eclipse.core.runtime.SafeRunner.run(SafeRunner.java:42)
	at org.eclipse.e4.ui.internal.workbench.swt.PartRenderingEngine.createGui(PartRenderingEngine.java:509)
	at org.eclipse.e4.ui.workbench.renderers.swt.ElementReferenceRenderer.createWidget(ElementReferenceRenderer.java:69)
	at org.eclipse.e4.ui.internal.workbench.swt.PartRenderingEngine.createWidget(PartRenderingEngine.java:971)
	at org.eclipse.e4.ui.internal.workbench.swt.PartRenderingEngine.safeCreateGui(PartRenderingEngine.java:640)
	at org.eclipse.e4.ui.internal.workbench.swt.PartRenderingEngine.safeCreateGui(PartRenderingEngine.java:746)
	at org.eclipse.e4.ui.internal.workbench.swt.PartRenderingEngine.access$0(PartRenderingEngine.java:717)
	at org.eclipse.e4.ui.internal.workbench.swt.PartRenderingEngine$2.run(PartRenderingEngine.java:711)
	at org.eclipse.core.runtime.SafeRunner.run(SafeRunner.java:42)
	at org.eclipse.e4.ui.internal.workbench.swt.PartRenderingEngine.createGui(PartRenderingEngine.java:695)
	at org.eclipse.e4.ui.workbench.renderers.swt.StackRenderer.showTab(StackRenderer.java:1306)
	at org.eclipse.e4.ui.workbench.renderers.swt.LazyStackRenderer$1.handleEvent(LazyStackRenderer.java:72)
	at org.eclipse.e4.ui.services.internal.events.UIEventHandler$1.run(UIEventHandler.java:40)
	at org.eclipse.swt.widgets.Synchronizer.syncExec(Synchronizer.java:186)
	at org.eclipse.ui.internal.UISynchronizer.syncExec(UISynchronizer.java:145)
	at org.eclipse.swt.widgets.Display.syncExec(Display.java:4633)
	at org.eclipse.e4.ui.internal.workbench.swt.E4Application$1.syncExec(E4Application.java:211)
	at org.eclipse.e4.ui.services.internal.events.UIEventHandler.handleEvent(UIEventHandler.java:36)
	at org.eclipse.equinox.internal.event.EventHandlerWrapper.handleEvent(EventHandlerWrapper.java:197)
	at org.eclipse.equinox.internal.event.EventHandlerTracker.dispatchEvent(EventHandlerTracker.java:197)
	at org.eclipse.equinox.internal.event.EventHandlerTracker.dispatchEvent(EventHandlerTracker.java:1)
	at org.eclipse.osgi.framework.eventmgr.EventManager.dispatchEvent(EventManager.java:230)
	at org.eclipse.osgi.framework.eventmgr.ListenerQueue.dispatchEventSynchronous(ListenerQueue.java:148)
	at org.eclipse.equinox.internal.event.EventAdminImpl.dispatchEvent(EventAdminImpl.java:135)
	at org.eclipse.equinox.internal.event.EventAdminImpl.sendEvent(EventAdminImpl.java:78)
	at org.eclipse.equinox.internal.event.EventComponent.sendEvent(EventComponent.java:39)
	at org.eclipse.e4.ui.services.internal.events.EventBroker.send(EventBroker.java:85)
	at org.eclipse.e4.ui.internal.workbench.UIEventPublisher.notifyChanged(UIEventPublisher.java:59)
	at org.eclipse.emf.common.notify.impl.BasicNotifierImpl.eNotify(BasicNotifierImpl.java:374)
	at org.eclipse.e4.ui.model.application.ui.impl.ElementContainerImpl.setSelectedElement(ElementContainerImpl.java:171)
	at org.eclipse.e4.ui.internal.workbench.ModelServiceImpl.showElementInWindow(ModelServiceImpl.java:494)
	at org.eclipse.e4.ui.internal.workbench.ModelServiceImpl.bringToTop(ModelServiceImpl.java:458)
	at org.eclipse.e4.ui.internal.workbench.PartServiceImpl.delegateBringToTop(PartServiceImpl.java:724)
	at org.eclipse.e4.ui.internal.workbench.PartServiceImpl.activate(PartServiceImpl.java:701)
	at org.eclipse.e4.ui.internal.workbench.PartServiceImpl.activate(PartServiceImpl.java:639)
	at org.eclipse.e4.ui.internal.workbench.PartServiceImpl.activate(PartServiceImpl.java:634)
	at org.eclipse.e4.ui.internal.workbench.PartServiceImpl.showPart(PartServiceImpl.java:1157)
	at org.eclipse.ui.internal.WorkbenchPage.showPart(WorkbenchPage.java:1275)
	at org.eclipse.ui.internal.WorkbenchPage.busyShowView(WorkbenchPage.java:1266)
	at org.eclipse.ui.internal.WorkbenchPage$12.run(WorkbenchPage.java:4211)
	at org.eclipse.swt.custom.BusyIndicator.showWhile(BusyIndicator.java:70)
	at org.eclipse.ui.internal.WorkbenchPage.showView(WorkbenchPage.java:4207)
	at org.eclipse.ui.internal.WorkbenchPage.showView(WorkbenchPage.java:4187)
	at org.eclipse.contribution.xref.ui.tests.views.XReferenceViewTest.testShowHide(XReferenceViewTest.java:59)
	at sun.reflect.NativeMethodAccessorImpl.invoke0(Native Method)
	at sun.reflect.NativeMethodAccessorImpl.invoke(NativeMethodAccessorImpl.java:57)
	at sun.reflect.DelegatingMethodAccessorImpl.invoke(DelegatingMethodAccessorImpl.java:43)
	at java.lang.reflect.Method.invoke(Method.java:606)
	at junit.framework.TestCase.runTest(TestCase.java:176)
	at junit.framework.TestCase.runBare(TestCase.java:141)
	at junit.framework.TestResult$1.protect(TestResult.java:122)
	at junit.framework.TestResult.runProtected(TestResult.java:142)
	at junit.framework.TestResult.run(TestResult.java:125)
	at junit.framework.TestCase.run(TestCase.java:129)
	at junit.framework.TestSuite.runTest(TestSuite.java:252)
	at junit.framework.TestSuite.run(TestSuite.java:247)
	at junit.framework.TestSuite.runTest(TestSuite.java:252)
	at junit.framework.TestSuite.run(TestSuite.java:247)
	at org.junit.internal.runners.JUnit38ClassRunner.run(JUnit38ClassRunner.java:86)
	at org.apache.maven.surefire.junit4.JUnit4Provider.execute(JUnit4Provider.java:264)
	at org.apache.maven.surefire.junit4.JUnit4Provider.executeTestSet(JUnit4Provider.java:153)
	at org.apache.maven.surefire.junit4.JUnit4Provider.invoke(JUnit4Provider.java:124)
	at sun.reflect.NativeMethodAccessorImpl.invoke0(Native Method)
	at sun.reflect.NativeMethodAccessorImpl.invoke(NativeMethodAccessorImpl.java:57)
	at sun.reflect.DelegatingMethodAccessorImpl.invoke(DelegatingMethodAccessorImpl.java:43)
	at java.lang.reflect.Method.invoke(Method.java:606)
	at org.apache.maven.surefire.util.ReflectionUtils.invokeMethodWithArray2(ReflectionUtils.java:208)
	at org.apache.maven.surefire.booter.ProviderFactory$ProviderProxy.invoke(ProviderFactory.java:156)
	at org.apache.maven.surefire.booter.ProviderFactory.invokeProvider(ProviderFactory.java:82)
	at org.eclipse.tycho.surefire.osgibooter.OsgiSurefireBooter.run(OsgiSurefireBooter.java:91)
	at org.eclipse.tycho.surefire.osgibooter.AbstractUITestApplication$1.run(AbstractUITestApplication.java:35)
	at org.eclipse.swt.widgets.RunnableLock.run(RunnableLock.java:35)
	at org.eclipse.swt.widgets.Synchronizer.runAsyncMessages(Synchronizer.java:135)
	at org.eclipse.swt.widgets.Display.runAsyncMessages(Display.java:3794)
	at org.eclipse.swt.widgets.Display.readAndDispatch(Display.java:3433)
	at org.eclipse.e4.ui.internal.workbench.swt.PartRenderingEngine$4.run(PartRenderingEngine.java:1127)
	at org.eclipse.core.databinding.observable.Realm.runWithDefault(Realm.java:337)
	at org.eclipse.e4.ui.internal.workbench.swt.PartRenderingEngine.run(PartRenderingEngine.java:1018)
	at org.eclipse.e4.ui.internal.workbench.E4Workbench.createAndRunUI(E4Workbench.java:156)
	at org.eclipse.ui.internal.Workbench$5.run(Workbench.java:654)
	at org.eclipse.core.databinding.observable.Realm.runWithDefault(Realm.java:337)
	at org.eclipse.ui.internal.Workbench.createAndRunWorkbench(Workbench.java:598)
	at org.eclipse.ui.PlatformUI.createAndRunWorkbench(PlatformUI.java:150)
	at org.eclipse.ui.internal.ide.application.IDEApplication.start(IDEApplication.java:139)
	at org.eclipse.tycho.surefire.osgibooter.UITestApplication.runApplication(UITestApplication.java:31)
	at org.eclipse.tycho.surefire.osgibooter.AbstractUITestApplication.run(AbstractUITestApplication.java:120)
	at org.eclipse.tycho.surefire.osgibooter.UITestApplication.start(UITestApplication.java:37)
	at org.eclipse.equinox.internal.app.EclipseAppHandle.run(EclipseAppHandle.java:196)
	at org.eclipse.core.runtime.internal.adaptor.EclipseAppLauncher.runApplication(EclipseAppLauncher.java:134)
	at org.eclipse.core.runtime.internal.adaptor.EclipseAppLauncher.start(EclipseAppLauncher.java:104)
	at org.eclipse.core.runtime.adaptor.EclipseStarter.run(EclipseStarter.java:380)
	at org.eclipse.core.runtime.adaptor.EclipseStarter.run(EclipseStarter.java:235)
	at sun.reflect.NativeMethodAccessorImpl.invoke0(Native Method)
	at sun.reflect.NativeMethodAccessorImpl.invoke(NativeMethodAccessorImpl.java:57)
	at sun.reflect.DelegatingMethodAccessorImpl.invoke(DelegatingMethodAccessorImpl.java:43)
	at java.lang.reflect.Method.invoke(Method.java:606)
	at org.eclipse.equinox.launcher.Main.invokeFramework(Main.java:669)
	at org.eclipse.equinox.launcher.Main.basicRun(Main.java:608)
	at org.eclipse.equinox.launcher.Main.run(Main.java:1515)
	at org.eclipse.equinox.launcher.Main.main(Main.java:1488)
Caused by: java.lang.ClassNotFoundException: org.eclipse.contribution.xref.core.tests.UnknownProvider cannot be found by org.eclipse.contribution.xref.core.tests_2.2.4.201602042048
	at org.eclipse.osgi.internal.loader.BundleLoader.findClassInternal(BundleLoader.java:439)
	at org.eclipse.osgi.internal.loader.BundleLoader.findClass(BundleLoader.java:352)
	at org.eclipse.osgi.internal.loader.BundleLoader.findClass(BundleLoader.java:344)
	at org.eclipse.osgi.internal.loader.ModuleClassLoader.loadClass(ModuleClassLoader.java:160)
	at java.lang.ClassLoader.loadClass(ClassLoader.java:358)
	at org.eclipse.osgi.internal.framework.EquinoxBundle.loadClass(EquinoxBundle.java:573)
	at org.eclipse.core.internal.registry.osgi.RegistryStrategyOSGI.createExecutableExtension(RegistryStrategyOSGI.java:174)
	... 129 more
!SUBENTRY 1 org.eclipse.equinox.registry 4 1 2016-02-04 17:04:08.608
!MESSAGE Plug-in org.eclipse.contribution.xref.core.tests was unable to load class org.eclipse.contribution.xref.core.tests.UnknownProvider.
!STACK 0
java.lang.ClassNotFoundException: org.eclipse.contribution.xref.core.tests.UnknownProvider cannot be found by org.eclipse.contribution.xref.core.tests_2.2.4.201602042048
	at org.eclipse.osgi.internal.loader.BundleLoader.findClassInternal(BundleLoader.java:439)
	at org.eclipse.osgi.internal.loader.BundleLoader.findClass(BundleLoader.java:352)
	at org.eclipse.osgi.internal.loader.BundleLoader.findClass(BundleLoader.java:344)
	at org.eclipse.osgi.internal.loader.ModuleClassLoader.loadClass(ModuleClassLoader.java:160)
	at java.lang.ClassLoader.loadClass(ClassLoader.java:358)
	at org.eclipse.osgi.internal.framework.EquinoxBundle.loadClass(EquinoxBundle.java:573)
	at org.eclipse.core.internal.registry.osgi.RegistryStrategyOSGI.createExecutableExtension(RegistryStrategyOSGI.java:174)
	at org.eclipse.core.internal.registry.ExtensionRegistry.createExecutableExtension(ExtensionRegistry.java:905)
	at org.eclipse.core.internal.registry.ConfigurationElement.createExecutableExtension(ConfigurationElement.java:243)
	at org.eclipse.core.internal.registry.ConfigurationElementHandle.createExecutableExtension(ConfigurationElementHandle.java:55)
	at org.eclipse.contribution.xref.core.XReferenceProviderDefinition.<init>(XReferenceProviderDefinition.java:32)
	at org.eclipse.contribution.xref.core.XReferenceProviderManager.getRegisteredProviders(XReferenceProviderManager.java:95)
	at org.eclipse.contribution.xref.internal.ui.actions.XReferenceCustomFilterAction.<init>(XReferenceCustomFilterAction.java:58)
	at org.eclipse.contribution.xref.ui.views.XReferenceView.makeActions(XReferenceView.java:458)
	at org.eclipse.contribution.xref.ui.views.XReferenceView.createPartControl(XReferenceView.java:117)
	at org.eclipse.ui.internal.e4.compatibility.CompatibilityPart.createPartControl(CompatibilityPart.java:151)
	at org.eclipse.ui.internal.e4.compatibility.CompatibilityView.createPartControl(CompatibilityView.java:143)
	at org.eclipse.ui.internal.e4.compatibility.CompatibilityPart.create(CompatibilityPart.java:341)
	at sun.reflect.NativeMethodAccessorImpl.invoke0(Native Method)
	at sun.reflect.NativeMethodAccessorImpl.invoke(NativeMethodAccessorImpl.java:57)
	at sun.reflect.DelegatingMethodAccessorImpl.invoke(DelegatingMethodAccessorImpl.java:43)
	at java.lang.reflect.Method.invoke(Method.java:606)
	at org.eclipse.e4.core.internal.di.MethodRequestor.execute(MethodRequestor.java:56)
	at org.eclipse.e4.core.internal.di.InjectorImpl.processAnnotated(InjectorImpl.java:898)
	at org.eclipse.e4.core.internal.di.InjectorImpl.processAnnotated(InjectorImpl.java:879)
	at org.eclipse.e4.core.internal.di.InjectorImpl.inject(InjectorImpl.java:121)
	at org.eclipse.e4.core.internal.di.InjectorImpl.internalMake(InjectorImpl.java:345)
	at org.eclipse.e4.core.internal.di.InjectorImpl.make(InjectorImpl.java:264)
	at org.eclipse.e4.core.contexts.ContextInjectionFactory.make(ContextInjectionFactory.java:162)
	at org.eclipse.e4.ui.internal.workbench.ReflectionContributionFactory.createFromBundle(ReflectionContributionFactory.java:104)
	at org.eclipse.e4.ui.internal.workbench.ReflectionContributionFactory.doCreate(ReflectionContributionFactory.java:73)
	at org.eclipse.e4.ui.internal.workbench.ReflectionContributionFactory.create(ReflectionContributionFactory.java:55)
	at org.eclipse.e4.ui.workbench.renderers.swt.ContributedPartRenderer.createWidget(ContributedPartRenderer.java:129)
	at org.eclipse.e4.ui.internal.workbench.swt.PartRenderingEngine.createWidget(PartRenderingEngine.java:971)
	at org.eclipse.e4.ui.internal.workbench.swt.PartRenderingEngine.safeCreateGui(PartRenderingEngine.java:640)
	at org.eclipse.e4.ui.internal.workbench.swt.PartRenderingEngine$1.run(PartRenderingEngine.java:525)
	at org.eclipse.core.runtime.SafeRunner.run(SafeRunner.java:42)
	at org.eclipse.e4.ui.internal.workbench.swt.PartRenderingEngine.createGui(PartRenderingEngine.java:509)
	at org.eclipse.e4.ui.workbench.renderers.swt.ElementReferenceRenderer.createWidget(ElementReferenceRenderer.java:69)
	at org.eclipse.e4.ui.internal.workbench.swt.PartRenderingEngine.createWidget(PartRenderingEngine.java:971)
	at org.eclipse.e4.ui.internal.workbench.swt.PartRenderingEngine.safeCreateGui(PartRenderingEngine.java:640)
	at org.eclipse.e4.ui.internal.workbench.swt.PartRenderingEngine.safeCreateGui(PartRenderingEngine.java:746)
	at org.eclipse.e4.ui.internal.workbench.swt.PartRenderingEngine.access$0(PartRenderingEngine.java:717)
	at org.eclipse.e4.ui.internal.workbench.swt.PartRenderingEngine$2.run(PartRenderingEngine.java:711)
	at org.eclipse.core.runtime.SafeRunner.run(SafeRunner.java:42)
	at org.eclipse.e4.ui.internal.workbench.swt.PartRenderingEngine.createGui(PartRenderingEngine.java:695)
	at org.eclipse.e4.ui.workbench.renderers.swt.StackRenderer.showTab(StackRenderer.java:1306)
	at org.eclipse.e4.ui.workbench.renderers.swt.LazyStackRenderer$1.handleEvent(LazyStackRenderer.java:72)
	at org.eclipse.e4.ui.services.internal.events.UIEventHandler$1.run(UIEventHandler.java:40)
	at org.eclipse.swt.widgets.Synchronizer.syncExec(Synchronizer.java:186)
	at org.eclipse.ui.internal.UISynchronizer.syncExec(UISynchronizer.java:145)
	at org.eclipse.swt.widgets.Display.syncExec(Display.java:4633)
	at org.eclipse.e4.ui.internal.workbench.swt.E4Application$1.syncExec(E4Application.java:211)
	at org.eclipse.e4.ui.services.internal.events.UIEventHandler.handleEvent(UIEventHandler.java:36)
	at org.eclipse.equinox.internal.event.EventHandlerWrapper.handleEvent(EventHandlerWrapper.java:197)
	at org.eclipse.equinox.internal.event.EventHandlerTracker.dispatchEvent(EventHandlerTracker.java:197)
	at org.eclipse.equinox.internal.event.EventHandlerTracker.dispatchEvent(EventHandlerTracker.java:1)
	at org.eclipse.osgi.framework.eventmgr.EventManager.dispatchEvent(EventManager.java:230)
	at org.eclipse.osgi.framework.eventmgr.ListenerQueue.dispatchEventSynchronous(ListenerQueue.java:148)
	at org.eclipse.equinox.internal.event.EventAdminImpl.dispatchEvent(EventAdminImpl.java:135)
	at org.eclipse.equinox.internal.event.EventAdminImpl.sendEvent(EventAdminImpl.java:78)
	at org.eclipse.equinox.internal.event.EventComponent.sendEvent(EventComponent.java:39)
	at org.eclipse.e4.ui.services.internal.events.EventBroker.send(EventBroker.java:85)
	at org.eclipse.e4.ui.internal.workbench.UIEventPublisher.notifyChanged(UIEventPublisher.java:59)
	at org.eclipse.emf.common.notify.impl.BasicNotifierImpl.eNotify(BasicNotifierImpl.java:374)
	at org.eclipse.e4.ui.model.application.ui.impl.ElementContainerImpl.setSelectedElement(ElementContainerImpl.java:171)
	at org.eclipse.e4.ui.internal.workbench.ModelServiceImpl.showElementInWindow(ModelServiceImpl.java:494)
	at org.eclipse.e4.ui.internal.workbench.ModelServiceImpl.bringToTop(ModelServiceImpl.java:458)
	at org.eclipse.e4.ui.internal.workbench.PartServiceImpl.delegateBringToTop(PartServiceImpl.java:724)
	at org.eclipse.e4.ui.internal.workbench.PartServiceImpl.activate(PartServiceImpl.java:701)
	at org.eclipse.e4.ui.internal.workbench.PartServiceImpl.activate(PartServiceImpl.java:639)
	at org.eclipse.e4.ui.internal.workbench.PartServiceImpl.activate(PartServiceImpl.java:634)
	at org.eclipse.e4.ui.internal.workbench.PartServiceImpl.showPart(PartServiceImpl.java:1157)
	at org.eclipse.ui.internal.WorkbenchPage.showPart(WorkbenchPage.java:1275)
	at org.eclipse.ui.internal.WorkbenchPage.busyShowView(WorkbenchPage.java:1266)
	at org.eclipse.ui.internal.WorkbenchPage$12.run(WorkbenchPage.java:4211)
	at org.eclipse.swt.custom.BusyIndicator.showWhile(BusyIndicator.java:70)
	at org.eclipse.ui.internal.WorkbenchPage.showView(WorkbenchPage.java:4207)
	at org.eclipse.ui.internal.WorkbenchPage.showView(WorkbenchPage.java:4187)
	at org.eclipse.contribution.xref.ui.tests.views.XReferenceViewTest.testShowHide(XReferenceViewTest.java:59)
	at sun.reflect.NativeMethodAccessorImpl.invoke0(Native Method)
	at sun.reflect.NativeMethodAccessorImpl.invoke(NativeMethodAccessorImpl.java:57)
	at sun.reflect.DelegatingMethodAccessorImpl.invoke(DelegatingMethodAccessorImpl.java:43)
	at java.lang.reflect.Method.invoke(Method.java:606)
	at junit.framework.TestCase.runTest(TestCase.java:176)
	at junit.framework.TestCase.runBare(TestCase.java:141)
	at junit.framework.TestResult$1.protect(TestResult.java:122)
	at junit.framework.TestResult.runProtected(TestResult.java:142)
	at junit.framework.TestResult.run(TestResult.java:125)
	at junit.framework.TestCase.run(TestCase.java:129)
	at junit.framework.TestSuite.runTest(TestSuite.java:252)
	at junit.framework.TestSuite.run(TestSuite.java:247)
	at junit.framework.TestSuite.runTest(TestSuite.java:252)
	at junit.framework.TestSuite.run(TestSuite.java:247)
	at org.junit.internal.runners.JUnit38ClassRunner.run(JUnit38ClassRunner.java:86)
	at org.apache.maven.surefire.junit4.JUnit4Provider.execute(JUnit4Provider.java:264)
	at org.apache.maven.surefire.junit4.JUnit4Provider.executeTestSet(JUnit4Provider.java:153)
	at org.apache.maven.surefire.junit4.JUnit4Provider.invoke(JUnit4Provider.java:124)
	at sun.reflect.NativeMethodAccessorImpl.invoke0(Native Method)
	at sun.reflect.NativeMethodAccessorImpl.invoke(NativeMethodAccessorImpl.java:57)
	at sun.reflect.DelegatingMethodAccessorImpl.invoke(DelegatingMethodAccessorImpl.java:43)
	at java.lang.reflect.Method.invoke(Method.java:606)
	at org.apache.maven.surefire.util.ReflectionUtils.invokeMethodWithArray2(ReflectionUtils.java:208)
	at org.apache.maven.surefire.booter.ProviderFactory$ProviderProxy.invoke(ProviderFactory.java:156)
	at org.apache.maven.surefire.booter.ProviderFactory.invokeProvider(ProviderFactory.java:82)
	at org.eclipse.tycho.surefire.osgibooter.OsgiSurefireBooter.run(OsgiSurefireBooter.java:91)
	at org.eclipse.tycho.surefire.osgibooter.AbstractUITestApplication$1.run(AbstractUITestApplication.java:35)
	at org.eclipse.swt.widgets.RunnableLock.run(RunnableLock.java:35)
	at org.eclipse.swt.widgets.Synchronizer.runAsyncMessages(Synchronizer.java:135)
	at org.eclipse.swt.widgets.Display.runAsyncMessages(Display.java:3794)
	at org.eclipse.swt.widgets.Display.readAndDispatch(Display.java:3433)
	at org.eclipse.e4.ui.internal.workbench.swt.PartRenderingEngine$4.run(PartRenderingEngine.java:1127)
	at org.eclipse.core.databinding.observable.Realm.runWithDefault(Realm.java:337)
	at org.eclipse.e4.ui.internal.workbench.swt.PartRenderingEngine.run(PartRenderingEngine.java:1018)
	at org.eclipse.e4.ui.internal.workbench.E4Workbench.createAndRunUI(E4Workbench.java:156)
	at org.eclipse.ui.internal.Workbench$5.run(Workbench.java:654)
	at org.eclipse.core.databinding.observable.Realm.runWithDefault(Realm.java:337)
	at org.eclipse.ui.internal.Workbench.createAndRunWorkbench(Workbench.java:598)
	at org.eclipse.ui.PlatformUI.createAndRunWorkbench(PlatformUI.java:150)
	at org.eclipse.ui.internal.ide.application.IDEApplication.start(IDEApplication.java:139)
	at org.eclipse.tycho.surefire.osgibooter.UITestApplication.runApplication(UITestApplication.java:31)
	at org.eclipse.tycho.surefire.osgibooter.AbstractUITestApplication.run(AbstractUITestApplication.java:120)
	at org.eclipse.tycho.surefire.osgibooter.UITestApplication.start(UITestApplication.java:37)
	at org.eclipse.equinox.internal.app.EclipseAppHandle.run(EclipseAppHandle.java:196)
	at org.eclipse.core.runtime.internal.adaptor.EclipseAppLauncher.runApplication(EclipseAppLauncher.java:134)
	at org.eclipse.core.runtime.internal.adaptor.EclipseAppLauncher.start(EclipseAppLauncher.java:104)
	at org.eclipse.core.runtime.adaptor.EclipseStarter.run(EclipseStarter.java:380)
	at org.eclipse.core.runtime.adaptor.EclipseStarter.run(EclipseStarter.java:235)
	at sun.reflect.NativeMethodAccessorImpl.invoke0(Native Method)
	at sun.reflect.NativeMethodAccessorImpl.invoke(NativeMethodAccessorImpl.java:57)
	at sun.reflect.DelegatingMethodAccessorImpl.invoke(DelegatingMethodAccessorImpl.java:43)
	at java.lang.reflect.Method.invoke(Method.java:606)
	at org.eclipse.equinox.launcher.Main.invokeFramework(Main.java:669)
	at org.eclipse.equinox.launcher.Main.basicRun(Main.java:608)
	at org.eclipse.equinox.launcher.Main.run(Main.java:1515)
	at org.eclipse.equinox.launcher.Main.main(Main.java:1488)
Tests run: 6, Failures: 1, Errors: 0, Skipped: 0, Time elapsed: 0.251 sec <<< FAILURE! - in org.eclipse.contribution.xref.ui.tests.AllTests
testViewContentProvider(org.eclipse.contribution.xref.ui.tests.views.XReferenceViewTest)  Time elapsed: 0.006 sec
testTreeObject(org.eclipse.contribution.xref.ui.tests.views.XReferenceViewTest)  Time elapsed: 0 sec
testTreeParent(org.eclipse.contribution.xref.ui.tests.views.XReferenceViewTest)  Time elapsed: 0.001 sec
testShowHide(org.eclipse.contribution.xref.ui.tests.views.XReferenceViewTest)  Time elapsed: 0.218 sec
testViewContentProviderLive(org.eclipse.contribution.xref.ui.tests.views.XReferenceViewTest)  Time elapsed: 0.005 sec  <<< FAILURE!
junit.framework.AssertionFailedError: expected:<test associate> but was:<AdaptableString [val=test associate]>
	at junit.framework.Assert.fail(Assert.java:57)
	at junit.framework.Assert.failNotEquals(Assert.java:329)
	at junit.framework.Assert.assertEquals(Assert.java:78)
	at junit.framework.Assert.assertEquals(Assert.java:86)
	at junit.framework.TestCase.assertEquals(TestCase.java:253)
	at org.eclipse.contribution.xref.ui.tests.views.XReferenceViewTest.testViewContentProviderLive(XReferenceViewTest.java:205)

testSetCheckedFilters(org.eclipse.contribution.xref.ui.tests.AJXReferenceProviderTest)  Time elapsed: 0.001 sec

Results :

Failed tests: 
  XReferenceViewTest.testViewContentProviderLive:205 expected:<test associate> but was:<AdaptableString [val=test associate]>

Tests run: 6, Failures: 1, Errors: 0, Skipped: 0

[ERROR] There are test failures.

Please refer to /jobs/genie.ajdt/ajdt-on-eclipse-45/workspace/org.eclipse.contribution.xref.ui.tests/target/surefire-reports for the individual test results.
[INFO] 
[INFO] --- eclipse-jarsigner-plugin:1.0.4:sign (sign) @ org.eclipse.contribution.xref.ui.tests ---
[INFO] Signed org.eclipse.ajdt:org.eclipse.contribution.xref.ui.tests:eclipse-test-plugin:2.2.4-SNAPSHOT in 1 seconds.
[INFO] 
[INFO] --- tycho-p2-plugin:0.23.1:p2-metadata (p2-metadata) @ org.eclipse.contribution.xref.ui.tests ---
[INFO]                                                                         
[INFO] ------------------------------------------------------------------------
[INFO] Building org.eclipse.aspectj.feature_tests 2.2.4-SNAPSHOT
[INFO] ------------------------------------------------------------------------
[INFO] 
[INFO] --- maven-clean-plugin:2.5:clean (default-clean) @ org.eclipse.aspectj.feature_tests ---
[INFO] Deleting /jobs/genie.ajdt/ajdt-on-eclipse-45/workspace/org.eclipse.aspectj.feature_tests/target
[INFO] 
[INFO] --- tycho-packaging-plugin:0.23.1:build-qualifier-aggregator (default-build-qualifier-aggregator) @ org.eclipse.aspectj.feature_tests ---
[INFO] The project's OSGi version is 2.2.4.201602042048
[INFO] 
[INFO] --- tycho-packaging-plugin:0.23.1:validate-id (default-validate-id) @ org.eclipse.aspectj.feature_tests ---
[INFO] 
[INFO] --- tycho-packaging-plugin:0.23.1:validate-version (default-validate-version) @ org.eclipse.aspectj.feature_tests ---
[INFO] 
[INFO] --- target-platform-configuration:0.23.1:target-platform (default-target-platform) @ org.eclipse.aspectj.feature_tests ---
[INFO] 
[INFO] --- tycho-packaging-plugin:0.23.1:package-feature (default-package-feature) @ org.eclipse.aspectj.feature_tests ---
[INFO] Building jar: /jobs/genie.ajdt/ajdt-on-eclipse-45/workspace/org.eclipse.aspectj.feature_tests/target/org.eclipse.aspectj.feature_tests-2.2.4-SNAPSHOT.jar
[INFO] 
[INFO] --- tycho-p2-plugin:0.23.1:p2-metadata-default (default-p2-metadata-default) @ org.eclipse.aspectj.feature_tests ---
[INFO] 
[INFO] --- tycho-p2-plugin:0.23.1:feature-p2-metadata (default-feature-p2-metadata) @ org.eclipse.aspectj.feature_tests ---
[INFO] 
[INFO] --- eclipse-jarsigner-plugin:1.0.4:sign (sign) @ org.eclipse.aspectj.feature_tests ---
[INFO] Signed org.eclipse.ajdt:org.eclipse.aspectj.feature_tests:eclipse-feature:2.2.4-SNAPSHOT in 0 seconds.
[INFO] 
[INFO] --- tycho-p2-plugin:0.23.1:p2-metadata (p2-metadata) @ org.eclipse.aspectj.feature_tests ---
[INFO]                                                                         
[INFO] ------------------------------------------------------------------------
[INFO] Building org.eclipse.ajdt.releng 2.2.4-SNAPSHOT
[INFO] ------------------------------------------------------------------------
[INFO] 
[INFO] --- maven-clean-plugin:2.5:clean (default-clean) @ org.eclipse.ajdt.releng ---
[INFO] Deleting /jobs/genie.ajdt/ajdt-on-eclipse-45/workspace/org.eclipse.ajdt.releng/target
[INFO] 
[INFO] --- tycho-packaging-plugin:0.23.1:build-qualifier-aggregator (default-build-qualifier-aggregator) @ org.eclipse.ajdt.releng ---
[INFO] The project's OSGi version is 2.2.4.201602042048
[INFO] 
[INFO] --- maven-clean-plugin:2.5:clean (default-clean-1) @ org.eclipse.ajdt.releng ---
[INFO] 
[INFO] --- maven-resources-plugin:2.4.3:resources (default-resources) @ org.eclipse.ajdt.releng ---
[WARNING] Using platform encoding (UTF-8 actually) to copy filtered resources, i.e. build is platform dependent!
[INFO] skip non existing resourceDirectory /jobs/genie.ajdt/ajdt-on-eclipse-45/workspace/org.eclipse.ajdt.releng/src/main/resources
[INFO] 
[INFO] --- target-platform-configuration:0.23.1:target-platform (default-target-platform) @ org.eclipse.ajdt.releng ---
[INFO] 
[INFO] --- tycho-p2-publisher-plugin:0.23.1:publish-products (default-publish-products) @ org.eclipse.ajdt.releng ---
[INFO] 
[INFO] --- tycho-p2-publisher-plugin:0.23.1:publish-categories (default-publish-categories) @ org.eclipse.ajdt.releng ---
[INFO] 
[INFO] --- tycho-p2-publisher-plugin:0.23.1:attach-artifacts (default-attach-artifacts) @ org.eclipse.ajdt.releng ---
[INFO] 
[INFO] --- tycho-p2-repository-plugin:0.23.1:assemble-repository (default-assemble-repository) @ org.eclipse.ajdt.releng ---
[INFO] 
[INFO] --- tycho-p2-repository-plugin:0.23.1:archive-repository (default-archive-repository) @ org.eclipse.ajdt.releng ---
[INFO] Building zip: /jobs/genie.ajdt/ajdt-on-eclipse-45/workspace/org.eclipse.ajdt.releng/target/ajdt-e45-2.2.4.201602042048.zip
[INFO] 
[INFO] --- maven-antrun-plugin:1.7:run (default) @ org.eclipse.ajdt.releng ---
[WARNING] Parameter tasks is deprecated, use target instead
[INFO] Executing tasks

main:
[propertyfile] Creating new property file: /jobs/genie.ajdt/ajdt-on-eclipse-45/workspace/org.eclipse.ajdt.releng/target/ajdt-zip.properties
[INFO] Executed tasks
[INFO] 
[INFO] --- maven-antrun-plugin:1.7:run (update-composite-update-site) @ org.eclipse.ajdt.releng ---
[INFO] Executing tasks

main:
  [taskdef] Could not load definitions from resource net/sf/antcontrib/antcontrib.properties. It could not be found.
     [copy] Copying 1 file to /jobs/genie.ajdt/ajdt-on-eclipse-45/workspace/org.eclipse.ajdt.releng/target
     [copy] Copying 1 file to /jobs/genie.ajdt/ajdt-on-eclipse-45/workspace/org.eclipse.ajdt.releng/target
     [copy] Copying 1 file to /jobs/genie.ajdt/ajdt-on-eclipse-45/workspace/org.eclipse.ajdt.releng/target
  [replace] Replaced 1 occurrences in 1 files.
  [replace] Replaced 1 occurrences in 1 files.
  [replace] Replaced 1 occurrences in 1 files.
  [replace] Replaced 1 occurrences in 1 files.
[INFO] Executed tasks
[INFO] 
[INFO] --- eclipse-jarsigner-plugin:1.0.4:sign (sign) @ org.eclipse.ajdt.releng ---
[INFO] 
[INFO] --- tycho-p2-plugin:0.23.1:p2-metadata (p2-metadata) @ org.eclipse.ajdt.releng ---
[INFO] ------------------------------------------------------------------------
[INFO] Reactor Summary:
[INFO] 
[INFO] parent ............................................. SUCCESS [  0.239 s]
[INFO] org.aspectj.runtime ................................ SUCCESS [  3.271 s]
[INFO] org.aspectj.weaver ................................. SUCCESS [  3.780 s]
[INFO] org.aspectj.ajde ................................... SUCCESS [  7.340 s]
[INFO] org.aspectj ........................................ SUCCESS [  2.235 s]
[INFO] org.eclipse.contribution.weaving.jdt ............... SUCCESS [  5.675 s]
[INFO] org.eclipse.ajdt.core .............................. SUCCESS [ 10.414 s]
[INFO] org.eclipse.ajdt.doc.user .......................... SUCCESS [  1.842 s]
[INFO] org.eclipse.ajdt.examples .......................... SUCCESS [  3.267 s]
[INFO] org.eclipse.contribution.visualiser ................ SUCCESS [  4.561 s]
[INFO] org.eclipse.contribution.xref.core ................. SUCCESS [  5.744 s]
[INFO] org.eclipse.contribution.xref.ui ................... SUCCESS [  2.996 s]
[INFO] org.eclipse.ajdt.ui ................................ SUCCESS [  8.867 s]
[INFO] org.eclipse.aspectj ................................ SUCCESS [  1.435 s]
[INFO] org.eclipse.ajdt.mylyn.ui .......................... SUCCESS [  2.724 s]
[INFO] org.eclipse.equinox.weaving.aspectj ................ SUCCESS [  3.004 s]
[INFO] org.eclipse.equinox.weaving.sdk .................... SUCCESS [  1.087 s]
[INFO] org.eclipse.ajdt ................................... SUCCESS [  2.909 s]
[INFO] org.eclipse.contribution.weaving ................... SUCCESS [  2.507 s]
[INFO] org.eclipse.contribution.xref ...................... SUCCESS [  2.112 s]
[INFO] org.eclipse.ajdt.sdk ............................... SUCCESS [  1.274 s]
[INFO] org.eclipse.ajdt.core.tests ........................ SUCCESS [35:01 min]
[INFO] org.eclipse.contribution.visualiser.tests .......... SUCCESS [ 16.371 s]
[INFO] org.eclipse.ajdt.ui.tests .......................... SUCCESS [37:04 min]
[INFO] org.eclipse.ajdt.mylyn.ui.tests .................... SUCCESS [  1.210 s]
[INFO] org.eclipse.contribution.weaving.jdt.tests ......... SUCCESS [01:15 min]
[INFO] org.eclipse.contribution.xref.core.tests ........... SUCCESS [ 13.480 s]
[INFO] org.eclipse.contribution.xref.ui.tests ............. SUCCESS [ 14.886 s]
[INFO] org.eclipse.aspectj.feature_tests .................. SUCCESS [  1.258 s]
[INFO] org.eclipse.ajdt.releng ............................ SUCCESS [  3.537 s]
[INFO] ------------------------------------------------------------------------
[INFO] BUILD SUCCESS
[INFO] ------------------------------------------------------------------------
[INFO] Total time: 01:16 h
[INFO] Finished at: 2016-02-04T17:04:17-05:00
[INFO] Final Memory: 293M/6629M
[INFO] ------------------------------------------------------------------------
[DEBUG] Closing connection to remote
[DEBUG] Waiting for process to finish
[DEBUG] Result: 0
[workspace] $ /bin/sh -xe /tmp/genie.ajdt/hudson3027802022171706290.sh
+ cd org.eclipse.ajdt.releng/target
++ pwd
+ targetdir=/jobs/genie.ajdt/ajdt-on-eclipse-45/workspace/org.eclipse.ajdt.releng/target
+ zipfile=(ajdt-e45*.zip)
++ basename ajdt-e45-2.2.4.201602042048.zip .zip
+ zipname=ajdt-e45-2.2.4.201602042048
+ echo ajdt-e45-2.2.4.201602042048.zip
ajdt-e45-2.2.4.201602042048.zip
+ cp ajdt-e45-2.2.4.201602042048.zip /home/data/httpd/download.eclipse.org/tools/ajdt/45/dev/update
+ cd /home/data/httpd/download.eclipse.org/tools/ajdt/45/dev/update
+ unzip -o ajdt-e45-2.2.4.201602042048.zip -d ajdt-e45-2.2.4.201602042048
Archive:  ajdt-e45-2.2.4.201602042048.zip
   creating: ajdt-e45-2.2.4.201602042048/features/
   creating: ajdt-e45-2.2.4.201602042048/plugins/
  inflating: ajdt-e45-2.2.4.201602042048/features/org.eclipse.ajdt_2.2.4.201602042048.jar  
  inflating: ajdt-e45-2.2.4.201602042048/features/org.eclipse.contribution.weaving_2.2.4.201602042048.jar  
  inflating: ajdt-e45-2.2.4.201602042048/features/org.eclipse.contribution.xref_2.2.4.201602042048.jar  
  inflating: ajdt-e45-2.2.4.201602042048/features/org.eclipse.ajdt.source_2.2.4.201602042048.jar  
  inflating: ajdt-e45-2.2.4.201602042048/features/org.eclipse.contribution.xref.source_2.2.4.201602042048.jar  
  inflating: ajdt-e45-2.2.4.201602042048/features/org.eclipse.contribution.weaving.source_2.2.4.201602042048.jar  
  inflating: ajdt-e45-2.2.4.201602042048/features/org.aspectj.source_1.8.9.201602042048.jar  
  inflating: ajdt-e45-2.2.4.201602042048/features/org.eclipse.equinox.weaving.sdk_1.2.0.201602042048.jar  
  inflating: ajdt-e45-2.2.4.201602042048/features/org.aspectj_1.8.9.201602042048.jar  
  inflating: ajdt-e45-2.2.4.201602042048/plugins/org.eclipse.ajdt.examples_2.2.4.201602042048.jar  
  inflating: ajdt-e45-2.2.4.201602042048/plugins/org.eclipse.ajdt.mylyn.ui_2.2.4.201602042048.jar  
  inflating: ajdt-e45-2.2.4.201602042048/plugins/org.aspectj.runtime.source_1.8.9.201602042048.jar  
  inflating: ajdt-e45-2.2.4.201602042048/plugins/org.eclipse.ajdt.core.source_2.2.4.201602042048.jar  
  inflating: ajdt-e45-2.2.4.201602042048/plugins/org.eclipse.contribution.xref.ui_2.2.4.201602042048.jar  
  inflating: ajdt-e45-2.2.4.201602042048/plugins/org.eclipse.ajdt.ui_2.2.4.201602042048.jar  
  inflating: ajdt-e45-2.2.4.201602042048/plugins/org.aspectj.weaver.source_1.8.9.201602042048.jar  
  inflating: ajdt-e45-2.2.4.201602042048/plugins/org.eclipse.aspectj_2.2.4.201602042048.jar  
  inflating: ajdt-e45-2.2.4.201602042048/plugins/org.eclipse.ajdt.ui.source_2.2.4.201602042048.jar  
  inflating: ajdt-e45-2.2.4.201602042048/plugins/org.eclipse.contribution.xref.core_2.2.4.201602042048.jar  
  inflating: ajdt-e45-2.2.4.201602042048/plugins/org.eclipse.equinox.weaving.hook_1.1.100.v20140821-1915.jar.pack.gz  
  inflating: ajdt-e45-2.2.4.201602042048/plugins/org.eclipse.contribution.xref.ui.source_2.2.4.201602042048.jar  
  inflating: ajdt-e45-2.2.4.201602042048/plugins/org.aspectj.runtime_1.8.9.201602042048.jar  
  inflating: ajdt-e45-2.2.4.201602042048/plugins/org.eclipse.ajdt.mylyn.ui.source_2.2.4.201602042048.jar  
  inflating: ajdt-e45-2.2.4.201602042048/plugins/org.eclipse.ajdt.doc.user_2.2.4.201602042048.jar  
  inflating: ajdt-e45-2.2.4.201602042048/plugins/org.eclipse.contribution.xref.core.source_2.2.4.201602042048.jar  
  inflating: ajdt-e45-2.2.4.201602042048/plugins/org.eclipse.equinox.weaving.aspectj_1.0.400.201602042048.jar  
  inflating: ajdt-e45-2.2.4.201602042048/plugins/org.eclipse.ajdt.core_2.2.4.201602042048.jar  
  inflating: ajdt-e45-2.2.4.201602042048/plugins/org.eclipse.equinox.weaving.caching_1.0.400.v20140529-1734.jar  
  inflating: ajdt-e45-2.2.4.201602042048/plugins/org.eclipse.contribution.visualiser_2.2.4.201602042048.jar  
  inflating: ajdt-e45-2.2.4.201602042048/plugins/org.eclipse.equinox.weaving.caching_1.0.400.v20140529-1734.jar.pack.gz  
  inflating: ajdt-e45-2.2.4.201602042048/plugins/org.aspectj.ajde_1.8.9.201602042048.jar  
  inflating: ajdt-e45-2.2.4.201602042048/plugins/org.aspectj.weaver_1.8.9.201602042048.jar  
  inflating: ajdt-e45-2.2.4.201602042048/plugins/org.aspectj.ajde.source_1.8.9.201602042048.jar  
  inflating: ajdt-e45-2.2.4.201602042048/plugins/org.eclipse.ajdt.examples.source_2.2.4.201602042048.jar  
  inflating: ajdt-e45-2.2.4.201602042048/plugins/org.eclipse.contribution.weaving.jdt.source_2.2.4.201602042048.jar  
  inflating: ajdt-e45-2.2.4.201602042048/plugins/org.eclipse.equinox.weaving.hook_1.1.100.v20140821-1915.jar  
  inflating: ajdt-e45-2.2.4.201602042048/plugins/org.eclipse.contribution.visualiser.source_2.2.4.201602042048.jar  
  inflating: ajdt-e45-2.2.4.201602042048/plugins/org.eclipse.contribution.weaving.jdt_2.2.4.201602042048.jar  
  inflating: ajdt-e45-2.2.4.201602042048/artifacts.jar  
  inflating: ajdt-e45-2.2.4.201602042048/content.jar  
+ cp /jobs/genie.ajdt/ajdt-on-eclipse-45/workspace/org.eclipse.ajdt.releng/target/compositeArtifacts.xml .
+ cp /jobs/genie.ajdt/ajdt-on-eclipse-45/workspace/org.eclipse.ajdt.releng/target/compositeContent.xml .
+ cp /jobs/genie.ajdt/ajdt-on-eclipse-45/workspace/org.eclipse.ajdt.releng/target/p2.index .
Terminating xvnc.
Recording test results
Finished: UNSTABLE