AbortedConsole Output

Skipping 813 KB.. Full Log
ces
Classpath = /jobs/genie.ajdt/ajdt-on-eclipse-45/workspace/org.eclipse.ajdt.core.tests/target/work/data/Bug273334/bin:/opt/public/common/jdk1.7.0_80/jre/lib/resources.jar:/opt/public/common/jdk1.7.0_80/jre/lib/rt.jar:/opt/public/common/jdk1.7.0_80/jre/lib/jsse.jar:/opt/public/common/jdk1.7.0_80/jre/lib/jce.jar:/opt/public/common/jdk1.7.0_80/jre/lib/charsets.jar:/opt/public/common/jdk1.7.0_80/jre/lib/jfr.jar:/opt/public/common/jdk1.7.0_80/jre/lib/ext/dnsns.jar:/opt/public/common/jdk1.7.0_80/jre/lib/ext/sunpkcs11.jar:/opt/public/common/jdk1.7.0_80/jre/lib/ext/zipfs.jar:/opt/public/common/jdk1.7.0_80/jre/lib/ext/sunec.jar:/opt/public/common/jdk1.7.0_80/jre/lib/ext/sunjce_provider.jar:/opt/public/common/jdk1.7.0_80/jre/lib/ext/localedata.jar:/jobs/genie.ajdt/ajdt-on-eclipse-45/workspace/org.aspectj.runtime/target/org.aspectj.runtime-1.8.7-SNAPSHOT.jar:
Timer event: 2ms: Pre compile
Compiler configuration for project Bug273334 has been read by compiler.  Resetting.
     Configuration was [PROJECTSOURCEFILES_CHANGED, JAVAOPTIONS_CHANGED, ASPECTPATH_CHANGED, CLASSPATH_CHANGED, INPATH_CHANGED, NONSTANDARDOPTIONS_CHANGED, OUTJAR_CHANGED, PROJECTSOURCERESOURCES_CHANGED, OUTPUTDESTINATIONS_CHANGED, INJARS_CHANGED]
Resetting list of modified source files.  Was null
Preparing for build: not going to be incremental because no successful previous full build
AJC: compiling source files
Timer event: 32ms: Time to first compiled message
AJC: compiled: /jobs/genie.ajdt/ajdt-on-eclipse-45/workspace/org.eclipse.ajdt.core.tests/target/work/data/Bug273334/src/a/DeclaresITDs.aj
Timer event: 34ms: Time to first woven message
AJC: woven aspect a.DeclaresITDs (from /jobs/genie.ajdt/ajdt-on-eclipse-45/workspace/org.eclipse.ajdt.core.tests/target/work/data/Bug273334/src/a/DeclaresITDs.aj)
AJC: compiled: /jobs/genie.ajdt/ajdt-on-eclipse-45/workspace/org.eclipse.ajdt.core.tests/target/work/data/Bug273334/src/a/HasAnITD.java
AJC: woven class a.HasAnITD (from /jobs/genie.ajdt/ajdt-on-eclipse-45/workspace/org.eclipse.ajdt.core.tests/target/work/data/Bug273334/src/a/HasAnITD.java)
AJC: compiled: /jobs/genie.ajdt/ajdt-on-eclipse-45/workspace/org.eclipse.ajdt.core.tests/target/work/data/Bug273334/src/a/AThird.java
AJC: woven class a.AThird (from /jobs/genie.ajdt/ajdt-on-eclipse-45/workspace/org.eclipse.ajdt.core.tests/target/work/data/Bug273334/src/a/AThird.java)
AspectJ reports build successful, build was: FULL
AJDE Callback: finish. Was full build: true
Timer event: 38ms: Total time spent in AJDE
Timer event: 0ms: Refresh after build
Types affected during build = 3
Timer event: 0ms: Delete markers: Bug273334 (Finished deleting markers for Bug273334)
Timer event: 2ms: Create markers: Bug273334 (Finished creating markers for Bug273334)
Created 3 markers in 3 files
Crosscutting model sanity checked with no problems
Timer event: 4ms: Model sanity check for: Bug273334
Timer event: 45ms: Total time spent in AJBuilder.build()
===========================================================================================
Build kind = AUTOBUILD
Project=DefaultEmptyProject, kind of build requested=Incremental AspectJ compilation
Timer event: 0ms: Flush included source file cache
Timer event: 0ms: Check delta
CoreCompilerConfiguration for project DefaultEmptyProject registered a configuration change: [PROJECTSOURCEFILES_CHANGED]
CoreCompilerConfiguration for project DefaultEmptyProject registered a configuration change: [PROJECTSOURCEFILES_CHANGED]
build: Examined delta - 0 changed, 0 added, and 2 deleted source files in required project DefaultEmptyProject
CoreCompilerConfiguration for project DefaultEmptyProject registered a configuration change: [ASPECTPATH_CHANGED, CLASSPATH_CHANGED, INPATH_CHANGED, OUTPUTDESTINATIONS_CHANGED]
CoreCompilerConfiguration for project DefaultEmptyProject registered a configuration change: [JAVAOPTIONS_CHANGED, NONSTANDARDOPTIONS_CHANGED, OUTJAR_CHANGED]
Timer event: 0ms: Looking for and marking configuration changes in DefaultEmptyProject
	Configuration changes found: true
Timer event: 1ms: Look for source/resource changes
Setting list of classpath elements with modified contents:
      []
Classpath = /jobs/genie.ajdt/ajdt-on-eclipse-45/workspace/org.eclipse.ajdt.core.tests/target/work/data/DefaultEmptyProject/bin:/jobs/genie.ajdt/ajdt-on-eclipse-45/workspace/org.aspectj.runtime/target/org.aspectj.runtime-1.8.7-SNAPSHOT.jar:/opt/public/common/jdk1.7.0_80/jre/lib/resources.jar:/opt/public/common/jdk1.7.0_80/jre/lib/rt.jar:/opt/public/common/jdk1.7.0_80/jre/lib/jsse.jar:/opt/public/common/jdk1.7.0_80/jre/lib/jce.jar:/opt/public/common/jdk1.7.0_80/jre/lib/charsets.jar:/opt/public/common/jdk1.7.0_80/jre/lib/jfr.jar:/opt/public/common/jdk1.7.0_80/jre/lib/ext/dnsns.jar:/opt/public/common/jdk1.7.0_80/jre/lib/ext/sunpkcs11.jar:/opt/public/common/jdk1.7.0_80/jre/lib/ext/zipfs.jar:/opt/public/common/jdk1.7.0_80/jre/lib/ext/sunec.jar:/opt/public/common/jdk1.7.0_80/jre/lib/ext/sunjce_provider.jar:/opt/public/common/jdk1.7.0_80/jre/lib/ext/localedata.jar:/jobs/genie.ajdt/ajdt-on-eclipse-45/workspace/org.eclipse.ajdt.core.tests/target/work/configuration/org.eclipse.osgi/40/0/.cp/junit.jar:/jobs/genie.ajdt/ajdt-on-eclipse-45/workspace/org.eclipse.ajdt.core.tests/target/work/configuration/org.eclipse.osgi/218/0/.cp:
Timer event: 5ms: Pre compile
Sending the following configuration changes to the compiler: [PROJECTSOURCEFILES_CHANGED, JAVAOPTIONS_CHANGED, ASPECTPATH_CHANGED, CLASSPATH_CHANGED, INPATH_CHANGED, NONSTANDARDOPTIONS_CHANGED, OUTJAR_CHANGED, OUTPUTDESTINATIONS_CHANGED]
Compiler configuration for project DefaultEmptyProject has been read by compiler.  Resetting.
     Configuration was [PROJECTSOURCEFILES_CHANGED, JAVAOPTIONS_CHANGED, ASPECTPATH_CHANGED, CLASSPATH_CHANGED, INPATH_CHANGED, NONSTANDARDOPTIONS_CHANGED, OUTJAR_CHANGED, OUTPUTDESTINATIONS_CHANGED]
Resetting list of modified source files.  Was []
ClassFileChangeChecking: failed to find a state instance managing output location : /jobs/genie.ajdt/ajdt-on-eclipse-45/workspace/org.eclipse.ajdt.core.tests/target/work/configuration/org.eclipse.osgi/218/0/.cp (could be getting managed by JDT)
Preparing for build: not going to be incremental because an aspect was deleted
Falling back to batch compilation
Preparing for build: not going to be incremental because no successful previous full build
AJC: compiling source files
AspectJ reports build successful, build was: FULL
AJDE Callback: finish. Was full build: true
Timer event: 10ms: Total time spent in AJDE
Timer event: 0ms: Refresh after build
Crosscutting model sanity checked with no problems
Timer event: 0ms: Model sanity check for: DefaultEmptyProject
Timer event: 15ms: Total time spent in AJBuilder.build()
===Code Select.  Unit: DeclaresITDs.aj [ 248, 13 ]
===Code Select.  Unit: DeclaresITDs.aj [ 272, 13 ]
===Code Select.  Unit: DeclaresITDs.aj [ 291, 12 ]
===Code Select.  Unit: DeclaresITDs.aj [ 314, 12 ]
Timer event: 0ms: Update visualizer, xref, advice listeners for (separate thread): Bug273334
Timer event: 0ms: Update visualizer, xref, advice listeners for (separate thread): DefaultEmptyProject
------------------------
Starting testOtherFileHyperlink
Compiler configuration for project Bug273334 doesn't know previous state, so assuming EVERYTHING has changed.
===========================================================================================
Build kind = FULLBUILD
Project=Bug273334, kind of build requested=Full AspectJ compilation
Timer event: 0ms: Flush included source file cache
Timer event: 0ms: Check delta
Builder: Tidied output folder(s), removed class files and derived resources
Classpath = /jobs/genie.ajdt/ajdt-on-eclipse-45/workspace/org.eclipse.ajdt.core.tests/target/work/data/Bug273334/bin:/opt/public/common/jdk1.7.0_80/jre/lib/resources.jar:/opt/public/common/jdk1.7.0_80/jre/lib/rt.jar:/opt/public/common/jdk1.7.0_80/jre/lib/jsse.jar:/opt/public/common/jdk1.7.0_80/jre/lib/jce.jar:/opt/public/common/jdk1.7.0_80/jre/lib/charsets.jar:/opt/public/common/jdk1.7.0_80/jre/lib/jfr.jar:/opt/public/common/jdk1.7.0_80/jre/lib/ext/dnsns.jar:/opt/public/common/jdk1.7.0_80/jre/lib/ext/sunpkcs11.jar:/opt/public/common/jdk1.7.0_80/jre/lib/ext/zipfs.jar:/opt/public/common/jdk1.7.0_80/jre/lib/ext/sunec.jar:/opt/public/common/jdk1.7.0_80/jre/lib/ext/sunjce_provider.jar:/opt/public/common/jdk1.7.0_80/jre/lib/ext/localedata.jar:/jobs/genie.ajdt/ajdt-on-eclipse-45/workspace/org.aspectj.runtime/target/org.aspectj.runtime-1.8.7-SNAPSHOT.jar:
Timer event: 2ms: Pre compile
Compiler configuration for project Bug273334 has been read by compiler.  Resetting.
     Configuration was [PROJECTSOURCEFILES_CHANGED, JAVAOPTIONS_CHANGED, ASPECTPATH_CHANGED, CLASSPATH_CHANGED, INPATH_CHANGED, NONSTANDARDOPTIONS_CHANGED, OUTJAR_CHANGED, PROJECTSOURCERESOURCES_CHANGED, OUTPUTDESTINATIONS_CHANGED, INJARS_CHANGED]
Resetting list of modified source files.  Was null
Preparing for build: not going to be incremental because no successful previous full build
AJC: compiling source files
Timer event: 34ms: Time to first compiled message
AJC: compiled: /jobs/genie.ajdt/ajdt-on-eclipse-45/workspace/org.eclipse.ajdt.core.tests/target/work/data/Bug273334/src/a/DeclaresITDs.aj
Timer event: 35ms: Time to first woven message
AJC: woven aspect a.DeclaresITDs (from /jobs/genie.ajdt/ajdt-on-eclipse-45/workspace/org.eclipse.ajdt.core.tests/target/work/data/Bug273334/src/a/DeclaresITDs.aj)
AJC: compiled: /jobs/genie.ajdt/ajdt-on-eclipse-45/workspace/org.eclipse.ajdt.core.tests/target/work/data/Bug273334/src/a/HasAnITD.java
AJC: woven class a.HasAnITD (from /jobs/genie.ajdt/ajdt-on-eclipse-45/workspace/org.eclipse.ajdt.core.tests/target/work/data/Bug273334/src/a/HasAnITD.java)
AJC: compiled: /jobs/genie.ajdt/ajdt-on-eclipse-45/workspace/org.eclipse.ajdt.core.tests/target/work/data/Bug273334/src/a/AThird.java
AJC: woven class a.AThird (from /jobs/genie.ajdt/ajdt-on-eclipse-45/workspace/org.eclipse.ajdt.core.tests/target/work/data/Bug273334/src/a/AThird.java)
AspectJ reports build successful, build was: FULL
AJDE Callback: finish. Was full build: true
Timer event: 40ms: Total time spent in AJDE
Timer event: 0ms: Refresh after build
Types affected during build = 3
Timer event: 1ms: Delete markers: Bug273334 (Finished deleting markers for Bug273334)
Timer event: 1ms: Create markers: Bug273334 (Finished creating markers for Bug273334)
Created 3 markers in 3 files
Crosscutting model sanity checked with no problems
Timer event: 4ms: Model sanity check for: Bug273334
Timer event: 46ms: Total time spent in AJBuilder.build()
===========================================================================================
Build kind = AUTOBUILD
Project=DefaultEmptyProject, kind of build requested=Incremental AspectJ compilation
Timer event: 0ms: Flush included source file cache
Timer event: 0ms: Check delta
CoreCompilerConfiguration for project DefaultEmptyProject registered a configuration change: [ASPECTPATH_CHANGED, CLASSPATH_CHANGED, INPATH_CHANGED, OUTPUTDESTINATIONS_CHANGED]
Timer event: 0ms: Looking for and marking configuration changes in DefaultEmptyProject
	Configuration changes found: true
Timer event: 1ms: Look for source/resource changes
Setting list of classpath elements with modified contents:
      []
Classpath = /jobs/genie.ajdt/ajdt-on-eclipse-45/workspace/org.eclipse.ajdt.core.tests/target/work/data/DefaultEmptyProject/bin:/jobs/genie.ajdt/ajdt-on-eclipse-45/workspace/org.aspectj.runtime/target/org.aspectj.runtime-1.8.7-SNAPSHOT.jar:/opt/public/common/jdk1.7.0_80/jre/lib/resources.jar:/opt/public/common/jdk1.7.0_80/jre/lib/rt.jar:/opt/public/common/jdk1.7.0_80/jre/lib/jsse.jar:/opt/public/common/jdk1.7.0_80/jre/lib/jce.jar:/opt/public/common/jdk1.7.0_80/jre/lib/charsets.jar:/opt/public/common/jdk1.7.0_80/jre/lib/jfr.jar:/opt/public/common/jdk1.7.0_80/jre/lib/ext/dnsns.jar:/opt/public/common/jdk1.7.0_80/jre/lib/ext/sunpkcs11.jar:/opt/public/common/jdk1.7.0_80/jre/lib/ext/zipfs.jar:/opt/public/common/jdk1.7.0_80/jre/lib/ext/sunec.jar:/opt/public/common/jdk1.7.0_80/jre/lib/ext/sunjce_provider.jar:/opt/public/common/jdk1.7.0_80/jre/lib/ext/localedata.jar:/jobs/genie.ajdt/ajdt-on-eclipse-45/workspace/org.eclipse.ajdt.core.tests/target/work/configuration/org.eclipse.osgi/40/0/.cp/junit.jar:/jobs/genie.ajdt/ajdt-on-eclipse-45/workspace/org.eclipse.ajdt.core.tests/target/work/configuration/org.eclipse.osgi/218/0/.cp:
Timer event: 9ms: Pre compile
Sending the following configuration changes to the compiler: [ASPECTPATH_CHANGED, CLASSPATH_CHANGED, INPATH_CHANGED, OUTPUTDESTINATIONS_CHANGED]
Compiler configuration for project DefaultEmptyProject has been read by compiler.  Resetting.
     Configuration was [ASPECTPATH_CHANGED, CLASSPATH_CHANGED, INPATH_CHANGED, OUTPUTDESTINATIONS_CHANGED]
Resetting list of modified source files.  Was []
ClassFileChangeChecking: failed to find a state instance managing output location : /jobs/genie.ajdt/ajdt-on-eclipse-45/workspace/org.eclipse.ajdt.core.tests/target/work/configuration/org.eclipse.osgi/218/0/.cp (could be getting managed by JDT)
Timer event: 0ms: OutputLocationManager: binary folder to declaring project map creation: P/DefaultEmptyProject
Preparing for build: planning to be an incremental build
AspectJ reports build successful, build was: INCREMENTAL
AJDE Callback: finish. Was full build: false
Timer event: 7ms: Total time spent in AJDE
Timer event: 0ms: Refresh after build
Crosscutting model sanity checked with no problems
Timer event: 0ms: Model sanity check for: DefaultEmptyProject
Timer event: 18ms: Total time spent in AJBuilder.build()
===Code Select.  Unit: AThird.java [ 97, 5 ]
===Code Select.  Unit: AThird.java [ 70, 6 ]
Timer event: 0ms: Update visualizer, xref, advice listeners for (separate thread): Bug273334
Timer event: 0ms: Update visualizer, xref, advice listeners for (separate thread): DefaultEmptyProject
------------------------
Starting testAspectFileHyperlink
Compiler configuration for project Bug273334 doesn't know previous state, so assuming EVERYTHING has changed.
===========================================================================================
Build kind = FULLBUILD
Project=Bug273334, kind of build requested=Full AspectJ compilation
Timer event: 0ms: Flush included source file cache
Timer event: 0ms: Check delta
Builder: Tidied output folder(s), removed class files and derived resources
Classpath = /jobs/genie.ajdt/ajdt-on-eclipse-45/workspace/org.eclipse.ajdt.core.tests/target/work/data/Bug273334/bin:/opt/public/common/jdk1.7.0_80/jre/lib/resources.jar:/opt/public/common/jdk1.7.0_80/jre/lib/rt.jar:/opt/public/common/jdk1.7.0_80/jre/lib/jsse.jar:/opt/public/common/jdk1.7.0_80/jre/lib/jce.jar:/opt/public/common/jdk1.7.0_80/jre/lib/charsets.jar:/opt/public/common/jdk1.7.0_80/jre/lib/jfr.jar:/opt/public/common/jdk1.7.0_80/jre/lib/ext/dnsns.jar:/opt/public/common/jdk1.7.0_80/jre/lib/ext/sunpkcs11.jar:/opt/public/common/jdk1.7.0_80/jre/lib/ext/zipfs.jar:/opt/public/common/jdk1.7.0_80/jre/lib/ext/sunec.jar:/opt/public/common/jdk1.7.0_80/jre/lib/ext/sunjce_provider.jar:/opt/public/common/jdk1.7.0_80/jre/lib/ext/localedata.jar:/jobs/genie.ajdt/ajdt-on-eclipse-45/workspace/org.aspectj.runtime/target/org.aspectj.runtime-1.8.7-SNAPSHOT.jar:
Timer event: 1ms: Pre compile
Compiler configuration for project Bug273334 has been read by compiler.  Resetting.
     Configuration was [PROJECTSOURCEFILES_CHANGED, JAVAOPTIONS_CHANGED, ASPECTPATH_CHANGED, CLASSPATH_CHANGED, INPATH_CHANGED, NONSTANDARDOPTIONS_CHANGED, OUTJAR_CHANGED, PROJECTSOURCERESOURCES_CHANGED, OUTPUTDESTINATIONS_CHANGED, INJARS_CHANGED]
Resetting list of modified source files.  Was null
Preparing for build: not going to be incremental because no successful previous full build
AJC: compiling source files
Timer event: 32ms: Time to first compiled message
AJC: compiled: /jobs/genie.ajdt/ajdt-on-eclipse-45/workspace/org.eclipse.ajdt.core.tests/target/work/data/Bug273334/src/a/DeclaresITDs.aj
Timer event: 34ms: Time to first woven message
AJC: woven aspect a.DeclaresITDs (from /jobs/genie.ajdt/ajdt-on-eclipse-45/workspace/org.eclipse.ajdt.core.tests/target/work/data/Bug273334/src/a/DeclaresITDs.aj)
AJC: compiled: /jobs/genie.ajdt/ajdt-on-eclipse-45/workspace/org.eclipse.ajdt.core.tests/target/work/data/Bug273334/src/a/HasAnITD.java
AJC: woven class a.HasAnITD (from /jobs/genie.ajdt/ajdt-on-eclipse-45/workspace/org.eclipse.ajdt.core.tests/target/work/data/Bug273334/src/a/HasAnITD.java)
AJC: compiled: /jobs/genie.ajdt/ajdt-on-eclipse-45/workspace/org.eclipse.ajdt.core.tests/target/work/data/Bug273334/src/a/AThird.java
AJC: woven class a.AThird (from /jobs/genie.ajdt/ajdt-on-eclipse-45/workspace/org.eclipse.ajdt.core.tests/target/work/data/Bug273334/src/a/AThird.java)
AspectJ reports build successful, build was: FULL
AJDE Callback: finish. Was full build: true
Timer event: 39ms: Total time spent in AJDE
Timer event: 0ms: Refresh after build
Types affected during build = 3
Timer event: 0ms: Delete markers: Bug273334 (Finished deleting markers for Bug273334)
Crosscutting model sanity checked with no problems
Timer event: 3ms: Model sanity check for: Bug273334
Timer event: 44ms: Total time spent in AJBuilder.build()
Timer event: 4ms: Create markers: Bug273334 (Finished creating markers for Bug273334)
Created 3 markers in 3 files
===========================================================================================
Build kind = AUTOBUILD
Project=DefaultEmptyProject, kind of build requested=Incremental AspectJ compilation
Timer event: 0ms: Flush included source file cache
Timer event: 0ms: Check delta
CoreCompilerConfiguration for project DefaultEmptyProject registered a configuration change: [ASPECTPATH_CHANGED, CLASSPATH_CHANGED, INPATH_CHANGED, OUTPUTDESTINATIONS_CHANGED]
Timer event: 0ms: Looking for and marking configuration changes in DefaultEmptyProject
	Configuration changes found: true
Timer event: 0ms: Look for source/resource changes
Setting list of classpath elements with modified contents:
      []
Classpath = /jobs/genie.ajdt/ajdt-on-eclipse-45/workspace/org.eclipse.ajdt.core.tests/target/work/data/DefaultEmptyProject/bin:/jobs/genie.ajdt/ajdt-on-eclipse-45/workspace/org.aspectj.runtime/target/org.aspectj.runtime-1.8.7-SNAPSHOT.jar:/opt/public/common/jdk1.7.0_80/jre/lib/resources.jar:/opt/public/common/jdk1.7.0_80/jre/lib/rt.jar:/opt/public/common/jdk1.7.0_80/jre/lib/jsse.jar:/opt/public/common/jdk1.7.0_80/jre/lib/jce.jar:/opt/public/common/jdk1.7.0_80/jre/lib/charsets.jar:/opt/public/common/jdk1.7.0_80/jre/lib/jfr.jar:/opt/public/common/jdk1.7.0_80/jre/lib/ext/dnsns.jar:/opt/public/common/jdk1.7.0_80/jre/lib/ext/sunpkcs11.jar:/opt/public/common/jdk1.7.0_80/jre/lib/ext/zipfs.jar:/opt/public/common/jdk1.7.0_80/jre/lib/ext/sunec.jar:/opt/public/common/jdk1.7.0_80/jre/lib/ext/sunjce_provider.jar:/opt/public/common/jdk1.7.0_80/jre/lib/ext/localedata.jar:/jobs/genie.ajdt/ajdt-on-eclipse-45/workspace/org.eclipse.ajdt.core.tests/target/work/configuration/org.eclipse.osgi/40/0/.cp/junit.jar:/jobs/genie.ajdt/ajdt-on-eclipse-45/workspace/org.eclipse.ajdt.core.tests/target/work/configuration/org.eclipse.osgi/218/0/.cp:
Timer event: 7ms: Pre compile
Sending the following configuration changes to the compiler: [ASPECTPATH_CHANGED, CLASSPATH_CHANGED, INPATH_CHANGED, OUTPUTDESTINATIONS_CHANGED]
Compiler configuration for project DefaultEmptyProject has been read by compiler.  Resetting.
     Configuration was [ASPECTPATH_CHANGED, CLASSPATH_CHANGED, INPATH_CHANGED, OUTPUTDESTINATIONS_CHANGED]
Resetting list of modified source files.  Was []
ClassFileChangeChecking: failed to find a state instance managing output location : /jobs/genie.ajdt/ajdt-on-eclipse-45/workspace/org.eclipse.ajdt.core.tests/target/work/configuration/org.eclipse.osgi/218/0/.cp (could be getting managed by JDT)
Timer event: 0ms: OutputLocationManager: binary folder to declaring project map creation: P/DefaultEmptyProject
Preparing for build: planning to be an incremental build
AspectJ reports build successful, build was: INCREMENTAL
AJDE Callback: finish. Was full build: false
Timer event: 8ms: Total time spent in AJDE
Timer event: 0ms: Refresh after build
Crosscutting model sanity checked with no problems
Timer event: 0ms: Model sanity check for: DefaultEmptyProject
Timer event: 15ms: Total time spent in AJBuilder.build()
===Code Select.  Unit: DeclaresITDs.aj [ 120, 5 ]
===Code Select.  Unit: DeclaresITDs.aj [ 188, 5 ]
===Code Select.  Unit: DeclaresITDs.aj [ 206, 5 ]
===Code Select.  Unit: DeclaresITDs.aj [ 87, 6 ]
===Code Select.  Unit: DeclaresITDs.aj [ 219, 6 ]
===Code Select.  Unit: DeclaresITDs.aj [ 236, 6 ]
Timer event: 0ms: Update visualizer, xref, advice listeners for (separate thread): Bug273334
Timer event: 0ms: Update visualizer, xref, advice listeners for (separate thread): DefaultEmptyProject
------------------------
Starting testITDTargetFileHyperlink
Compiler configuration for project Bug273334 doesn't know previous state, so assuming EVERYTHING has changed.
===========================================================================================
Build kind = FULLBUILD
Project=Bug273334, kind of build requested=Full AspectJ compilation
Timer event: 0ms: Flush included source file cache
Timer event: 0ms: Check delta
Builder: Tidied output folder(s), removed class files and derived resources
Classpath = /jobs/genie.ajdt/ajdt-on-eclipse-45/workspace/org.eclipse.ajdt.core.tests/target/work/data/Bug273334/bin:/opt/public/common/jdk1.7.0_80/jre/lib/resources.jar:/opt/public/common/jdk1.7.0_80/jre/lib/rt.jar:/opt/public/common/jdk1.7.0_80/jre/lib/jsse.jar:/opt/public/common/jdk1.7.0_80/jre/lib/jce.jar:/opt/public/common/jdk1.7.0_80/jre/lib/charsets.jar:/opt/public/common/jdk1.7.0_80/jre/lib/jfr.jar:/opt/public/common/jdk1.7.0_80/jre/lib/ext/dnsns.jar:/opt/public/common/jdk1.7.0_80/jre/lib/ext/sunpkcs11.jar:/opt/public/common/jdk1.7.0_80/jre/lib/ext/zipfs.jar:/opt/public/common/jdk1.7.0_80/jre/lib/ext/sunec.jar:/opt/public/common/jdk1.7.0_80/jre/lib/ext/sunjce_provider.jar:/opt/public/common/jdk1.7.0_80/jre/lib/ext/localedata.jar:/jobs/genie.ajdt/ajdt-on-eclipse-45/workspace/org.aspectj.runtime/target/org.aspectj.runtime-1.8.7-SNAPSHOT.jar:
Timer event: 1ms: Pre compile
Compiler configuration for project Bug273334 has been read by compiler.  Resetting.
     Configuration was [PROJECTSOURCEFILES_CHANGED, JAVAOPTIONS_CHANGED, ASPECTPATH_CHANGED, CLASSPATH_CHANGED, INPATH_CHANGED, NONSTANDARDOPTIONS_CHANGED, OUTJAR_CHANGED, PROJECTSOURCERESOURCES_CHANGED, OUTPUTDESTINATIONS_CHANGED, INJARS_CHANGED]
Resetting list of modified source files.  Was null
Preparing for build: not going to be incremental because no successful previous full build
AJC: compiling source files
Timer event: 32ms: Time to first compiled message
AJC: compiled: /jobs/genie.ajdt/ajdt-on-eclipse-45/workspace/org.eclipse.ajdt.core.tests/target/work/data/Bug273334/src/a/DeclaresITDs.aj
Timer event: 33ms: Time to first woven message
AJC: woven aspect a.DeclaresITDs (from /jobs/genie.ajdt/ajdt-on-eclipse-45/workspace/org.eclipse.ajdt.core.tests/target/work/data/Bug273334/src/a/DeclaresITDs.aj)
AJC: compiled: /jobs/genie.ajdt/ajdt-on-eclipse-45/workspace/org.eclipse.ajdt.core.tests/target/work/data/Bug273334/src/a/HasAnITD.java
AJC: woven class a.HasAnITD (from /jobs/genie.ajdt/ajdt-on-eclipse-45/workspace/org.eclipse.ajdt.core.tests/target/work/data/Bug273334/src/a/HasAnITD.java)
AJC: compiled: /jobs/genie.ajdt/ajdt-on-eclipse-45/workspace/org.eclipse.ajdt.core.tests/target/work/data/Bug273334/src/a/AThird.java
AJC: woven class a.AThird (from /jobs/genie.ajdt/ajdt-on-eclipse-45/workspace/org.eclipse.ajdt.core.tests/target/work/data/Bug273334/src/a/AThird.java)
AspectJ reports build successful, build was: FULL
AJDE Callback: finish. Was full build: true
Timer event: 39ms: Total time spent in AJDE
Timer event: 0ms: Refresh after build
Types affected during build = 3
Timer event: 0ms: Delete markers: Bug273334 (Finished deleting markers for Bug273334)
Timer event: 2ms: Create markers: Bug273334 (Finished creating markers for Bug273334)
Created 3 markers in 3 files
Crosscutting model sanity checked with no problems
Timer event: 4ms: Model sanity check for: Bug273334
Timer event: 45ms: Total time spent in AJBuilder.build()
===========================================================================================
Build kind = AUTOBUILD
Project=DefaultEmptyProject, kind of build requested=Incremental AspectJ compilation
Timer event: 0ms: Flush included source file cache
Timer event: 0ms: Check delta
CoreCompilerConfiguration for project DefaultEmptyProject registered a configuration change: [ASPECTPATH_CHANGED, CLASSPATH_CHANGED, INPATH_CHANGED, OUTPUTDESTINATIONS_CHANGED]
Timer event: 1ms: Looking for and marking configuration changes in DefaultEmptyProject
	Configuration changes found: true
Timer event: 1ms: Look for source/resource changes
Setting list of classpath elements with modified contents:
      []
Classpath = /jobs/genie.ajdt/ajdt-on-eclipse-45/workspace/org.eclipse.ajdt.core.tests/target/work/data/DefaultEmptyProject/bin:/jobs/genie.ajdt/ajdt-on-eclipse-45/workspace/org.aspectj.runtime/target/org.aspectj.runtime-1.8.7-SNAPSHOT.jar:/opt/public/common/jdk1.7.0_80/jre/lib/resources.jar:/opt/public/common/jdk1.7.0_80/jre/lib/rt.jar:/opt/public/common/jdk1.7.0_80/jre/lib/jsse.jar:/opt/public/common/jdk1.7.0_80/jre/lib/jce.jar:/opt/public/common/jdk1.7.0_80/jre/lib/charsets.jar:/opt/public/common/jdk1.7.0_80/jre/lib/jfr.jar:/opt/public/common/jdk1.7.0_80/jre/lib/ext/dnsns.jar:/opt/public/common/jdk1.7.0_80/jre/lib/ext/sunpkcs11.jar:/opt/public/common/jdk1.7.0_80/jre/lib/ext/zipfs.jar:/opt/public/common/jdk1.7.0_80/jre/lib/ext/sunec.jar:/opt/public/common/jdk1.7.0_80/jre/lib/ext/sunjce_provider.jar:/opt/public/common/jdk1.7.0_80/jre/lib/ext/localedata.jar:/jobs/genie.ajdt/ajdt-on-eclipse-45/workspace/org.eclipse.ajdt.core.tests/target/work/configuration/org.eclipse.osgi/40/0/.cp/junit.jar:/jobs/genie.ajdt/ajdt-on-eclipse-45/workspace/org.eclipse.ajdt.core.tests/target/work/configuration/org.eclipse.osgi/218/0/.cp:
Timer event: 9ms: Pre compile
Sending the following configuration changes to the compiler: [ASPECTPATH_CHANGED, CLASSPATH_CHANGED, INPATH_CHANGED, OUTPUTDESTINATIONS_CHANGED]
Compiler configuration for project DefaultEmptyProject has been read by compiler.  Resetting.
     Configuration was [ASPECTPATH_CHANGED, CLASSPATH_CHANGED, INPATH_CHANGED, OUTPUTDESTINATIONS_CHANGED]
Resetting list of modified source files.  Was []
ClassFileChangeChecking: failed to find a state instance managing output location : /jobs/genie.ajdt/ajdt-on-eclipse-45/workspace/org.eclipse.ajdt.core.tests/target/work/configuration/org.eclipse.osgi/218/0/.cp (could be getting managed by JDT)
Timer event: 1ms: OutputLocationManager: binary folder to declaring project map creation: P/DefaultEmptyProject
Preparing for build: planning to be an incremental build
AspectJ reports build successful, build was: INCREMENTAL
AJDE Callback: finish. Was full build: false
Timer event: 8ms: Total time spent in AJDE
Timer event: 0ms: Refresh after build
Crosscutting model sanity checked with no problems
Timer event: 0ms: Model sanity check for: DefaultEmptyProject
Timer event: 17ms: Total time spent in AJBuilder.build()
===Code Select.  Unit: HasAnITD.java [ 64, 5 ]
===Code Select.  Unit: HasAnITD.java [ 75, 5 ]
===Code Select.  Unit: HasAnITD.java [ 91, 6 ]
===Code Select.  Unit: HasAnITD.java [ 103, 6 ]
Timer event: 0ms: Update visualizer, xref, advice listeners for (separate thread): Bug273334
Timer event: 0ms: Update visualizer, xref, advice listeners for (separate thread): DefaultEmptyProject
------------------------
Starting testITDTargetFileHyperlinkOtherProject
Compiler configuration for project Bug273334depending doesn't know previous state, so assuming EVERYTHING has changed.
===========================================================================================
Build kind = FULLBUILD
Project=Bug273334depending, kind of build requested=Full AspectJ compilation
Timer event: 0ms: Flush included source file cache
Timer event: 0ms: Check delta
Builder: Tidied output folder(s), removed class files and derived resources
Classpath = /jobs/genie.ajdt/ajdt-on-eclipse-45/workspace/org.eclipse.ajdt.core.tests/target/work/data/Bug273334depending/bin:/opt/public/common/jdk1.7.0_80/jre/lib/resources.jar:/opt/public/common/jdk1.7.0_80/jre/lib/rt.jar:/opt/public/common/jdk1.7.0_80/jre/lib/jsse.jar:/opt/public/common/jdk1.7.0_80/jre/lib/jce.jar:/opt/public/common/jdk1.7.0_80/jre/lib/charsets.jar:/opt/public/common/jdk1.7.0_80/jre/lib/jfr.jar:/opt/public/common/jdk1.7.0_80/jre/lib/ext/dnsns.jar:/opt/public/common/jdk1.7.0_80/jre/lib/ext/sunpkcs11.jar:/opt/public/common/jdk1.7.0_80/jre/lib/ext/zipfs.jar:/opt/public/common/jdk1.7.0_80/jre/lib/ext/sunec.jar:/opt/public/common/jdk1.7.0_80/jre/lib/ext/sunjce_provider.jar:/opt/public/common/jdk1.7.0_80/jre/lib/ext/localedata.jar:/jobs/genie.ajdt/ajdt-on-eclipse-45/workspace/org.aspectj.runtime/target/org.aspectj.runtime-1.8.7-SNAPSHOT.jar:
Timer event: 1ms: Pre compile
Compiler configuration for project Bug273334depending has been read by compiler.  Resetting.
     Configuration was [PROJECTSOURCEFILES_CHANGED, JAVAOPTIONS_CHANGED, ASPECTPATH_CHANGED, CLASSPATH_CHANGED, INPATH_CHANGED, NONSTANDARDOPTIONS_CHANGED, OUTJAR_CHANGED, PROJECTSOURCERESOURCES_CHANGED, OUTPUTDESTINATIONS_CHANGED, INJARS_CHANGED]
Resetting list of modified source files.  Was null
Preparing for build: not going to be incremental because no successful previous full build
AJC: compiling source files
Timer event: 32ms: Time to first compiled message
AJC: compiled: /jobs/genie.ajdt/ajdt-on-eclipse-45/workspace/org.eclipse.ajdt.core.tests/target/work/data/Bug273334depending/src/r/DeclaresITD.aj
Timer event: 34ms: Time to first woven message
AJC: woven aspect r.DeclaresITD (from /jobs/genie.ajdt/ajdt-on-eclipse-45/workspace/org.eclipse.ajdt.core.tests/target/work/data/Bug273334depending/src/r/DeclaresITD.aj)
AJC: compiled: /jobs/genie.ajdt/ajdt-on-eclipse-45/workspace/org.eclipse.ajdt.core.tests/target/work/data/Bug273334depending/src/r/HasITDs2.java
AJC: woven class r.HasITDs2 (from /jobs/genie.ajdt/ajdt-on-eclipse-45/workspace/org.eclipse.ajdt.core.tests/target/work/data/Bug273334depending/src/r/HasITDs2.java)
AJC: compiled: /jobs/genie.ajdt/ajdt-on-eclipse-45/workspace/org.eclipse.ajdt.core.tests/target/work/data/Bug273334depending/src/r/InterfaceForITD.java
AJC: woven class r.InterfaceForITD (from /jobs/genie.ajdt/ajdt-on-eclipse-45/workspace/org.eclipse.ajdt.core.tests/target/work/data/Bug273334depending/src/r/InterfaceForITD.java)
AspectJ reports build successful, build was: FULL
AJDE Callback: finish. Was full build: true
Timer event: 39ms: Total time spent in AJDE
Timer event: 0ms: Refresh after build
Types affected during build = 3
Timer event: 0ms: Delete markers: Bug273334depending (Finished deleting markers for Bug273334depending)
Crosscutting model sanity checked with no problems
Timer event: 3ms: Create markers: Bug273334depending (Finished creating markers for Bug273334depending)
Timer event: 5ms: Model sanity check for: Bug273334depending
Created 4 markers in 3 files
Timer event: 45ms: Total time spent in AJBuilder.build()
Compiler configuration for project Bug273334base doesn't know previous state, so assuming EVERYTHING has changed.
===========================================================================================
Build kind = FULLBUILD
Project=Bug273334base, kind of build requested=Full AspectJ compilation
Timer event: 0ms: Flush included source file cache
Timer event: 0ms: Check delta
Builder: Tidied output folder(s), removed class files and derived resources
Classpath = /jobs/genie.ajdt/ajdt-on-eclipse-45/workspace/org.eclipse.ajdt.core.tests/target/work/data/Bug273334base/bin:/opt/public/common/jdk1.7.0_80/jre/lib/resources.jar:/opt/public/common/jdk1.7.0_80/jre/lib/rt.jar:/opt/public/common/jdk1.7.0_80/jre/lib/jsse.jar:/opt/public/common/jdk1.7.0_80/jre/lib/jce.jar:/opt/public/common/jdk1.7.0_80/jre/lib/charsets.jar:/opt/public/common/jdk1.7.0_80/jre/lib/jfr.jar:/opt/public/common/jdk1.7.0_80/jre/lib/ext/dnsns.jar:/opt/public/common/jdk1.7.0_80/jre/lib/ext/sunpkcs11.jar:/opt/public/common/jdk1.7.0_80/jre/lib/ext/zipfs.jar:/opt/public/common/jdk1.7.0_80/jre/lib/ext/sunec.jar:/opt/public/common/jdk1.7.0_80/jre/lib/ext/sunjce_provider.jar:/opt/public/common/jdk1.7.0_80/jre/lib/ext/localedata.jar:/jobs/genie.ajdt/ajdt-on-eclipse-45/workspace/org.aspectj.runtime/target/org.aspectj.runtime-1.8.7-SNAPSHOT.jar:/jobs/genie.ajdt/ajdt-on-eclipse-45/workspace/org.eclipse.ajdt.core.tests/target/work/data/Bug273334depending/bin:
Timer event: 2ms: Pre compile
Compiler configuration for project Bug273334base has been read by compiler.  Resetting.
     Configuration was [PROJECTSOURCEFILES_CHANGED, JAVAOPTIONS_CHANGED, ASPECTPATH_CHANGED, CLASSPATH_CHANGED, INPATH_CHANGED, NONSTANDARDOPTIONS_CHANGED, OUTJAR_CHANGED, PROJECTSOURCERESOURCES_CHANGED, OUTPUTDESTINATIONS_CHANGED, INJARS_CHANGED]
Resetting list of modified source files.  Was null
Preparing for build: not going to be incremental because no successful previous full build
AJC: compiling source files
Timer event: 29ms: Time to first compiled message
AJC: compiled: /jobs/genie.ajdt/ajdt-on-eclipse-45/workspace/org.eclipse.ajdt.core.tests/target/work/data/Bug273334base/src/q/UsesITDs1.java
Timer event: 30ms: Time to first woven message
AJC: woven class q.UsesITDs1 (from /jobs/genie.ajdt/ajdt-on-eclipse-45/workspace/org.eclipse.ajdt.core.tests/target/work/data/Bug273334base/src/q/UsesITDs1.java)
AJC: compiled: /jobs/genie.ajdt/ajdt-on-eclipse-45/workspace/org.eclipse.ajdt.core.tests/target/work/data/Bug273334base/src/p/HasITDs1.java
AJC: woven class p.HasITDs1 (from /jobs/genie.ajdt/ajdt-on-eclipse-45/workspace/org.eclipse.ajdt.core.tests/target/work/data/Bug273334base/src/p/HasITDs1.java)
AspectJ reports build successful, build was: FULL
AJDE Callback: finish. Was full build: true
Timer event: 33ms: Total time spent in AJDE
Timer event: 0ms: Refresh after build
Types affected during build = 2
Timer event: 0ms: Delete markers: Bug273334base (Finished deleting markers for Bug273334base)
Crosscutting model sanity checked with no problems
Timer event: 62ms: Model sanity check for: Bug273334base
Timer event: 98ms: Total time spent in AJBuilder.build()
Timer event: 69ms: Create markers: Bug273334base (Finished creating markers for Bug273334base)
Created 1 markers in 2 files
Timer event: 0ms: Update visualizer, xref, advice listeners for (separate thread): Bug273334depending
Timer event: 0ms: Update visualizer, xref, advice listeners for (separate thread): Bug273334base
===========================================================================================
Build kind = AUTOBUILD
Project=DefaultEmptyProject, kind of build requested=Incremental AspectJ compilation
Timer event: 0ms: Flush included source file cache
Timer event: 0ms: Check delta
CoreCompilerConfiguration for project DefaultEmptyProject registered a configuration change: [ASPECTPATH_CHANGED, CLASSPATH_CHANGED, INPATH_CHANGED, OUTPUTDESTINATIONS_CHANGED]
Timer event: 1ms: Looking for and marking configuration changes in DefaultEmptyProject
	Configuration changes found: true
Timer event: 1ms: Look for source/resource changes
Setting list of classpath elements with modified contents:
      []
Classpath = /jobs/genie.ajdt/ajdt-on-eclipse-45/workspace/org.eclipse.ajdt.core.tests/target/work/data/DefaultEmptyProject/bin:/jobs/genie.ajdt/ajdt-on-eclipse-45/workspace/org.aspectj.runtime/target/org.aspectj.runtime-1.8.7-SNAPSHOT.jar:/opt/public/common/jdk1.7.0_80/jre/lib/resources.jar:/opt/public/common/jdk1.7.0_80/jre/lib/rt.jar:/opt/public/common/jdk1.7.0_80/jre/lib/jsse.jar:/opt/public/common/jdk1.7.0_80/jre/lib/jce.jar:/opt/public/common/jdk1.7.0_80/jre/lib/charsets.jar:/opt/public/common/jdk1.7.0_80/jre/lib/jfr.jar:/opt/public/common/jdk1.7.0_80/jre/lib/ext/dnsns.jar:/opt/public/common/jdk1.7.0_80/jre/lib/ext/sunpkcs11.jar:/opt/public/common/jdk1.7.0_80/jre/lib/ext/zipfs.jar:/opt/public/common/jdk1.7.0_80/jre/lib/ext/sunec.jar:/opt/public/common/jdk1.7.0_80/jre/lib/ext/sunjce_provider.jar:/opt/public/common/jdk1.7.0_80/jre/lib/ext/localedata.jar:/jobs/genie.ajdt/ajdt-on-eclipse-45/workspace/org.eclipse.ajdt.core.tests/target/work/configuration/org.eclipse.osgi/40/0/.cp/junit.jar:/jobs/genie.ajdt/ajdt-on-eclipse-45/workspace/org.eclipse.ajdt.core.tests/target/work/configuration/org.eclipse.osgi/218/0/.cp:
Timer event: 6ms: Pre compile
Sending the following configuration changes to the compiler: [ASPECTPATH_CHANGED, CLASSPATH_CHANGED, INPATH_CHANGED, OUTPUTDESTINATIONS_CHANGED]
Compiler configuration for project DefaultEmptyProject has been read by compiler.  Resetting.
     Configuration was [ASPECTPATH_CHANGED, CLASSPATH_CHANGED, INPATH_CHANGED, OUTPUTDESTINATIONS_CHANGED]
Resetting list of modified source files.  Was []
ClassFileChangeChecking: failed to find a state instance managing output location : /jobs/genie.ajdt/ajdt-on-eclipse-45/workspace/org.eclipse.ajdt.core.tests/target/work/configuration/org.eclipse.osgi/218/0/.cp (could be getting managed by JDT)
Timer event: 0ms: OutputLocationManager: binary folder to declaring project map creation: P/DefaultEmptyProject
Preparing for build: planning to be an incremental build
AspectJ reports build successful, build was: INCREMENTAL
AJDE Callback: finish. Was full build: false
Timer event: 6ms: Total time spent in AJDE
Timer event: 0ms: Refresh after build
Crosscutting model sanity checked with no problems
Timer event: 0ms: Model sanity check for: DefaultEmptyProject
Timer event: 12ms: Total time spent in AJBuilder.build()
Timer event: 0ms: Update visualizer, xref, advice listeners for (separate thread): DefaultEmptyProject
===Code Select.  Unit: UsesITDs1.java [ 134, 6 ]
===Code Select.  Unit: UsesITDs1.java [ 196, 7 ]
------------------------
Starting testITDTargetFileHyperlink
Compiler configuration for project Bug273334depending doesn't know previous state, so assuming EVERYTHING has changed.
===========================================================================================
Build kind = FULLBUILD
Project=Bug273334depending, kind of build requested=Full AspectJ compilation
Timer event: 0ms: Flush included source file cache
Timer event: 0ms: Check delta
Builder: Tidied output folder(s), removed class files and derived resources
Classpath = /jobs/genie.ajdt/ajdt-on-eclipse-45/workspace/org.eclipse.ajdt.core.tests/target/work/data/Bug273334depending/bin:/opt/public/common/jdk1.7.0_80/jre/lib/resources.jar:/opt/public/common/jdk1.7.0_80/jre/lib/rt.jar:/opt/public/common/jdk1.7.0_80/jre/lib/jsse.jar:/opt/public/common/jdk1.7.0_80/jre/lib/jce.jar:/opt/public/common/jdk1.7.0_80/jre/lib/charsets.jar:/opt/public/common/jdk1.7.0_80/jre/lib/jfr.jar:/opt/public/common/jdk1.7.0_80/jre/lib/ext/dnsns.jar:/opt/public/common/jdk1.7.0_80/jre/lib/ext/sunpkcs11.jar:/opt/public/common/jdk1.7.0_80/jre/lib/ext/zipfs.jar:/opt/public/common/jdk1.7.0_80/jre/lib/ext/sunec.jar:/opt/public/common/jdk1.7.0_80/jre/lib/ext/sunjce_provider.jar:/opt/public/common/jdk1.7.0_80/jre/lib/ext/localedata.jar:/jobs/genie.ajdt/ajdt-on-eclipse-45/workspace/org.aspectj.runtime/target/org.aspectj.runtime-1.8.7-SNAPSHOT.jar:
Timer event: 2ms: Pre compile
Compiler configuration for project Bug273334depending has been read by compiler.  Resetting.
     Configuration was [PROJECTSOURCEFILES_CHANGED, JAVAOPTIONS_CHANGED, ASPECTPATH_CHANGED, CLASSPATH_CHANGED, INPATH_CHANGED, NONSTANDARDOPTIONS_CHANGED, OUTJAR_CHANGED, PROJECTSOURCERESOURCES_CHANGED, OUTPUTDESTINATIONS_CHANGED, INJARS_CHANGED]
Resetting list of modified source files.  Was null
Preparing for build: not going to be incremental because no successful previous full build
AJC: compiling source files
Timer event: 38ms: Time to first compiled message
AJC: compiled: /jobs/genie.ajdt/ajdt-on-eclipse-45/workspace/org.eclipse.ajdt.core.tests/target/work/data/Bug273334depending/src/r/DeclaresITD.aj
Timer event: 40ms: Time to first woven message
AJC: woven aspect r.DeclaresITD (from /jobs/genie.ajdt/ajdt-on-eclipse-45/workspace/org.eclipse.ajdt.core.tests/target/work/data/Bug273334depending/src/r/DeclaresITD.aj)
AJC: compiled: /jobs/genie.ajdt/ajdt-on-eclipse-45/workspace/org.eclipse.ajdt.core.tests/target/work/data/Bug273334depending/src/r/HasITDs2.java
AJC: woven class r.HasITDs2 (from /jobs/genie.ajdt/ajdt-on-eclipse-45/workspace/org.eclipse.ajdt.core.tests/target/work/data/Bug273334depending/src/r/HasITDs2.java)
AJC: compiled: /jobs/genie.ajdt/ajdt-on-eclipse-45/workspace/org.eclipse.ajdt.core.tests/target/work/data/Bug273334depending/src/r/InterfaceForITD.java
AJC: woven class r.InterfaceForITD (from /jobs/genie.ajdt/ajdt-on-eclipse-45/workspace/org.eclipse.ajdt.core.tests/target/work/data/Bug273334depending/src/r/InterfaceForITD.java)
AspectJ reports build successful, build was: FULL
AJDE Callback: finish. Was full build: true
Timer event: 45ms: Total time spent in AJDE
Timer event: 0ms: Refresh after build
Types affected during build = 3
Timer event: 0ms: Delete markers: Bug273334depending (Finished deleting markers for Bug273334depending)
Timer event: 3ms: Create markers: Bug273334depending (Finished creating markers for Bug273334depending)
Created 4 markers in 3 files
Crosscutting model sanity checked with no problems
Timer event: 5ms: Model sanity check for: Bug273334depending
Timer event: 52ms: Total time spent in AJBuilder.build()
Compiler configuration for project Bug273334base doesn't know previous state, so assuming EVERYTHING has changed.
===========================================================================================
Build kind = FULLBUILD
Project=Bug273334base, kind of build requested=Full AspectJ compilation
Timer event: 0ms: Flush included source file cache
Timer event: 0ms: Check delta
Builder: Tidied output folder(s), removed class files and derived resources
Classpath = /jobs/genie.ajdt/ajdt-on-eclipse-45/workspace/org.eclipse.ajdt.core.tests/target/work/data/Bug273334base/bin:/opt/public/common/jdk1.7.0_80/jre/lib/resources.jar:/opt/public/common/jdk1.7.0_80/jre/lib/rt.jar:/opt/public/common/jdk1.7.0_80/jre/lib/jsse.jar:/opt/public/common/jdk1.7.0_80/jre/lib/jce.jar:/opt/public/common/jdk1.7.0_80/jre/lib/charsets.jar:/opt/public/common/jdk1.7.0_80/jre/lib/jfr.jar:/opt/public/common/jdk1.7.0_80/jre/lib/ext/dnsns.jar:/opt/public/common/jdk1.7.0_80/jre/lib/ext/sunpkcs11.jar:/opt/public/common/jdk1.7.0_80/jre/lib/ext/zipfs.jar:/opt/public/common/jdk1.7.0_80/jre/lib/ext/sunec.jar:/opt/public/common/jdk1.7.0_80/jre/lib/ext/sunjce_provider.jar:/opt/public/common/jdk1.7.0_80/jre/lib/ext/localedata.jar:/jobs/genie.ajdt/ajdt-on-eclipse-45/workspace/org.aspectj.runtime/target/org.aspectj.runtime-1.8.7-SNAPSHOT.jar:/jobs/genie.ajdt/ajdt-on-eclipse-45/workspace/org.eclipse.ajdt.core.tests/target/work/data/Bug273334depending/bin:
Timer event: 1ms: Pre compile
Compiler configuration for project Bug273334base has been read by compiler.  Resetting.
     Configuration was [PROJECTSOURCEFILES_CHANGED, JAVAOPTIONS_CHANGED, ASPECTPATH_CHANGED, CLASSPATH_CHANGED, INPATH_CHANGED, NONSTANDARDOPTIONS_CHANGED, OUTJAR_CHANGED, PROJECTSOURCERESOURCES_CHANGED, OUTPUTDESTINATIONS_CHANGED, INJARS_CHANGED]
Resetting list of modified source files.  Was null
Preparing for build: not going to be incremental because no successful previous full build
AJC: compiling source files
Timer event: 32ms: Time to first compiled message
AJC: compiled: /jobs/genie.ajdt/ajdt-on-eclipse-45/workspace/org.eclipse.ajdt.core.tests/target/work/data/Bug273334base/src/q/UsesITDs1.java
Timer event: 33ms: Time to first woven message
AJC: woven class q.UsesITDs1 (from /jobs/genie.ajdt/ajdt-on-eclipse-45/workspace/org.eclipse.ajdt.core.tests/target/work/data/Bug273334base/src/q/UsesITDs1.java)
AJC: compiled: /jobs/genie.ajdt/ajdt-on-eclipse-45/workspace/org.eclipse.ajdt.core.tests/target/work/data/Bug273334base/src/p/HasITDs1.java
AJC: woven class p.HasITDs1 (from /jobs/genie.ajdt/ajdt-on-eclipse-45/workspace/org.eclipse.ajdt.core.tests/target/work/data/Bug273334base/src/p/HasITDs1.java)
AspectJ reports build successful, build was: FULL
AJDE Callback: finish. Was full build: true
Timer event: 37ms: Total time spent in AJDE
Timer event: 0ms: Refresh after build
Types affected during build = 2
Timer event: 0ms: Delete markers: Bug273334base (Finished deleting markers for Bug273334base)
Crosscutting model sanity checked with no problems
Timer event: 66ms: Model sanity check for: Bug273334base
Timer event: 105ms: Total time spent in AJBuilder.build()
Timer event: 75ms: Create markers: Bug273334base (Finished creating markers for Bug273334base)
Created 1 markers in 2 files
Timer event: 0ms: Update visualizer, xref, advice listeners for (separate thread): Bug273334depending
Timer event: 0ms: Update visualizer, xref, advice listeners for (separate thread): Bug273334base
===========================================================================================
Build kind = AUTOBUILD
Project=DefaultEmptyProject, kind of build requested=Incremental AspectJ compilation
Timer event: 0ms: Flush included source file cache
Timer event: 0ms: Check delta
CoreCompilerConfiguration for project DefaultEmptyProject registered a configuration change: [ASPECTPATH_CHANGED, CLASSPATH_CHANGED, INPATH_CHANGED, OUTPUTDESTINATIONS_CHANGED]
Timer event: 0ms: Looking for and marking configuration changes in DefaultEmptyProject
	Configuration changes found: true
Timer event: 0ms: Look for source/resource changes
Setting list of classpath elements with modified contents:
      []
Classpath = /jobs/genie.ajdt/ajdt-on-eclipse-45/workspace/org.eclipse.ajdt.core.tests/target/work/data/DefaultEmptyProject/bin:/jobs/genie.ajdt/ajdt-on-eclipse-45/workspace/org.aspectj.runtime/target/org.aspectj.runtime-1.8.7-SNAPSHOT.jar:/opt/public/common/jdk1.7.0_80/jre/lib/resources.jar:/opt/public/common/jdk1.7.0_80/jre/lib/rt.jar:/opt/public/common/jdk1.7.0_80/jre/lib/jsse.jar:/opt/public/common/jdk1.7.0_80/jre/lib/jce.jar:/opt/public/common/jdk1.7.0_80/jre/lib/charsets.jar:/opt/public/common/jdk1.7.0_80/jre/lib/jfr.jar:/opt/public/common/jdk1.7.0_80/jre/lib/ext/dnsns.jar:/opt/public/common/jdk1.7.0_80/jre/lib/ext/sunpkcs11.jar:/opt/public/common/jdk1.7.0_80/jre/lib/ext/zipfs.jar:/opt/public/common/jdk1.7.0_80/jre/lib/ext/sunec.jar:/opt/public/common/jdk1.7.0_80/jre/lib/ext/sunjce_provider.jar:/opt/public/common/jdk1.7.0_80/jre/lib/ext/localedata.jar:/jobs/genie.ajdt/ajdt-on-eclipse-45/workspace/org.eclipse.ajdt.core.tests/target/work/configuration/org.eclipse.osgi/40/0/.cp/junit.jar:/jobs/genie.ajdt/ajdt-on-eclipse-45/workspace/org.eclipse.ajdt.core.tests/target/work/configuration/org.eclipse.osgi/218/0/.cp:
Timer event: 10ms: Pre compile
Sending the following configuration changes to the compiler: [ASPECTPATH_CHANGED, CLASSPATH_CHANGED, INPATH_CHANGED, OUTPUTDESTINATIONS_CHANGED]
Compiler configuration for project DefaultEmptyProject has been read by compiler.  Resetting.
     Configuration was [ASPECTPATH_CHANGED, CLASSPATH_CHANGED, INPATH_CHANGED, OUTPUTDESTINATIONS_CHANGED]
Resetting list of modified source files.  Was []
ClassFileChangeChecking: failed to find a state instance managing output location : /jobs/genie.ajdt/ajdt-on-eclipse-45/workspace/org.eclipse.ajdt.core.tests/target/work/configuration/org.eclipse.osgi/218/0/.cp (could be getting managed by JDT)
Timer event: 0ms: OutputLocationManager: binary folder to declaring project map creation: P/DefaultEmptyProject
Preparing for build: planning to be an incremental build
AspectJ reports build successful, build was: INCREMENTAL
AJDE Callback: finish. Was full build: false
Timer event: 7ms: Total time spent in AJDE
Timer event: 0ms: Refresh after build
Crosscutting model sanity checked with no problems
Timer event: 0ms: Model sanity check for: DefaultEmptyProject
Timer event: 17ms: Total time spent in AJBuilder.build()
Timer event: 0ms: Update visualizer, xref, advice listeners for (separate thread): DefaultEmptyProject
===Code Select.  Unit: UsesITDs1.java [ 106, 6 ]
===Code Select.  Unit: UsesITDs1.java [ 161, 7 ]
------------------------
Starting testBug318509MethodAndITDWithSameNumberOfArgs
Compiler configuration for project Bug318509MethodAndITDWithSameNumberOfArgs doesn't know previous state, so assuming EVERYTHING has changed.
===========================================================================================
Build kind = FULLBUILD
Project=Bug318509MethodAndITDWithSameNumberOfArgs, kind of build requested=Full AspectJ compilation
Timer event: 0ms: Flush included source file cache
Timer event: 0ms: Check delta
Builder: Tidied output folder(s), removed class files and derived resources
Classpath = /jobs/genie.ajdt/ajdt-on-eclipse-45/workspace/org.eclipse.ajdt.core.tests/target/work/data/Bug318509MethodAndITDWithSameNumberOfArgs/bin:/opt/public/common/jdk1.7.0_80/jre/lib/resources.jar:/opt/public/common/jdk1.7.0_80/jre/lib/rt.jar:/opt/public/common/jdk1.7.0_80/jre/lib/jsse.jar:/opt/public/common/jdk1.7.0_80/jre/lib/jce.jar:/opt/public/common/jdk1.7.0_80/jre/lib/charsets.jar:/opt/public/common/jdk1.7.0_80/jre/lib/jfr.jar:/opt/public/common/jdk1.7.0_80/jre/lib/ext/dnsns.jar:/opt/public/common/jdk1.7.0_80/jre/lib/ext/sunpkcs11.jar:/opt/public/common/jdk1.7.0_80/jre/lib/ext/zipfs.jar:/opt/public/common/jdk1.7.0_80/jre/lib/ext/sunec.jar:/opt/public/common/jdk1.7.0_80/jre/lib/ext/sunjce_provider.jar:/opt/public/common/jdk1.7.0_80/jre/lib/ext/localedata.jar:/jobs/genie.ajdt/ajdt-on-eclipse-45/workspace/org.aspectj.runtime/target/org.aspectj.runtime-1.8.7-SNAPSHOT.jar:
Timer event: 1ms: Pre compile
Compiler configuration for project Bug318509MethodAndITDWithSameNumberOfArgs has been read by compiler.  Resetting.
     Configuration was [PROJECTSOURCEFILES_CHANGED, JAVAOPTIONS_CHANGED, ASPECTPATH_CHANGED, CLASSPATH_CHANGED, INPATH_CHANGED, NONSTANDARDOPTIONS_CHANGED, OUTJAR_CHANGED, PROJECTSOURCERESOURCES_CHANGED, OUTPUTDESTINATIONS_CHANGED, INJARS_CHANGED]
Resetting list of modified source files.  Was null
Preparing for build: not going to be incremental because no successful previous full build
AJC: compiling source files
Timer event: 38ms: Time to first compiled message
AJC: compiled: /jobs/genie.ajdt/ajdt-on-eclipse-45/workspace/org.eclipse.ajdt.core.tests/target/work/data/Bug318509MethodAndITDWithSameNumberOfArgs/src/MyAspect.aj
Timer event: 40ms: Time to first woven message
AJC: woven aspect MyAspect (from /jobs/genie.ajdt/ajdt-on-eclipse-45/workspace/org.eclipse.ajdt.core.tests/target/work/data/Bug318509MethodAndITDWithSameNumberOfArgs/src/MyAspect.aj)
inter-type constructor does not contain explicit constructor call: field initializers in the target type will not be executed [Xlint:noExplicitConstructorCall]
AJC: compiled: /jobs/genie.ajdt/ajdt-on-eclipse-45/workspace/org.eclipse.ajdt.core.tests/target/work/data/Bug318509MethodAndITDWithSameNumberOfArgs/src/Main.java
AJC: woven class Main (from /jobs/genie.ajdt/ajdt-on-eclipse-45/workspace/org.eclipse.ajdt.core.tests/target/work/data/Bug318509MethodAndITDWithSameNumberOfArgs/src/Main.java)
AJC: compiled: /jobs/genie.ajdt/ajdt-on-eclipse-45/workspace/org.eclipse.ajdt.core.tests/target/work/data/Bug318509MethodAndITDWithSameNumberOfArgs/src/MyClass.java
AJC: woven class MyClass (from /jobs/genie.ajdt/ajdt-on-eclipse-45/workspace/org.eclipse.ajdt.core.tests/target/work/data/Bug318509MethodAndITDWithSameNumberOfArgs/src/MyClass.java)
AspectJ reports build successful, build was: FULL
AJDE Callback: finish. Was full build: true
Timer event: 46ms: Total time spent in AJDE
Timer event: 0ms: Refresh after build
Types affected during build = 3
Timer event: 0ms: Delete markers: Bug318509MethodAndITDWithSameNumberOfArgs (Finished deleting markers for Bug318509MethodAndITDWithSameNumberOfArgs)
Timer event: 3ms: Create markers: Bug318509MethodAndITDWithSameNumberOfArgs (Finished creating markers for Bug318509MethodAndITDWithSameNumberOfArgs)
Created 3 markers in 3 files
Crosscutting model sanity checked with no problems
Timer event: 4ms: Model sanity check for: Bug318509MethodAndITDWithSameNumberOfArgs
Timer event: 52ms: Total time spent in AJBuilder.build()
===========================================================================================
Build kind = FULLBUILD
Project=Bug318509MethodAndITDWithSameNumberOfArgs, kind of build requested=Full AspectJ compilation
Timer event: 0ms: Flush included source file cache
Timer event: 0ms: Check delta
Builder: Tidied output folder(s), removed class files and derived resources
Classpath = /jobs/genie.ajdt/ajdt-on-eclipse-45/workspace/org.eclipse.ajdt.core.tests/target/work/data/Bug318509MethodAndITDWithSameNumberOfArgs/bin:/opt/public/common/jdk1.7.0_80/jre/lib/resources.jar:/opt/public/common/jdk1.7.0_80/jre/lib/rt.jar:/opt/public/common/jdk1.7.0_80/jre/lib/jsse.jar:/opt/public/common/jdk1.7.0_80/jre/lib/jce.jar:/opt/public/common/jdk1.7.0_80/jre/lib/charsets.jar:/opt/public/common/jdk1.7.0_80/jre/lib/jfr.jar:/opt/public/common/jdk1.7.0_80/jre/lib/ext/dnsns.jar:/opt/public/common/jdk1.7.0_80/jre/lib/ext/sunpkcs11.jar:/opt/public/common/jdk1.7.0_80/jre/lib/ext/zipfs.jar:/opt/public/common/jdk1.7.0_80/jre/lib/ext/sunec.jar:/opt/public/common/jdk1.7.0_80/jre/lib/ext/sunjce_provider.jar:/opt/public/common/jdk1.7.0_80/jre/lib/ext/localedata.jar:/jobs/genie.ajdt/ajdt-on-eclipse-45/workspace/org.aspectj.runtime/target/org.aspectj.runtime-1.8.7-SNAPSHOT.jar:
Timer event: 1ms: Pre compile
Compiler configuration for project Bug318509MethodAndITDWithSameNumberOfArgs has been read by compiler.  Resetting.
     Configuration was []
Resetting list of modified source files.  Was []
Preparing for build: not going to be incremental because no successful previous full build
AJC: compiling source files
Timer event: 33ms: Time to first compiled message
AJC: compiled: /jobs/genie.ajdt/ajdt-on-eclipse-45/workspace/org.eclipse.ajdt.core.tests/target/work/data/Bug318509MethodAndITDWithSameNumberOfArgs/src/MyAspect.aj
Timer event: 34ms: Time to first woven message
AJC: woven aspect MyAspect (from /jobs/genie.ajdt/ajdt-on-eclipse-45/workspace/org.eclipse.ajdt.core.tests/target/work/data/Bug318509MethodAndITDWithSameNumberOfArgs/src/MyAspect.aj)
inter-type constructor does not contain explicit constructor call: field initializers in the target type will not be executed [Xlint:noExplicitConstructorCall]
AJC: compiled: /jobs/genie.ajdt/ajdt-on-eclipse-45/workspace/org.eclipse.ajdt.core.tests/target/work/data/Bug318509MethodAndITDWithSameNumberOfArgs/src/Main.java
AJC: woven class Main (from /jobs/genie.ajdt/ajdt-on-eclipse-45/workspace/org.eclipse.ajdt.core.tests/target/work/data/Bug318509MethodAndITDWithSameNumberOfArgs/src/Main.java)
AJC: compiled: /jobs/genie.ajdt/ajdt-on-eclipse-45/workspace/org.eclipse.ajdt.core.tests/target/work/data/Bug318509MethodAndITDWithSameNumberOfArgs/src/MyClass.java
AJC: woven class MyClass (from /jobs/genie.ajdt/ajdt-on-eclipse-45/workspace/org.eclipse.ajdt.core.tests/target/work/data/Bug318509MethodAndITDWithSameNumberOfArgs/src/MyClass.java)
AspectJ reports build successful, build was: FULL
AJDE Callback: finish. Was full build: true
Timer event: 40ms: Total time spent in AJDE
Timer event: 1ms: Refresh after build
Types affected during build = 3
Crosscutting model sanity checked with no problems
Timer event: 1ms: Model sanity check for: Bug318509MethodAndITDWithSameNumberOfArgs
Timer event: 43ms: Total time spent in AJBuilder.build()
Timer event: 1ms: Delete markers: Bug318509MethodAndITDWithSameNumberOfArgs (Finished deleting markers for Bug318509MethodAndITDWithSameNumberOfArgs)
Timer event: 5ms: Create markers: Bug318509MethodAndITDWithSameNumberOfArgs (Finished creating markers for Bug318509MethodAndITDWithSameNumberOfArgs)
Created 3 markers in 3 files
===Code Select.  Unit: Main.java [ 119, 6 ]
===Code Select.  Unit: Main.java [ 193, 6 ]
===Code Select.  Unit: Main.java [ 99, 7 ]
===Code Select.  Unit: Main.java [ 169, 7 ]
Timer event: 0ms: Update visualizer, xref, advice listeners for (separate thread): Bug318509MethodAndITDWithSameNumberOfArgs
Timer event: 0ms: Update visualizer, xref, advice listeners for (separate thread): Bug318509MethodAndITDWithSameNumberOfArgs
------------------------
Starting testSelectInTargetType
===========================================================================================
Build kind = FULLBUILD
Project=DefaultEmptyProject, kind of build requested=Full AspectJ compilation
Timer event: 0ms: Flush included source file cache
Timer event: 0ms: Check delta
Builder: Tidied output folder(s), removed class files and derived resources
Classpath = /jobs/genie.ajdt/ajdt-on-eclipse-45/workspace/org.eclipse.ajdt.core.tests/target/work/data/DefaultEmptyProject/bin:/jobs/genie.ajdt/ajdt-on-eclipse-45/workspace/org.aspectj.runtime/target/org.aspectj.runtime-1.8.7-SNAPSHOT.jar:/opt/public/common/jdk1.7.0_80/jre/lib/resources.jar:/opt/public/common/jdk1.7.0_80/jre/lib/rt.jar:/opt/public/common/jdk1.7.0_80/jre/lib/jsse.jar:/opt/public/common/jdk1.7.0_80/jre/lib/jce.jar:/opt/public/common/jdk1.7.0_80/jre/lib/charsets.jar:/opt/public/common/jdk1.7.0_80/jre/lib/jfr.jar:/opt/public/common/jdk1.7.0_80/jre/lib/ext/dnsns.jar:/opt/public/common/jdk1.7.0_80/jre/lib/ext/sunpkcs11.jar:/opt/public/common/jdk1.7.0_80/jre/lib/ext/zipfs.jar:/opt/public/common/jdk1.7.0_80/jre/lib/ext/sunec.jar:/opt/public/common/jdk1.7.0_80/jre/lib/ext/sunjce_provider.jar:/opt/public/common/jdk1.7.0_80/jre/lib/ext/localedata.jar:/jobs/genie.ajdt/ajdt-on-eclipse-45/workspace/org.eclipse.ajdt.core.tests/target/work/configuration/org.eclipse.osgi/40/0/.cp/junit.jar:/jobs/genie.ajdt/ajdt-on-eclipse-45/workspace/org.eclipse.ajdt.core.tests/target/work/configuration/org.eclipse.osgi/218/0/.cp:
Timer event: 5ms: Pre compile
Compiler configuration for project DefaultEmptyProject has been read by compiler.  Resetting.
     Configuration was []
Resetting list of modified source files.  Was []
Preparing for build: not going to be incremental because no successful previous full build
AJC: compiling source files
AspectJ reports build successful, build was: FULL
AJDE Callback: finish. Was full build: true
Timer event: 6ms: Total time spent in AJDE
Timer event: 0ms: Refresh after build
Crosscutting model sanity checked with no problems
Timer event: 0ms: Model sanity check for: DefaultEmptyProject
Timer event: 11ms: Total time spent in AJBuilder.build()
Timer event: 5ms: Delete markers: DefaultEmptyProject (Finished deleting markers for DefaultEmptyProject)
Timer event: 0ms: Create markers: DefaultEmptyProject (Finished creating markers for DefaultEmptyProject)
Created 0 markers in 0 files
Timer event: 0ms: Update visualizer, xref, advice listeners for (separate thread): DefaultEmptyProject
===========================================================================================
Build kind = FULLBUILD
Project=DefaultEmptyProject, kind of build requested=Full AspectJ compilation
Timer event: 0ms: Flush included source file cache
Timer event: 0ms: Check delta
Builder: Tidied output folder(s), removed class files and derived resources
Classpath = /jobs/genie.ajdt/ajdt-on-eclipse-45/workspace/org.eclipse.ajdt.core.tests/target/work/data/DefaultEmptyProject/bin:/jobs/genie.ajdt/ajdt-on-eclipse-45/workspace/org.aspectj.runtime/target/org.aspectj.runtime-1.8.7-SNAPSHOT.jar:/opt/public/common/jdk1.7.0_80/jre/lib/resources.jar:/opt/public/common/jdk1.7.0_80/jre/lib/rt.jar:/opt/public/common/jdk1.7.0_80/jre/lib/jsse.jar:/opt/public/common/jdk1.7.0_80/jre/lib/jce.jar:/opt/public/common/jdk1.7.0_80/jre/lib/charsets.jar:/opt/public/common/jdk1.7.0_80/jre/lib/jfr.jar:/opt/public/common/jdk1.7.0_80/jre/lib/ext/dnsns.jar:/opt/public/common/jdk1.7.0_80/jre/lib/ext/sunpkcs11.jar:/opt/public/common/jdk1.7.0_80/jre/lib/ext/zipfs.jar:/opt/public/common/jdk1.7.0_80/jre/lib/ext/sunec.jar:/opt/public/common/jdk1.7.0_80/jre/lib/ext/sunjce_provider.jar:/opt/public/common/jdk1.7.0_80/jre/lib/ext/localedata.jar:/jobs/genie.ajdt/ajdt-on-eclipse-45/workspace/org.eclipse.ajdt.core.tests/target/work/configuration/org.eclipse.osgi/40/0/.cp/junit.jar:/jobs/genie.ajdt/ajdt-on-eclipse-45/workspace/org.eclipse.ajdt.core.tests/target/work/configuration/org.eclipse.osgi/218/0/.cp:
Timer event: 2ms: Pre compile
Compiler configuration for project DefaultEmptyProject has been read by compiler.  Resetting.
     Configuration was []
Resetting list of modified source files.  Was []
Preparing for build: not going to be incremental because no successful previous full build
AJC: compiling source files
Timer event: 47ms: Time to first compiled message
AJC: compiled: /jobs/genie.ajdt/ajdt-on-eclipse-45/workspace/org.eclipse.ajdt.core.tests/target/work/data/DefaultEmptyProject/src/p/AspectCity.aj
Timer event: 49ms: Time to first woven message
AJC: woven aspect p.AspectCity (from /jobs/genie.ajdt/ajdt-on-eclipse-45/workspace/org.eclipse.ajdt.core.tests/target/work/data/DefaultEmptyProject/src/p/AspectCity.aj)
AJC: woven class p.City$Keys (from /jobs/genie.ajdt/ajdt-on-eclipse-45/workspace/org.eclipse.ajdt.core.tests/target/work/data/DefaultEmptyProject/src/p/AspectCity.aj)
The import java.util.List is never used
AJC: compiled: /jobs/genie.ajdt/ajdt-on-eclipse-45/workspace/org.eclipse.ajdt.core.tests/target/work/data/DefaultEmptyProject/src/p/City.java
AJC: woven class p.City (from /jobs/genie.ajdt/ajdt-on-eclipse-45/workspace/org.eclipse.ajdt.core.tests/target/work/data/DefaultEmptyProject/src/p/City.java)
AJC: compiled: /jobs/genie.ajdt/ajdt-on-eclipse-45/workspace/org.eclipse.ajdt.core.tests/target/work/data/DefaultEmptyProject/src/p/Function.java
AJC: woven class p.Function (from /jobs/genie.ajdt/ajdt-on-eclipse-45/workspace/org.eclipse.ajdt.core.tests/target/work/data/DefaultEmptyProject/src/p/Function.java)
AspectJ reports build successful, build was: FULL
AJDE Callback: finish. Was full build: true
Timer event: 54ms: Total time spent in AJDE
Timer event: 0ms: Refresh after build
Types affected during build = 3
Timer event: 1ms: Delete markers: DefaultEmptyProject (Finished deleting markers for DefaultEmptyProject)
Timer event: 1ms: Create markers: DefaultEmptyProject (Finished creating markers for DefaultEmptyProject)
Created 2 markers in 3 files
Crosscutting model sanity checked with no problems
Timer event: 3ms: Model sanity check for: DefaultEmptyProject
Timer event: 60ms: Total time spent in AJBuilder.build()
Timer event: 0ms: Update visualizer, xref, advice listeners for (separate thread): DefaultEmptyProject
===Code Select.  Unit: City.java [ 56, 4 ]
===Code Select.  Unit: City.java [ 24, 4 ]
===Code Select.  Unit: City.java [ 92, 3 ]
------------------------
Starting testSelectInAspect
===========================================================================================
Build kind = FULLBUILD
Project=DefaultEmptyProject, kind of build requested=Full AspectJ compilation
Timer event: 0ms: Flush included source file cache
Timer event: 0ms: Check delta
Builder: Tidied output folder(s), removed class files and derived resources
Classpath = /jobs/genie.ajdt/ajdt-on-eclipse-45/workspace/org.eclipse.ajdt.core.tests/target/work/data/DefaultEmptyProject/bin:/jobs/genie.ajdt/ajdt-on-eclipse-45/workspace/org.aspectj.runtime/target/org.aspectj.runtime-1.8.7-SNAPSHOT.jar:/opt/public/common/jdk1.7.0_80/jre/lib/resources.jar:/opt/public/common/jdk1.7.0_80/jre/lib/rt.jar:/opt/public/common/jdk1.7.0_80/jre/lib/jsse.jar:/opt/public/common/jdk1.7.0_80/jre/lib/jce.jar:/opt/public/common/jdk1.7.0_80/jre/lib/charsets.jar:/opt/public/common/jdk1.7.0_80/jre/lib/jfr.jar:/opt/public/common/jdk1.7.0_80/jre/lib/ext/dnsns.jar:/opt/public/common/jdk1.7.0_80/jre/lib/ext/sunpkcs11.jar:/opt/public/common/jdk1.7.0_80/jre/lib/ext/zipfs.jar:/opt/public/common/jdk1.7.0_80/jre/lib/ext/sunec.jar:/opt/public/common/jdk1.7.0_80/jre/lib/ext/sunjce_provider.jar:/opt/public/common/jdk1.7.0_80/jre/lib/ext/localedata.jar:/jobs/genie.ajdt/ajdt-on-eclipse-45/workspace/org.eclipse.ajdt.core.tests/target/work/configuration/org.eclipse.osgi/40/0/.cp/junit.jar:/jobs/genie.ajdt/ajdt-on-eclipse-45/workspace/org.eclipse.ajdt.core.tests/target/work/configuration/org.eclipse.osgi/218/0/.cp:
Timer event: 4ms: Pre compile
Compiler configuration for project DefaultEmptyProject has been read by compiler.  Resetting.
     Configuration was []
Resetting list of modified source files.  Was []
Preparing for build: not going to be incremental because no successful previous full build
AJC: compiling source files
AspectJ reports build successful, build was: FULL
AJDE Callback: finish. Was full build: true
Timer event: 6ms: Total time spent in AJDE
Timer event: 0ms: Refresh after build
Crosscutting model sanity checked with no problems
Timer event: 0ms: Model sanity check for: DefaultEmptyProject
Timer event: 10ms: Total time spent in AJBuilder.build()
Timer event: 3ms: Delete markers: DefaultEmptyProject (Finished deleting markers for DefaultEmptyProject)
Timer event: 1ms: Create markers: DefaultEmptyProject (Finished creating markers for DefaultEmptyProject)
Created 0 markers in 0 files
Timer event: 0ms: Update visualizer, xref, advice listeners for (separate thread): DefaultEmptyProject
===========================================================================================
Build kind = FULLBUILD
Project=DefaultEmptyProject, kind of build requested=Full AspectJ compilation
Timer event: 0ms: Flush included source file cache
Timer event: 0ms: Check delta
Builder: Tidied output folder(s), removed class files and derived resources
Classpath = /jobs/genie.ajdt/ajdt-on-eclipse-45/workspace/org.eclipse.ajdt.core.tests/target/work/data/DefaultEmptyProject/bin:/jobs/genie.ajdt/ajdt-on-eclipse-45/workspace/org.aspectj.runtime/target/org.aspectj.runtime-1.8.7-SNAPSHOT.jar:/opt/public/common/jdk1.7.0_80/jre/lib/resources.jar:/opt/public/common/jdk1.7.0_80/jre/lib/rt.jar:/opt/public/common/jdk1.7.0_80/jre/lib/jsse.jar:/opt/public/common/jdk1.7.0_80/jre/lib/jce.jar:/opt/public/common/jdk1.7.0_80/jre/lib/charsets.jar:/opt/public/common/jdk1.7.0_80/jre/lib/jfr.jar:/opt/public/common/jdk1.7.0_80/jre/lib/ext/dnsns.jar:/opt/public/common/jdk1.7.0_80/jre/lib/ext/sunpkcs11.jar:/opt/public/common/jdk1.7.0_80/jre/lib/ext/zipfs.jar:/opt/public/common/jdk1.7.0_80/jre/lib/ext/sunec.jar:/opt/public/common/jdk1.7.0_80/jre/lib/ext/sunjce_provider.jar:/opt/public/common/jdk1.7.0_80/jre/lib/ext/localedata.jar:/jobs/genie.ajdt/ajdt-on-eclipse-45/workspace/org.eclipse.ajdt.core.tests/target/work/configuration/org.eclipse.osgi/40/0/.cp/junit.jar:/jobs/genie.ajdt/ajdt-on-eclipse-45/workspace/org.eclipse.ajdt.core.tests/target/work/configuration/org.eclipse.osgi/218/0/.cp:
Timer event: 2ms: Pre compile
Compiler configuration for project DefaultEmptyProject has been read by compiler.  Resetting.
     Configuration was []
Resetting list of modified source files.  Was []
Preparing for build: not going to be incremental because no successful previous full build
AJC: compiling source files
Timer event: 38ms: Time to first compiled message
AJC: compiled: /jobs/genie.ajdt/ajdt-on-eclipse-45/workspace/org.eclipse.ajdt.core.tests/target/work/data/DefaultEmptyProject/src/p/AspectCity.aj
Timer event: 39ms: Time to first woven message
AJC: woven aspect p.AspectCity (from /jobs/genie.ajdt/ajdt-on-eclipse-45/workspace/org.eclipse.ajdt.core.tests/target/work/data/DefaultEmptyProject/src/p/AspectCity.aj)
AJC: woven class p.City$Keys (from /jobs/genie.ajdt/ajdt-on-eclipse-45/workspace/org.eclipse.ajdt.core.tests/target/work/data/DefaultEmptyProject/src/p/AspectCity.aj)
AJC: compiled: /jobs/genie.ajdt/ajdt-on-eclipse-45/workspace/org.eclipse.ajdt.core.tests/target/work/data/DefaultEmptyProject/src/p/City.java
AJC: woven class p.City (from /jobs/genie.ajdt/ajdt-on-eclipse-45/workspace/org.eclipse.ajdt.core.tests/target/work/data/DefaultEmptyProject/src/p/City.java)
AJC: compiled: /jobs/genie.ajdt/ajdt-on-eclipse-45/workspace/org.eclipse.ajdt.core.tests/target/work/data/DefaultEmptyProject/src/p/Function.java
AJC: woven class p.Function (from /jobs/genie.ajdt/ajdt-on-eclipse-45/workspace/org.eclipse.ajdt.core.tests/target/work/data/DefaultEmptyProject/src/p/Function.java)
AspectJ reports build successful, build was: FULL
AJDE Callback: finish. Was full build: true
Timer event: 45ms: Total time spent in AJDE
Timer event: 0ms: Refresh after build
Types affected during build = 3
Timer event: 1ms: Delete markers: DefaultEmptyProject (Finished deleting markers for DefaultEmptyProject)
Timer event: 2ms: Create markers: DefaultEmptyProject (Finished creating markers for DefaultEmptyProject)
Created 2 markers in 3 files
Crosscutting model sanity checked with no problems
Timer event: 3ms: Model sanity check for: DefaultEmptyProject
Timer event: 50ms: Total time spent in AJBuilder.build()
Timer event: 0ms: Update visualizer, xref, advice listeners for (separate thread): DefaultEmptyProject
===Code Select.  Unit: AspectCity.aj [ 70, 4 ]
===Code Select.  Unit: AspectCity.aj [ 65, 4 ]
===Code Select.  Unit: AspectCity.aj [ 75, 4 ]
------------------------
Starting testSelectOtherType1
===========================================================================================
Build kind = FULLBUILD
Project=DefaultEmptyProject, kind of build requested=Full AspectJ compilation
Timer event: 0ms: Flush included source file cache
Timer event: 0ms: Check delta
Builder: Tidied output folder(s), removed class files and derived resources
Classpath = /jobs/genie.ajdt/ajdt-on-eclipse-45/workspace/org.eclipse.ajdt.core.tests/target/work/data/DefaultEmptyProject/bin:/jobs/genie.ajdt/ajdt-on-eclipse-45/workspace/org.aspectj.runtime/target/org.aspectj.runtime-1.8.7-SNAPSHOT.jar:/opt/public/common/jdk1.7.0_80/jre/lib/resources.jar:/opt/public/common/jdk1.7.0_80/jre/lib/rt.jar:/opt/public/common/jdk1.7.0_80/jre/lib/jsse.jar:/opt/public/common/jdk1.7.0_80/jre/lib/jce.jar:/opt/public/common/jdk1.7.0_80/jre/lib/charsets.jar:/opt/public/common/jdk1.7.0_80/jre/lib/jfr.jar:/opt/public/common/jdk1.7.0_80/jre/lib/ext/dnsns.jar:/opt/public/common/jdk1.7.0_80/jre/lib/ext/sunpkcs11.jar:/opt/public/common/jdk1.7.0_80/jre/lib/ext/zipfs.jar:/opt/public/common/jdk1.7.0_80/jre/lib/ext/sunec.jar:/opt/public/common/jdk1.7.0_80/jre/lib/ext/sunjce_provider.jar:/opt/public/common/jdk1.7.0_80/jre/lib/ext/localedata.jar:/jobs/genie.ajdt/ajdt-on-eclipse-45/workspace/org.eclipse.ajdt.core.tests/target/work/configuration/org.eclipse.osgi/40/0/.cp/junit.jar:/jobs/genie.ajdt/ajdt-on-eclipse-45/workspace/org.eclipse.ajdt.core.tests/target/work/configuration/org.eclipse.osgi/218/0/.cp:
Timer event: 5ms: Pre compile
Compiler configuration for project DefaultEmptyProject has been read by compiler.  Resetting.
     Configuration was []
Resetting list of modified source files.  Was []
Preparing for build: not going to be incremental because no successful previous full build
AJC: compiling source files
AspectJ reports build successful, build was: FULL
AJDE Callback: finish. Was full build: true
Timer event: 7ms: Total time spent in AJDE
Timer event: 0ms: Refresh after build
Crosscutting model sanity checked with no problems
Timer event: 0ms: Model sanity check for: DefaultEmptyProject
Timer event: 12ms: Total time spent in AJBuilder.build()
Timer event: 5ms: Delete markers: DefaultEmptyProject (Finished deleting markers for DefaultEmptyProject)
Timer event: 0ms: Create markers: DefaultEmptyProject (Finished creating markers for DefaultEmptyProject)
Created 0 markers in 0 files
Timer event: 0ms: Update visualizer, xref, advice listeners for (separate thread): DefaultEmptyProject
===========================================================================================
Build kind = FULLBUILD
Project=DefaultEmptyProject, kind of build requested=Full AspectJ compilation
Timer event: 0ms: Flush included source file cache
Timer event: 0ms: Check delta
Builder: Tidied output folder(s), removed class files and derived resources
Classpath = /jobs/genie.ajdt/ajdt-on-eclipse-45/workspace/org.eclipse.ajdt.core.tests/target/work/data/DefaultEmptyProject/bin:/jobs/genie.ajdt/ajdt-on-eclipse-45/workspace/org.aspectj.runtime/target/org.aspectj.runtime-1.8.7-SNAPSHOT.jar:/opt/public/common/jdk1.7.0_80/jre/lib/resources.jar:/opt/public/common/jdk1.7.0_80/jre/lib/rt.jar:/opt/public/common/jdk1.7.0_80/jre/lib/jsse.jar:/opt/public/common/jdk1.7.0_80/jre/lib/jce.jar:/opt/public/common/jdk1.7.0_80/jre/lib/charsets.jar:/opt/public/common/jdk1.7.0_80/jre/lib/jfr.jar:/opt/public/common/jdk1.7.0_80/jre/lib/ext/dnsns.jar:/opt/public/common/jdk1.7.0_80/jre/lib/ext/sunpkcs11.jar:/opt/public/common/jdk1.7.0_80/jre/lib/ext/zipfs.jar:/opt/public/common/jdk1.7.0_80/jre/lib/ext/sunec.jar:/opt/public/common/jdk1.7.0_80/jre/lib/ext/sunjce_provider.jar:/opt/public/common/jdk1.7.0_80/jre/lib/ext/localedata.jar:/jobs/genie.ajdt/ajdt-on-eclipse-45/workspace/org.eclipse.ajdt.core.tests/target/work/configuration/org.eclipse.osgi/40/0/.cp/junit.jar:/jobs/genie.ajdt/ajdt-on-eclipse-45/workspace/org.eclipse.ajdt.core.tests/target/work/configuration/org.eclipse.osgi/218/0/.cp:
Timer event: 2ms: Pre compile
Compiler configuration for project DefaultEmptyProject has been read by compiler.  Resetting.
     Configuration was []
Resetting list of modified source files.  Was []
Preparing for build: not going to be incremental because no successful previous full build
AJC: compiling source files
Timer event: 37ms: Time to first compiled message
AJC: compiled: /jobs/genie.ajdt/ajdt-on-eclipse-45/workspace/org.eclipse.ajdt.core.tests/target/work/data/DefaultEmptyProject/src/p/CityAspect.aj
Timer event: 39ms: Time to first woven message
AJC: woven aspect p.CityAspect (from /jobs/genie.ajdt/ajdt-on-eclipse-45/workspace/org.eclipse.ajdt.core.tests/target/work/data/DefaultEmptyProject/src/p/CityAspect.aj)
AJC: woven class p.City$Keys (from /jobs/genie.ajdt/ajdt-on-eclipse-45/workspace/org.eclipse.ajdt.core.tests/target/work/data/DefaultEmptyProject/src/p/CityAspect.aj)
AJC: compiled: /jobs/genie.ajdt/ajdt-on-eclipse-45/workspace/org.eclipse.ajdt.core.tests/target/work/data/DefaultEmptyProject/src/p/City.java
AJC: woven class p.City (from /jobs/genie.ajdt/ajdt-on-eclipse-45/workspace/org.eclipse.ajdt.core.tests/target/work/data/DefaultEmptyProject/src/p/City.java)
AJC: compiled: /jobs/genie.ajdt/ajdt-on-eclipse-45/workspace/org.eclipse.ajdt.core.tests/target/work/data/DefaultEmptyProject/src/q/Test.java
AJC: woven class q.Test (from /jobs/genie.ajdt/ajdt-on-eclipse-45/workspace/org.eclipse.ajdt.core.tests/target/work/data/DefaultEmptyProject/src/q/Test.java)
AJC: compiled: /jobs/genie.ajdt/ajdt-on-eclipse-45/workspace/org.eclipse.ajdt.core.tests/target/work/data/DefaultEmptyProject/src/p/Function.java
AJC: woven class p.Function (from /jobs/genie.ajdt/ajdt-on-eclipse-45/workspace/org.eclipse.ajdt.core.tests/target/work/data/DefaultEmptyProject/src/p/Function.java)
AspectJ reports build successful, build was: FULL
AJDE Callback: finish. Was full build: true
Timer event: 47ms: Total time spent in AJDE
Timer event: 0ms: Refresh after build
Types affected during build = 4
Timer event: 0ms: Delete markers: DefaultEmptyProject (Finished deleting markers for DefaultEmptyProject)
Timer event: 2ms: Create markers: DefaultEmptyProject (Finished creating markers for DefaultEmptyProject)
Created 2 markers in 4 files
Crosscutting model sanity checked with no problems
Timer event: 3ms: Model sanity check for: DefaultEmptyProject
Timer event: 54ms: Total time spent in AJBuilder.build()
Timer event: 0ms: Update visualizer, xref, advice listeners for (separate thread): DefaultEmptyProject
===Code Select.  Unit: Test.java [ 105, 4 ]
===Code Select.  Unit: Test.java [ 110, 4 ]
===Code Select.  Unit: Test.java [ 165, 5 ]
------------------------
Starting testSelectOtherType2
===========================================================================================
Build kind = FULLBUILD
Project=DefaultEmptyProject, kind of build requested=Full AspectJ compilation
Timer event: 0ms: Flush included source file cache
Timer event: 0ms: Check delta
Builder: Tidied output folder(s), removed class files and derived resources
Classpath = /jobs/genie.ajdt/ajdt-on-eclipse-45/workspace/org.eclipse.ajdt.core.tests/target/work/data/DefaultEmptyProject/bin:/jobs/genie.ajdt/ajdt-on-eclipse-45/workspace/org.aspectj.runtime/target/org.aspectj.runtime-1.8.7-SNAPSHOT.jar:/opt/public/common/jdk1.7.0_80/jre/lib/resources.jar:/opt/public/common/jdk1.7.0_80/jre/lib/rt.jar:/opt/public/common/jdk1.7.0_80/jre/lib/jsse.jar:/opt/public/common/jdk1.7.0_80/jre/lib/jce.jar:/opt/public/common/jdk1.7.0_80/jre/lib/charsets.jar:/opt/public/common/jdk1.7.0_80/jre/lib/jfr.jar:/opt/public/common/jdk1.7.0_80/jre/lib/ext/dnsns.jar:/opt/public/common/jdk1.7.0_80/jre/lib/ext/sunpkcs11.jar:/opt/public/common/jdk1.7.0_80/jre/lib/ext/zipfs.jar:/opt/public/common/jdk1.7.0_80/jre/lib/ext/sunec.jar:/opt/public/common/jdk1.7.0_80/jre/lib/ext/sunjce_provider.jar:/opt/public/common/jdk1.7.0_80/jre/lib/ext/localedata.jar:/jobs/genie.ajdt/ajdt-on-eclipse-45/workspace/org.eclipse.ajdt.core.tests/target/work/configuration/org.eclipse.osgi/40/0/.cp/junit.jar:/jobs/genie.ajdt/ajdt-on-eclipse-45/workspace/org.eclipse.ajdt.core.tests/target/work/configuration/org.eclipse.osgi/218/0/.cp:
Timer event: 5ms: Pre compile
Compiler configuration for project DefaultEmptyProject has been read by compiler.  Resetting.
     Configuration was []
Resetting list of modified source files.  Was []
Preparing for build: not going to be incremental because no successful previous full build
AJC: compiling source files
AspectJ reports build successful, build was: FULL
AJDE Callback: finish. Was full build: true
Timer event: 8ms: Total time spent in AJDE
Timer event: 0ms: Refresh after build
Crosscutting model sanity checked with no problems
Timer event: 0ms: Model sanity check for: DefaultEmptyProject
Timer event: 14ms: Total time spent in AJBuilder.build()
Timer event: 4ms: Delete markers: DefaultEmptyProject (Finished deleting markers for DefaultEmptyProject)
Timer event: 0ms: Create markers: DefaultEmptyProject (Finished creating markers for DefaultEmptyProject)
Created 0 markers in 0 files
Timer event: 0ms: Update visualizer, xref, advice listeners for (separate thread): DefaultEmptyProject
===========================================================================================
Build kind = FULLBUILD
Project=DefaultEmptyProject, kind of build requested=Full AspectJ compilation
Timer event: 0ms: Flush included source file cache
Timer event: 1ms: Check delta
Builder: Tidied output folder(s), removed class files and derived resources
Classpath = /jobs/genie.ajdt/ajdt-on-eclipse-45/workspace/org.eclipse.ajdt.core.tests/target/work/data/DefaultEmptyProject/bin:/jobs/genie.ajdt/ajdt-on-eclipse-45/workspace/org.aspectj.runtime/target/org.aspectj.runtime-1.8.7-SNAPSHOT.jar:/opt/public/common/jdk1.7.0_80/jre/lib/resources.jar:/opt/public/common/jdk1.7.0_80/jre/lib/rt.jar:/opt/public/common/jdk1.7.0_80/jre/lib/jsse.jar:/opt/public/common/jdk1.7.0_80/jre/lib/jce.jar:/opt/public/common/jdk1.7.0_80/jre/lib/charsets.jar:/opt/public/common/jdk1.7.0_80/jre/lib/jfr.jar:/opt/public/common/jdk1.7.0_80/jre/lib/ext/dnsns.jar:/opt/public/common/jdk1.7.0_80/jre/lib/ext/sunpkcs11.jar:/opt/public/common/jdk1.7.0_80/jre/lib/ext/zipfs.jar:/opt/public/common/jdk1.7.0_80/jre/lib/ext/sunec.jar:/opt/public/common/jdk1.7.0_80/jre/lib/ext/sunjce_provider.jar:/opt/public/common/jdk1.7.0_80/jre/lib/ext/localedata.jar:/jobs/genie.ajdt/ajdt-on-eclipse-45/workspace/org.eclipse.ajdt.core.tests/target/work/configuration/org.eclipse.osgi/40/0/.cp/junit.jar:/jobs/genie.ajdt/ajdt-on-eclipse-45/workspace/org.eclipse.ajdt.core.tests/target/work/configuration/org.eclipse.osgi/218/0/.cp:
Timer event: 2ms: Pre compile
Compiler configuration for project DefaultEmptyProject has been read by compiler.  Resetting.
     Configuration was []
Resetting list of modified source files.  Was []
Preparing for build: not going to be incremental because no successful previous full build
AJC: compiling source files
Timer event: 46ms: Time to first compiled message
AJC: compiled: /jobs/genie.ajdt/ajdt-on-eclipse-45/workspace/org.eclipse.ajdt.core.tests/target/work/data/DefaultEmptyProject/src/p/CityAspect.aj
Timer event: 48ms: Time to first woven message
AJC: woven aspect p.CityAspect (from /jobs/genie.ajdt/ajdt-on-eclipse-45/workspace/org.eclipse.ajdt.core.tests/target/work/data/DefaultEmptyProject/src/p/CityAspect.aj)
AJC: woven class p.City$Keys (from /jobs/genie.ajdt/ajdt-on-eclipse-45/workspace/org.eclipse.ajdt.core.tests/target/work/data/DefaultEmptyProject/src/p/CityAspect.aj)
AJC: compiled: /jobs/genie.ajdt/ajdt-on-eclipse-45/workspace/org.eclipse.ajdt.core.tests/target/work/data/DefaultEmptyProject/src/p/City.java
AJC: woven class p.City (from /jobs/genie.ajdt/ajdt-on-eclipse-45/workspace/org.eclipse.ajdt.core.tests/target/work/data/DefaultEmptyProject/src/p/City.java)
AJC: compiled: /jobs/genie.ajdt/ajdt-on-eclipse-45/workspace/org.eclipse.ajdt.core.tests/target/work/data/DefaultEmptyProject/src/q/Test.java
AJC: woven class q.Test (from /jobs/genie.ajdt/ajdt-on-eclipse-45/workspace/org.eclipse.ajdt.core.tests/target/work/data/DefaultEmptyProject/src/q/Test.java)
AJC: compiled: /jobs/genie.ajdt/ajdt-on-eclipse-45/workspace/org.eclipse.ajdt.core.tests/target/work/data/DefaultEmptyProject/src/p/Function.java
AJC: woven class p.Function (from /jobs/genie.ajdt/ajdt-on-eclipse-45/workspace/org.eclipse.ajdt.core.tests/target/work/data/DefaultEmptyProject/src/p/Function.java)
AspectJ reports build successful, build was: FULL
AJDE Callback: finish. Was full build: true
Timer event: 56ms: Total time spent in AJDE
Timer event: 0ms: Refresh after build
Types affected during build = 4
Timer event: 1ms: Delete markers: DefaultEmptyProject (Finished deleting markers for DefaultEmptyProject)
Crosscutting model sanity checked with no problems
Timer event: 3ms: Model sanity check for: DefaultEmptyProject
Timer event: 62ms: Total time spent in AJBuilder.build()
Timer event: 4ms: Create markers: DefaultEmptyProject (Finished creating markers for DefaultEmptyProject)
Created 2 markers in 4 files
Timer event: 0ms: Update visualizer, xref, advice listeners for (separate thread): DefaultEmptyProject
===Code Select.  Unit: Test.java [ 40, 4 ]
===Code Select.  Unit: Test.java [ 67, 4 ]
===Code Select.  Unit: Test.java [ 72, 4 ]
===Code Select.  Unit: Test.java [ 157, 4 ]
===Code Select.  Unit: Test.java [ 162, 4 ]
===Code Select.  Unit: Test.java [ 182, 4 ]
===Code Select.  Unit: Test.java [ 187, 4 ]
===Code Select.  Unit: Test.java [ 207, 4 ]
------------------------
Starting testPackageInfo
Compiler configuration for project Bug283468 doesn't know previous state, so assuming EVERYTHING has changed.
===========================================================================================
Build kind = FULLBUILD
Project=Bug283468, kind of build requested=Full AspectJ compilation
Timer event: 0ms: Flush included source file cache
Timer event: 0ms: Check delta
Builder: Tidied output folder(s), removed class files and derived resources
Classpath = /jobs/genie.ajdt/ajdt-on-eclipse-45/workspace/org.eclipse.ajdt.core.tests/target/work/data/Bug283468/bin:/opt/public/common/jdk1.7.0_80/jre/lib/resources.jar:/opt/public/common/jdk1.7.0_80/jre/lib/rt.jar:/opt/public/common/jdk1.7.0_80/jre/lib/jsse.jar:/opt/public/common/jdk1.7.0_80/jre/lib/jce.jar:/opt/public/common/jdk1.7.0_80/jre/lib/charsets.jar:/opt/public/common/jdk1.7.0_80/jre/lib/jfr.jar:/opt/public/common/jdk1.7.0_80/jre/lib/ext/dnsns.jar:/opt/public/common/jdk1.7.0_80/jre/lib/ext/sunpkcs11.jar:/opt/public/common/jdk1.7.0_80/jre/lib/ext/zipfs.jar:/opt/public/common/jdk1.7.0_80/jre/lib/ext/sunec.jar:/opt/public/common/jdk1.7.0_80/jre/lib/ext/sunjce_provider.jar:/opt/public/common/jdk1.7.0_80/jre/lib/ext/localedata.jar:/jobs/genie.ajdt/ajdt-on-eclipse-45/workspace/org.aspectj.runtime/target/org.aspectj.runtime-1.8.7-SNAPSHOT.jar:
Timer event: 2ms: Pre compile
Compiler configuration for project Bug283468 has been read by compiler.  Resetting.
     Configuration was [PROJECTSOURCEFILES_CHANGED, JAVAOPTIONS_CHANGED, ASPECTPATH_CHANGED, CLASSPATH_CHANGED, INPATH_CHANGED, NONSTANDARDOPTIONS_CHANGED, OUTJAR_CHANGED, PROJECTSOURCERESOURCES_CHANGED, OUTPUTDESTINATIONS_CHANGED, INJARS_CHANGED]
Resetting list of modified source files.  Was null
Preparing for build: not going to be incremental because no successful previous full build
AJC: compiling source files
Timer event: 39ms: Time to first compiled message
AJC: compiled: /jobs/genie.ajdt/ajdt-on-eclipse-45/workspace/org.eclipse.ajdt.core.tests/target/work/data/Bug283468/src/f/MyAspect.aj
Timer event: 40ms: Time to first woven message
AJC: woven aspect f.MyAspect (from /jobs/genie.ajdt/ajdt-on-eclipse-45/workspace/org.eclipse.ajdt.core.tests/target/work/data/Bug283468/src/f/MyAspect.aj)
AJC: compiled: /jobs/genie.ajdt/ajdt-on-eclipse-45/workspace/org.eclipse.ajdt.core.tests/target/work/data/Bug283468/src/f/Anno.java
AJC: woven class f.Anno (from /jobs/genie.ajdt/ajdt-on-eclipse-45/workspace/org.eclipse.ajdt.core.tests/target/work/data/Bug283468/src/f/Anno.java)
AJC: compiled: /jobs/genie.ajdt/ajdt-on-eclipse-45/workspace/org.eclipse.ajdt.core.tests/target/work/data/Bug283468/src/f/H.java
AJC: woven class f.H (from /jobs/genie.ajdt/ajdt-on-eclipse-45/workspace/org.eclipse.ajdt.core.tests/target/work/data/Bug283468/src/f/H.java)
AJC: compiled: /jobs/genie.ajdt/ajdt-on-eclipse-45/workspace/org.eclipse.ajdt.core.tests/target/work/data/Bug283468/src/f/package-info.java
AJC: woven class f.package-info (from /jobs/genie.ajdt/ajdt-on-eclipse-45/workspace/org.eclipse.ajdt.core.tests/target/work/data/Bug283468/src/f/package-info.java)
AspectJ reports build successful, build was: FULL
AJDE Callback: finish. Was full build: true
Timer event: 47ms: Total time spent in AJDE
Timer event: 0ms: Refresh after build
Types affected during build = 4
Timer event: 0ms: Delete markers: Bug283468 (Finished deleting markers for Bug283468)
Timer event: 2ms: Create markers: Bug283468 (Finished creating markers for Bug283468)
Created 2 markers in 4 files
Crosscutting model sanity checked with no problems
Timer event: 4ms: Model sanity check for: Bug283468
Timer event: 54ms: Total time spent in AJBuilder.build()
Timer event: 0ms: Update visualizer, xref, advice listeners for (separate thread): Bug283468
------------------------
Starting testITDFieldInOtherProject
===========================================================================================
Build kind = FULLBUILD
Project=DefaultEmptyProject, kind of build requested=Full AspectJ compilation
Timer event: 0ms: Flush included source file cache
Timer event: 0ms: Check delta
Builder: Tidied output folder(s), removed class files and derived resources
Classpath = /jobs/genie.ajdt/ajdt-on-eclipse-45/workspace/org.eclipse.ajdt.core.tests/target/work/data/DefaultEmptyProject/bin:/jobs/genie.ajdt/ajdt-on-eclipse-45/workspace/org.aspectj.runtime/target/org.aspectj.runtime-1.8.7-SNAPSHOT.jar:/opt/public/common/jdk1.7.0_80/jre/lib/resources.jar:/opt/public/common/jdk1.7.0_80/jre/lib/rt.jar:/opt/public/common/jdk1.7.0_80/jre/lib/jsse.jar:/opt/public/common/jdk1.7.0_80/jre/lib/jce.jar:/opt/public/common/jdk1.7.0_80/jre/lib/charsets.jar:/opt/public/common/jdk1.7.0_80/jre/lib/jfr.jar:/opt/public/common/jdk1.7.0_80/jre/lib/ext/dnsns.jar:/opt/public/common/jdk1.7.0_80/jre/lib/ext/sunpkcs11.jar:/opt/public/common/jdk1.7.0_80/jre/lib/ext/zipfs.jar:/opt/public/common/jdk1.7.0_80/jre/lib/ext/sunec.jar:/opt/public/common/jdk1.7.0_80/jre/lib/ext/sunjce_provider.jar:/opt/public/common/jdk1.7.0_80/jre/lib/ext/localedata.jar:/jobs/genie.ajdt/ajdt-on-eclipse-45/workspace/org.eclipse.ajdt.core.tests/target/work/configuration/org.eclipse.osgi/40/0/.cp/junit.jar:/jobs/genie.ajdt/ajdt-on-eclipse-45/workspace/org.eclipse.ajdt.core.tests/target/work/configuration/org.eclipse.osgi/218/0/.cp:
Timer event: 4ms: Pre compile
Compiler configuration for project DefaultEmptyProject has been read by compiler.  Resetting.
     Configuration was []
Resetting list of modified source files.  Was []
Preparing for build: not going to be incremental because no successful previous full build
AJC: compiling source files
AspectJ reports build successful, build was: FULL
AJDE Callback: finish. Was full build: true
Timer event: 6ms: Total time spent in AJDE
Timer event: 0ms: Refresh after build
Crosscutting model sanity checked with no problems
Timer event: 0ms: Model sanity check for: DefaultEmptyProject
Timer event: 10ms: Total time spent in AJBuilder.build()
Timer event: 3ms: Delete markers: DefaultEmptyProject (Finished deleting markers for DefaultEmptyProject)
Timer event: 1ms: Create markers: DefaultEmptyProject (Finished creating markers for DefaultEmptyProject)
Created 0 markers in 0 files
Compiler configuration for project DefaultEmptyProjectDependent doesn't know previous state, so assuming EVERYTHING has changed.
===========================================================================================
Build kind = FULLBUILD
Project=DefaultEmptyProjectDependent, kind of build requested=Full AspectJ compilation
Timer event: 0ms: Flush included source file cache
Timer event: 0ms: Check delta
Builder: Tidied output folder(s), removed class files and derived resources
Classpath = /jobs/genie.ajdt/ajdt-on-eclipse-45/workspace/org.eclipse.ajdt.core.tests/target/work/data/DefaultEmptyProjectDependent/bin:/jobs/genie.ajdt/ajdt-on-eclipse-45/workspace/org.aspectj.runtime/target/org.aspectj.runtime-1.8.7-SNAPSHOT.jar:/opt/public/common/jdk1.7.0_80/jre/lib/resources.jar:/opt/public/common/jdk1.7.0_80/jre/lib/rt.jar:/opt/public/common/jdk1.7.0_80/jre/lib/jsse.jar:/opt/public/common/jdk1.7.0_80/jre/lib/jce.jar:/opt/public/common/jdk1.7.0_80/jre/lib/charsets.jar:/opt/public/common/jdk1.7.0_80/jre/lib/jfr.jar:/opt/public/common/jdk1.7.0_80/jre/lib/ext/dnsns.jar:/opt/public/common/jdk1.7.0_80/jre/lib/ext/sunpkcs11.jar:/opt/public/common/jdk1.7.0_80/jre/lib/ext/zipfs.jar:/opt/public/common/jdk1.7.0_80/jre/lib/ext/sunec.jar:/opt/public/common/jdk1.7.0_80/jre/lib/ext/sunjce_provider.jar:/opt/public/common/jdk1.7.0_80/jre/lib/ext/localedata.jar:/jobs/genie.ajdt/ajdt-on-eclipse-45/workspace/org.eclipse.ajdt.core.tests/target/work/configuration/org.eclipse.osgi/40/0/.cp/junit.jar:/jobs/genie.ajdt/ajdt-on-eclipse-45/workspace/org.eclipse.ajdt.core.tests/target/work/configuration/org.eclipse.osgi/218/0/.cp:/jobs/genie.ajdt/ajdt-on-eclipse-45/workspace/org.eclipse.ajdt.core.tests/target/work/data/DefaultEmptyProject/bin:
Timer event: 5ms: Pre compile
Compiler configuration for project DefaultEmptyProjectDependent has been read by compiler.  Resetting.
     Configuration was [PROJECTSOURCEFILES_CHANGED, JAVAOPTIONS_CHANGED, ASPECTPATH_CHANGED, CLASSPATH_CHANGED, INPATH_CHANGED, NONSTANDARDOPTIONS_CHANGED, OUTJAR_CHANGED, PROJECTSOURCERESOURCES_CHANGED, OUTPUTDESTINATIONS_CHANGED, INJARS_CHANGED]
Resetting list of modified source files.  Was null
Preparing for build: not going to be incremental because no successful previous full build
AJC: compiling source files
AspectJ reports build successful, build was: FULL
AJDE Callback: finish. Was full build: true
Timer event: 6ms: Total time spent in AJDE
Timer event: 0ms: Refresh after build
Crosscutting model sanity checked with no problems
Timer event: 0ms: Model sanity check for: DefaultEmptyProjectDependent
Timer event: 11ms: Total time spent in AJBuilder.build()
Timer event: 5ms: Delete markers: DefaultEmptyProjectDependent (Finished deleting markers for DefaultEmptyProjectDependent)
Timer event: 0ms: Create markers: DefaultEmptyProjectDependent (Finished creating markers for DefaultEmptyProjectDependent)
Created 0 markers in 0 files
Timer event: 0ms: Update visualizer, xref, advice listeners for (separate thread): DefaultEmptyProject
Timer event: 0ms: Update visualizer, xref, advice listeners for (separate thread): DefaultEmptyProjectDependent
===========================================================================================
Build kind = AUTOBUILD
Project=DefaultEmptyProject, kind of build requested=Incremental AspectJ compilation
Timer event: 0ms: Flush included source file cache
Timer event: 0ms: Check delta
CoreCompilerConfiguration for project DefaultEmptyProject registered a configuration change: [PROJECTSOURCEFILES_CHANGED]
build: Examined delta - 0 changed, 1 added, and 0 deleted source files in required project DefaultEmptyProject
Timer event: 0ms: Looking for and marking configuration changes in DefaultEmptyProject
	Configuration changes found: true
Timer event: 0ms: Look for source/resource changes
Setting list of classpath elements with modified contents:
      []
Classpath = /jobs/genie.ajdt/ajdt-on-eclipse-45/workspace/org.eclipse.ajdt.core.tests/target/work/data/DefaultEmptyProject/bin:/jobs/genie.ajdt/ajdt-on-eclipse-45/workspace/org.aspectj.runtime/target/org.aspectj.runtime-1.8.7-SNAPSHOT.jar:/opt/public/common/jdk1.7.0_80/jre/lib/resources.jar:/opt/public/common/jdk1.7.0_80/jre/lib/rt.jar:/opt/public/common/jdk1.7.0_80/jre/lib/jsse.jar:/opt/public/common/jdk1.7.0_80/jre/lib/jce.jar:/opt/public/common/jdk1.7.0_80/jre/lib/charsets.jar:/opt/public/common/jdk1.7.0_80/jre/lib/jfr.jar:/opt/public/common/jdk1.7.0_80/jre/lib/ext/dnsns.jar:/opt/public/common/jdk1.7.0_80/jre/lib/ext/sunpkcs11.jar:/opt/public/common/jdk1.7.0_80/jre/lib/ext/zipfs.jar:/opt/public/common/jdk1.7.0_80/jre/lib/ext/sunec.jar:/opt/public/common/jdk1.7.0_80/jre/lib/ext/sunjce_provider.jar:/opt/public/common/jdk1.7.0_80/jre/lib/ext/localedata.jar:/jobs/genie.ajdt/ajdt-on-eclipse-45/workspace/org.eclipse.ajdt.core.tests/target/work/configuration/org.eclipse.osgi/40/0/.cp/junit.jar:/jobs/genie.ajdt/ajdt-on-eclipse-45/workspace/org.eclipse.ajdt.core.tests/target/work/configuration/org.eclipse.osgi/218/0/.cp:
Timer event: 1ms: Pre compile
Sending the following configuration changes to the compiler: [PROJECTSOURCEFILES_CHANGED]
Compiler configuration for project DefaultEmptyProject has been read by compiler.  Resetting.
     Configuration was [PROJECTSOURCEFILES_CHANGED]
Resetting list of modified source files.  Was []
ClassFileChangeChecking: failed to find a state instance managing output location : /jobs/genie.ajdt/ajdt-on-eclipse-45/workspace/org.eclipse.ajdt.core.tests/target/work/configuration/org.eclipse.osgi/218/0/.cp (could be getting managed by JDT)
Timer event: 0ms: OutputLocationManager: binary folder to declaring project map creation: P/DefaultEmptyProject
Preparing for build: planning to be an incremental build
Starting incremental compilation loop 1 of possibly 5
AJC: compiling source files
Timer event: 41ms: Time to first compiled message
AJC: compiled: /jobs/genie.ajdt/ajdt-on-eclipse-45/workspace/org.eclipse.ajdt.core.tests/target/work/data/DefaultEmptyProject/src/common/Aspect.aj
 Dropping back to full build
Preparing for build: not going to be incremental because no successful previous full build
AJC: compiling source files
AJC: compiled: /jobs/genie.ajdt/ajdt-on-eclipse-45/workspace/org.eclipse.ajdt.core.tests/target/work/data/DefaultEmptyProject/src/common/Aspect.aj
Timer event: 82ms: Time to first woven message
AJC: woven aspect common.Aspect (from /jobs/genie.ajdt/ajdt-on-eclipse-45/workspace/org.eclipse.ajdt.core.tests/target/work/data/DefaultEmptyProject/src/common/Aspect.aj)
AJC: woven class common.Aspect$Foo (from /jobs/genie.ajdt/ajdt-on-eclipse-45/workspace/org.eclipse.ajdt.core.tests/target/work/data/DefaultEmptyProject/src/common/Aspect.aj)
AJC: woven class common.Aspect$ITD (from /jobs/genie.ajdt/ajdt-on-eclipse-45/workspace/org.eclipse.ajdt.core.tests/target/work/data/DefaultEmptyProject/src/common/Aspect.aj)
AspectJ reports build successful, build was: FULL
AJDE Callback: finish. Was full build: true
Timer event: 84ms: Total time spent in AJDE
Timer event: 1ms: Refresh after build
Types affected during build = 1
Timer event: 0ms: Delete markers: DefaultEmptyProject (Finished deleting markers for DefaultEmptyProject)
Timer event: 1ms: Create markers: DefaultEmptyProject (Finished creating markers for DefaultEmptyProject)
Created 3 markers in 1 files
Crosscutting model sanity checked with no problems
Timer event: 3ms: Model sanity check for: DefaultEmptyProject
Timer event: 89ms: Total time spent in AJBuilder.build()
===========================================================================================
Build kind = AUTOBUILD
Project=DefaultEmptyProjectDependent, kind of build requested=Incremental AspectJ compilation
Timer event: 0ms: Flush included source file cache
Timer event: 0ms: Check delta
Timer event: 0ms: Looking for and marking configuration changes in DefaultEmptyProjectDependent
	Configuration changes found: false
build: Examined delta - no source file or classpath changes for project DefaultEmptyProjectDependent
CoreCompilerConfiguration for project DefaultEmptyProject registered a configuration change: [PROJECTSOURCEFILES_CHANGED]
build: Examined delta - 0 changed, 1 added, and 0 deleted source files in required project DefaultEmptyProject
Timer event: 0ms: Looking for and marking configuration changes in DefaultEmptyProject
	Configuration changes found: true
Timer event: 0ms: Look for source/resource changes
Setting list of classpath elements with modified contents:
      [/jobs/genie.ajdt/ajdt-on-eclipse-45/workspace/org.eclipse.ajdt.core.tests/target/work/data/DefaultEmptyProject/bin]
Classpath = /jobs/genie.ajdt/ajdt-on-eclipse-45/workspace/org.eclipse.ajdt.core.tests/target/work/data/DefaultEmptyProjectDependent/bin:/jobs/genie.ajdt/ajdt-on-eclipse-45/workspace/org.aspectj.runtime/target/org.aspectj.runtime-1.8.7-SNAPSHOT.jar:/opt/public/common/jdk1.7.0_80/jre/lib/resources.jar:/opt/public/common/jdk1.7.0_80/jre/lib/rt.jar:/opt/public/common/jdk1.7.0_80/jre/lib/jsse.jar:/opt/public/common/jdk1.7.0_80/jre/lib/jce.jar:/opt/public/common/jdk1.7.0_80/jre/lib/charsets.jar:/opt/public/common/jdk1.7.0_80/jre/lib/jfr.jar:/opt/public/common/jdk1.7.0_80/jre/lib/ext/dnsns.jar:/opt/public/common/jdk1.7.0_80/jre/lib/ext/sunpkcs11.jar:/opt/public/common/jdk1.7.0_80/jre/lib/ext/zipfs.jar:/opt/public/common/jdk1.7.0_80/jre/lib/ext/sunec.jar:/opt/public/common/jdk1.7.0_80/jre/lib/ext/sunjce_provider.jar:/opt/public/common/jdk1.7.0_80/jre/lib/ext/localedata.jar:/jobs/genie.ajdt/ajdt-on-eclipse-45/workspace/org.eclipse.ajdt.core.tests/target/work/configuration/org.eclipse.osgi/40/0/.cp/junit.jar:/jobs/genie.ajdt/ajdt-on-eclipse-45/workspace/org.eclipse.ajdt.core.tests/target/work/configuration/org.eclipse.osgi/218/0/.cp:/jobs/genie.ajdt/ajdt-on-eclipse-45/workspace/org.eclipse.ajdt.core.tests/target/work/data/DefaultEmptyProject/bin:
Timer event: 1ms: Pre compile
Sending the following configuration changes to the compiler: []
0 source file changes since last build
Compiler configuration for project DefaultEmptyProjectDependent has been read by compiler.  Resetting.
     Configuration was []
Resetting list of modified source files.  Was []
ClassFileChangeChecking: found state instance managing output location : /jobs/genie.ajdt/ajdt-on-eclipse-45/workspace/org.eclipse.ajdt.core.tests/target/work/data/DefaultEmptyProject/bin
ClassFileChangeChecking: structural change detected in : /jobs/genie.ajdt/ajdt-on-eclipse-45/workspace/org.eclipse.ajdt.core.tests/target/work/data/DefaultEmptyProject/bin/common/Aspect$ITD.class
AjState(DefaultEmptyProjectDependent): type common/Aspect$ITD is not depended upon by this state
ClassFileChangeChecking: aspect found that has structurally changed : /jobs/genie.ajdt/ajdt-on-eclipse-45/workspace/org.eclipse.ajdt.core.tests/target/work/data/DefaultEmptyProject/bin/common/Aspect.class
Preparing for build: not going to be incremental because path change detected (one of classpath/aspectpath/inpath/injars)
Falling back to batch compilation
Preparing for build: not going to be incremental because no successful previous full build
AJC: compiling source files
AspectJ reports build successful, build was: FULL
AJDE Callback: finish. Was full build: true
Timer event: 5ms: Total time spent in AJDE
Timer event: 0ms: Refresh after build
Crosscutting model sanity checked with no problems
Timer event: 0ms: Model sanity check for: DefaultEmptyProjectDependent
Timer event: 6ms: Total time spent in AJBuilder.build()
Timer event: 0ms: Update visualizer, xref, advice listeners for (separate thread): DefaultEmptyProject
Timer event: 0ms: Update visualizer, xref, advice listeners for (separate thread): DefaultEmptyProjectDependent
===========================================================================================
Build kind = AUTOBUILD
Project=DefaultEmptyProjectDependent, kind of build requested=Incremental AspectJ compilation
Timer event: 0ms: Flush included source file cache
Timer event: 1ms: Check delta
CoreCompilerConfiguration for project DefaultEmptyProjectDependent registered a configuration change: [PROJECTSOURCEFILES_CHANGED]
build: Examined delta - 0 changed, 1 added, and 0 deleted source files in required project DefaultEmptyProjectDependent
Timer event: 0ms: Looking for and marking configuration changes in DefaultEmptyProjectDependent
	Configuration changes found: true
Timer event: 0ms: Look for source/resource changes
Setting list of classpath elements with modified contents:
      []
Classpath = /jobs/genie.ajdt/ajdt-on-eclipse-45/workspace/org.eclipse.ajdt.core.tests/target/work/data/DefaultEmptyProjectDependent/bin:/jobs/genie.ajdt/ajdt-on-eclipse-45/workspace/org.aspectj.runtime/target/org.aspectj.runtime-1.8.7-SNAPSHOT.jar:/opt/public/common/jdk1.7.0_80/jre/lib/resources.jar:/opt/public/common/jdk1.7.0_80/jre/lib/rt.jar:/opt/public/common/jdk1.7.0_80/jre/lib/jsse.jar:/opt/public/common/jdk1.7.0_80/jre/lib/jce.jar:/opt/public/common/jdk1.7.0_80/jre/lib/charsets.jar:/opt/public/common/jdk1.7.0_80/jre/lib/jfr.jar:/opt/public/common/jdk1.7.0_80/jre/lib/ext/dnsns.jar:/opt/public/common/jdk1.7.0_80/jre/lib/ext/sunpkcs11.jar:/opt/public/common/jdk1.7.0_80/jre/lib/ext/zipfs.jar:/opt/public/common/jdk1.7.0_80/jre/lib/ext/sunec.jar:/opt/public/common/jdk1.7.0_80/jre/lib/ext/sunjce_provider.jar:/opt/public/common/jdk1.7.0_80/jre/lib/ext/localedata.jar:/jobs/genie.ajdt/ajdt-on-eclipse-45/workspace/org.eclipse.ajdt.core.tests/target/work/configuration/org.eclipse.osgi/40/0/.cp/junit.jar:/jobs/genie.ajdt/ajdt-on-eclipse-45/workspace/org.eclipse.ajdt.core.tests/target/work/configuration/org.eclipse.osgi/218/0/.cp:/jobs/genie.ajdt/ajdt-on-eclipse-45/workspace/org.eclipse.ajdt.core.tests/target/work/data/DefaultEmptyProject/bin:
Timer event: 2ms: Pre compile
Sending the following configuration changes to the compiler: [PROJECTSOURCEFILES_CHANGED]
Compiler configuration for project DefaultEmptyProjectDependent has been read by compiler.  Resetting.
     Configuration was [PROJECTSOURCEFILES_CHANGED]
Resetting list of modified source files.  Was []
ClassFileChangeChecking: failed to find a state instance managing output location : /jobs/genie.ajdt/ajdt-on-eclipse-45/workspace/org.eclipse.ajdt.core.tests/target/work/configuration/org.eclipse.osgi/218/0/.cp (could be getting managed by JDT)
Timer event: 0ms: OutputLocationManager: binary folder to declaring project map creation: P/DefaultEmptyProjectDependent
ClassFileChangeChecking: found state instance managing output location : /jobs/genie.ajdt/ajdt-on-eclipse-45/workspace/org.eclipse.ajdt.core.tests/target/work/data/DefaultEmptyProject/bin
ClassFileChangeChecking: no reported changes in that state
Preparing for build: planning to be an incremental build
Starting incremental compilation loop 1 of possibly 5
AJC: compiling source files
Timer event: 43ms: Time to first compiled message
AJC: compiled: /jobs/genie.ajdt/ajdt-on-eclipse-45/workspace/org.eclipse.ajdt.core.tests/target/work/data/DefaultEmptyProjectDependent/src/dependent/Java.java
Timer event: 47ms: Time to first woven message
AJC: woven class dependent.Java (from /jobs/genie.ajdt/ajdt-on-eclipse-45/workspace/org.eclipse.ajdt.core.tests/target/work/data/DefaultEmptyProjectDependent/src/dependent/Java.java)
Examining whether any other files now need compilation based on just compiling: '{/jobs/genie.ajdt/ajdt-on-eclipse-45/workspace/org.eclipse.ajdt.core.tests/target/work/data/DefaultEmptyProjectDependent/src/dependent/Java.java}'
AspectJ reports build successful, build was: INCREMENTAL
AJDE Callback: finish. Was full build: false
Timer event: 47ms: Total time spent in AJDE
Timer event: 1ms: Refresh after build
Types affected during build = 1
Timer event: 0ms: Delete markers: DefaultEmptyProjectDependent (Finished deleting markers for DefaultEmptyProjectDependent)
Timer event: 73ms: Create markers: DefaultEmptyProjectDependent (Finished creating markers for DefaultEmptyProjectDependent)
Created 1 markers in 1 files
Crosscutting model sanity checked.  The following problems found:
Java Element does not exist: *Aspect.aj
	It is the source relationship of *Aspect.aj --annotates--> =DefaultEmptyProjectDependent/src<dependent{Java.java[Java
	This may not actually be a problem if compiling broken code.
Java Element does not exist: *Aspect.aj
	It is the source relationship of =DefaultEmptyProjectDependent/src<dependent{Java.java[Java --annotated by--> *Aspect.aj
	This may not actually be a problem if compiling broken code.

Timer event: 73ms: Model sanity check for: DefaultEmptyProjectDependent
Timer event: 123ms: Total time spent in AJBuilder.build()
Timer event: 0ms: Update visualizer, xref, advice listeners for (separate thread): DefaultEmptyProjectDependent
------------------------
Starting testQualifiedMarkerAnnotationMethod1
===========================================================================================
Build kind = FULLBUILD
Project=DefaultEmptyProject, kind of build requested=Full AspectJ compilation
Timer event: 0ms: Flush included source file cache
Timer event: 0ms: Check delta
Builder: Tidied output folder(s), removed class files and derived resources
Classpath = /jobs/genie.ajdt/ajdt-on-eclipse-45/workspace/org.eclipse.ajdt.core.tests/target/work/data/DefaultEmptyProject/bin:/jobs/genie.ajdt/ajdt-on-eclipse-45/workspace/org.aspectj.runtime/target/org.aspectj.runtime-1.8.7-SNAPSHOT.jar:/opt/public/common/jdk1.7.0_80/jre/lib/resources.jar:/opt/public/common/jdk1.7.0_80/jre/lib/rt.jar:/opt/public/common/jdk1.7.0_80/jre/lib/jsse.jar:/opt/public/common/jdk1.7.0_80/jre/lib/jce.jar:/opt/public/common/jdk1.7.0_80/jre/lib/charsets.jar:/opt/public/common/jdk1.7.0_80/jre/lib/jfr.jar:/opt/public/common/jdk1.7.0_80/jre/lib/ext/dnsns.jar:/opt/public/common/jdk1.7.0_80/jre/lib/ext/sunpkcs11.jar:/opt/public/common/jdk1.7.0_80/jre/lib/ext/zipfs.jar:/opt/public/common/jdk1.7.0_80/jre/lib/ext/sunec.jar:/opt/public/common/jdk1.7.0_80/jre/lib/ext/sunjce_provider.jar:/opt/public/common/jdk1.7.0_80/jre/lib/ext/localedata.jar:/jobs/genie.ajdt/ajdt-on-eclipse-45/workspace/org.eclipse.ajdt.core.tests/target/work/configuration/org.eclipse.osgi/40/0/.cp/junit.jar:/jobs/genie.ajdt/ajdt-on-eclipse-45/workspace/org.eclipse.ajdt.core.tests/target/work/configuration/org.eclipse.osgi/218/0/.cp:
Timer event: 9ms: Pre compile
Compiler configuration for project DefaultEmptyProject has been read by compiler.  Resetting.
     Configuration was [PROJECTSOURCEFILES_CHANGED]
Resetting list of modified source files.  Was []
Preparing for build: not going to be incremental because no successful previous full build
AJC: compiling source files
AspectJ reports build successful, build was: FULL
AJDE Callback: finish. Was full build: true
Timer event: 10ms: Total time spent in AJDE
Timer event: 0ms: Refresh after build
Crosscutting model sanity checked with no problems
Timer event: 0ms: Model sanity check for: DefaultEmptyProject
Timer event: 20ms: Total time spent in AJBuilder.build()
Timer event: 4ms: Delete markers: DefaultEmptyProject (Finished deleting markers for DefaultEmptyProject)
Timer event: 1ms: Create markers: DefaultEmptyProject (Finished creating markers for DefaultEmptyProject)
Created 0 markers in 0 files
Timer event: 0ms: Update visualizer, xref, advice listeners for (separate thread): DefaultEmptyProject
===========================================================================================
Build kind = AUTOBUILD
Project=DefaultEmptyProject, kind of build requested=Incremental AspectJ compilation
Timer event: 0ms: Flush included source file cache
Timer event: 1ms: Check delta
CoreCompilerConfiguration for project DefaultEmptyProject registered a configuration change: [PROJECTSOURCEFILES_CHANGED]
build: Examined delta - 0 changed, 1 added, and 0 deleted source files in required project DefaultEmptyProject
Timer event: 1ms: Looking for and marking configuration changes in DefaultEmptyProject
	Configuration changes found: true
Timer event: 1ms: Look for source/resource changes
Setting list of classpath elements with modified contents:
      []
Classpath = /jobs/genie.ajdt/ajdt-on-eclipse-45/workspace/org.eclipse.ajdt.core.tests/target/work/data/DefaultEmptyProject/bin:/jobs/genie.ajdt/ajdt-on-eclipse-45/workspace/org.aspectj.runtime/target/org.aspectj.runtime-1.8.7-SNAPSHOT.jar:/opt/public/common/jdk1.7.0_80/jre/lib/resources.jar:/opt/public/common/jdk1.7.0_80/jre/lib/rt.jar:/opt/public/common/jdk1.7.0_80/jre/lib/jsse.jar:/opt/public/common/jdk1.7.0_80/jre/lib/jce.jar:/opt/public/common/jdk1.7.0_80/jre/lib/charsets.jar:/opt/public/common/jdk1.7.0_80/jre/lib/jfr.jar:/opt/public/common/jdk1.7.0_80/jre/lib/ext/dnsns.jar:/opt/public/common/jdk1.7.0_80/jre/lib/ext/sunpkcs11.jar:/opt/public/common/jdk1.7.0_80/jre/lib/ext/zipfs.jar:/opt/public/common/jdk1.7.0_80/jre/lib/ext/sunec.jar:/opt/public/common/jdk1.7.0_80/jre/lib/ext/sunjce_provider.jar:/opt/public/common/jdk1.7.0_80/jre/lib/ext/localedata.jar:/jobs/genie.ajdt/ajdt-on-eclipse-45/workspace/org.eclipse.ajdt.core.tests/target/work/configuration/org.eclipse.osgi/40/0/.cp/junit.jar:/jobs/genie.ajdt/ajdt-on-eclipse-45/workspace/org.eclipse.ajdt.core.tests/target/work/configuration/org.eclipse.osgi/218/0/.cp:
Timer event: 2ms: Pre compile
Sending the following configuration changes to the compiler: [PROJECTSOURCEFILES_CHANGED]
Compiler configuration for project DefaultEmptyProject has been read by compiler.  Resetting.
     Configuration was [PROJECTSOURCEFILES_CHANGED]
Resetting list of modified source files.  Was []
ClassFileChangeChecking: failed to find a state instance managing output location : /jobs/genie.ajdt/ajdt-on-eclipse-45/workspace/org.eclipse.ajdt.core.tests/target/work/configuration/org.eclipse.osgi/218/0/.cp (could be getting managed by JDT)
Timer event: 1ms: OutputLocationManager: binary folder to declaring project map creation: P/DefaultEmptyProject
Preparing for build: planning to be an incremental build
Starting incremental compilation loop 1 of possibly 5
AJC: compiling source files
Timer event: 39ms: Time to first compiled message
AJC: compiled: /jobs/genie.ajdt/ajdt-on-eclipse-45/workspace/org.eclipse.ajdt.core.tests/target/work/data/DefaultEmptyProject/src/q/Other.java
Timer event: 40ms: Time to first woven message
AJC: woven class q.Other (from /jobs/genie.ajdt/ajdt-on-eclipse-45/workspace/org.eclipse.ajdt.core.tests/target/work/data/DefaultEmptyProject/src/q/Other.java)
Examining whether any other files now need compilation based on just compiling: '{/jobs/genie.ajdt/ajdt-on-eclipse-45/workspace/org.eclipse.ajdt.core.tests/target/work/data/DefaultEmptyProject/src/q/Other.java}'
AspectJ reports build successful, build was: INCREMENTAL
AJDE Callback: finish. Was full build: false
Timer event: 41ms: Total time spent in AJDE
Timer event: 0ms: Refresh after build
Types affected during build = 1
Crosscutting model sanity checked with no problems
Timer event: 0ms: Model sanity check for: DefaultEmptyProject
Timer event: 44ms: Total time spent in AJBuilder.build()
Timer event: 0ms: Delete markers: DefaultEmptyProject (Finished deleting markers for DefaultEmptyProject)
Timer event: 1ms: Create markers: DefaultEmptyProject (Finished creating markers for DefaultEmptyProject)
Created 0 markers in 1 files
Timer event: 0ms: Update visualizer, xref, advice listeners for (separate thread): DefaultEmptyProject
===========================================================================================
Build kind = FULLBUILD
Project=DefaultEmptyProject, kind of build requested=Full AspectJ compilation
Timer event: 0ms: Flush included source file cache
Timer event: 0ms: Check delta
Builder: Tidied output folder(s), removed class files and derived resources
Classpath = /jobs/genie.ajdt/ajdt-on-eclipse-45/workspace/org.eclipse.ajdt.core.tests/target/work/data/DefaultEmptyProject/bin:/jobs/genie.ajdt/ajdt-on-eclipse-45/workspace/org.aspectj.runtime/target/org.aspectj.runtime-1.8.7-SNAPSHOT.jar:/opt/public/common/jdk1.7.0_80/jre/lib/resources.jar:/opt/public/common/jdk1.7.0_80/jre/lib/rt.jar:/opt/public/common/jdk1.7.0_80/jre/lib/jsse.jar:/opt/public/common/jdk1.7.0_80/jre/lib/jce.jar:/opt/public/common/jdk1.7.0_80/jre/lib/charsets.jar:/opt/public/common/jdk1.7.0_80/jre/lib/jfr.jar:/opt/public/common/jdk1.7.0_80/jre/lib/ext/dnsns.jar:/opt/public/common/jdk1.7.0_80/jre/lib/ext/sunpkcs11.jar:/opt/public/common/jdk1.7.0_80/jre/lib/ext/zipfs.jar:/opt/public/common/jdk1.7.0_80/jre/lib/ext/sunec.jar:/opt/public/common/jdk1.7.0_80/jre/lib/ext/sunjce_provider.jar:/opt/public/common/jdk1.7.0_80/jre/lib/ext/localedata.jar:/jobs/genie.ajdt/ajdt-on-eclipse-45/workspace/org.eclipse.ajdt.core.tests/target/work/configuration/org.eclipse.osgi/40/0/.cp/junit.jar:/jobs/genie.ajdt/ajdt-on-eclipse-45/workspace/org.eclipse.ajdt.core.tests/target/work/configuration/org.eclipse.osgi/218/0/.cp:
Timer event: 3ms: Pre compile
Compiler configuration for project DefaultEmptyProject has been read by compiler.  Resetting.
     Configuration was []
Resetting list of modified source files.  Was []
Preparing for build: not going to be incremental because no successful previous full build
AJC: compiling source files
Timer event: 34ms: Time to first compiled message
AJC: compiled: /jobs/genie.ajdt/ajdt-on-eclipse-45/workspace/org.eclipse.ajdt.core.tests/target/work/data/DefaultEmptyProject/src/q/Other.java
Timer event: 35ms: Time to first woven message
AJC: woven class q.Other (from /jobs/genie.ajdt/ajdt-on-eclipse-45/workspace/org.eclipse.ajdt.core.tests/target/work/data/DefaultEmptyProject/src/q/Other.java)
AspectJ reports build successful, build was: FULL
AJDE Callback: finish. Was full build: true
Timer event: 35ms: Total time spent in AJDE
Timer event: 0ms: Refresh after build
Types affected during build = 1
Crosscutting model sanity checked with no problems
Timer event: 0ms: Model sanity check for: DefaultEmptyProject
Timer event: 39ms: Total time spent in AJBuilder.build()
Timer event: 1ms: Delete markers: DefaultEmptyProject (Finished deleting markers for DefaultEmptyProject)
Timer event: 1ms: Create markers: DefaultEmptyProject (Finished creating markers for DefaultEmptyProject)
Created 0 markers in 1 files
Timer event: 0ms: Update visualizer, xref, advice listeners for (separate thread): DefaultEmptyProject
===========================================================================================
Build kind = AUTOBUILD
Project=DefaultEmptyProject, kind of build requested=Incremental AspectJ compilation
Timer event: 0ms: Flush included source file cache
Timer event: 0ms: Check delta
CoreCompilerConfiguration for project DefaultEmptyProject registered a configuration change: [PROJECTSOURCEFILES_CHANGED]
build: Examined delta - 0 changed, 1 added, and 0 deleted source files in required project DefaultEmptyProject
Timer event: 0ms: Looking for and marking configuration changes in DefaultEmptyProject
	Configuration changes found: true
Timer event: 0ms: Look for source/resource changes
Setting list of classpath elements with modified contents:
      []
Classpath = /jobs/genie.ajdt/ajdt-on-eclipse-45/workspace/org.eclipse.ajdt.core.tests/target/work/data/DefaultEmptyProject/bin:/jobs/genie.ajdt/ajdt-on-eclipse-45/workspace/org.aspectj.runtime/target/org.aspectj.runtime-1.8.7-SNAPSHOT.jar:/opt/public/common/jdk1.7.0_80/jre/lib/resources.jar:/opt/public/common/jdk1.7.0_80/jre/lib/rt.jar:/opt/public/common/jdk1.7.0_80/jre/lib/jsse.jar:/opt/public/common/jdk1.7.0_80/jre/lib/jce.jar:/opt/public/common/jdk1.7.0_80/jre/lib/charsets.jar:/opt/public/common/jdk1.7.0_80/jre/lib/jfr.jar:/opt/public/common/jdk1.7.0_80/jre/lib/ext/dnsns.jar:/opt/public/common/jdk1.7.0_80/jre/lib/ext/sunpkcs11.jar:/opt/public/common/jdk1.7.0_80/jre/lib/ext/zipfs.jar:/opt/public/common/jdk1.7.0_80/jre/lib/ext/sunec.jar:/opt/public/common/jdk1.7.0_80/jre/lib/ext/sunjce_provider.jar:/opt/public/common/jdk1.7.0_80/jre/lib/ext/localedata.jar:/jobs/genie.ajdt/ajdt-on-eclipse-45/workspace/org.eclipse.ajdt.core.tests/target/work/configuration/org.eclipse.osgi/40/0/.cp/junit.jar:/jobs/genie.ajdt/ajdt-on-eclipse-45/workspace/org.eclipse.ajdt.core.tests/target/work/configuration/org.eclipse.osgi/218/0/.cp:
Timer event: 1ms: Pre compile
Sending the following configuration changes to the compiler: [PROJECTSOURCEFILES_CHANGED]
Compiler configuration for project DefaultEmptyProject has been read by compiler.  Resetting.
     Configuration was [PROJECTSOURCEFILES_CHANGED]
Resetting list of modified source files.  Was []
ClassFileChangeChecking: failed to find a state instance managing output location : /jobs/genie.ajdt/ajdt-on-eclipse-45/workspace/org.eclipse.ajdt.core.tests/target/work/configuration/org.eclipse.osgi/218/0/.cp (could be getting managed by JDT)
Timer event: 0ms: OutputLocationManager: binary folder to declaring project map creation: P/DefaultEmptyProject
Preparing for build: planning to be an incremental build
Starting incremental compilation loop 1 of possibly 5
AJC: compiling source files
Timer event: 39ms: Time to first compiled message
AJC: compiled: /jobs/genie.ajdt/ajdt-on-eclipse-45/workspace/org.eclipse.ajdt.core.tests/target/work/data/DefaultEmptyProject/src/p/Aspect.aj
 Dropping back to full build
Preparing for build: not going to be incremental because no successful previous full build
AJC: compiling source files
AJC: compiled: /jobs/genie.ajdt/ajdt-on-eclipse-45/workspace/org.eclipse.ajdt.core.tests/target/work/data/DefaultEmptyProject/src/p/Aspect.aj
Timer event: 73ms: Time to first woven message
AJC: woven aspect p.Aspect (from /jobs/genie.ajdt/ajdt-on-eclipse-45/workspace/org.eclipse.ajdt.core.tests/target/work/data/DefaultEmptyProject/src/p/Aspect.aj)
AJC: compiled: /jobs/genie.ajdt/ajdt-on-eclipse-45/workspace/org.eclipse.ajdt.core.tests/target/work/data/DefaultEmptyProject/src/q/Other.java
AJC: woven class q.Other (from /jobs/genie.ajdt/ajdt-on-eclipse-45/workspace/org.eclipse.ajdt.core.tests/target/work/data/DefaultEmptyProject/src/q/Other.java)
AspectJ reports build successful, build was: FULL
AJDE Callback: finish. Was full build: true
Timer event: 129ms: Total time spent in AJDE
Timer event: 0ms: Refresh after build
Types affected during build = 2
Crosscutting model sanity checked with no problems
Timer event: 0ms: Model sanity check for: DefaultEmptyProject
Timer event: 131ms: Total time spent in AJBuilder.build()
Timer event: 1ms: Delete markers: DefaultEmptyProject (Finished deleting markers for DefaultEmptyProject)
Timer event: 1ms: Create markers: DefaultEmptyProject (Finished creating markers for DefaultEmptyProject)
Created 0 markers in 2 files
Timer event: 0ms: Update visualizer, xref, advice listeners for (separate thread): DefaultEmptyProject
===========================================================================================
Build kind = FULLBUILD
Project=DefaultEmptyProject, kind of build requested=Full AspectJ compilation
Timer event: 0ms: Flush included source file cache
Timer event: 0ms: Check delta
Builder: Tidied output folder(s), removed class files and derived resources
Classpath = /jobs/genie.ajdt/ajdt-on-eclipse-45/workspace/org.eclipse.ajdt.core.tests/target/work/data/DefaultEmptyProject/bin:/jobs/genie.ajdt/ajdt-on-eclipse-45/workspace/org.aspectj.runtime/target/org.aspectj.runtime-1.8.7-SNAPSHOT.jar:/opt/public/common/jdk1.7.0_80/jre/lib/resources.jar:/opt/public/common/jdk1.7.0_80/jre/lib/rt.jar:/opt/public/common/jdk1.7.0_80/jre/lib/jsse.jar:/opt/public/common/jdk1.7.0_80/jre/lib/jce.jar:/opt/public/common/jdk1.7.0_80/jre/lib/charsets.jar:/opt/public/common/jdk1.7.0_80/jre/lib/jfr.jar:/opt/public/common/jdk1.7.0_80/jre/lib/ext/dnsns.jar:/opt/public/common/jdk1.7.0_80/jre/lib/ext/sunpkcs11.jar:/opt/public/common/jdk1.7.0_80/jre/lib/ext/zipfs.jar:/opt/public/common/jdk1.7.0_80/jre/lib/ext/sunec.jar:/opt/public/common/jdk1.7.0_80/jre/lib/ext/sunjce_provider.jar:/opt/public/common/jdk1.7.0_80/jre/lib/ext/localedata.jar:/jobs/genie.ajdt/ajdt-on-eclipse-45/workspace/org.eclipse.ajdt.core.tests/target/work/configuration/org.eclipse.osgi/40/0/.cp/junit.jar:/jobs/genie.ajdt/ajdt-on-eclipse-45/workspace/org.eclipse.ajdt.core.tests/target/work/configuration/org.eclipse.osgi/218/0/.cp:
Timer event: 3ms: Pre compile
Compiler configuration for project DefaultEmptyProject has been read by compiler.  Resetting.
     Configuration was []
Resetting list of modified source files.  Was []
Preparing for build: not going to be incremental because no successful previous full build
AJC: compiling source files
Timer event: 34ms: Time to first compiled message
AJC: compiled: /jobs/genie.ajdt/ajdt-on-eclipse-45/workspace/org.eclipse.ajdt.core.tests/target/work/data/DefaultEmptyProject/src/p/Aspect.aj
Timer event: 35ms: Time to first woven message
AJC: woven aspect p.Aspect (from /jobs/genie.ajdt/ajdt-on-eclipse-45/workspace/org.eclipse.ajdt.core.tests/target/work/data/DefaultEmptyProject/src/p/Aspect.aj)
AJC: compiled: /jobs/genie.ajdt/ajdt-on-eclipse-45/workspace/org.eclipse.ajdt.core.tests/target/work/data/DefaultEmptyProject/src/q/Other.java
AJC: woven class q.Other (from /jobs/genie.ajdt/ajdt-on-eclipse-45/workspace/org.eclipse.ajdt.core.tests/target/work/data/DefaultEmptyProject/src/q/Other.java)
AspectJ reports build successful, build was: FULL
AJDE Callback: finish. Was full build: true
Timer event: 37ms: Total time spent in AJDE
Timer event: 0ms: Refresh after build
Types affected during build = 2
Crosscutting model sanity checked with no problems
Timer event: 0ms: Model sanity check for: DefaultEmptyProject
Timer event: 40ms: Total time spent in AJBuilder.build()
Timer event: 1ms: Delete markers: DefaultEmptyProject (Finished deleting markers for DefaultEmptyProject)
Timer event: 1ms: Create markers: DefaultEmptyProject (Finished creating markers for DefaultEmptyProject)
Created 0 markers in 2 files
Timer event: 0ms: Update visualizer, xref, advice listeners for (separate thread): DefaultEmptyProject
------------------------
Starting testSimpleMarkerAnnotationMethod1
===========================================================================================
Build kind = FULLBUILD
Project=DefaultEmptyProject, kind of build requested=Full AspectJ compilation
Timer event: 0ms: Flush included source file cache
Timer event: 0ms: Check delta
Builder: Tidied output folder(s), removed class files and derived resources
Classpath = /jobs/genie.ajdt/ajdt-on-eclipse-45/workspace/org.eclipse.ajdt.core.tests/target/work/data/DefaultEmptyProject/bin:/jobs/genie.ajdt/ajdt-on-eclipse-45/workspace/org.aspectj.runtime/target/org.aspectj.runtime-1.8.7-SNAPSHOT.jar:/opt/public/common/jdk1.7.0_80/jre/lib/resources.jar:/opt/public/common/jdk1.7.0_80/jre/lib/rt.jar:/opt/public/common/jdk1.7.0_80/jre/lib/jsse.jar:/opt/public/common/jdk1.7.0_80/jre/lib/jce.jar:/opt/public/common/jdk1.7.0_80/jre/lib/charsets.jar:/opt/public/common/jdk1.7.0_80/jre/lib/jfr.jar:/opt/public/common/jdk1.7.0_80/jre/lib/ext/dnsns.jar:/opt/public/common/jdk1.7.0_80/jre/lib/ext/sunpkcs11.jar:/opt/public/common/jdk1.7.0_80/jre/lib/ext/zipfs.jar:/opt/public/common/jdk1.7.0_80/jre/lib/ext/sunec.jar:/opt/public/common/jdk1.7.0_80/jre/lib/ext/sunjce_provider.jar:/opt/public/common/jdk1.7.0_80/jre/lib/ext/localedata.jar:/jobs/genie.ajdt/ajdt-on-eclipse-45/workspace/org.eclipse.ajdt.core.tests/target/work/configuration/org.eclipse.osgi/40/0/.cp/junit.jar:/jobs/genie.ajdt/ajdt-on-eclipse-45/workspace/org.eclipse.ajdt.core.tests/target/work/configuration/org.eclipse.osgi/218/0/.cp:
Timer event: 5ms: Pre compile
Compiler configuration for project DefaultEmptyProject has been read by compiler.  Resetting.
     Configuration was []
Resetting list of modified source files.  Was []
Preparing for build: not going to be incremental because no successful previous full build
AJC: compiling source files
AspectJ reports build successful, build was: FULL
AJDE Callback: finish. Was full build: true
Timer event: 6ms: Total time spent in AJDE
Timer event: 0ms: Refresh after build
Crosscutting model sanity checked with no problems
Timer event: 0ms: Model sanity check for: DefaultEmptyProject
Timer event: 12ms: Total time spent in AJBuilder.build()
Timer event: 3ms: Delete markers: DefaultEmptyProject (Finished deleting markers for DefaultEmptyProject)
Timer event: 1ms: Create markers: DefaultEmptyProject (Finished creating markers for DefaultEmptyProject)
Created 0 markers in 0 files
Timer event: 0ms: Update visualizer, xref, advice listeners for (separate thread): DefaultEmptyProject
===========================================================================================
Build kind = AUTOBUILD
Project=DefaultEmptyProject, kind of build requested=Incremental AspectJ compilation
Timer event: 0ms: Flush included source file cache
Timer event: 0ms: Check delta
CoreCompilerConfiguration for project DefaultEmptyProject registered a configuration change: [PROJECTSOURCEFILES_CHANGED]
build: Examined delta - 0 changed, 1 added, and 0 deleted source files in required project DefaultEmptyProject
Timer event: 0ms: Looking for and marking configuration changes in DefaultEmptyProject
	Configuration changes found: true
Timer event: 0ms: Look for source/resource changes
Setting list of classpath elements with modified contents:
      []
Classpath = /jobs/genie.ajdt/ajdt-on-eclipse-45/workspace/org.eclipse.ajdt.core.tests/target/work/data/DefaultEmptyProject/bin:/jobs/genie.ajdt/ajdt-on-eclipse-45/workspace/org.aspectj.runtime/target/org.aspectj.runtime-1.8.7-SNAPSHOT.jar:/opt/public/common/jdk1.7.0_80/jre/lib/resources.jar:/opt/public/common/jdk1.7.0_80/jre/lib/rt.jar:/opt/public/common/jdk1.7.0_80/jre/lib/jsse.jar:/opt/public/common/jdk1.7.0_80/jre/lib/jce.jar:/opt/public/common/jdk1.7.0_80/jre/lib/charsets.jar:/opt/public/common/jdk1.7.0_80/jre/lib/jfr.jar:/opt/public/common/jdk1.7.0_80/jre/lib/ext/dnsns.jar:/opt/public/common/jdk1.7.0_80/jre/lib/ext/sunpkcs11.jar:/opt/public/common/jdk1.7.0_80/jre/lib/ext/zipfs.jar:/opt/public/common/jdk1.7.0_80/jre/lib/ext/sunec.jar:/opt/public/common/jdk1.7.0_80/jre/lib/ext/sunjce_provider.jar:/opt/public/common/jdk1.7.0_80/jre/lib/ext/localedata.jar:/jobs/genie.ajdt/ajdt-on-eclipse-45/workspace/org.eclipse.ajdt.core.tests/target/work/configuration/org.eclipse.osgi/40/0/.cp/junit.jar:/jobs/genie.ajdt/ajdt-on-eclipse-45/workspace/org.eclipse.ajdt.core.tests/target/work/configuration/org.eclipse.osgi/218/0/.cp:
Timer event: 1ms: Pre compile
Sending the following configuration changes to the compiler: [PROJECTSOURCEFILES_CHANGED]
Compiler configuration for project DefaultEmptyProject has been read by compiler.  Resetting.
     Configuration was [PROJECTSOURCEFILES_CHANGED]
Resetting list of modified source files.  Was []
ClassFileChangeChecking: failed to find a state instance managing output location : /jobs/genie.ajdt/ajdt-on-eclipse-45/workspace/org.eclipse.ajdt.core.tests/target/work/configuration/org.eclipse.osgi/218/0/.cp (could be getting managed by JDT)
Timer event: 0ms: OutputLocationManager: binary folder to declaring project map creation: P/DefaultEmptyProject
Preparing for build: planning to be an incremental build
Starting incremental compilation loop 1 of possibly 5
AJC: compiling source files
Timer event: 40ms: Time to first compiled message
AJC: compiled: /jobs/genie.ajdt/ajdt-on-eclipse-45/workspace/org.eclipse.ajdt.core.tests/target/work/data/DefaultEmptyProject/src/p/Aspect.aj
 Dropping back to full build
Preparing for build: not going to be incremental because no successful previous full build
AJC: compiling source files
AJC: compiled: /jobs/genie.ajdt/ajdt-on-eclipse-45/workspace/org.eclipse.ajdt.core.tests/target/work/data/DefaultEmptyProject/src/p/Aspect.aj
Timer event: 78ms: Time to first woven message
AJC: woven aspect p.Aspect (from /jobs/genie.ajdt/ajdt-on-eclipse-45/workspace/org.eclipse.ajdt.core.tests/target/work/data/DefaultEmptyProject/src/p/Aspect.aj)
AspectJ reports build successful, build was: FULL
AJDE Callback: finish. Was full build: true
Timer event: 79ms: Total time spent in AJDE
Timer event: 0ms: Refresh after build
Types affected during build = 1
Crosscutting model sanity checked with no problems
Timer event: 0ms: Model sanity check for: DefaultEmptyProject
Timer event: 80ms: Total time spent in AJBuilder.build()
Timer event: 2ms: Delete markers: DefaultEmptyProject (Finished deleting markers for DefaultEmptyProject)
Timer event: 0ms: Create markers: DefaultEmptyProject (Finished creating markers for DefaultEmptyProject)
Created 0 markers in 1 files
Timer event: 0ms: Update visualizer, xref, advice listeners for (separate thread): DefaultEmptyProject
===========================================================================================
Build kind = FULLBUILD
Project=DefaultEmptyProject, kind of build requested=Full AspectJ compilation
Timer event: 0ms: Flush included source file cache
Timer event: 0ms: Check delta
Builder: Tidied output folder(s), removed class files and derived resources
Classpath = /jobs/genie.ajdt/ajdt-on-eclipse-45/workspace/org.eclipse.ajdt.core.tests/target/work/data/DefaultEmptyProject/bin:/jobs/genie.ajdt/ajdt-on-eclipse-45/workspace/org.aspectj.runtime/target/org.aspectj.runtime-1.8.7-SNAPSHOT.jar:/opt/public/common/jdk1.7.0_80/jre/lib/resources.jar:/opt/public/common/jdk1.7.0_80/jre/lib/rt.jar:/opt/public/common/jdk1.7.0_80/jre/lib/jsse.jar:/opt/public/common/jdk1.7.0_80/jre/lib/jce.jar:/opt/public/common/jdk1.7.0_80/jre/lib/charsets.jar:/opt/public/common/jdk1.7.0_80/jre/lib/jfr.jar:/opt/public/common/jdk1.7.0_80/jre/lib/ext/dnsns.jar:/opt/public/common/jdk1.7.0_80/jre/lib/ext/sunpkcs11.jar:/opt/public/common/jdk1.7.0_80/jre/lib/ext/zipfs.jar:/opt/public/common/jdk1.7.0_80/jre/lib/ext/sunec.jar:/opt/public/common/jdk1.7.0_80/jre/lib/ext/sunjce_provider.jar:/opt/public/common/jdk1.7.0_80/jre/lib/ext/localedata.jar:/jobs/genie.ajdt/ajdt-on-eclipse-45/workspace/org.eclipse.ajdt.core.tests/target/work/configuration/org.eclipse.osgi/40/0/.cp/junit.jar:/jobs/genie.ajdt/ajdt-on-eclipse-45/workspace/org.eclipse.ajdt.core.tests/target/work/configuration/org.eclipse.osgi/218/0/.cp:
Timer event: 2ms: Pre compile
Compiler configuration for project DefaultEmptyProject has been read by compiler.  Resetting.
     Configuration was []
Resetting list of modified source files.  Was []
Preparing for build: not going to be incremental because no successful previous full build
AJC: compiling source files
Timer event: 39ms: Time to first compiled message
AJC: compiled: /jobs/genie.ajdt/ajdt-on-eclipse-45/workspace/org.eclipse.ajdt.core.tests/target/work/data/DefaultEmptyProject/src/p/Aspect.aj
Timer event: 40ms: Time to first woven message
AJC: woven aspect p.Aspect (from /jobs/genie.ajdt/ajdt-on-eclipse-45/workspace/org.eclipse.ajdt.core.tests/target/work/data/DefaultEmptyProject/src/p/Aspect.aj)
AspectJ reports build successful, build was: FULL
AJDE Callback: finish. Was full build: true
Timer event: 41ms: Total time spent in AJDE
Timer event: 0ms: Refresh after build
Types affected during build = 1
Crosscutting model sanity checked with no problems
Timer event: 0ms: Model sanity check for: DefaultEmptyProject
Timer event: 44ms: Total time spent in AJBuilder.build()
Timer event: 1ms: Delete markers: DefaultEmptyProject (Finished deleting markers for DefaultEmptyProject)
Timer event: 0ms: Create markers: DefaultEmptyProject (Finished creating markers for DefaultEmptyProject)
Created 0 markers in 1 files
Timer event: 0ms: Update visualizer, xref, advice listeners for (separate thread): DefaultEmptyProject
------------------------
Starting testSimpleMarkerAnnotationMethod2
===========================================================================================
Build kind = FULLBUILD
Project=DefaultEmptyProject, kind of build requested=Full AspectJ compilation
Timer event: 0ms: Flush included source file cache
Timer event: 0ms: Check delta
Builder: Tidied output folder(s), removed class files and derived resources
Classpath = /jobs/genie.ajdt/ajdt-on-eclipse-45/workspace/org.eclipse.ajdt.core.tests/target/work/data/DefaultEmptyProject/bin:/jobs/genie.ajdt/ajdt-on-eclipse-45/workspace/org.aspectj.runtime/target/org.aspectj.runtime-1.8.7-SNAPSHOT.jar:/opt/public/common/jdk1.7.0_80/jre/lib/resources.jar:/opt/public/common/jdk1.7.0_80/jre/lib/rt.jar:/opt/public/common/jdk1.7.0_80/jre/lib/jsse.jar:/opt/public/common/jdk1.7.0_80/jre/lib/jce.jar:/opt/public/common/jdk1.7.0_80/jre/lib/charsets.jar:/opt/public/common/jdk1.7.0_80/jre/lib/jfr.jar:/opt/public/common/jdk1.7.0_80/jre/lib/ext/dnsns.jar:/opt/public/common/jdk1.7.0_80/jre/lib/ext/sunpkcs11.jar:/opt/public/common/jdk1.7.0_80/jre/lib/ext/zipfs.jar:/opt/public/common/jdk1.7.0_80/jre/lib/ext/sunec.jar:/opt/public/common/jdk1.7.0_80/jre/lib/ext/sunjce_provider.jar:/opt/public/common/jdk1.7.0_80/jre/lib/ext/localedata.jar:/jobs/genie.ajdt/ajdt-on-eclipse-45/workspace/org.eclipse.ajdt.core.tests/target/work/configuration/org.eclipse.osgi/40/0/.cp/junit.jar:/jobs/genie.ajdt/ajdt-on-eclipse-45/workspace/org.eclipse.ajdt.core.tests/target/work/configuration/org.eclipse.osgi/218/0/.cp:
Timer event: 9ms: Pre compile
Compiler configuration for project DefaultEmptyProject has been read by compiler.  Resetting.
     Configuration was []
Resetting list of modified source files.  Was []
Preparing for build: not going to be incremental because no successful previous full build
AJC: compiling source files
AspectJ reports build successful, build was: FULL
AJDE Callback: finish. Was full build: true
Timer event: 10ms: Total time spent in AJDE
Timer event: 0ms: Refresh after build
Crosscutting model sanity checked with no problems
Timer event: 0ms: Model sanity check for: DefaultEmptyProject
Timer event: 19ms: Total time spent in AJBuilder.build()
Timer event: 4ms: Delete markers: DefaultEmptyProject (Finished deleting markers for DefaultEmptyProject)
Timer event: 0ms: Create markers: DefaultEmptyProject (Finished creating markers for DefaultEmptyProject)
Created 0 markers in 0 files
Timer event: 0ms: Update visualizer, xref, advice listeners for (separate thread): DefaultEmptyProject
===========================================================================================
Build kind = AUTOBUILD
Project=DefaultEmptyProject, kind of build requested=Incremental AspectJ compilation
Timer event: 0ms: Flush included source file cache
Timer event: 1ms: Check delta
CoreCompilerConfiguration for project DefaultEmptyProject registered a configuration change: [PROJECTSOURCEFILES_CHANGED]
build: Examined delta - 0 changed, 1 added, and 0 deleted source files in required project DefaultEmptyProject
Timer event: 0ms: Looking for and marking configuration changes in DefaultEmptyProject
	Configuration changes found: true
Timer event: 0ms: Look for source/resource changes
Setting list of classpath elements with modified contents:
      []
Classpath = /jobs/genie.ajdt/ajdt-on-eclipse-45/workspace/org.eclipse.ajdt.core.tests/target/work/data/DefaultEmptyProject/bin:/jobs/genie.ajdt/ajdt-on-eclipse-45/workspace/org.aspectj.runtime/target/org.aspectj.runtime-1.8.7-SNAPSHOT.jar:/opt/public/common/jdk1.7.0_80/jre/lib/resources.jar:/opt/public/common/jdk1.7.0_80/jre/lib/rt.jar:/opt/public/common/jdk1.7.0_80/jre/lib/jsse.jar:/opt/public/common/jdk1.7.0_80/jre/lib/jce.jar:/opt/public/common/jdk1.7.0_80/jre/lib/charsets.jar:/opt/public/common/jdk1.7.0_80/jre/lib/jfr.jar:/opt/public/common/jdk1.7.0_80/jre/lib/ext/dnsns.jar:/opt/public/common/jdk1.7.0_80/jre/lib/ext/sunpkcs11.jar:/opt/public/common/jdk1.7.0_80/jre/lib/ext/zipfs.jar:/opt/public/common/jdk1.7.0_80/jre/lib/ext/sunec.jar:/opt/public/common/jdk1.7.0_80/jre/lib/ext/sunjce_provider.jar:/opt/public/common/jdk1.7.0_80/jre/lib/ext/localedata.jar:/jobs/genie.ajdt/ajdt-on-eclipse-45/workspace/org.eclipse.ajdt.core.tests/target/work/configuration/org.eclipse.osgi/40/0/.cp/junit.jar:/jobs/genie.ajdt/ajdt-on-eclipse-45/workspace/org.eclipse.ajdt.core.tests/target/work/configuration/org.eclipse.osgi/218/0/.cp:
Timer event: 1ms: Pre compile
Sending the following configuration changes to the compiler: [PROJECTSOURCEFILES_CHANGED]
Compiler configuration for project DefaultEmptyProject has been read by compiler.  Resetting.
     Configuration was [PROJECTSOURCEFILES_CHANGED]
Resetting list of modified source files.  Was []
ClassFileChangeChecking: failed to find a state instance managing output location : /jobs/genie.ajdt/ajdt-on-eclipse-45/workspace/org.eclipse.ajdt.core.tests/target/work/configuration/org.eclipse.osgi/218/0/.cp (could be getting managed by JDT)
Timer event: 0ms: OutputLocationManager: binary folder to declaring project map creation: P/DefaultEmptyProject
Preparing for build: planning to be an incremental build
Starting incremental compilation loop 1 of possibly 5
AJC: compiling source files
Timer event: 42ms: Time to first compiled message
AJC: compiled: /jobs/genie.ajdt/ajdt-on-eclipse-45/workspace/org.eclipse.ajdt.core.tests/target/work/data/DefaultEmptyProject/src/p/Aspect.aj
 Dropping back to full build
Preparing for build: not going to be incremental because no successful previous full build
AJC: compiling source files
AJC: compiled: /jobs/genie.ajdt/ajdt-on-eclipse-45/workspace/org.eclipse.ajdt.core.tests/target/work/data/DefaultEmptyProject/src/p/Aspect.aj
Timer event: 81ms: Time to first woven message
AJC: woven aspect p.Aspect (from /jobs/genie.ajdt/ajdt-on-eclipse-45/workspace/org.eclipse.ajdt.core.tests/target/work/data/DefaultEmptyProject/src/p/Aspect.aj)
AJC: woven class p.Other (from /jobs/genie.ajdt/ajdt-on-eclipse-45/workspace/org.eclipse.ajdt.core.tests/target/work/data/DefaultEmptyProject/src/p/Aspect.aj)
AspectJ reports build successful, build was: FULL
AJDE Callback: finish. Was full build: true
Timer event: 82ms: Total time spent in AJDE
Timer event: 0ms: Refresh after build
Types affected during build = 1
Crosscutting model sanity checked with no problems
Timer event: 0ms: Model sanity check for: DefaultEmptyProject
Timer event: 84ms: Total time spent in AJBuilder.build()
Timer event: 1ms: Delete markers: DefaultEmptyProject (Finished deleting markers for DefaultEmptyProject)
Timer event: 0ms: Create markers: DefaultEmptyProject (Finished creating markers for DefaultEmptyProject)
Created 0 markers in 1 files
Timer event: 0ms: Update visualizer, xref, advice listeners for (separate thread): DefaultEmptyProject
===========================================================================================
Build kind = FULLBUILD
Project=DefaultEmptyProject, kind of build requested=Full AspectJ compilation
Timer event: 0ms: Flush included source file cache
Timer event: 0ms: Check delta
Builder: Tidied output folder(s), removed class files and derived resources
Classpath = /jobs/genie.ajdt/ajdt-on-eclipse-45/workspace/org.eclipse.ajdt.core.tests/target/work/data/DefaultEmptyProject/bin:/jobs/genie.ajdt/ajdt-on-eclipse-45/workspace/org.aspectj.runtime/target/org.aspectj.runtime-1.8.7-SNAPSHOT.jar:/opt/public/common/jdk1.7.0_80/jre/lib/resources.jar:/opt/public/common/jdk1.7.0_80/jre/lib/rt.jar:/opt/public/common/jdk1.7.0_80/jre/lib/jsse.jar:/opt/public/common/jdk1.7.0_80/jre/lib/jce.jar:/opt/public/common/jdk1.7.0_80/jre/lib/charsets.jar:/opt/public/common/jdk1.7.0_80/jre/lib/jfr.jar:/opt/public/common/jdk1.7.0_80/jre/lib/ext/dnsns.jar:/opt/public/common/jdk1.7.0_80/jre/lib/ext/sunpkcs11.jar:/opt/public/common/jdk1.7.0_80/jre/lib/ext/zipfs.jar:/opt/public/common/jdk1.7.0_80/jre/lib/ext/sunec.jar:/opt/public/common/jdk1.7.0_80/jre/lib/ext/sunjce_provider.jar:/opt/public/common/jdk1.7.0_80/jre/lib/ext/localedata.jar:/jobs/genie.ajdt/ajdt-on-eclipse-45/workspace/org.eclipse.ajdt.core.tests/target/work/configuration/org.eclipse.osgi/40/0/.cp/junit.jar:/jobs/genie.ajdt/ajdt-on-eclipse-45/workspace/org.eclipse.ajdt.core.tests/target/work/configuration/org.eclipse.osgi/218/0/.cp:
Timer event: 2ms: Pre compile
Compiler configuration for project DefaultEmptyProject has been read by compiler.  Resetting.
     Configuration was []
Resetting list of modified source files.  Was []
Preparing for build: not going to be incremental because no successful previous full build
AJC: compiling source files
Timer event: 39ms: Time to first compiled message
AJC: compiled: /jobs/genie.ajdt/ajdt-on-eclipse-45/workspace/org.eclipse.ajdt.core.tests/target/work/data/DefaultEmptyProject/src/p/Aspect.aj
Timer event: 41ms: Time to first woven message
AJC: woven aspect p.Aspect (from /jobs/genie.ajdt/ajdt-on-eclipse-45/workspace/org.eclipse.ajdt.core.tests/target/work/data/DefaultEmptyProject/src/p/Aspect.aj)
AJC: woven class p.Other (from /jobs/genie.ajdt/ajdt-on-eclipse-45/workspace/org.eclipse.ajdt.core.tests/target/work/data/DefaultEmptyProject/src/p/Aspect.aj)
AspectJ reports build successful, build was: FULL
AJDE Callback: finish. Was full build: true
Timer event: 43ms: Total time spent in AJDE
Timer event: 0ms: Refresh after build
Types affected during build = 1
Crosscutting model sanity checked with no problems
Timer event: 0ms: Model sanity check for: DefaultEmptyProject
Timer event: 45ms: Total time spent in AJBuilder.build()
Timer event: 1ms: Delete markers: DefaultEmptyProject (Finished deleting markers for DefaultEmptyProject)
Timer event: 1ms: Create markers: DefaultEmptyProject (Finished creating markers for DefaultEmptyProject)
Created 0 markers in 1 files
Timer event: 0ms: Update visualizer, xref, advice listeners for (separate thread): DefaultEmptyProject
------------------------
Starting testNormalAnnotationITD1
===========================================================================================
Build kind = FULLBUILD
Project=DefaultEmptyProject, kind of build requested=Full AspectJ compilation
Timer event: 0ms: Flush included source file cache
Timer event: 0ms: Check delta
Builder: Tidied output folder(s), removed class files and derived resources
Classpath = /jobs/genie.ajdt/ajdt-on-eclipse-45/workspace/org.eclipse.ajdt.core.tests/target/work/data/DefaultEmptyProject/bin:/jobs/genie.ajdt/ajdt-on-eclipse-45/workspace/org.aspectj.runtime/target/org.aspectj.runtime-1.8.7-SNAPSHOT.jar:/opt/public/common/jdk1.7.0_80/jre/lib/resources.jar:/opt/public/common/jdk1.7.0_80/jre/lib/rt.jar:/opt/public/common/jdk1.7.0_80/jre/lib/jsse.jar:/opt/public/common/jdk1.7.0_80/jre/lib/jce.jar:/opt/public/common/jdk1.7.0_80/jre/lib/charsets.jar:/opt/public/common/jdk1.7.0_80/jre/lib/jfr.jar:/opt/public/common/jdk1.7.0_80/jre/lib/ext/dnsns.jar:/opt/public/common/jdk1.7.0_80/jre/lib/ext/sunpkcs11.jar:/opt/public/common/jdk1.7.0_80/jre/lib/ext/zipfs.jar:/opt/public/common/jdk1.7.0_80/jre/lib/ext/sunec.jar:/opt/public/common/jdk1.7.0_80/jre/lib/ext/sunjce_provider.jar:/opt/public/common/jdk1.7.0_80/jre/lib/ext/localedata.jar:/jobs/genie.ajdt/ajdt-on-eclipse-45/workspace/org.eclipse.ajdt.core.tests/target/work/configuration/org.eclipse.osgi/40/0/.cp/junit.jar:/jobs/genie.ajdt/ajdt-on-eclipse-45/workspace/org.eclipse.ajdt.core.tests/target/work/configuration/org.eclipse.osgi/218/0/.cp:
Timer event: 7ms: Pre compile
Compiler configuration for project DefaultEmptyProject has been read by compiler.  Resetting.
     Configuration was []
Resetting list of modified source files.  Was []
Preparing for build: not going to be incremental because no successful previous full build
AJC: compiling source files
AspectJ reports build successful, build was: FULL
AJDE Callback: finish. Was full build: true
Timer event: 9ms: Total time spent in AJDE
Timer event: 0ms: Refresh after build
Crosscutting model sanity checked with no problems
Timer event: 0ms: Model sanity check for: DefaultEmptyProject
Timer event: 17ms: Total time spent in AJBuilder.build()
Timer event: 4ms: Delete markers: DefaultEmptyProject (Finished deleting markers for DefaultEmptyProject)
Timer event: 0ms: Create markers: DefaultEmptyProject (Finished creating markers for DefaultEmptyProject)
Created 0 markers in 0 files
Timer event: 0ms: Update visualizer, xref, advice listeners for (separate thread): DefaultEmptyProject
===========================================================================================
Build kind = AUTOBUILD
Project=DefaultEmptyProject, kind of build requested=Incremental AspectJ compilation
Timer event: 0ms: Flush included source file cache
Timer event: 1ms: Check delta
CoreCompilerConfiguration for project DefaultEmptyProject registered a configuration change: [PROJECTSOURCEFILES_CHANGED]
build: Examined delta - 0 changed, 1 added, and 0 deleted source files in required project DefaultEmptyProject
Timer event: 0ms: Looking for and marking configuration changes in DefaultEmptyProject
	Configuration changes found: true
Timer event: 0ms: Look for source/resource changes
Setting list of classpath elements with modified contents:
      []
Classpath = /jobs/genie.ajdt/ajdt-on-eclipse-45/workspace/org.eclipse.ajdt.core.tests/target/work/data/DefaultEmptyProject/bin:/jobs/genie.ajdt/ajdt-on-eclipse-45/workspace/org.aspectj.runtime/target/org.aspectj.runtime-1.8.7-SNAPSHOT.jar:/opt/public/common/jdk1.7.0_80/jre/lib/resources.jar:/opt/public/common/jdk1.7.0_80/jre/lib/rt.jar:/opt/public/common/jdk1.7.0_80/jre/lib/jsse.jar:/opt/public/common/jdk1.7.0_80/jre/lib/jce.jar:/opt/public/common/jdk1.7.0_80/jre/lib/charsets.jar:/opt/public/common/jdk1.7.0_80/jre/lib/jfr.jar:/opt/public/common/jdk1.7.0_80/jre/lib/ext/dnsns.jar:/opt/public/common/jdk1.7.0_80/jre/lib/ext/sunpkcs11.jar:/opt/public/common/jdk1.7.0_80/jre/lib/ext/zipfs.jar:/opt/public/common/jdk1.7.0_80/jre/lib/ext/sunec.jar:/opt/public/common/jdk1.7.0_80/jre/lib/ext/sunjce_provider.jar:/opt/public/common/jdk1.7.0_80/jre/lib/ext/localedata.jar:/jobs/genie.ajdt/ajdt-on-eclipse-45/workspace/org.eclipse.ajdt.core.tests/target/work/configuration/org.eclipse.osgi/40/0/.cp/junit.jar:/jobs/genie.ajdt/ajdt-on-eclipse-45/workspace/org.eclipse.ajdt.core.tests/target/work/configuration/org.eclipse.osgi/218/0/.cp:
Timer event: 1ms: Pre compile
Sending the following configuration changes to the compiler: [PROJECTSOURCEFILES_CHANGED]
Compiler configuration for project DefaultEmptyProject has been read by compiler.  Resetting.
     Configuration was [PROJECTSOURCEFILES_CHANGED]
Resetting list of modified source files.  Was []
ClassFileChangeChecking: failed to find a state instance managing output location : /jobs/genie.ajdt/ajdt-on-eclipse-45/workspace/org.eclipse.ajdt.core.tests/target/work/configuration/org.eclipse.osgi/218/0/.cp (could be getting managed by JDT)
Timer event: 0ms: OutputLocationManager: binary folder to declaring project map creation: P/DefaultEmptyProject
Preparing for build: planning to be an incremental build
Starting incremental compilation loop 1 of possibly 5
AJC: compiling source files
Timer event: 48ms: Time to first compiled message
AJC: compiled: /jobs/genie.ajdt/ajdt-on-eclipse-45/workspace/org.eclipse.ajdt.core.tests/target/work/data/DefaultEmptyProject/src/p/Aspect.aj
 Dropping back to full build
Preparing for build: not going to be incremental because no successful previous full build
AJC: compiling source files
AJC: compiled: /jobs/genie.ajdt/ajdt-on-eclipse-45/workspace/org.eclipse.ajdt.core.tests/target/work/data/DefaultEmptyProject/src/p/Aspect.aj
Timer event: 89ms: Time to first woven message
AJC: woven aspect p.Aspect (from /jobs/genie.ajdt/ajdt-on-eclipse-45/workspace/org.eclipse.ajdt.core.tests/target/work/data/DefaultEmptyProject/src/p/Aspect.aj)
AJC: woven class p.Other (from /jobs/genie.ajdt/ajdt-on-eclipse-45/workspace/org.eclipse.ajdt.core.tests/target/work/data/DefaultEmptyProject/src/p/Aspect.aj)
AJC: woven class p.Aspect$F (from /jobs/genie.ajdt/ajdt-on-eclipse-45/workspace/org.eclipse.ajdt.core.tests/target/work/data/DefaultEmptyProject/src/p/Aspect.aj)
AspectJ reports build successful, build was: FULL
AJDE Callback: finish. Was full build: true
Timer event: 92ms: Total time spent in AJDE
Timer event: 0ms: Refresh after build
Types affected during build = 1
Timer event: 0ms: Delete markers: DefaultEmptyProject (Finished deleting markers for DefaultEmptyProject)
Crosscutting model sanity checked with no problems
Timer event: 0ms: Model sanity check for: DefaultEmptyProject
Timer event: 95ms: Total time spent in AJBuilder.build()
Timer event: 3ms: Create markers: DefaultEmptyProject (Finished creating markers for DefaultEmptyProject)
Created 2 markers in 1 files
Timer event: 0ms: Update visualizer, xref, advice listeners for (separate thread): DefaultEmptyProject
[ERROR] Failure: java.lang.InterruptedException
Terminating xvnc.
Build was aborted
SWT: Fatal IO error 11 (Resource temporarily unavailable) on X server :1422.0.
[ERROR] o.h.m.e.EventSpyProcessor - Processing failure; aborting Maven
java.lang.IllegalStateException: Unable to call invoke. Invalid object ID 3
	at hudson.remoting.RemoteInvocationHandler$RPCRequest.perform(RemoteInvocationHandler.java:264) ~[hudson-remoting-3.0.3.jar:na]
	at hudson.remoting.RemoteInvocationHandler$RPCRequest.call(RemoteInvocationHandler.java:251) ~[hudson-remoting-3.0.3.jar:na]
	at hudson.remoting.RemoteInvocationHandler$RPCRequest.call(RemoteInvocationHandler.java:211) ~[hudson-remoting-3.0.3.jar:na]
	at hudson.remoting.UserRequest.perform(UserRequest.java:107) ~[hudson-remoting-3.0.3.jar:na]
	at hudson.remoting.UserRequest.perform(UserRequest.java:41) ~[hudson-remoting-3.0.3.jar:na]
	at hudson.remoting.Request$2.run(Request.java:276) ~[hudson-remoting-3.0.3.jar:na]
	at java.util.concurrent.Executors$RunnableAdapter.call(Executors.java:471) ~[na:1.7.0_80]
	at java.util.concurrent.FutureTask.run(FutureTask.java:262) ~[na:1.7.0_80]
	at java.util.concurrent.ThreadPoolExecutor.runWorker(ThreadPoolExecutor.java:1145) ~[na:1.7.0_80]
	at java.util.concurrent.ThreadPoolExecutor$Worker.run(ThreadPoolExecutor.java:615) ~[na:1.7.0_80]
	at java.lang.Thread.run(Thread.java:745) ~[na:1.7.0_80]
[INFO] ------------------------------------------------------------------------
[INFO] Reactor Summary:
[INFO] 
[INFO] parent ............................................. SUCCESS [  0.383 s]
[INFO] org.aspectj.runtime ................................ SUCCESS [  3.304 s]
[INFO] org.aspectj.weaver ................................. SUCCESS [  3.992 s]
[INFO] org.aspectj.ajde ................................... SUCCESS [  6.623 s]
[INFO] org.aspectj ........................................ SUCCESS [  3.065 s]
[INFO] org.eclipse.contribution.weaving.jdt ............... SUCCESS [  6.043 s]
[INFO] org.eclipse.ajdt.core .............................. SUCCESS [ 10.770 s]
[INFO] org.eclipse.ajdt.doc.user .......................... SUCCESS [  1.210 s]
[INFO] org.eclipse.ajdt.examples .......................... SUCCESS [  3.390 s]
[INFO] org.eclipse.contribution.visualiser ................ SUCCESS [  4.728 s]
[INFO] org.eclipse.contribution.xref.core ................. SUCCESS [  2.715 s]
[INFO] org.eclipse.contribution.xref.ui ................... SUCCESS [  3.477 s]
[INFO] org.eclipse.ajdt.ui ................................ SUCCESS [  9.786 s]
[INFO] org.eclipse.aspectj ................................ SUCCESS [  1.125 s]
[INFO] org.eclipse.ajdt.mylyn.ui .......................... SUCCESS [  6.777 s]
[INFO] org.eclipse.equinox.weaving.aspectj ................ SUCCESS [  2.336 s]
[INFO] org.eclipse.equinox.weaving.sdk .................... SUCCESS [  1.254 s]
[INFO] org.eclipse.ajdt ................................... SUCCESS [  2.847 s]
[INFO] org.eclipse.contribution.weaving ................... SUCCESS [  2.120 s]
[INFO] org.eclipse.contribution.xref ...................... SUCCESS [  2.610 s]
[INFO] org.eclipse.ajdt.sdk ............................... SUCCESS [  1.465 s]
[INFO] org.eclipse.ajdt.core.tests ........................ FAILURE [04:46 min]
[INFO] org.eclipse.contribution.visualiser.tests .......... SKIPPED
[INFO] org.eclipse.ajdt.ui.tests .......................... SKIPPED
[INFO] org.eclipse.ajdt.mylyn.ui.tests .................... SKIPPED
[INFO] org.eclipse.contribution.weaving.jdt.tests ......... SKIPPED
[INFO] org.eclipse.contribution.xref.core.tests ........... SKIPPED
[INFO] org.eclipse.contribution.xref.ui.tests ............. SKIPPED
[INFO] org.eclipse.aspectj.feature_tests .................. SKIPPED
[INFO] org.eclipse.ajdt.releng ............................ SKIPPED
[INFO] ------------------------------------------------------------------------
[INFO] BUILD FAILURE
[INFO] ------------------------------------------------------------------------
[INFO] Total time: 06:39 min
[INFO] Finished at: 2016-01-19T05:47:11-05:00
Finished: ABORTED