UnstableConsole Output

Skipping 675 KB.. Full Log
rTemplateTests)
  testParseTemplateMultipleVariable(org.eclipse.acceleo.parser.tests.ast.ASTParserTemplateTests)
  testParseTemplateVariableInit(org.eclipse.acceleo.parser.tests.ast.ASTParserTemplateTests)
  testParseTemplateInvalidHeader(org.eclipse.acceleo.parser.tests.ast.ASTParserTemplateTests)
  testParseTemplateMissingPostParenthesis2(org.eclipse.acceleo.parser.tests.ast.ASTParserTemplateTests)
  testParseTemplatePostGuardVariableInitOverridesQualifiedName(org.eclipse.acceleo.parser.tests.ast.ASTParserTemplateTests)
  testParseTemplateMissingCurlyBrace(org.eclipse.acceleo.parser.tests.ast.ASTParserTemplateTests)
  testParseTemplateParamNameKeyword(org.eclipse.acceleo.parser.tests.ast.ASTParserTemplateTests)
  testParseTemplateInvalidVisibility(org.eclipse.acceleo.parser.tests.ast.ASTParserTemplateTests)
  testParseTemplateMissingSemiColon(org.eclipse.acceleo.parser.tests.ast.ASTParserTemplateTests)
  testParseTemplateMissingQuestionMark(org.eclipse.acceleo.parser.tests.ast.ASTParserTemplateTests)
  testParseTemplateMultipleOverrideInSameModule(org.eclipse.acceleo.parser.tests.ast.ASTParserTemplateTests)
  testParseTemplateOverrideInSameModuleQualifiedName(org.eclipse.acceleo.parser.tests.ast.ASTParserTemplateTests)
  testParseTemplateInvalidParamName(org.eclipse.acceleo.parser.tests.ast.ASTParserTemplateTests)
  testParseTemplateInvalidParamType(org.eclipse.acceleo.parser.tests.ast.ASTParserTemplateTests)
  testParseTemplateInvalidGuard(org.eclipse.acceleo.parser.tests.ast.ASTParserTemplateTests)
  testParseMacroMissingName(org.eclipse.acceleo.parser.tests.ast.ASTParserMacroTests)
  testParseMacroMissingVisibility(org.eclipse.acceleo.parser.tests.ast.ASTParserMacroTests)
  testParseMacroInvalidReturnType(org.eclipse.acceleo.parser.tests.ast.ASTParserMacroTests)
  testParseMacroParamNameKeyword(org.eclipse.acceleo.parser.tests.ast.ASTParserMacroTests)
  testParseMacroDocumentation(org.eclipse.acceleo.parser.tests.ast.ASTParserMacroTests)
  testParseMacroInvalidParamName(org.eclipse.acceleo.parser.tests.ast.ASTParserMacroTests)
  testParseMacroInvalidParamType(org.eclipse.acceleo.parser.tests.ast.ASTParserMacroTests)
  testParseMacroValid2(org.eclipse.acceleo.parser.tests.ast.ASTParserMacroTests)
  testParseMacroInvalidVisibility(org.eclipse.acceleo.parser.tests.ast.ASTParserMacroTests)
  testParseMacroMissingParenthesis(org.eclipse.acceleo.parser.tests.ast.ASTParserMacroTests)
  testParseMacroDocumentationDeprecated(org.eclipse.acceleo.parser.tests.ast.ASTParserMacroTests)
  testParseMacroNamedMacro(org.eclipse.acceleo.parser.tests.ast.ASTParserMacroTests)
  testParseMacroInvalidHeader(org.eclipse.acceleo.parser.tests.ast.ASTParserMacroTests)
  testParseMacroInvalidName(org.eclipse.acceleo.parser.tests.ast.ASTParserMacroTests)
  testParseMacroNameKeyword(org.eclipse.acceleo.parser.tests.ast.ASTParserMacroTests)
  testParseMacroInvalidHeader2(org.eclipse.acceleo.parser.tests.ast.ASTParserMacroTests)
  testParseMacroMissingParamName(org.eclipse.acceleo.parser.tests.ast.ASTParserMacroTests)
  testParseMacroMissingParamType(org.eclipse.acceleo.parser.tests.ast.ASTParserMacroTests)
  testParseMacroValid(org.eclipse.acceleo.parser.tests.ast.ASTParserMacroTests)
  testParseMacroMissingReturnType(org.eclipse.acceleo.parser.tests.ast.ASTParserMacroTests)
  testParseMacroMissingParenthesis2(org.eclipse.acceleo.parser.tests.ast.ASTParserMacroTests)
  testParseMacroMissingParenthesis3(org.eclipse.acceleo.parser.tests.ast.ASTParserMacroTests)
  testParseFileInvalid(org.eclipse.acceleo.parser.tests.ast.ASTModelExpressionsTests)
  testParseIfValid2(org.eclipse.acceleo.parser.tests.ast.ASTModelExpressionsTests)
  testParseIfValid3(org.eclipse.acceleo.parser.tests.ast.ASTModelExpressionsTests)
  testParseIfValid4(org.eclipse.acceleo.parser.tests.ast.ASTModelExpressionsTests)
  testParseProtectedInvalid2(org.eclipse.acceleo.parser.tests.ast.ASTModelExpressionsTests)
  testParseProtectedInvalid3(org.eclipse.acceleo.parser.tests.ast.ASTModelExpressionsTests)
  testParseProtectedInvalid4(org.eclipse.acceleo.parser.tests.ast.ASTModelExpressionsTests)
  testParseProtectedInvalid5(org.eclipse.acceleo.parser.tests.ast.ASTModelExpressionsTests)
  testParseProtectedInvalid6(org.eclipse.acceleo.parser.tests.ast.ASTModelExpressionsTests)
  testParseProtectedInvalid7(org.eclipse.acceleo.parser.tests.ast.ASTModelExpressionsTests)
  testParseFileInvalid2(org.eclipse.acceleo.parser.tests.ast.ASTModelExpressionsTests)
  testParseFileInvalid3(org.eclipse.acceleo.parser.tests.ast.ASTModelExpressionsTests)
  testParseFileInvalid4(org.eclipse.acceleo.parser.tests.ast.ASTModelExpressionsTests)
  testParseFileInvalid5(org.eclipse.acceleo.parser.tests.ast.ASTModelExpressionsTests)
  testParseFileInvalid6(org.eclipse.acceleo.parser.tests.ast.ASTModelExpressionsTests)
  testParseFileInvalid7(org.eclipse.acceleo.parser.tests.ast.ASTModelExpressionsTests)
  testParseFileInvalid8(org.eclipse.acceleo.parser.tests.ast.ASTModelExpressionsTests)
  testParseProtectedValid(org.eclipse.acceleo.parser.tests.ast.ASTModelExpressionsTests)
  testParseTraceValid2(org.eclipse.acceleo.parser.tests.ast.ASTModelExpressionsTests)
  testParseLetValid(org.eclipse.acceleo.parser.tests.ast.ASTModelExpressionsTests)
  testParseFileValid(org.eclipse.acceleo.parser.tests.ast.ASTModelExpressionsTests)
  testParseProtectedInvalid(org.eclipse.acceleo.parser.tests.ast.ASTModelExpressionsTests)
  testParseProtectedValid2(org.eclipse.acceleo.parser.tests.ast.ASTModelExpressionsTests)
  testParseCommentValid2(org.eclipse.acceleo.parser.tests.ast.ASTModelExpressionsTests)
  testParseTraceValid(org.eclipse.acceleo.parser.tests.ast.ASTModelExpressionsTests)
  testParseCommentInvalid(org.eclipse.acceleo.parser.tests.ast.ASTModelExpressionsTests)
  testParseIfInvalid10(org.eclipse.acceleo.parser.tests.ast.ASTModelExpressionsTests)
  testParseCommentInvalid2(org.eclipse.acceleo.parser.tests.ast.ASTModelExpressionsTests)
  testParseCommentInvalid3(org.eclipse.acceleo.parser.tests.ast.ASTModelExpressionsTests)
  testParseCommentInvalid4(org.eclipse.acceleo.parser.tests.ast.ASTModelExpressionsTests)
  testParseCommentValid(org.eclipse.acceleo.parser.tests.ast.ASTModelExpressionsTests)
  testParseForInvalid2(org.eclipse.acceleo.parser.tests.ast.ASTModelExpressionsTests)
  testParseForInvalid3(org.eclipse.acceleo.parser.tests.ast.ASTModelExpressionsTests)
  testParseForInvalid4(org.eclipse.acceleo.parser.tests.ast.ASTModelExpressionsTests)
  testParseIfInvalid(org.eclipse.acceleo.parser.tests.ast.ASTModelExpressionsTests)
  testParseLetValid2(org.eclipse.acceleo.parser.tests.ast.ASTModelExpressionsTests)
  testParseLetValid3(org.eclipse.acceleo.parser.tests.ast.ASTModelExpressionsTests)
  testParseIfInvalid2(org.eclipse.acceleo.parser.tests.ast.ASTModelExpressionsTests)
  testParseIfInvalid3(org.eclipse.acceleo.parser.tests.ast.ASTModelExpressionsTests)
  testParseIfInvalid4(org.eclipse.acceleo.parser.tests.ast.ASTModelExpressionsTests)
  testParseIfInvalid5(org.eclipse.acceleo.parser.tests.ast.ASTModelExpressionsTests)
  testParseIfInvalid6(org.eclipse.acceleo.parser.tests.ast.ASTModelExpressionsTests)
  testParseIfInvalid7(org.eclipse.acceleo.parser.tests.ast.ASTModelExpressionsTests)
  testParseIfInvalid8(org.eclipse.acceleo.parser.tests.ast.ASTModelExpressionsTests)
  testParseIfInvalid9(org.eclipse.acceleo.parser.tests.ast.ASTModelExpressionsTests)
  testParseFileValid2(org.eclipse.acceleo.parser.tests.ast.ASTModelExpressionsTests)
  testParseLetInvalid2(org.eclipse.acceleo.parser.tests.ast.ASTModelExpressionsTests)
  testParseLetInvalid3(org.eclipse.acceleo.parser.tests.ast.ASTModelExpressionsTests)
  testParseLetInvalid4(org.eclipse.acceleo.parser.tests.ast.ASTModelExpressionsTests)
  testParseLetInvalid5(org.eclipse.acceleo.parser.tests.ast.ASTModelExpressionsTests)
  testParseLetInvalid6(org.eclipse.acceleo.parser.tests.ast.ASTModelExpressionsTests)
  testParseIfValid(org.eclipse.acceleo.parser.tests.ast.ASTModelExpressionsTests)
  testParseLetInvalid(org.eclipse.acceleo.parser.tests.ast.ASTModelExpressionsTests)
  testParseTraceInvalid2(org.eclipse.acceleo.parser.tests.ast.ASTModelExpressionsTests)
  testParseForValid2(org.eclipse.acceleo.parser.tests.ast.ASTModelExpressionsTests)
  testParseForValid3(org.eclipse.acceleo.parser.tests.ast.ASTModelExpressionsTests)
  testParseForValid4(org.eclipse.acceleo.parser.tests.ast.ASTModelExpressionsTests)
  testParseForValid5(org.eclipse.acceleo.parser.tests.ast.ASTModelExpressionsTests)
  testParseForValid6(org.eclipse.acceleo.parser.tests.ast.ASTModelExpressionsTests)
  testParseTraceInvalid(org.eclipse.acceleo.parser.tests.ast.ASTModelExpressionsTests)
  testParseForValid(org.eclipse.acceleo.parser.tests.ast.ASTModelExpressionsTests)
  testParseForInvalid(org.eclipse.acceleo.parser.tests.ast.ASTModelExpressionsTests)
  testParseDocumentationValid(org.eclipse.acceleo.parser.tests.ast.ASTDocumentationTests)
  testParseDocumentationValid2(org.eclipse.acceleo.parser.tests.ast.ASTDocumentationTests)
  testParseDocumentationModuleElementInvalid(org.eclipse.acceleo.parser.tests.ast.ASTDocumentationTests)
  testParserScopeForInvalid2(org.eclipse.acceleo.parser.tests.ast.ASTScopeForTests)
  testParserScopeForInvalid3(org.eclipse.acceleo.parser.tests.ast.ASTScopeForTests)
  testParserScopeForInvalid4(org.eclipse.acceleo.parser.tests.ast.ASTScopeForTests)
  testParserScopeForInvalid5(org.eclipse.acceleo.parser.tests.ast.ASTScopeForTests)
  testParserScopeForInvalid6(org.eclipse.acceleo.parser.tests.ast.ASTScopeForTests)
  testParserScopeForInvalid7(org.eclipse.acceleo.parser.tests.ast.ASTScopeForTests)
  testParserScopeForInvalid8(org.eclipse.acceleo.parser.tests.ast.ASTScopeForTests)
  testParserScopeForInvalid(org.eclipse.acceleo.parser.tests.ast.ASTScopeForTests)
  testParserScopeForValid(org.eclipse.acceleo.parser.tests.ast.ASTScopeForTests)
  testParserScopeForValid2(org.eclipse.acceleo.parser.tests.ast.ASTScopeForTests)
  testParserScopeForValid3(org.eclipse.acceleo.parser.tests.ast.ASTScopeForTests)
  testParserScopeForValid4(org.eclipse.acceleo.parser.tests.ast.ASTScopeForTests)
  testParserScopeLetValid2(org.eclipse.acceleo.parser.tests.ast.ASTScopeLetTests)
  testParserScopeLetValid3(org.eclipse.acceleo.parser.tests.ast.ASTScopeLetTests)
  testParserScopeLetValid4(org.eclipse.acceleo.parser.tests.ast.ASTScopeLetTests)
  testParserScopeLetInvalid2(org.eclipse.acceleo.parser.tests.ast.ASTScopeLetTests)
  testParserScopeLetInvalid3(org.eclipse.acceleo.parser.tests.ast.ASTScopeLetTests)
  testParserScopeLetInvalid4(org.eclipse.acceleo.parser.tests.ast.ASTScopeLetTests)
  testParserScopeLetInvalid5(org.eclipse.acceleo.parser.tests.ast.ASTScopeLetTests)
  testParserScopeLetInvalid6(org.eclipse.acceleo.parser.tests.ast.ASTScopeLetTests)
  testParserScopeLetInvalid7(org.eclipse.acceleo.parser.tests.ast.ASTScopeLetTests)
  testParserScopeLetInvalid8(org.eclipse.acceleo.parser.tests.ast.ASTScopeLetTests)
  testParserScopeLetInvalid9(org.eclipse.acceleo.parser.tests.ast.ASTScopeLetTests)
  testParserScopeLetValid(org.eclipse.acceleo.parser.tests.ast.ASTScopeLetTests)
  testParserScopeLetInvalid(org.eclipse.acceleo.parser.tests.ast.ASTScopeLetTests)
  testParserScopeQueryInvalid(org.eclipse.acceleo.parser.tests.ast.ASTScopeQueryTests)
  testParserScopeQueryValid(org.eclipse.acceleo.parser.tests.ast.ASTScopeQueryTests)
  testParserScopeQueryValid2(org.eclipse.acceleo.parser.tests.ast.ASTScopeQueryTests)
  testParserScopeQueryValid3(org.eclipse.acceleo.parser.tests.ast.ASTScopeQueryTests)
  testParserScopeTemplateInvalid(org.eclipse.acceleo.parser.tests.ast.ASTScopeTemplateTests)
  testParserScopeTemplateValid2(org.eclipse.acceleo.parser.tests.ast.ASTScopeTemplateTests)
  testParserScopeTemplateValid3(org.eclipse.acceleo.parser.tests.ast.ASTScopeTemplateTests)
  testParserScopeTemplateValid4(org.eclipse.acceleo.parser.tests.ast.ASTScopeTemplateTests)
  testParserScopeTemplateValid5(org.eclipse.acceleo.parser.tests.ast.ASTScopeTemplateTests)
  testParserScopeTemplateInvalid2(org.eclipse.acceleo.parser.tests.ast.ASTScopeTemplateTests)
  testParserScopeTemplateValid(org.eclipse.acceleo.parser.tests.ast.ASTScopeTemplateTests)
  testParserContextForInvalid(org.eclipse.acceleo.parser.tests.ast.ASTContextForTests)
  testParserContextForValid2(org.eclipse.acceleo.parser.tests.ast.ASTContextForTests)
  testParserContextForValid3(org.eclipse.acceleo.parser.tests.ast.ASTContextForTests)
  testParserContextForValid4(org.eclipse.acceleo.parser.tests.ast.ASTContextForTests)
  testParserContextForInvalid2(org.eclipse.acceleo.parser.tests.ast.ASTContextForTests)
  testParserContextForInvalid3(org.eclipse.acceleo.parser.tests.ast.ASTContextForTests)
  testParserContextForInvalid4(org.eclipse.acceleo.parser.tests.ast.ASTContextForTests)
  testParserContextForInvalid5(org.eclipse.acceleo.parser.tests.ast.ASTContextForTests)
  testParserContextForInvalid6(org.eclipse.acceleo.parser.tests.ast.ASTContextForTests)
  testParserContextForValid(org.eclipse.acceleo.parser.tests.ast.ASTContextForTests)
  testParserScopeLetValid2(org.eclipse.acceleo.parser.tests.ast.ASTContextLetTests)
  testParserContextLetInvalid(org.eclipse.acceleo.parser.tests.ast.ASTContextLetTests)
  testParserScopeLetValid(org.eclipse.acceleo.parser.tests.ast.ASTContextLetTests)
  testParserContextLetInvalid2(org.eclipse.acceleo.parser.tests.ast.ASTContextLetTests)
  testTraceabilityTextSimpleMultiline(org.eclipse.acceleo.traceability.tests.unit.text.AcceleoTraceabilityTextTests): expected:<[[]]> but was:<[[Missing [module] definition]]>
  testTraceabilityTextSimple(org.eclipse.acceleo.traceability.tests.unit.text.AcceleoTraceabilityTextTests): expected:<[[]]> but was:<[[Missing [module] definition]]>
  testTraceabilityTextSimpleWithSpace(org.eclipse.acceleo.traceability.tests.unit.text.AcceleoTraceabilityTextTests): expected:<[[]]> but was:<[[Missing [module] definition]]>
  testTraceabilityTemplateCollectionCollect2(org.eclipse.acceleo.traceability.tests.unit.template.AcceleoTraceabilityTemplateTests): expected:<[[]]> but was:<[[Missing [module] definition]]>
  testTraceabilityTemplateCollectionCollect3(org.eclipse.acceleo.traceability.tests.unit.template.AcceleoTraceabilityTemplateTests): expected:<[[]]> but was:<[[Missing [module] definition]]>
  testTraceabilityTemplateComplexUseCase(org.eclipse.acceleo.traceability.tests.unit.template.AcceleoTraceabilityTemplateTests): expected:<[[]]> but was:<[[Missing [module] definition]]>
  testTraceabilityTemplatePostSubstring(org.eclipse.acceleo.traceability.tests.unit.template.AcceleoTraceabilityTemplateTests): expected:<[[]]> but was:<[[Missing [module] definition]]>
  testTraceabilityTemplatePostTrim(org.eclipse.acceleo.traceability.tests.unit.template.AcceleoTraceabilityTemplateTests): expected:<[[]]> but was:<[[Missing [module] definition]]>
  testTraceabilityTemplateMultipleTemplates(org.eclipse.acceleo.traceability.tests.unit.template.AcceleoTraceabilityTemplateTests): expected:<[[]]> but was:<[[Missing [module] definition]]>
  testTraceabilityTemplateVariableInitialization(org.eclipse.acceleo.traceability.tests.unit.template.AcceleoTraceabilityTemplateTests): expected:<[[]]> but was:<[[Missing [module] definition]]>
  testTraceabilityTemplateVariableInitializationOperation(org.eclipse.acceleo.traceability.tests.unit.template.AcceleoTraceabilityTemplateTests): expected:<[[]]> but was:<[[Missing [module] definition]]>
  testTraceabilityTemplateMultipleParameters(org.eclipse.acceleo.traceability.tests.unit.template.AcceleoTraceabilityTemplateTests): expected:<[[]]> but was:<[[Missing [module] definition]]>
  testTraceabilityTemplateVariableInitializationTemplate(org.eclipse.acceleo.traceability.tests.unit.template.AcceleoTraceabilityTemplateTests): expected:<[[]]> but was:<[[Missing [module] definition]]>
  testTraceabilityTemplateCollectionReject(org.eclipse.acceleo.traceability.tests.unit.template.AcceleoTraceabilityTemplateTests): expected:<[[]]> but was:<[[Missing [module] definition]]>
  testTraceabilityTemplateCollectionSelect(org.eclipse.acceleo.traceability.tests.unit.template.AcceleoTraceabilityTemplateTests): expected:<[[]]> but was:<[[Missing [module] definition]]>
  testTraceabilityTemplateCollectIf(org.eclipse.acceleo.traceability.tests.unit.template.AcceleoTraceabilityTemplateTests): expected:<[[]]> but was:<[[Missing [module] definition]]>
  testTraceabilityTemplateTabulations(org.eclipse.acceleo.traceability.tests.unit.template.AcceleoTraceabilityTemplateTests): expected:<[[]]> but was:<[[Missing [module] definition]]>
  testTraceabilityTemplatePostTrim2(org.eclipse.acceleo.traceability.tests.unit.template.AcceleoTraceabilityTemplateTests): expected:<[[]]> but was:<[[Missing [module] definition]]>
  testTraceabilityTemplatePostTrim3(org.eclipse.acceleo.traceability.tests.unit.template.AcceleoTraceabilityTemplateTests): expected:<[[]]> but was:<[[Missing [module] definition]]>
  testTraceabilityTemplatePostTrim4(org.eclipse.acceleo.traceability.tests.unit.template.AcceleoTraceabilityTemplateTests): expected:<[[]]> but was:<[[Missing [module] definition]]>
  testTraceabilityTemplatePostTrim5(org.eclipse.acceleo.traceability.tests.unit.template.AcceleoTraceabilityTemplateTests): expected:<[[]]> but was:<[[Missing [module] definition]]>
  testTraceabilityTemplatePostTrim6(org.eclipse.acceleo.traceability.tests.unit.template.AcceleoTraceabilityTemplateTests): expected:<[[]]> but was:<[[Missing [module] definition]]>
  testTraceabilityTemplatePostTrim7(org.eclipse.acceleo.traceability.tests.unit.template.AcceleoTraceabilityTemplateTests): expected:<[[]]> but was:<[[Missing [module] definition]]>
  testTraceabilityTemplatePostTrim8(org.eclipse.acceleo.traceability.tests.unit.template.AcceleoTraceabilityTemplateTests): expected:<[[]]> but was:<[[Missing [module] definition]]>
  testTraceabilityTemplatePostTrim9(org.eclipse.acceleo.traceability.tests.unit.template.AcceleoTraceabilityTemplateTests): expected:<[[]]> but was:<[[Missing [module] definition]]>
  testTraceabilityTemplateImbricated(org.eclipse.acceleo.traceability.tests.unit.template.AcceleoTraceabilityTemplateTests): expected:<[[]]> but was:<[[Missing [module] definition]]>
  testTraceabilityTemplatePostTrim10(org.eclipse.acceleo.traceability.tests.unit.template.AcceleoTraceabilityTemplateTests): expected:<[[]]> but was:<[[Missing [module] definition]]>
  testTraceabilityTemplateGuard(org.eclipse.acceleo.traceability.tests.unit.template.AcceleoTraceabilityTemplateTests): expected:<[[]]> but was:<[[Missing [module] definition]]>
  testTraceabilityTemplateCollection2(org.eclipse.acceleo.traceability.tests.unit.template.AcceleoTraceabilityTemplateTests): expected:<[[]]> but was:<[[Missing [module] definition]]>
  testTraceabilityTemplateCollection3(org.eclipse.acceleo.traceability.tests.unit.template.AcceleoTraceabilityTemplateTests): expected:<[[]]> but was:<[[Missing [module] definition]]>
  testTraceabilityTemplateCollection4(org.eclipse.acceleo.traceability.tests.unit.template.AcceleoTraceabilityTemplateTests): expected:<[[]]> but was:<[[Missing [module] definition]]>
  testTraceabilityTemplateCollectionCollect(org.eclipse.acceleo.traceability.tests.unit.template.AcceleoTraceabilityTemplateTests): expected:<[[]]> but was:<[[Missing [module] definition]]>
  testTraceabilityTemplateSimple(org.eclipse.acceleo.traceability.tests.unit.template.AcceleoTraceabilityTemplateTests): expected:<[[]]> but was:<[[Missing [module] definition]]>
  testTraceabilityTemplateVariableInitializationQuery(org.eclipse.acceleo.traceability.tests.unit.template.AcceleoTraceabilityTemplateTests): expected:<[[]]> but was:<[[Missing [module] definition]]>
  testTraceabilityTemplateIndentation(org.eclipse.acceleo.traceability.tests.unit.template.AcceleoTraceabilityTemplateTests): expected:<[[]]> but was:<[[Missing [module] definition]]>
  testTraceabilityTemplateVariableExp(org.eclipse.acceleo.traceability.tests.unit.template.AcceleoTraceabilityTemplateTests): expected:<[[]]> but was:<[[Missing [module] definition]]>
  testTraceabilityTemplateCollectIf2(org.eclipse.acceleo.traceability.tests.unit.template.AcceleoTraceabilityTemplateTests): expected:<[[]]> but was:<[[Missing [module] definition]]>
  testTraceabilityTemplateCollectIf3(org.eclipse.acceleo.traceability.tests.unit.template.AcceleoTraceabilityTemplateTests): expected:<[[]]> but was:<[[Missing [module] definition]]>
  testTraceabilityTemplateCollection(org.eclipse.acceleo.traceability.tests.unit.template.AcceleoTraceabilityTemplateTests): expected:<[[]]> but was:<[[Missing [module] definition]]>
  testTraceabilityQueryCollectionCollect2(org.eclipse.acceleo.traceability.tests.unit.query.AcceleoTraceabilityQueryTests): expected:<[[]]> but was:<[[Missing [module] definition]]>
  testTraceabilityQueryCache(org.eclipse.acceleo.traceability.tests.unit.query.AcceleoTraceabilityQueryTests): expected:<[[]]> but was:<[[Missing [module] definition]]>
  testTraceabilityQueryImbricated(org.eclipse.acceleo.traceability.tests.unit.query.AcceleoTraceabilityQueryTests): expected:<[[]]> but was:<[[Missing [module] definition]]>
  testTraceabilityQueryCollection(org.eclipse.acceleo.traceability.tests.unit.query.AcceleoTraceabilityQueryTests): expected:<[[]]> but was:<[[Missing [module] definition]]>
  testTraceabilityQueryCollectionCollect(org.eclipse.acceleo.traceability.tests.unit.query.AcceleoTraceabilityQueryTests): expected:<[[]]> but was:<[[Missing [module] definition]]>
  testTraceabilityQueryMultipleQueries(org.eclipse.acceleo.traceability.tests.unit.query.AcceleoTraceabilityQueryTests): expected:<[[]]> but was:<[[Missing [module] definition]]>
  testTraceabilityQueryCollection2(org.eclipse.acceleo.traceability.tests.unit.query.AcceleoTraceabilityQueryTests): expected:<[[]]> but was:<[[Missing [module] definition]]>
  testTraceabilityQueryCollection3(org.eclipse.acceleo.traceability.tests.unit.query.AcceleoTraceabilityQueryTests): expected:<[[]]> but was:<[[Missing [module] definition]]>
  testTraceabilityQueryMultipleParameters(org.eclipse.acceleo.traceability.tests.unit.query.AcceleoTraceabilityQueryTests): expected:<[[]]> but was:<[[Missing [module] definition]]>
  testTraceabilityQueryComplexUseCase(org.eclipse.acceleo.traceability.tests.unit.query.AcceleoTraceabilityQueryTests): expected:<[[]]> but was:<[[Missing [module] definition]]>
  testTraceabilityQueryVariableExp(org.eclipse.acceleo.traceability.tests.unit.query.AcceleoTraceabilityQueryTests): expected:<[[]]> but was:<[[Missing [module] definition]]>
  testTraceabilityQuerySimple(org.eclipse.acceleo.traceability.tests.unit.query.AcceleoTraceabilityQueryTests): expected:<[[]]> but was:<[[Missing [module] definition]]>
  testTraceabilityQueryCollectionSelect(org.eclipse.acceleo.traceability.tests.unit.query.AcceleoTraceabilityQueryTests): expected:<[[]]> but was:<[[Missing [module] definition]]>
  testTraceabilityModelEnumToString(org.eclipse.acceleo.traceability.tests.unit.model.AcceleoTraceabilityModelTests): expected:<[[]]> but was:<[[Missing [module] definition]]>
  testTraceabilityModelSimple(org.eclipse.acceleo.traceability.tests.unit.model.AcceleoTraceabilityModelTests): expected:<[[]]> but was:<[[Missing [module] definition]]>
  testTraceabilityModelEnum(org.eclipse.acceleo.traceability.tests.unit.model.AcceleoTraceabilityModelTests): expected:<[[]]> but was:<[[Missing [module] definition]]>
  testTraceabilityModelPropertyOperationSize(org.eclipse.acceleo.traceability.tests.unit.model.AcceleoTraceabilityModelTests): expected:<[[]]> but was:<[[Missing [module] definition]]>
  testTraceabilityModelEnumString(org.eclipse.acceleo.traceability.tests.unit.model.AcceleoTraceabilityModelTests): expected:<[[]]> but was:<[[Missing [module] definition]]>
  testTraceabilityModelMetamodel(org.eclipse.acceleo.traceability.tests.unit.model.AcceleoTraceabilityModelTests): expected:<[[]]> but was:<[[Missing [module] definition]]>
  testTraceabilityBlockProtectedQuery(org.eclipse.acceleo.traceability.tests.unit.block.AcceleoTraceabilityBlockTests): expected:<[[]]> but was:<[[Missing [module] definition]]>
  testTraceabilityBlockElse(org.eclipse.acceleo.traceability.tests.unit.block.AcceleoTraceabilityBlockTests): expected:<[[]]> but was:<[[Missing [module] definition]]>
  testTraceabilityBlockFile(org.eclipse.acceleo.traceability.tests.unit.block.AcceleoTraceabilityBlockTests): expected:<[[]]> but was:<[[Missing [module] definition]]>
  testTraceabilityBlockForQuery2(org.eclipse.acceleo.traceability.tests.unit.block.AcceleoTraceabilityBlockTests): expected:<[[]]> but was:<[[Missing [module] definition]]>
  testTraceabilityBlockForQuery3(org.eclipse.acceleo.traceability.tests.unit.block.AcceleoTraceabilityBlockTests): expected:<[[]]> but was:<[[Missing [module] definition]]>
  testTraceabilityBlockForTemplate(org.eclipse.acceleo.traceability.tests.unit.block.AcceleoTraceabilityBlockTests): expected:<[[]]> but was:<[[Missing [module] definition]]>
  testTraceabilityBlockTemplateForIf(org.eclipse.acceleo.traceability.tests.unit.block.AcceleoTraceabilityBlockTests): expected:<[[]]> but was:<[[Missing [module] definition]]>
  testTraceabilityBlockFileTemplate(org.eclipse.acceleo.traceability.tests.unit.block.AcceleoTraceabilityBlockTests): expected:<[[]]> but was:<[[Missing [module] definition]]>
  testTraceabilityBlockLetTemplate(org.eclipse.acceleo.traceability.tests.unit.block.AcceleoTraceabilityBlockTests): expected:<[[]]> but was:<[[Missing [module] definition]]>
  testTraceabilityBlockIfTemplate(org.eclipse.acceleo.traceability.tests.unit.block.AcceleoTraceabilityBlockTests): expected:<[[]]> but was:<[[Missing [module] definition]]>
  testTraceabilityBlockTemplateForFor(org.eclipse.acceleo.traceability.tests.unit.block.AcceleoTraceabilityBlockTests): expected:<[[]]> but was:<[[Missing [module] definition]]>
  testTraceabilityBlockForVariableInitialization(org.eclipse.acceleo.traceability.tests.unit.block.AcceleoTraceabilityBlockTests): expected:<[[]]> but was:<[[Missing [module] definition]]>
  testTraceabilityBlockTemplateCollectFile2(org.eclipse.acceleo.traceability.tests.unit.block.AcceleoTraceabilityBlockTests): expected:<[[]]> but was:<[[Missing [module] definition]]>
  testTraceabilityBlockTemplateCollectFile3(org.eclipse.acceleo.traceability.tests.unit.block.AcceleoTraceabilityBlockTests): expected:<[[]]> but was:<[[Missing [module] definition]]>
  testTraceabilityBlockTemplateCollectFile4(org.eclipse.acceleo.traceability.tests.unit.block.AcceleoTraceabilityBlockTests): expected:<[[]]> but was:<[[Missing [module] definition]]>
  testTraceabilityBlockTemplateCollectFile5(org.eclipse.acceleo.traceability.tests.unit.block.AcceleoTraceabilityBlockTests): expected:<[[]]> but was:<[[Missing [module] definition]]>
  testTraceabilityBlockTemplateCollectFile6(org.eclipse.acceleo.traceability.tests.unit.block.AcceleoTraceabilityBlockTests): expected:<[[]]> but was:<[[Missing [module] definition]]>
  testTraceabilityBlockTemplateCollectFile7(org.eclipse.acceleo.traceability.tests.unit.block.AcceleoTraceabilityBlockTests): expected:<[[]]> but was:<[[Missing [module] definition]]>
  testTraceabilityBlockProtectedTemplate(org.eclipse.acceleo.traceability.tests.unit.block.AcceleoTraceabilityBlockTests): expected:<[[]]> but was:<[[Missing [module] definition]]>
  testTraceabilityBlockFileQuery(org.eclipse.acceleo.traceability.tests.unit.block.AcceleoTraceabilityBlockTests): expected:<[[]]> but was:<[[Missing [module] definition]]>
  testTraceabilityBlockForQuery(org.eclipse.acceleo.traceability.tests.unit.block.AcceleoTraceabilityBlockTests): expected:<[[]]> but was:<[[Missing [module] definition]]>
  testTraceabilityBlockIfQuery(org.eclipse.acceleo.traceability.tests.unit.block.AcceleoTraceabilityBlockTests): expected:<[[]]> but was:<[[Missing [module] definition]]>
  testTraceabilityBlockTemplateFor(org.eclipse.acceleo.traceability.tests.unit.block.AcceleoTraceabilityBlockTests): expected:<[[]]> but was:<[[Missing [module] definition]]>
  testTraceabilityBlockFileConcat(org.eclipse.acceleo.traceability.tests.unit.block.AcceleoTraceabilityBlockTests): expected:<[[]]> but was:<[[Missing [module] definition]]>
  testTraceabilityBlockTemplateFile(org.eclipse.acceleo.traceability.tests.unit.block.AcceleoTraceabilityBlockTests): expected:<[[]]> but was:<[[Missing [module] definition]]>
  testTraceabilityBlockTemplateCollectFileIf(org.eclipse.acceleo.traceability.tests.unit.block.AcceleoTraceabilityBlockTests): expected:<[[]]> but was:<[[Missing [module] definition]]>
  testTraceabilityBlockForVariableInitializationQuery(org.eclipse.acceleo.traceability.tests.unit.block.AcceleoTraceabilityBlockTests): expected:<[[]]> but was:<[[Missing [module] definition]]>
  testTraceabilityBlockFor(org.eclipse.acceleo.traceability.tests.unit.block.AcceleoTraceabilityBlockTests): expected:<[[]]> but was:<[[Missing [module] definition]]>
  testTraceabilityBlockLet(org.eclipse.acceleo.traceability.tests.unit.block.AcceleoTraceabilityBlockTests): expected:<[[]]> but was:<[[Missing [module] definition]]>
  testTraceabilityBlockProtected(org.eclipse.acceleo.traceability.tests.unit.block.AcceleoTraceabilityBlockTests): expected:<[[]]> but was:<[[Missing [module] definition]]>
  testTraceabilityBlockTemplateForIfLet(org.eclipse.acceleo.traceability.tests.unit.block.AcceleoTraceabilityBlockTests): expected:<[[]]> but was:<[[Missing [module] definition]]>
  testTraceabilityBlockTemplateCollectFile(org.eclipse.acceleo.traceability.tests.unit.block.AcceleoTraceabilityBlockTests): expected:<[[]]> but was:<[[Missing [module] definition]]>
  testTraceabilityBlockTemplateForForTemplateForForTemplateForForTemplateForFor(org.eclipse.acceleo.traceability.tests.unit.block.AcceleoTraceabilityBlockTests): expected:<[[]]> but was:<[[Missing [module] definition]]>
  testTraceabilityBlockIf(org.eclipse.acceleo.traceability.tests.unit.block.AcceleoTraceabilityBlockTests): expected:<[[]]> but was:<[[Missing [module] definition]]>
  testTraceabilityBlockTemplateCollectFileIfTrim(org.eclipse.acceleo.traceability.tests.unit.block.AcceleoTraceabilityBlockTests): expected:<[[]]> but was:<[[Missing [module] definition]]>
  testTraceabilityBlockTemplateCollectFileFor(org.eclipse.acceleo.traceability.tests.unit.block.AcceleoTraceabilityBlockTests): expected:<[[]]> but was:<[[Missing [module] definition]]>
  testTraceabilityBlockTemplateCollectFileIf2(org.eclipse.acceleo.traceability.tests.unit.block.AcceleoTraceabilityBlockTests): expected:<[[]]> but was:<[[Missing [module] definition]]>
  testTraceabilityBlockForVariableInitializationTemplate(org.eclipse.acceleo.traceability.tests.unit.block.AcceleoTraceabilityBlockTests): expected:<[[]]> but was:<[[Missing [module] definition]]>
  testTraceabilityBlockLetQuery(org.eclipse.acceleo.traceability.tests.unit.block.AcceleoTraceabilityBlockTests): expected:<[[]]> but was:<[[Missing [module] definition]]>
  testTraceabilityBlockForVariableInitializationOperation(org.eclipse.acceleo.traceability.tests.unit.block.AcceleoTraceabilityBlockTests): expected:<[[]]> but was:<[[Missing [module] definition]]>
  testTraceabilityLibraryStringReplaceAllTemplate(org.eclipse.acceleo.traceability.tests.unit.library.AcceleoTraceabilityLibraryStringTests): expected:<[[]]> but was:<[[Missing [module] definition]]>
  testTraceabilityLibraryStringCollectionSep(org.eclipse.acceleo.traceability.tests.unit.library.AcceleoTraceabilityLibraryStringTests): expected:<[[]]> but was:<[[Missing [module] definition]]>
  testTraceabilityLibraryStringCollection(org.eclipse.acceleo.traceability.tests.unit.library.AcceleoTraceabilityLibraryStringTests): expected:<[[]]> but was:<[[Missing [module] definition]]>
  testTraceabilityLibraryStringSubstituteAll(org.eclipse.acceleo.traceability.tests.unit.library.AcceleoTraceabilityLibraryStringTests): expected:<[[]]> but was:<[[Missing [module] definition]]>
  testTraceabilityLibraryStringStartsWith(org.eclipse.acceleo.traceability.tests.unit.library.AcceleoTraceabilityLibraryStringTests): expected:<[[]]> but was:<[[Missing [module] definition]]>
  testTraceabilityLibraryStringReplaceQuery(org.eclipse.acceleo.traceability.tests.unit.library.AcceleoTraceabilityLibraryStringTests): expected:<[[]]> but was:<[[Missing [module] definition]]>
  testTraceabilityLibraryStringToUpperFirst(org.eclipse.acceleo.traceability.tests.unit.library.AcceleoTraceabilityLibraryStringTests): expected:<[[]]> but was:<[[Missing [module] definition]]>
  testTraceabilityLibraryStringEndsWith(org.eclipse.acceleo.traceability.tests.unit.library.AcceleoTraceabilityLibraryStringTests): expected:<[[]]> but was:<[[Missing [module] definition]]>
  testTraceabilityLibraryStringReplaceAll(org.eclipse.acceleo.traceability.tests.unit.library.AcceleoTraceabilityLibraryStringTests): expected:<[[]]> but was:<[[Missing [module] definition]]>
  testTraceabilityLibraryStringReplaceAllQuery(org.eclipse.acceleo.traceability.tests.unit.library.AcceleoTraceabilityLibraryStringTests): expected:<[[]]> but was:<[[Missing [module] definition]]>
  testTraceabilityLibraryStringLastIndex(org.eclipse.acceleo.traceability.tests.unit.library.AcceleoTraceabilityLibraryStringTests): expected:<[[]]> but was:<[[Missing [module] definition]]>
  testTraceabilityLibraryStringEqualsIgnoreCase(org.eclipse.acceleo.traceability.tests.unit.library.AcceleoTraceabilityLibraryStringTests): expected:<[[]]> but was:<[[Missing [module] definition]]>
  testTraceabilityLibraryStringCollectionReverse(org.eclipse.acceleo.traceability.tests.unit.library.AcceleoTraceabilityLibraryStringTests): expected:<[[]]> but was:<[[Missing [module] definition]]>
  testTraceabilityLibraryStringSubstitute(org.eclipse.acceleo.traceability.tests.unit.library.AcceleoTraceabilityLibraryStringTests): expected:<[[]]> but was:<[[Missing [module] definition]]>
  testTraceabilityLibraryStringCollectionLast(org.eclipse.acceleo.traceability.tests.unit.library.AcceleoTraceabilityLibraryStringTests): expected:<[[]]> but was:<[[Missing [module] definition]]>
  testTraceabilityLibraryStringCollectionSep2(org.eclipse.acceleo.traceability.tests.unit.library.AcceleoTraceabilityLibraryStringTests): expected:<[[]]> but was:<[[Missing [module] definition]]>
  testTraceabilityLibraryStringReplaceTemplate(org.eclipse.acceleo.traceability.tests.unit.library.AcceleoTraceabilityLibraryStringTests): expected:<[[]]> but was:<[[Missing [module] definition]]>
  testTraceabilityLibraryStringLast(org.eclipse.acceleo.traceability.tests.unit.library.AcceleoTraceabilityLibraryStringTests): expected:<[[]]> but was:<[[Missing [module] definition]]>
  testTraceabilityLibraryStringTrim(org.eclipse.acceleo.traceability.tests.unit.library.AcceleoTraceabilityLibraryStringTests): expected:<[[]]> but was:<[[Missing [module] definition]]>
  testTraceabilityLibraryStringTokenize(org.eclipse.acceleo.traceability.tests.unit.library.AcceleoTraceabilityLibraryStringTests): expected:<[[]]> but was:<[[Missing [module] definition]]>
  testTraceabilityLibraryStringFirst(org.eclipse.acceleo.traceability.tests.unit.library.AcceleoTraceabilityLibraryStringTests): expected:<[[]]> but was:<[[Missing [module] definition]]>
  testTraceabilityLibraryStringIndex(org.eclipse.acceleo.traceability.tests.unit.library.AcceleoTraceabilityLibraryStringTests): expected:<[[]]> but was:<[[Missing [module] definition]]>
  testTraceabilityLibraryStringCollectionReverse2(org.eclipse.acceleo.traceability.tests.unit.library.AcceleoTraceabilityLibraryStringTests): expected:<[[]]> but was:<[[Missing [module] definition]]>
  testTraceabilityLibraryStringIsAlpha2(org.eclipse.acceleo.traceability.tests.unit.library.AcceleoTraceabilityLibraryStringTests): expected:<[[]]> but was:<[[Missing [module] definition]]>
  testTraceabilityLibraryStringContains(org.eclipse.acceleo.traceability.tests.unit.library.AcceleoTraceabilityLibraryStringTests): expected:<[[]]> but was:<[[Missing [module] definition]]>
  testTraceabilityLibraryStringIsAlphaNum2(org.eclipse.acceleo.traceability.tests.unit.library.AcceleoTraceabilityLibraryStringTests): expected:<[[]]> but was:<[[Missing [module] definition]]>
  testTraceabilityLibraryStringMatches(org.eclipse.acceleo.traceability.tests.unit.library.AcceleoTraceabilityLibraryStringTests): expected:<[[]]> but was:<[[Missing [module] definition]]>
  testTraceabilityLibraryStringCollectionFirst2(org.eclipse.acceleo.traceability.tests.unit.library.AcceleoTraceabilityLibraryStringTests): expected:<[[]]> but was:<[[Missing [module] definition]]>
  testTraceabilityLibraryStringCollectionFirst3(org.eclipse.acceleo.traceability.tests.unit.library.AcceleoTraceabilityLibraryStringTests): expected:<[[]]> but was:<[[Missing [module] definition]]>
  testTraceabilityLibraryStringReplace(org.eclipse.acceleo.traceability.tests.unit.library.AcceleoTraceabilityLibraryStringTests): expected:<[[]]> but was:<[[Missing [module] definition]]>
  testTraceabilityLibraryStringStrCmp(org.eclipse.acceleo.traceability.tests.unit.library.AcceleoTraceabilityLibraryStringTests): expected:<[[]]> but was:<[[Missing [module] definition]]>
  testTraceabilityLibraryStringStrStr(org.eclipse.acceleo.traceability.tests.unit.library.AcceleoTraceabilityLibraryStringTests): expected:<[[]]> but was:<[[Missing [module] definition]]>
  testTraceabilityLibraryStringStrTok(org.eclipse.acceleo.traceability.tests.unit.library.AcceleoTraceabilityLibraryStringTests): expected:<[[]]> but was:<[[Missing [module] definition]]>
  testTraceabilityLibraryStringReplaceAllFirstLast(org.eclipse.acceleo.traceability.tests.unit.library.AcceleoTraceabilityLibraryStringTests): expected:<[[]]> but was:<[[Missing [module] definition]]>
  testTraceabilityLibraryStringIsAlphaNum(org.eclipse.acceleo.traceability.tests.unit.library.AcceleoTraceabilityLibraryStringTests): expected:<[[]]> but was:<[[Missing [module] definition]]>
  testTraceabilityLibraryStringTokenize2(org.eclipse.acceleo.traceability.tests.unit.library.AcceleoTraceabilityLibraryStringTests): expected:<[[]]> but was:<[[Missing [module] definition]]>
  testTraceabilityLibraryStringToLowerFirst(org.eclipse.acceleo.traceability.tests.unit.library.AcceleoTraceabilityLibraryStringTests): expected:<[[]]> but was:<[[Missing [module] definition]]>
  testTraceabilityLibraryStringSubstring(org.eclipse.acceleo.traceability.tests.unit.library.AcceleoTraceabilityLibraryStringTests): expected:<[[]]> but was:<[[Missing [module] definition]]>
  testTraceabilityLibraryStringCollectionFirst(org.eclipse.acceleo.traceability.tests.unit.library.AcceleoTraceabilityLibraryStringTests): expected:<[[]]> but was:<[[Missing [module] definition]]>
  testTraceabilityLibraryStringCollectionLast2(org.eclipse.acceleo.traceability.tests.unit.library.AcceleoTraceabilityLibraryStringTests): expected:<[[]]> but was:<[[Missing [module] definition]]>
  testTraceabilityLibraryStringCollectionLast3(org.eclipse.acceleo.traceability.tests.unit.library.AcceleoTraceabilityLibraryStringTests): expected:<[[]]> but was:<[[Missing [module] definition]]>
  testTraceabilityLibraryStringIsAlpha(org.eclipse.acceleo.traceability.tests.unit.library.AcceleoTraceabilityLibraryStringTests): expected:<[[]]> but was:<[[Missing [module] definition]]>
  testTraceabilityLibraryOclIfPropertyExp(org.eclipse.acceleo.traceability.tests.unit.library.AcceleoTraceabilityLibraryOclTests): expected:<[[]]> but was:<[[Missing [module] definition]]>
  testTraceabilityLibraryOclIfStringLiteral(org.eclipse.acceleo.traceability.tests.unit.library.AcceleoTraceabilityLibraryOclTests): expected:<[[]]> but was:<[[Missing [module] definition]]>

Tests in error: 
  testScriptParameter(org.eclipse.acceleo.compatibility.tests.unit.migration.FileScriptParameterTest): java.io.FileNotFoundException: file:/opt/users/hudsonbuild/workspace/m2t-acceleo-3.3/tests/org.eclipse.acceleo.compatibility.tests/target/org.eclipse.acceleo.compatibility.tests-3.3.4-SNAPSHOT.jar!/data/fileScriptParameter/emt/chain.emt (No such file or directory)
  testIsScript(org.eclipse.acceleo.compatibility.tests.unit.migration.IsScriptTest): java.io.FileNotFoundException: file:/opt/users/hudsonbuild/workspace/m2t-acceleo-3.3/tests/org.eclipse.acceleo.compatibility.tests/target/org.eclipse.acceleo.compatibility.tests-3.3.4-SNAPSHOT.jar!/data/isScript/emt/chain.emt (No such file or directory)
  testPostTrim(org.eclipse.acceleo.compatibility.tests.unit.migration.PostTrimTest): java.io.FileNotFoundException: file:/opt/users/hudsonbuild/workspace/m2t-acceleo-3.3/tests/org.eclipse.acceleo.compatibility.tests/target/org.eclipse.acceleo.compatibility.tests-3.3.4-SNAPSHOT.jar!/data/postTrim/emt/chain.emt (No such file or directory)
  testFilter(org.eclipse.acceleo.compatibility.tests.unit.migration.FilterTest): java.io.FileNotFoundException: file:/opt/users/hudsonbuild/workspace/m2t-acceleo-3.3/tests/org.eclipse.acceleo.compatibility.tests/target/org.eclipse.acceleo.compatibility.tests-3.3.4-SNAPSHOT.jar!/data/filter/emt/chain.emt (No such file or directory)
  testGetProperty(org.eclipse.acceleo.compatibility.tests.unit.migration.getPropertyTest): java.io.FileNotFoundException: file:/opt/users/hudsonbuild/workspace/m2t-acceleo-3.3/tests/org.eclipse.acceleo.compatibility.tests/target/org.eclipse.acceleo.compatibility.tests-3.3.4-SNAPSHOT.jar!/data/getProperty/emt/chain.emt (No such file or directory)
  testArgs(org.eclipse.acceleo.compatibility.tests.unit.migration.ArgsTest): java.io.FileNotFoundException: file:/opt/users/hudsonbuild/workspace/m2t-acceleo-3.3/tests/org.eclipse.acceleo.compatibility.tests/target/org.eclipse.acceleo.compatibility.tests-3.3.4-SNAPSHOT.jar!/data/args/emt/chain.emt (No such file or directory)
  testSize(org.eclipse.acceleo.compatibility.tests.unit.migration.SizeTest): java.io.FileNotFoundException: file:/opt/users/hudsonbuild/workspace/m2t-acceleo-3.3/tests/org.eclipse.acceleo.compatibility.tests/target/org.eclipse.acceleo.compatibility.tests-3.3.4-SNAPSHOT.jar!/data/size/emt/chain.emt (No such file or directory)
  testService(org.eclipse.acceleo.compatibility.tests.unit.migration.ServiceTest): java.io.FileNotFoundException: file:/opt/users/hudsonbuild/workspace/m2t-acceleo-3.3/tests/org.eclipse.acceleo.compatibility.tests/target/org.eclipse.acceleo.compatibility.tests-3.3.4-SNAPSHOT.jar!/data/service/emt/chain.emt (No such file or directory)
  testNavigation(org.eclipse.acceleo.compatibility.tests.unit.migration.NavigationTest): java.io.FileNotFoundException: file:/opt/users/hudsonbuild/workspace/m2t-acceleo-3.3/tests/org.eclipse.acceleo.compatibility.tests/target/org.eclipse.acceleo.compatibility.tests-3.3.4-SNAPSHOT.jar!/data/navigation/emt/chain.emt (No such file or directory)
  testAdapt(org.eclipse.acceleo.compatibility.tests.unit.migration.AdaptTest): java.io.FileNotFoundException: file:/opt/users/hudsonbuild/workspace/m2t-acceleo-3.3/tests/org.eclipse.acceleo.compatibility.tests/target/org.eclipse.acceleo.compatibility.tests-3.3.4-SNAPSHOT.jar!/data/adapt/emt/chain.emt (No such file or directory)
  testForStatementAfterKeyword(org.eclipse.acceleo.engine.tests.unit.blocks.forBlock.ForBlockTest): Could not find public template testingAfter in module null.
  testForStatementBeforeKeyword(org.eclipse.acceleo.engine.tests.unit.blocks.forBlock.ForBlockTest): Could not find public template testingBefore in module null.
  testForStatementIVariable(org.eclipse.acceleo.engine.tests.unit.blocks.forBlock.ForBlockTest): Could not find public template testingI in module null.
  testForStatementIVariableSeparator(org.eclipse.acceleo.engine.tests.unit.blocks.forBlock.ForBlockTest): Could not find public template testingISeparator in module null.
  testForStatementBasicExample(org.eclipse.acceleo.engine.tests.unit.blocks.forBlock.ForBlockTest): Could not find public template testingSimple in module null.
  testForStatementSeparatorKeyword(org.eclipse.acceleo.engine.tests.unit.blocks.forBlock.ForBlockTest): Could not find public template testingSeparator in module null.
  testForStatementGuardKeyword(org.eclipse.acceleo.engine.tests.unit.blocks.forBlock.ForBlockTest): Could not find public template testingGuard in module null.
  testIfStatementNestedIf(org.eclipse.acceleo.engine.tests.unit.blocks.ifBlock.IfBlockTest): Could not find public template testingNestedIf in module null.
  testIfStatementCompleteIf(org.eclipse.acceleo.engine.tests.unit.blocks.ifBlock.IfBlockTest): Could not find public template testingCompleteIf in module null.
  testIfStatementElse(org.eclipse.acceleo.engine.tests.unit.blocks.ifBlock.IfBlockTest): Could not find public template testingElse in module null.
  testIfStatementElseif(org.eclipse.acceleo.engine.tests.unit.blocks.ifBlock.IfBlockTest): Could not find public template testingElseif in module null.
  testIfStatementIf(org.eclipse.acceleo.engine.tests.unit.blocks.ifBlock.IfBlockTest): Could not find public template testingIf in module null.
  testProtectedAreaIfTemplateIfBlock(org.eclipse.acceleo.engine.tests.unit.blocks.protectedareablock.ProtectedAreaBlockTest): Could not find public template test_protected_area_if_template_if_block in module null.
  testProtectedAreaTemplateFileForBlockMerge(org.eclipse.acceleo.engine.tests.unit.blocks.protectedareablock.ProtectedAreaBlockTest): Could not find public template test_protected_area_template_file_for_block_merge in module null.
  testProtectedAreaForTemplateIfBlock(org.eclipse.acceleo.engine.tests.unit.blocks.protectedareablock.ProtectedAreaBlockTest): Could not find public template test_protected_area_for_template_if_block in module null.
  testProtectedAreaTemplateLetBlockMerge(org.eclipse.acceleo.engine.tests.unit.blocks.protectedareablock.ProtectedAreaBlockTest): Could not find public template test_protected_area_template_let_block_merge in module null.
  testProtectedAreaIfTemplateIfBlockMerge(org.eclipse.acceleo.engine.tests.unit.blocks.protectedareablock.ProtectedAreaBlockTest): Could not find public template test_protected_area_if_template_if_block_merge in module null.
  testProtectedAreaMultipleGenerations(org.eclipse.acceleo.engine.tests.unit.blocks.protectedareablock.ProtectedAreaBlockTest): Could not find public template test_protected_area_multiple_generations in module null.
  testLostProtectedArea(org.eclipse.acceleo.engine.tests.unit.blocks.protectedareablock.ProtectedAreaBlockTest): Could not find public template test_lost_protected_area in module null.
  testProtectedAreaTemplateIfFileForIfElseTemplateBlock(org.eclipse.acceleo.engine.tests.unit.blocks.protectedareablock.ProtectedAreaBlockTest): Could not find public template test_protected_area_template_if_file_for_if_else_template_block in module null.
  testProtectedAreaTemplateFileTemplateForIfBlockMerge(org.eclipse.acceleo.engine.tests.unit.blocks.protectedareablock.ProtectedAreaBlockTest): Could not find public template test_protected_area_template_file_template_for_if_block_merge in module null.
  testProtectedAreaTemplateFileIfBlock(org.eclipse.acceleo.engine.tests.unit.blocks.protectedareablock.ProtectedAreaBlockTest): Could not find public template test_protected_area_template_file_if_block in module null.
  testProtectedAreaFileBlockMerge(org.eclipse.acceleo.engine.tests.unit.blocks.protectedareablock.ProtectedAreaBlockTest): Could not find public template test_protected_area_file_block_merge in module null.
  testProtectedAreaTemplateIfFileForLetElseLetTemplateBlockMerge(org.eclipse.acceleo.engine.tests.unit.blocks.protectedareablock.ProtectedAreaBlockTest): Could not find public template test_protected_area_template_if_file_for_let_elselet_template_block_merge in module null.
  testProtectedAreaForLetIfBlock(org.eclipse.acceleo.engine.tests.unit.blocks.protectedareablock.ProtectedAreaBlockTest): Could not find public template test_protected_area_for_let_if_block in module null.
  testProtectedAreaTemplateFileTemplateForIfBlock(org.eclipse.acceleo.engine.tests.unit.blocks.protectedareablock.ProtectedAreaBlockTest): Could not find public template test_protected_area_template_file_template_for_if_block in module null.
  testProtectedAreaTemplateFileLetBlock(org.eclipse.acceleo.engine.tests.unit.blocks.protectedareablock.ProtectedAreaBlockTest): Could not find public template test_protected_area_template_file_let_block in module null.
  testProtectedAreaTemplateFileForIfBlock(org.eclipse.acceleo.engine.tests.unit.blocks.protectedareablock.ProtectedAreaBlockTest): Could not find public template test_protected_area_template_file_for_if_block in module null.
  testProtectedAreaIfTemplateForBlock(org.eclipse.acceleo.engine.tests.unit.blocks.protectedareablock.ProtectedAreaBlockTest): Could not find public template test_protected_area_if_template_for_block in module null.
  testProtectedAreaTemplateFileTemplateForForBlock(org.eclipse.acceleo.engine.tests.unit.blocks.protectedareablock.ProtectedAreaBlockTest): Could not find public template test_protected_area_template_file_template_for_for_block in module null.
  testProtectedAreaVariableMarkerIdMultipleGenerations(org.eclipse.acceleo.engine.tests.unit.blocks.protectedareablock.ProtectedAreaBlockTest): Could not find public template test_protected_area_variable_marker_id_multiple_generations in module null.
  testProtectedAreaTemplateIfBlockMerge(org.eclipse.acceleo.engine.tests.unit.blocks.protectedareablock.ProtectedAreaBlockTest): Could not find public template test_protected_area_template_if_block_merge in module null.
  testProtectedAreaLetTemplateBlockMerge(org.eclipse.acceleo.engine.tests.unit.blocks.protectedareablock.ProtectedAreaBlockTest): Could not find public template test_protected_area_let_template_block_merge in module null.
  testProtectedAreaTemplateFileTemplateLetIfBlockMerge(org.eclipse.acceleo.engine.tests.unit.blocks.protectedareablock.ProtectedAreaBlockTest): Could not find public template test_protected_area_template_file_template_let_if_block_merge in module null.
  testProtectedAreaTemplateFileTemplateForLetBlockMerge(org.eclipse.acceleo.engine.tests.unit.blocks.protectedareablock.ProtectedAreaBlockTest): Could not find public template test_protected_area_template_file_template_for_let_block_merge in module null.
  testProtectedAreaTemplateFileTemplateIfLetBlock(org.eclipse.acceleo.engine.tests.unit.blocks.protectedareablock.ProtectedAreaBlockTest): Could not find public template test_protected_area_template_file_template_if_let_block in module null.
  testProtectedAreaLetTemplateIfBlock(org.eclipse.acceleo.engine.tests.unit.blocks.protectedareablock.ProtectedAreaBlockTest): Could not find public template test_protected_area_let_template_if_block in module null.
  testProtectedAreaIfBlock(org.eclipse.acceleo.engine.tests.unit.blocks.protectedareablock.ProtectedAreaBlockTest): Could not find public template test_protected_area_if_block in module null.
  testProtectedAreaIfTemplateBlock(org.eclipse.acceleo.engine.tests.unit.blocks.protectedareablock.ProtectedAreaBlockTest): Could not find public template test_protected_area_if_template_block in module null.
  testProtectedAreaTemplateFileTemplateLetForBlock(org.eclipse.acceleo.engine.tests.unit.blocks.protectedareablock.ProtectedAreaBlockTest): Could not find public template test_protected_area_template_file_template_let_for_block in module null.
  testProtectedAreaIfTemplateLetBlockMerge(org.eclipse.acceleo.engine.tests.unit.blocks.protectedareablock.ProtectedAreaBlockTest): Could not find public template test_protected_area_if_template_let_block_merge in module null.
  testRemovedProtectedArea(org.eclipse.acceleo.engine.tests.unit.blocks.protectedareablock.ProtectedAreaBlockTest): Could not find public template test_removed_protected_area in module null.
  testProtectedAreaLetTemplateForBlock(org.eclipse.acceleo.engine.tests.unit.blocks.protectedareablock.ProtectedAreaBlockTest): Could not find public template test_protected_area_let_template_for_block in module null.
  testProtectedAreaIfBlockMerge(org.eclipse.acceleo.engine.tests.unit.blocks.protectedareablock.ProtectedAreaBlockTest): Could not find public template test_protected_area_if_block_merge in module null.
  testProtectedAreaTemplateFileTemplateIfForBlockMerge(org.eclipse.acceleo.engine.tests.unit.blocks.protectedareablock.ProtectedAreaBlockTest): Could not find public template test_protected_area_template_file_template_if_for_block_merge in module null.
  testProtectedAreaTemplateFileTemplateLetForBlockMerge(org.eclipse.acceleo.engine.tests.unit.blocks.protectedareablock.ProtectedAreaBlockTest): Could not find public template test_protected_area_template_file_template_let_for_block_merge in module null.
  testProtectedAreaForTemplateIfBlockMerge(org.eclipse.acceleo.engine.tests.unit.blocks.protectedareablock.ProtectedAreaBlockTest): Could not find public template test_protected_area_for_template_if_block_merge in module null.
  testProtectedAreaForLetIfBlockMerge(org.eclipse.acceleo.engine.tests.unit.blocks.protectedareablock.ProtectedAreaBlockTest): Could not find public template test_protected_area_for_let_if_block_merge in module null.
  testProtectedAreaTemplateFileIfBlockMerge(org.eclipse.acceleo.engine.tests.unit.blocks.protectedareablock.ProtectedAreaBlockTest): Could not find public template test_protected_area_template_file_if_block_merge in module null.
  testProtectedAreaTemplateIfFileForLetElseLetTemplateBlock(org.eclipse.acceleo.engine.tests.unit.blocks.protectedareablock.ProtectedAreaBlockTest): Could not find public template test_protected_area_template_if_file_for_let_elselet_template_block in module null.
  testProtectedAreaForTemplateBlockMerge(org.eclipse.acceleo.engine.tests.unit.blocks.protectedareablock.ProtectedAreaBlockTest): Could not find public template test_protected_area_for_template_block_merge in module null.
  testProtectedAreaTemplateBlockMerge(org.eclipse.acceleo.engine.tests.unit.blocks.protectedareablock.ProtectedAreaBlockTest): Could not find public template test_protected_area_template_block_merge in module null.
  testProtectedAreaTemplateIfBlock(org.eclipse.acceleo.engine.tests.unit.blocks.protectedareablock.ProtectedAreaBlockTest): Could not find public template test_protected_area_template_if_block in module null.
  testProtectedAreaLetTemplateLetBlockMerge(org.eclipse.acceleo.engine.tests.unit.blocks.protectedareablock.ProtectedAreaBlockTest): Could not find public template test_protected_area_let_template_let_block_merge in module null.
  testProtectedAreaTemplateFileBlock(org.eclipse.acceleo.engine.tests.unit.blocks.protectedareablock.ProtectedAreaBlockTest): Could not find public template test_protected_area_template_file_block in module null.
  testProtectedAreaForBlock(org.eclipse.acceleo.engine.tests.unit.blocks.protectedareablock.ProtectedAreaBlockTest): Could not find public template test_protected_area_for_block in module null.
  testProtectedAreaLetTemplateBlock(org.eclipse.acceleo.engine.tests.unit.blocks.protectedareablock.ProtectedAreaBlockTest): Could not find public template test_protected_area_let_template_block in module null.
  testProtectedAreaLetBlockMerge(org.eclipse.acceleo.engine.tests.unit.blocks.protectedareablock.ProtectedAreaBlockTest): Could not find public template test_protected_area_let_block_merge in module null.
  testProtectedAreaIfTemplateBlockMerge(org.eclipse.acceleo.engine.tests.unit.blocks.protectedareablock.ProtectedAreaBlockTest): Could not find public template test_protected_area_if_template_block_merge in module null.
  testProtectedAreaConditionalMultipleGenerations(org.eclipse.acceleo.engine.tests.unit.blocks.protectedareablock.ProtectedAreaBlockTest): Could not find public template test_protected_area_conditional_multiple_generations in module null.
  testProtectedAreaTemplateForBlock(org.eclipse.acceleo.engine.tests.unit.blocks.protectedareablock.ProtectedAreaBlockTest): Could not find public template test_protected_area_template_for_block in module null.
  testProtectedAreaTemplateFileLetBlockMerge(org.eclipse.acceleo.engine.tests.unit.blocks.protectedareablock.ProtectedAreaBlockTest): Could not find public template test_protected_area_template_file_let_block_merge in module null.
  testProtectedAreaTemplateIfFileForLetElseTemplateBlock(org.eclipse.acceleo.engine.tests.unit.blocks.protectedareablock.ProtectedAreaBlockTest): Could not find public template test_protected_area_template_if_file_for_let_else_template_block in module null.
  testProtectedAreaTemplateBlock(org.eclipse.acceleo.engine.tests.unit.blocks.protectedareablock.ProtectedAreaBlockTest): Could not find public template test_protected_area_template_block in module null.
  testProtectedAreaTemplateIfFileForLetElseTemplateBlockMerge(org.eclipse.acceleo.engine.tests.unit.blocks.protectedareablock.ProtectedAreaBlockTest): Could not find public template test_protected_area_template_if_file_for_let_else_template_block_merge in module null.
  testProtectedAreaForTemplateForBlock(org.eclipse.acceleo.engine.tests.unit.blocks.protectedareablock.ProtectedAreaBlockTest): Could not find public template test_protected_area_for_template_for_block in module null.
  testProtectedAreaIfTemplateLetBlock(org.eclipse.acceleo.engine.tests.unit.blocks.protectedareablock.ProtectedAreaBlockTest): Could not find public template test_protected_area_if_template_let_block in module null.
  testProtectedAreaTemplateFileTemplateForLetBlock(org.eclipse.acceleo.engine.tests.unit.blocks.protectedareablock.ProtectedAreaBlockTest): Could not find public template test_protected_area_template_file_template_for_let_block in module null.
  testProtectedAreaTemplateForBlockMerge(org.eclipse.acceleo.engine.tests.unit.blocks.protectedareablock.ProtectedAreaBlockTest): Could not find public template test_protected_area_template_for_block_merge in module null.
  testProtectedAreaTemplateIfFileForIfElseTemplateBlockMerge(org.eclipse.acceleo.engine.tests.unit.blocks.protectedareablock.ProtectedAreaBlockTest): Could not find public template test_protected_area_template_if_file_for_if_else_template_block_merge in module null.
  testProtectedAreaTemplateFileTemplateLetLetBlock(org.eclipse.acceleo.engine.tests.unit.blocks.protectedareablock.ProtectedAreaBlockTest): Could not find public template test_protected_area_template_file_template_let_let_block in module null.
  testProtectedAreaFileBlock(org.eclipse.acceleo.engine.tests.unit.blocks.protectedareablock.ProtectedAreaBlockTest): Could not find public template test_protected_area_file_block in module null.
  testProtectedAreaLetTemplateLetBlock(org.eclipse.acceleo.engine.tests.unit.blocks.protectedareablock.ProtectedAreaBlockTest): Could not find public template test_protected_area_let_template_let_block in module null.
  testProtectedAreaTemplateFileTemplateIfIfBlockMerge(org.eclipse.acceleo.engine.tests.unit.blocks.protectedareablock.ProtectedAreaBlockTest): Could not find public template test_protected_area_template_file_template_if_if_block_merge in module null.
  testProtectedAreaPerformanceMultipleGenerations(org.eclipse.acceleo.engine.tests.unit.blocks.protectedareablock.ProtectedAreaBlockTest): Could not find public template test_protected_area_performance_multiple_generations in module null.
  testProtectedAreaTemplateFileForBlock(org.eclipse.acceleo.engine.tests.unit.blocks.protectedareablock.ProtectedAreaBlockTest): Could not find public template test_protected_area_template_file_for_block in module null.
  testProtectedAreaTemplateFileTemplateIfLetBlockMerge(org.eclipse.acceleo.engine.tests.unit.blocks.protectedareablock.ProtectedAreaBlockTest): Could not find public template test_protected_area_template_file_template_if_let_block_merge in module null.
  testProtectedAreaForTemplateTetBlockMerge(org.eclipse.acceleo.engine.tests.unit.blocks.protectedareablock.ProtectedAreaBlockTest): Could not find public template test_protected_area_for_template_let_block_merge in module null.
  testProtectedAreaTemplateFileTemplateLetLetBlockMerge(org.eclipse.acceleo.engine.tests.unit.blocks.protectedareablock.ProtectedAreaBlockTest): Could not find public template test_protected_area_template_file_template_let_let_block_merge in module null.
  testProtectedAreaTemplateFileTemplateForForBlockMerge(org.eclipse.acceleo.engine.tests.unit.blocks.protectedareablock.ProtectedAreaBlockTest): Could not find public template test_protected_area_template_file_template_for_for_block_merge in module null.
  testProtectedAreaLetComplex(org.eclipse.acceleo.engine.tests.unit.blocks.protectedareablock.ProtectedAreaBlockTest): Could not find public template test_protected_area_template_let_complex in module null.
  testProtectedAreaLetBlock(org.eclipse.acceleo.engine.tests.unit.blocks.protectedareablock.ProtectedAreaBlockTest): Could not find public template test_protected_area_let_block in module null.
  testProtectedAreaTemplateFileForIfBlockMerge(org.eclipse.acceleo.engine.tests.unit.blocks.protectedareablock.ProtectedAreaBlockTest): Could not find public template test_protected_area_template_file_for_if_block_merge in module null.
  testProtectedAreaTemplateFileBlockMerge(org.eclipse.acceleo.engine.tests.unit.blocks.protectedareablock.ProtectedAreaBlockTest): Could not find public template test_protected_area_template_file_block_merge in module null.
  testProtectedAreaIfTemplateForBlockMerge(org.eclipse.acceleo.engine.tests.unit.blocks.protectedareablock.ProtectedAreaBlockTest): Could not find public template test_protected_area_if_template_for_block_merge in module null.
  testProtectedAreaTemplateLetBlock(org.eclipse.acceleo.engine.tests.unit.blocks.protectedareablock.ProtectedAreaBlockTest): Could not find public template test_protected_area_template_let_block in module null.
  testProtectedAreaTemplateFileTemplateIfForBlock(org.eclipse.acceleo.engine.tests.unit.blocks.protectedareablock.ProtectedAreaBlockTest): Could not find public template test_protected_area_template_file_template_if_for_block in module null.
  testProtectedAreaTemplateFileTemplateIfIfBlock(org.eclipse.acceleo.engine.tests.unit.blocks.protectedareablock.ProtectedAreaBlockTest): Could not find public template test_protected_area_template_file_template_if_if_block in module null.
  testProtectedAreaForTemplateForBlockMerge(org.eclipse.acceleo.engine.tests.unit.blocks.protectedareablock.ProtectedAreaBlockTest): Could not find public template test_protected_area_for_template_for_block_merge in module null.
  testProtectedAreaTemplateFileTemplateLetIfBlock(org.eclipse.acceleo.engine.tests.unit.blocks.protectedareablock.ProtectedAreaBlockTest): Could not find public template test_protected_area_template_file_template_let_if_block in module null.
  testProtectedAreaForTemplateBlock(org.eclipse.acceleo.engine.tests.unit.blocks.protectedareablock.ProtectedAreaBlockTest): Could not find public template test_protected_area_for_template_block in module null.
  testProtectedAreaForTemplateLetBlock(org.eclipse.acceleo.engine.tests.unit.blocks.protectedareablock.ProtectedAreaBlockTest): Could not find public template test_protected_area_for_template_let_block in module null.
  testProtectedAreaLetTemplateIfBlockMerge(org.eclipse.acceleo.engine.tests.unit.blocks.protectedareablock.ProtectedAreaBlockTest): Could not find public template test_protected_area_let_template_if_block_merge in module null.
  testProtectedAreaLetTemplateForBlockMerge(org.eclipse.acceleo.engine.tests.unit.blocks.protectedareablock.ProtectedAreaBlockTest): Could not find public template test_protected_area_let_template_for_block_merge in module null.
  testProtectedAreaBlock(org.eclipse.acceleo.engine.tests.unit.blocks.protectedareablock.ProtectedAreaBlockTest): Could not find public template test_protected_area in module null.
  testProtectedAreaForBlockMerge(org.eclipse.acceleo.engine.tests.unit.blocks.protectedareablock.ProtectedAreaBlockTest): Could not find public template test_protected_area_for_block_merge in module null.
  testOrderedSetTemplate(org.eclipse.acceleo.engine.tests.unit.blocks.template.TemplateTest): Could not find public template test_ordered_set_template in module null.
  testFalseGuard(org.eclipse.acceleo.engine.tests.unit.blocks.template.TemplateTest): Could not find public template test_false_guard in module null.
  testTemplateCollectionCollection(org.eclipse.acceleo.engine.tests.unit.blocks.template.TemplateTest): Could not find public template test_template_collection_collection in module null.
  testAfter(org.eclipse.acceleo.engine.tests.unit.blocks.template.TemplateTest): Could not find public template test_after in module null.
  testBagTemplate(org.eclipse.acceleo.engine.tests.unit.blocks.template.TemplateTest): Could not find public template test_bag_template in module null.
  testTemplateCollection(org.eclipse.acceleo.engine.tests.unit.blocks.template.TemplateTest): Could not find public template test_template_collection in module null.
  testProtectedCall(org.eclipse.acceleo.engine.tests.unit.blocks.template.TemplateTest): Could not find public template test_protected_visibility in module null.
  testCollectionTemplate(org.eclipse.acceleo.engine.tests.unit.blocks.template.TemplateTest): Could not find public template test_collection_template in module null.
  testSequenceTemplate(org.eclipse.acceleo.engine.tests.unit.blocks.template.TemplateTest): Could not find public template test_sequence_template in module null.
  testSetTemplate(org.eclipse.acceleo.engine.tests.unit.blocks.template.TemplateTest): Could not find public template test_set_template in module null.
  testTemplateCollectionCollectionCollectionCollection(org.eclipse.acceleo.engine.tests.unit.blocks.template.TemplateTest): Could not find public template test_template_collection_collection_collection_collection in module null.
  testSuperCall(org.eclipse.acceleo.engine.tests.unit.blocks.template.TemplateTest): Could not find public template test_super in module null.
  testBefore(org.eclipse.acceleo.engine.tests.unit.blocks.template.TemplateTest): Could not find public template test_before in module null.
  testProtectOverride(org.eclipse.acceleo.engine.tests.unit.blocks.template.TemplateTest): Could not find public template test_protect_override in module null.
  testPrivateCall(org.eclipse.acceleo.engine.tests.unit.blocks.template.TemplateTest): Could not find public template test_private_visibility in module null.
  testImport(org.eclipse.acceleo.engine.tests.unit.blocks.template.TemplateTest): Could not find public template test_import in module null.
  testTrueGuard(org.eclipse.acceleo.engine.tests.unit.blocks.template.TemplateTest): Could not find public template test_true_guard in module null.
  testDualTemplateInvocation(org.eclipse.acceleo.engine.tests.unit.blocks.templateinvocation.DualTemplateInvocationTest): Could not find public template test in module null.
  testDualTemplateInvocation(org.eclipse.acceleo.engine.tests.unit.blocks.templateinvocation.QueryPropertyInvocationTest): Could not find public template test in module null.
  testRecursiveTemplateInvocation(org.eclipse.acceleo.engine.tests.unit.blocks.templateinvocation.RecursiveTemplateInvocation): Could not find public template recursive_source_is_argument in module null.
  testQueryInvocationWrapping(org.eclipse.acceleo.engine.tests.unit.blocks.queryinvocation.QueryInvocationWrapping): Could not find public template test in module null.
  testEvaluateLatin1Template(org.eclipse.acceleo.engine.tests.unit.encoding.GenerationEncodingTest): Could not find public template generate_ISO_8859_1 in module null.
  testEvaluateWrongEncodingTemplate(org.eclipse.acceleo.engine.tests.unit.encoding.GenerationEncodingTest): Could not find public template generate_wrong_encoding in module null.
  testEvaluateGreekTemplate(org.eclipse.acceleo.engine.tests.unit.encoding.GenerationEncodingTest): Could not find public template generate_ISO_8859_7 in module null.
  testEvaluateUTF8Template(org.eclipse.acceleo.engine.tests.unit.encoding.GenerationEncodingTest): Could not find public template generate_UTF_8 in module null.
  testEvaluateRussianTemplate(org.eclipse.acceleo.engine.tests.unit.encoding.GenerationEncodingTest): Could not find public template generate_ISO_8859_5 in module null.
  testEvaluateGuardedTemplateMismatchingArgs(org.eclipse.acceleo.engine.tests.unit.generation.AcceleoGenericEngineTest): Arguments of a generation cannot be null.
  testEvaluateNullRootNoPreview(org.eclipse.acceleo.engine.tests.unit.generation.AcceleoGenericEngineTest): Arguments of a generation cannot be null.
  testEvaluatePublicTemplateValidArgsNullRootPreview(org.eclipse.acceleo.engine.tests.unit.generation.AcceleoGenericEngineTest): Arguments of a generation cannot be null.
  testEvaluateGuardedTemplate(org.eclipse.acceleo.engine.tests.unit.generation.AcceleoGenericEngineTest): Arguments of a generation cannot be null.
  testEvaluatePublicTemplateValidArgs(org.eclipse.acceleo.engine.tests.unit.generation.AcceleoGenericEngineTest): Arguments of a generation cannot be null.
  testEvaluatePrivateTemplate(org.eclipse.acceleo.engine.tests.unit.generation.AcceleoGenericEngineTest): Arguments of a generation cannot be null.
  testEvaluatePublicTemplateValidArgsPreview(org.eclipse.acceleo.engine.tests.unit.generation.AcceleoGenericEngineTest): Arguments of a generation cannot be null.
  testEvaluatePublicTemplateWrongArgCount(org.eclipse.acceleo.engine.tests.unit.generation.AcceleoGenericEngineTest): Arguments of a generation cannot be null.
  testEvaluatePublicTemplateMismatchingArgs(org.eclipse.acceleo.engine.tests.unit.generation.AcceleoGenericEngineTest): Arguments of a generation cannot be null.
  testNullMonitor(org.eclipse.acceleo.engine.tests.unit.generation.AcceleoProgressMonitorTest): Could not find public template test in module null.
  testCanceledEvaluation(org.eclipse.acceleo.engine.tests.unit.generation.AcceleoProgressMonitorTest): Could not find public template test_cancel in module null.
  testDoGenerateModuleMapNoPreview(org.eclipse.acceleo.engine.tests.unit.service.facade.AcceleoServiceTest): Could not find public template template_2_1 in module null.
  testDoGenerateTemplatePrivateTemplate(org.eclipse.acceleo.engine.tests.unit.service.facade.AcceleoServiceTest): Arguments of a generation cannot be null.
  testDoGenerateModuleMapPreview(org.eclipse.acceleo.engine.tests.unit.service.facade.AcceleoServiceTest): Could not find public template template_1_2 in module null.
  testDoGenerateModuleNoPreviewNoGenerationRoot(org.eclipse.acceleo.engine.tests.unit.service.facade.AcceleoServiceTest): Could not find public template template_1_1 in module null.
  testDoGenerateTemplateNoPreview(org.eclipse.acceleo.engine.tests.unit.service.facade.AcceleoServiceTest): Arguments of a generation cannot be null.
  testDoGenerateModulePreview(org.eclipse.acceleo.engine.tests.unit.service.facade.AcceleoServiceTest): Could not find public template template_1_1 in module null.
  testDoGenerateTemplateMultipleArguments(org.eclipse.acceleo.engine.tests.unit.service.facade.AcceleoServiceTest): Arguments of a generation cannot be null.
  testDoGenerateModuleNoPreview(org.eclipse.acceleo.engine.tests.unit.service.facade.AcceleoServiceTest): Could not find public template template_1_1 in module null.
  testDoGenerateTemplatePreview(org.eclipse.acceleo.engine.tests.unit.service.facade.AcceleoServiceTest): Arguments of a generation cannot be null.
  testDoGenerateModuleNullInput(org.eclipse.acceleo.engine.tests.unit.service.facade.AcceleoServiceTest): Could not find public template template_1_1 in module null.
  testDoGenerateModulePreviewContainedTarget(org.eclipse.acceleo.engine.tests.unit.service.facade.AcceleoServiceTest): Could not find public template template_1_2 in module null.
  testSingleArgumentServiceInvocation(org.eclipse.acceleo.engine.tests.unit.service.java.AcceleoJavaServicesTest): Could not find public template test_call_single_argument in module null.
  testNoArgumentServiceInvocation(org.eclipse.acceleo.engine.tests.unit.service.java.AcceleoJavaServicesTest): Could not find public template test_call_no_argument in module null.
  testInstanceOfServiceInvocation(org.eclipse.acceleo.engine.tests.unit.service.java.AcceleoJavaServicesTest): Could not find public template test_call_instanceofs in module null.
  testSourceAndParametersChoice(org.eclipse.acceleo.engine.tests.unit.service.java.AcceleoJavaServicesTest): Could not find public template test_call_source_and_parameters in module null.
  testMultipleArgumentServiceInvocation(org.eclipse.acceleo.engine.tests.unit.service.java.AcceleoJavaServicesTest): Could not find public template test_call_multiple_argument in module null.
  testAcceleoGenerationEvent(org.eclipse.acceleo.engine.tests.unit.event.AcceleoListenersTest): Could not find public template test_generation_event in module null.
  testAcceleoGenerationListener(org.eclipse.acceleo.engine.tests.unit.event.AcceleoListenersTest): Could not find public template test_generation_listeners in module null.
  testNameResolutionExternalConflict(org.eclipse.acceleo.engine.tests.unit.resolution.namesake.SimpleNamesakeResolutionTest): Could not find public template test_namesake_external in module null.
  testNameResolutionPriority(org.eclipse.acceleo.engine.tests.unit.resolution.namesake.SimpleNamesakeResolutionTest): Could not find public template test_namesake_3 in module null.
  testNameResolutionConflictOnExtended(org.eclipse.acceleo.engine.tests.unit.resolution.namesake.SimpleNamesakeResolutionTest): Could not find public template test_namesake_extend in module null.
  testNameResolutionDistinctParamNames(org.eclipse.acceleo.engine.tests.unit.resolution.namesake.SimpleNamesakeResolutionTest): Could not find public template test_namesake_distinct_param_name in module null.
  testNameResolutionConflictOnImported(org.eclipse.acceleo.engine.tests.unit.resolution.namesake.SimpleNamesakeResolutionTest): Could not find public template test_namesake_import in module null.
  testNamesakeResolutionLocalMostSpecific(org.eclipse.acceleo.engine.tests.unit.resolution.namesake.ParameterTypeNarrowingResolutionTest): Could not find public template test_namesake_3_local_specific in module null.
  testNamesakeResolutionOnExtendExtendSpecific(org.eclipse.acceleo.engine.tests.unit.resolution.namesake.ParameterTypeNarrowingResolutionTest): Could not find public template test_namesake_extend_extend_specific in module null.
  testNamesakeResolutionExtendMostSpecific(org.eclipse.acceleo.engine.tests.unit.resolution.namesake.ParameterTypeNarrowingResolutionTest): Could not find public template test_namesake_3_extend_specific in module null.
  testNamesakeResolutionImportMostSpecific(org.eclipse.acceleo.engine.tests.unit.resolution.namesake.ParameterTypeNarrowingResolutionTest): Could not find public template test_namesake_3_import_specific in module null.
  testNamesakeResolutionOnImportImportSpecific(org.eclipse.acceleo.engine.tests.unit.resolution.namesake.ParameterTypeNarrowingResolutionTest): Could not find public template test_namesake_import_import_specific in module null.
  testNamesakeResolutionOnImportLocalSpecific(org.eclipse.acceleo.engine.tests.unit.resolution.namesake.ParameterTypeNarrowingResolutionTest): Could not find public template test_namesake_import_local_specific in module null.
  testNamesakeResolutionExternalExtendSpecific(org.eclipse.acceleo.engine.tests.unit.resolution.namesake.ParameterTypeNarrowingResolutionTest): Could not find public template test_namesake_external_extend_specific in module null.
  testNamesakeResolutionExternalImportSpecific(org.eclipse.acceleo.engine.tests.unit.resolution.namesake.ParameterTypeNarrowingResolutionTest): Could not find public template test_namesake_external_import_specific in module null.
  testNamesakeResolutionOnExtendLocalSpecific(org.eclipse.acceleo.engine.tests.unit.resolution.namesake.ParameterTypeNarrowingResolutionTest): Could not find public template test_namesake_extend_local_specific in module null.
  testNamesakeGuardImportSpecific(org.eclipse.acceleo.engine.tests.unit.resolution.namesake.NamesakeGuardResolutionTest): Could not find public template test_namesake_guard_import_specific in module null.
  testNamesakeGuardedSpecific(org.eclipse.acceleo.engine.tests.unit.resolution.namesake.NamesakeGuardResolutionTest): Could not find public template test_namesake_guarded_specific in module null.
  testNamesakeGuard(org.eclipse.acceleo.engine.tests.unit.resolution.namesake.NamesakeGuardResolutionTest): Could not find public template test_namesake_guard in module null.
  testLocalOverrideDirectCall(org.eclipse.acceleo.engine.tests.unit.resolution.override.SimpleOverridesResolutionTest): Could not find public template test_local_overriden_direct_call in module null.
  testOverridePriorityIndirectCall(org.eclipse.acceleo.engine.tests.unit.resolution.override.SimpleOverridesResolutionTest): Could not find public template test_override_priority_indirect in module null.
  testOverridePriorityMidIndirectCall(org.eclipse.acceleo.engine.tests.unit.resolution.override.SimpleOverridesResolutionTest): Could not find public template test_override_priority_indirect_extend in module null.
  testExtendOverrideIndirectCall(org.eclipse.acceleo.engine.tests.unit.resolution.override.SimpleOverridesResolutionTest): Could not find public template test_extend_overriden_indirect_call in module null.
  testOverridePriorityDirectCall(org.eclipse.acceleo.engine.tests.unit.resolution.override.SimpleOverridesResolutionTest): Could not find public template test_override_priority_direct in module null.
  testLocalOverrideIndirectCall(org.eclipse.acceleo.engine.tests.unit.resolution.override.SimpleOverridesResolutionTest): Could not find public template test_local_overriden_indirect_call in module null.
  testExtendOverrideDirectCall(org.eclipse.acceleo.engine.tests.unit.resolution.override.SimpleOverridesResolutionTest): Could not find public template test_extend_overriden_direct_call in module null.
  testOverrideParameterNarrowingLocal(org.eclipse.acceleo.engine.tests.unit.resolution.override.OverrideParameterTypeNarrowingResolutionTest): Could not find public template test_resolution_local_override in module null.
  testOverrideParameterNarrowing(org.eclipse.acceleo.engine.tests.unit.resolution.override.OverrideParameterTypeNarrowingResolutionTest): Could not find public template test_resolution_override_specific in module null.
  testOverrideParameterNarrowingExternal(org.eclipse.acceleo.engine.tests.unit.resolution.override.OverrideParameterTypeNarrowingResolutionTest): Could not find public template test_resolution_external_override in module null.
  testOverrideSpecificGuarded(org.eclipse.acceleo.engine.tests.unit.resolution.override.OverrideGuardResolutionTest): Could not find public template test_resolution_override_specific_guarded in module null.
  testOverrideLocalDefinitionGuarded(org.eclipse.acceleo.engine.tests.unit.resolution.override.OverrideGuardResolutionTest): Could not find public template test_resolution_local_override_definition_guarded in module null.
  testOverrideParameterNarrowingExternal(org.eclipse.acceleo.engine.tests.unit.resolution.override.OverrideGuardResolutionTest): Could not find public template test_resolution_external_override_definition_guarded in module null.
  testImplicitSelfVariableInQuery(org.eclipse.acceleo.engine.tests.unit.variables.SelfTest): Could not find public template test_implicit_self_query in module null.
  testSelfVariableInQuery(org.eclipse.acceleo.engine.tests.unit.variables.SelfTest): Could not find public template test_self_query in module null.
  testSelfVariableInTemplate(org.eclipse.acceleo.engine.tests.unit.variables.SelfTest): Could not find public template test_self_template in module null.
  testImplicitSelfVariableInTemplate(org.eclipse.acceleo.engine.tests.unit.variables.SelfTest): Could not find public template test_implicit_self_template in module null.
  testStringToLowerFirst(org.eclipse.acceleo.engine.tests.unit.environment.AcceleoStandardLibraryParsedTest): Could not find public template test_stdlib in module null.
  testStringSubstitute(org.eclipse.acceleo.engine.tests.unit.environment.AcceleoStandardLibraryParsedTest): Could not find public template test_stdlib in module null.
  testStringToUpperFirst(org.eclipse.acceleo.engine.tests.unit.environment.AcceleoStandardLibraryParsedTest): Could not find public template test_stdlib in module null.
  testStringIsAlpha(org.eclipse.acceleo.engine.tests.unit.environment.AcceleoStandardLibraryParsedTest): Could not find public template test_stdlib in module null.
  testStringIsAlphanum(org.eclipse.acceleo.engine.tests.unit.environment.AcceleoStandardLibraryParsedTest): Could not find public template test_stdlib in module null.
  testStringStrcmp(org.eclipse.acceleo.engine.tests.unit.environment.AcceleoStandardLibraryParsedTest): Could not find public template test_stdlib in module null.
  testStringStrstr(org.eclipse.acceleo.engine.tests.unit.environment.AcceleoStandardLibraryParsedTest): Could not find public template test_stdlib in module null.
  testStringStrtok(org.eclipse.acceleo.engine.tests.unit.environment.AcceleoStandardLibraryParsedTest): Could not find public template test_stdlib in module null.
  testStringLast(org.eclipse.acceleo.engine.tests.unit.environment.AcceleoStandardLibraryParsedTest): Could not find public template test_stdlib in module null.
  testStringFirst(org.eclipse.acceleo.engine.tests.unit.environment.AcceleoStandardLibraryParsedTest): Could not find public template test_stdlib in module null.
  testStringIndex(org.eclipse.acceleo.engine.tests.unit.environment.AcceleoStandardLibraryParsedTest): Could not find public template test_stdlib in module null.
  testStringStartsWith(org.eclipse.acceleo.engine.tests.unit.environment.AcceleoNonStandardLibraryParsedTest): Could not find public template test_nonstdlib in module null.
  testOclAnyToString(org.eclipse.acceleo.engine.tests.unit.environment.AcceleoNonStandardLibraryParsedTest): Could not find public template test_nonstdlib in module null.
  testStringReplaceAll(org.eclipse.acceleo.engine.tests.unit.environment.AcceleoNonStandardLibraryParsedTest): Could not find public template test_nonstdlib in module null.
  testCollectionEndsWith(org.eclipse.acceleo.engine.tests.unit.environment.AcceleoNonStandardLibraryParsedTest): Could not find public template test_nonstdlib in module null.
  testStringTokenizeLine(org.eclipse.acceleo.engine.tests.unit.environment.AcceleoNonStandardLibraryParsedTest): Could not find public template test_nonstdlib in module null.
  testOclAnyTypedEInverse(org.eclipse.acceleo.engine.tests.unit.environment.AcceleoNonStandardLibraryParsedTest): Could not find public template test_nonstdlib in module null.
  testOclAnyTypedEAllContents(org.eclipse.acceleo.engine.tests.unit.environment.AcceleoNonStandardLibraryParsedTest): Could not find public template test_nonstdlib in module null.
  testOclAnyLineSeparator(org.eclipse.acceleo.engine.tests.unit.environment.AcceleoNonStandardLibraryParsedTest): Could not find public template test_nonstdlib in module null.
  testCollectionLastIndexOfSlice(org.eclipse.acceleo.engine.tests.unit.environment.AcceleoNonStandardLibraryParsedTest): Could not find public template test_nonstdlib in module null.
  testCollectionStartsWith(org.eclipse.acceleo.engine.tests.unit.environment.AcceleoNonStandardLibraryParsedTest): Could not find public template test_nonstdlib in module null.
  testStringReplace(org.eclipse.acceleo.engine.tests.unit.environment.AcceleoNonStandardLibraryParsedTest): Could not find public template test_nonstdlib in module null.
  testOclAnyAncestors(org.eclipse.acceleo.engine.tests.unit.environment.AcceleoNonStandardLibraryParsedTest): Could not find public template test_nonstdlib in module null.
  testCollectionDrop(org.eclipse.acceleo.engine.tests.unit.environment.AcceleoNonStandardLibraryParsedTest): Could not find public template test_nonstdlib in module null.
  testStringEndsWith(org.eclipse.acceleo.engine.tests.unit.environment.AcceleoNonStandardLibraryParsedTest): Could not find public template test_nonstdlib in module null.
  testOclAnyEInverse(org.eclipse.acceleo.engine.tests.unit.environment.AcceleoNonStandardLibraryParsedTest): Could not find public template test_nonstdlib in module null.
  testOclAnyTypedSiblings(org.eclipse.acceleo.engine.tests.unit.environment.AcceleoNonStandardLibraryParsedTest): Could not find public template test_nonstdlib in module null.
  testCollectionRemoveAll(org.eclipse.acceleo.engine.tests.unit.environment.AcceleoNonStandardLibraryParsedTest): Could not find public template test_nonstdlib in module null.
  testStringTokenize_2(org.eclipse.acceleo.engine.tests.unit.environment.AcceleoNonStandardLibraryParsedTest): Could not find public template test_nonstdlib in module null.
  testOclAnyInvoke(org.eclipse.acceleo.engine.tests.unit.environment.AcceleoNonStandardLibraryParsedTest): Could not find public template test_nonstdlib in module null.
  testCollectionIndexOfSlice(org.eclipse.acceleo.engine.tests.unit.environment.AcceleoNonStandardLibraryParsedTest): Could not find public template test_nonstdlib in module null.
  testOclAnySiblings(org.eclipse.acceleo.engine.tests.unit.environment.AcceleoNonStandardLibraryParsedTest): Could not find public template test_nonstdlib in module null.
  testStringTokenize(org.eclipse.acceleo.engine.tests.unit.environment.AcceleoNonStandardLibraryParsedTest): Could not find public template test_nonstdlib in module null.
  testStringSubstituteAll(org.eclipse.acceleo.engine.tests.unit.environment.AcceleoNonStandardLibraryParsedTest): Could not find public template test_nonstdlib in module null.
  testOclAnyEAllContents(org.eclipse.acceleo.engine.tests.unit.environment.AcceleoNonStandardLibraryParsedTest): Could not find public template test_nonstdlib in module null.
  testCollectionAddAll(org.eclipse.acceleo.engine.tests.unit.environment.AcceleoNonStandardLibraryParsedTest): Could not find public template test_nonstdlib in module null.
  testStringLastIndex(org.eclipse.acceleo.engine.tests.unit.environment.AcceleoNonStandardLibraryParsedTest): Could not find public template test_nonstdlib in module null.
  testOclAnyTypedAncestors(org.eclipse.acceleo.engine.tests.unit.environment.AcceleoNonStandardLibraryParsedTest): Could not find public template test_nonstdlib in module null.
  testStringContains(org.eclipse.acceleo.engine.tests.unit.environment.AcceleoNonStandardLibraryParsedTest): Could not find public template test_nonstdlib in module null.
  testCollectionSep(org.eclipse.acceleo.engine.tests.unit.environment.AcceleoNonStandardLibraryParsedTest): Could not find public template test_nonstdlib in module null.
  testCollectionDropRight(org.eclipse.acceleo.engine.tests.unit.environment.AcceleoNonStandardLibraryParsedTest): Could not find public template test_nonstdlib in module null.
  testStringTrim(org.eclipse.acceleo.engine.tests.unit.environment.AcceleoNonStandardLibraryParsedTest): Could not find public template test_nonstdlib in module null.
  testStringIndex(org.eclipse.acceleo.engine.tests.unit.environment.AcceleoNonStandardLibraryParsedTest): Could not find public template test_nonstdlib in module null.
  testScriptParameter(org.eclipse.acceleo.compatibility.tests.unit.migration.FileScriptParameterTest): java.io.FileNotFoundException: file:/opt/users/hudsonbuild/workspace/m2t-acceleo-3.3/tests/org.eclipse.acceleo.compatibility.tests/target/org.eclipse.acceleo.compatibility.tests-3.3.4-SNAPSHOT.jar!/data/fileScriptParameter/emt/chain.emt (No such file or directory)
  testIsScript(org.eclipse.acceleo.compatibility.tests.unit.migration.IsScriptTest): java.io.FileNotFoundException: file:/opt/users/hudsonbuild/workspace/m2t-acceleo-3.3/tests/org.eclipse.acceleo.compatibility.tests/target/org.eclipse.acceleo.compatibility.tests-3.3.4-SNAPSHOT.jar!/data/isScript/emt/chain.emt (No such file or directory)
  testPostTrim(org.eclipse.acceleo.compatibility.tests.unit.migration.PostTrimTest): java.io.FileNotFoundException: file:/opt/users/hudsonbuild/workspace/m2t-acceleo-3.3/tests/org.eclipse.acceleo.compatibility.tests/target/org.eclipse.acceleo.compatibility.tests-3.3.4-SNAPSHOT.jar!/data/postTrim/emt/chain.emt (No such file or directory)
  testFilter(org.eclipse.acceleo.compatibility.tests.unit.migration.FilterTest): java.io.FileNotFoundException: file:/opt/users/hudsonbuild/workspace/m2t-acceleo-3.3/tests/org.eclipse.acceleo.compatibility.tests/target/org.eclipse.acceleo.compatibility.tests-3.3.4-SNAPSHOT.jar!/data/filter/emt/chain.emt (No such file or directory)
  testGetProperty(org.eclipse.acceleo.compatibility.tests.unit.migration.getPropertyTest): java.io.FileNotFoundException: file:/opt/users/hudsonbuild/workspace/m2t-acceleo-3.3/tests/org.eclipse.acceleo.compatibility.tests/target/org.eclipse.acceleo.compatibility.tests-3.3.4-SNAPSHOT.jar!/data/getProperty/emt/chain.emt (No such file or directory)
  testArgs(org.eclipse.acceleo.compatibility.tests.unit.migration.ArgsTest): java.io.FileNotFoundException: file:/opt/users/hudsonbuild/workspace/m2t-acceleo-3.3/tests/org.eclipse.acceleo.compatibility.tests/target/org.eclipse.acceleo.compatibility.tests-3.3.4-SNAPSHOT.jar!/data/args/emt/chain.emt (No such file or directory)
  testSize(org.eclipse.acceleo.compatibility.tests.unit.migration.SizeTest): java.io.FileNotFoundException: file:/opt/users/hudsonbuild/workspace/m2t-acceleo-3.3/tests/org.eclipse.acceleo.compatibility.tests/target/org.eclipse.acceleo.compatibility.tests-3.3.4-SNAPSHOT.jar!/data/size/emt/chain.emt (No such file or directory)
  testService(org.eclipse.acceleo.compatibility.tests.unit.migration.ServiceTest): java.io.FileNotFoundException: file:/opt/users/hudsonbuild/workspace/m2t-acceleo-3.3/tests/org.eclipse.acceleo.compatibility.tests/target/org.eclipse.acceleo.compatibility.tests-3.3.4-SNAPSHOT.jar!/data/service/emt/chain.emt (No such file or directory)
  testNavigation(org.eclipse.acceleo.compatibility.tests.unit.migration.NavigationTest): java.io.FileNotFoundException: file:/opt/users/hudsonbuild/workspace/m2t-acceleo-3.3/tests/org.eclipse.acceleo.compatibility.tests/target/org.eclipse.acceleo.compatibility.tests-3.3.4-SNAPSHOT.jar!/data/navigation/emt/chain.emt (No such file or directory)
  testAdapt(org.eclipse.acceleo.compatibility.tests.unit.migration.AdaptTest): java.io.FileNotFoundException: file:/opt/users/hudsonbuild/workspace/m2t-acceleo-3.3/tests/org.eclipse.acceleo.compatibility.tests/target/org.eclipse.acceleo.compatibility.tests-3.3.4-SNAPSHOT.jar!/data/adapt/emt/chain.emt (No such file or directory)
  testForStatementAfterKeyword(org.eclipse.acceleo.engine.tests.unit.blocks.forBlock.ForBlockTest): Could not find public template testingAfter in module null.
  testForStatementBeforeKeyword(org.eclipse.acceleo.engine.tests.unit.blocks.forBlock.ForBlockTest): Could not find public template testingBefore in module null.
  testForStatementIVariable(org.eclipse.acceleo.engine.tests.unit.blocks.forBlock.ForBlockTest): Could not find public template testingI in module null.
  testForStatementIVariableSeparator(org.eclipse.acceleo.engine.tests.unit.blocks.forBlock.ForBlockTest): Could not find public template testingISeparator in module null.
  testForStatementBasicExample(org.eclipse.acceleo.engine.tests.unit.blocks.forBlock.ForBlockTest): Could not find public template testingSimple in module null.
  testForStatementSeparatorKeyword(org.eclipse.acceleo.engine.tests.unit.blocks.forBlock.ForBlockTest): Could not find public template testingSeparator in module null.
  testForStatementGuardKeyword(org.eclipse.acceleo.engine.tests.unit.blocks.forBlock.ForBlockTest): Could not find public template testingGuard in module null.
  testIfStatementNestedIf(org.eclipse.acceleo.engine.tests.unit.blocks.ifBlock.IfBlockTest): Could not find public template testingNestedIf in module null.
  testIfStatementCompleteIf(org.eclipse.acceleo.engine.tests.unit.blocks.ifBlock.IfBlockTest): Could not find public template testingCompleteIf in module null.
  testIfStatementElse(org.eclipse.acceleo.engine.tests.unit.blocks.ifBlock.IfBlockTest): Could not find public template testingElse in module null.
  testIfStatementElseif(org.eclipse.acceleo.engine.tests.unit.blocks.ifBlock.IfBlockTest): Could not find public template testingElseif in module null.
  testIfStatementIf(org.eclipse.acceleo.engine.tests.unit.blocks.ifBlock.IfBlockTest): Could not find public template testingIf in module null.
  testProtectedAreaIfTemplateIfBlock(org.eclipse.acceleo.engine.tests.unit.blocks.protectedareablock.ProtectedAreaBlockTest): Could not find public template test_protected_area_if_template_if_block in module null.
  testProtectedAreaTemplateFileForBlockMerge(org.eclipse.acceleo.engine.tests.unit.blocks.protectedareablock.ProtectedAreaBlockTest): Could not find public template test_protected_area_template_file_for_block_merge in module null.
  testProtectedAreaForTemplateIfBlock(org.eclipse.acceleo.engine.tests.unit.blocks.protectedareablock.ProtectedAreaBlockTest): Could not find public template test_protected_area_for_template_if_block in module null.
  testProtectedAreaTemplateLetBlockMerge(org.eclipse.acceleo.engine.tests.unit.blocks.protectedareablock.ProtectedAreaBlockTest): Could not find public template test_protected_area_template_let_block_merge in module null.
  testProtectedAreaIfTemplateIfBlockMerge(org.eclipse.acceleo.engine.tests.unit.blocks.protectedareablock.ProtectedAreaBlockTest): Could not find public template test_protected_area_if_template_if_block_merge in module null.
  testProtectedAreaMultipleGenerations(org.eclipse.acceleo.engine.tests.unit.blocks.protectedareablock.ProtectedAreaBlockTest): Could not find public template test_protected_area_multiple_generations in module null.
  testLostProtectedArea(org.eclipse.acceleo.engine.tests.unit.blocks.protectedareablock.ProtectedAreaBlockTest): Could not find public template test_lost_protected_area in module null.
  testProtectedAreaTemplateIfFileForIfElseTemplateBlock(org.eclipse.acceleo.engine.tests.unit.blocks.protectedareablock.ProtectedAreaBlockTest): Could not find public template test_protected_area_template_if_file_for_if_else_template_block in module null.
  testProtectedAreaTemplateFileTemplateForIfBlockMerge(org.eclipse.acceleo.engine.tests.unit.blocks.protectedareablock.ProtectedAreaBlockTest): Could not find public template test_protected_area_template_file_template_for_if_block_merge in module null.
  testProtectedAreaTemplateFileIfBlock(org.eclipse.acceleo.engine.tests.unit.blocks.protectedareablock.ProtectedAreaBlockTest): Could not find public template test_protected_area_template_file_if_block in module null.
  testProtectedAreaFileBlockMerge(org.eclipse.acceleo.engine.tests.unit.blocks.protectedareablock.ProtectedAreaBlockTest): Could not find public template test_protected_area_file_block_merge in module null.
  testProtectedAreaTemplateIfFileForLetElseLetTemplateBlockMerge(org.eclipse.acceleo.engine.tests.unit.blocks.protectedareablock.ProtectedAreaBlockTest): Could not find public template test_protected_area_template_if_file_for_let_elselet_template_block_merge in module null.
  testProtectedAreaForLetIfBlock(org.eclipse.acceleo.engine.tests.unit.blocks.protectedareablock.ProtectedAreaBlockTest): Could not find public template test_protected_area_for_let_if_block in module null.
  testProtectedAreaTemplateFileTemplateForIfBlock(org.eclipse.acceleo.engine.tests.unit.blocks.protectedareablock.ProtectedAreaBlockTest): Could not find public template test_protected_area_template_file_template_for_if_block in module null.
  testProtectedAreaTemplateFileLetBlock(org.eclipse.acceleo.engine.tests.unit.blocks.protectedareablock.ProtectedAreaBlockTest): Could not find public template test_protected_area_template_file_let_block in module null.
  testProtectedAreaTemplateFileForIfBlock(org.eclipse.acceleo.engine.tests.unit.blocks.protectedareablock.ProtectedAreaBlockTest): Could not find public template test_protected_area_template_file_for_if_block in module null.
  testProtectedAreaIfTemplateForBlock(org.eclipse.acceleo.engine.tests.unit.blocks.protectedareablock.ProtectedAreaBlockTest): Could not find public template test_protected_area_if_template_for_block in module null.
  testProtectedAreaTemplateFileTemplateForForBlock(org.eclipse.acceleo.engine.tests.unit.blocks.protectedareablock.ProtectedAreaBlockTest): Could not find public template test_protected_area_template_file_template_for_for_block in module null.
  testProtectedAreaVariableMarkerIdMultipleGenerations(org.eclipse.acceleo.engine.tests.unit.blocks.protectedareablock.ProtectedAreaBlockTest): Could not find public template test_protected_area_variable_marker_id_multiple_generations in module null.
  testProtectedAreaTemplateIfBlockMerge(org.eclipse.acceleo.engine.tests.unit.blocks.protectedareablock.ProtectedAreaBlockTest): Could not find public template test_protected_area_template_if_block_merge in module null.
  testProtectedAreaLetTemplateBlockMerge(org.eclipse.acceleo.engine.tests.unit.blocks.protectedareablock.ProtectedAreaBlockTest): Could not find public template test_protected_area_let_template_block_merge in module null.
  testProtectedAreaTemplateFileTemplateLetIfBlockMerge(org.eclipse.acceleo.engine.tests.unit.blocks.protectedareablock.ProtectedAreaBlockTest): Could not find public template test_protected_area_template_file_template_let_if_block_merge in module null.
  testProtectedAreaTemplateFileTemplateForLetBlockMerge(org.eclipse.acceleo.engine.tests.unit.blocks.protectedareablock.ProtectedAreaBlockTest): Could not find public template test_protected_area_template_file_template_for_let_block_merge in module null.
  testProtectedAreaTemplateFileTemplateIfLetBlock(org.eclipse.acceleo.engine.tests.unit.blocks.protectedareablock.ProtectedAreaBlockTest): Could not find public template test_protected_area_template_file_template_if_let_block in module null.
  testProtectedAreaLetTemplateIfBlock(org.eclipse.acceleo.engine.tests.unit.blocks.protectedareablock.ProtectedAreaBlockTest): Could not find public template test_protected_area_let_template_if_block in module null.
  testProtectedAreaIfBlock(org.eclipse.acceleo.engine.tests.unit.blocks.protectedareablock.ProtectedAreaBlockTest): Could not find public template test_protected_area_if_block in module null.
  testProtectedAreaIfTemplateBlock(org.eclipse.acceleo.engine.tests.unit.blocks.protectedareablock.ProtectedAreaBlockTest): Could not find public template test_protected_area_if_template_block in module null.
  testProtectedAreaTemplateFileTemplateLetForBlock(org.eclipse.acceleo.engine.tests.unit.blocks.protectedareablock.ProtectedAreaBlockTest): Could not find public template test_protected_area_template_file_template_let_for_block in module null.
  testProtectedAreaIfTemplateLetBlockMerge(org.eclipse.acceleo.engine.tests.unit.blocks.protectedareablock.ProtectedAreaBlockTest): Could not find public template test_protected_area_if_template_let_block_merge in module null.
  testRemovedProtectedArea(org.eclipse.acceleo.engine.tests.unit.blocks.protectedareablock.ProtectedAreaBlockTest): Could not find public template test_removed_protected_area in module null.
  testProtectedAreaLetTemplateForBlock(org.eclipse.acceleo.engine.tests.unit.blocks.protectedareablock.ProtectedAreaBlockTest): Could not find public template test_protected_area_let_template_for_block in module null.
  testProtectedAreaIfBlockMerge(org.eclipse.acceleo.engine.tests.unit.blocks.protectedareablock.ProtectedAreaBlockTest): Could not find public template test_protected_area_if_block_merge in module null.
  testProtectedAreaTemplateFileTemplateIfForBlockMerge(org.eclipse.acceleo.engine.tests.unit.blocks.protectedareablock.ProtectedAreaBlockTest): Could not find public template test_protected_area_template_file_template_if_for_block_merge in module null.
  testProtectedAreaTemplateFileTemplateLetForBlockMerge(org.eclipse.acceleo.engine.tests.unit.blocks.protectedareablock.ProtectedAreaBlockTest): Could not find public template test_protected_area_template_file_template_let_for_block_merge in module null.
  testProtectedAreaForTemplateIfBlockMerge(org.eclipse.acceleo.engine.tests.unit.blocks.protectedareablock.ProtectedAreaBlockTest): Could not find public template test_protected_area_for_template_if_block_merge in module null.
  testProtectedAreaForLetIfBlockMerge(org.eclipse.acceleo.engine.tests.unit.blocks.protectedareablock.ProtectedAreaBlockTest): Could not find public template test_protected_area_for_let_if_block_merge in module null.
  testProtectedAreaTemplateFileIfBlockMerge(org.eclipse.acceleo.engine.tests.unit.blocks.protectedareablock.ProtectedAreaBlockTest): Could not find public template test_protected_area_template_file_if_block_merge in module null.
  testProtectedAreaTemplateIfFileForLetElseLetTemplateBlock(org.eclipse.acceleo.engine.tests.unit.blocks.protectedareablock.ProtectedAreaBlockTest): Could not find public template test_protected_area_template_if_file_for_let_elselet_template_block in module null.
  testProtectedAreaForTemplateBlockMerge(org.eclipse.acceleo.engine.tests.unit.blocks.protectedareablock.ProtectedAreaBlockTest): Could not find public template test_protected_area_for_template_block_merge in module null.
  testProtectedAreaTemplateBlockMerge(org.eclipse.acceleo.engine.tests.unit.blocks.protectedareablock.ProtectedAreaBlockTest): Could not find public template test_protected_area_template_block_merge in module null.
  testProtectedAreaTemplateIfBlock(org.eclipse.acceleo.engine.tests.unit.blocks.protectedareablock.ProtectedAreaBlockTest): Could not find public template test_protected_area_template_if_block in module null.
  testProtectedAreaLetTemplateLetBlockMerge(org.eclipse.acceleo.engine.tests.unit.blocks.protectedareablock.ProtectedAreaBlockTest): Could not find public template test_protected_area_let_template_let_block_merge in module null.
  testProtectedAreaTemplateFileBlock(org.eclipse.acceleo.engine.tests.unit.blocks.protectedareablock.ProtectedAreaBlockTest): Could not find public template test_protected_area_template_file_block in module null.
  testProtectedAreaForBlock(org.eclipse.acceleo.engine.tests.unit.blocks.protectedareablock.ProtectedAreaBlockTest): Could not find public template test_protected_area_for_block in module null.
  testProtectedAreaLetTemplateBlock(org.eclipse.acceleo.engine.tests.unit.blocks.protectedareablock.ProtectedAreaBlockTest): Could not find public template test_protected_area_let_template_block in module null.
  testProtectedAreaLetBlockMerge(org.eclipse.acceleo.engine.tests.unit.blocks.protectedareablock.ProtectedAreaBlockTest): Could not find public template test_protected_area_let_block_merge in module null.
  testProtectedAreaIfTemplateBlockMerge(org.eclipse.acceleo.engine.tests.unit.blocks.protectedareablock.ProtectedAreaBlockTest): Could not find public template test_protected_area_if_template_block_merge in module null.
  testProtectedAreaConditionalMultipleGenerations(org.eclipse.acceleo.engine.tests.unit.blocks.protectedareablock.ProtectedAreaBlockTest): Could not find public template test_protected_area_conditional_multiple_generations in module null.
  testProtectedAreaTemplateForBlock(org.eclipse.acceleo.engine.tests.unit.blocks.protectedareablock.ProtectedAreaBlockTest): Could not find public template test_protected_area_template_for_block in module null.
  testProtectedAreaTemplateFileLetBlockMerge(org.eclipse.acceleo.engine.tests.unit.blocks.protectedareablock.ProtectedAreaBlockTest): Could not find public template test_protected_area_template_file_let_block_merge in module null.
  testProtectedAreaTemplateIfFileForLetElseTemplateBlock(org.eclipse.acceleo.engine.tests.unit.blocks.protectedareablock.ProtectedAreaBlockTest): Could not find public template test_protected_area_template_if_file_for_let_else_template_block in module null.
  testProtectedAreaTemplateBlock(org.eclipse.acceleo.engine.tests.unit.blocks.protectedareablock.ProtectedAreaBlockTest): Could not find public template test_protected_area_template_block in module null.
  testProtectedAreaTemplateIfFileForLetElseTemplateBlockMerge(org.eclipse.acceleo.engine.tests.unit.blocks.protectedareablock.ProtectedAreaBlockTest): Could not find public template test_protected_area_template_if_file_for_let_else_template_block_merge in module null.
  testProtectedAreaForTemplateForBlock(org.eclipse.acceleo.engine.tests.unit.blocks.protectedareablock.ProtectedAreaBlockTest): Could not find public template test_protected_area_for_template_for_block in module null.
  testProtectedAreaIfTemplateLetBlock(org.eclipse.acceleo.engine.tests.unit.blocks.protectedareablock.ProtectedAreaBlockTest): Could not find public template test_protected_area_if_template_let_block in module null.
  testProtectedAreaTemplateFileTemplateForLetBlock(org.eclipse.acceleo.engine.tests.unit.blocks.protectedareablock.ProtectedAreaBlockTest): Could not find public template test_protected_area_template_file_template_for_let_block in module null.
  testProtectedAreaTemplateForBlockMerge(org.eclipse.acceleo.engine.tests.unit.blocks.protectedareablock.ProtectedAreaBlockTest): Could not find public template test_protected_area_template_for_block_merge in module null.
  testProtectedAreaTemplateIfFileForIfElseTemplateBlockMerge(org.eclipse.acceleo.engine.tests.unit.blocks.protectedareablock.ProtectedAreaBlockTest): Could not find public template test_protected_area_template_if_file_for_if_else_template_block_merge in module null.
  testProtectedAreaTemplateFileTemplateLetLetBlock(org.eclipse.acceleo.engine.tests.unit.blocks.protectedareablock.ProtectedAreaBlockTest): Could not find public template test_protected_area_template_file_template_let_let_block in module null.
  testProtectedAreaFileBlock(org.eclipse.acceleo.engine.tests.unit.blocks.protectedareablock.ProtectedAreaBlockTest): Could not find public template test_protected_area_file_block in module null.
  testProtectedAreaLetTemplateLetBlock(org.eclipse.acceleo.engine.tests.unit.blocks.protectedareablock.ProtectedAreaBlockTest): Could not find public template test_protected_area_let_template_let_block in module null.
  testProtectedAreaTemplateFileTemplateIfIfBlockMerge(org.eclipse.acceleo.engine.tests.unit.blocks.protectedareablock.ProtectedAreaBlockTest): Could not find public template test_protected_area_template_file_template_if_if_block_merge in module null.
  testProtectedAreaPerformanceMultipleGenerations(org.eclipse.acceleo.engine.tests.unit.blocks.protectedareablock.ProtectedAreaBlockTest): Could not find public template test_protected_area_performance_multiple_generations in module null.
  testProtectedAreaTemplateFileForBlock(org.eclipse.acceleo.engine.tests.unit.blocks.protectedareablock.ProtectedAreaBlockTest): Could not find public template test_protected_area_template_file_for_block in module null.
  testProtectedAreaTemplateFileTemplateIfLetBlockMerge(org.eclipse.acceleo.engine.tests.unit.blocks.protectedareablock.ProtectedAreaBlockTest): Could not find public template test_protected_area_template_file_template_if_let_block_merge in module null.
  testProtectedAreaForTemplateTetBlockMerge(org.eclipse.acceleo.engine.tests.unit.blocks.protectedareablock.ProtectedAreaBlockTest): Could not find public template test_protected_area_for_template_let_block_merge in module null.
  testProtectedAreaTemplateFileTemplateLetLetBlockMerge(org.eclipse.acceleo.engine.tests.unit.blocks.protectedareablock.ProtectedAreaBlockTest): Could not find public template test_protected_area_template_file_template_let_let_block_merge in module null.
  testProtectedAreaTemplateFileTemplateForForBlockMerge(org.eclipse.acceleo.engine.tests.unit.blocks.protectedareablock.ProtectedAreaBlockTest): Could not find public template test_protected_area_template_file_template_for_for_block_merge in module null.
  testProtectedAreaLetComplex(org.eclipse.acceleo.engine.tests.unit.blocks.protectedareablock.ProtectedAreaBlockTest): Could not find public template test_protected_area_template_let_complex in module null.
  testProtectedAreaLetBlock(org.eclipse.acceleo.engine.tests.unit.blocks.protectedareablock.ProtectedAreaBlockTest): Could not find public template test_protected_area_let_block in module null.
  testProtectedAreaTemplateFileForIfBlockMerge(org.eclipse.acceleo.engine.tests.unit.blocks.protectedareablock.ProtectedAreaBlockTest): Could not find public template test_protected_area_template_file_for_if_block_merge in module null.
  testProtectedAreaTemplateFileBlockMerge(org.eclipse.acceleo.engine.tests.unit.blocks.protectedareablock.ProtectedAreaBlockTest): Could not find public template test_protected_area_template_file_block_merge in module null.
  testProtectedAreaIfTemplateForBlockMerge(org.eclipse.acceleo.engine.tests.unit.blocks.protectedareablock.ProtectedAreaBlockTest): Could not find public template test_protected_area_if_template_for_block_merge in module null.
  testProtectedAreaTemplateLetBlock(org.eclipse.acceleo.engine.tests.unit.blocks.protectedareablock.ProtectedAreaBlockTest): Could not find public template test_protected_area_template_let_block in module null.
  testProtectedAreaTemplateFileTemplateIfForBlock(org.eclipse.acceleo.engine.tests.unit.blocks.protectedareablock.ProtectedAreaBlockTest): Could not find public template test_protected_area_template_file_template_if_for_block in module null.
  testProtectedAreaTemplateFileTemplateIfIfBlock(org.eclipse.acceleo.engine.tests.unit.blocks.protectedareablock.ProtectedAreaBlockTest): Could not find public template test_protected_area_template_file_template_if_if_block in module null.
  testProtectedAreaForTemplateForBlockMerge(org.eclipse.acceleo.engine.tests.unit.blocks.protectedareablock.ProtectedAreaBlockTest): Could not find public template test_protected_area_for_template_for_block_merge in module null.
  testProtectedAreaTemplateFileTemplateLetIfBlock(org.eclipse.acceleo.engine.tests.unit.blocks.protectedareablock.ProtectedAreaBlockTest): Could not find public template test_protected_area_template_file_template_let_if_block in module null.
  testProtectedAreaForTemplateBlock(org.eclipse.acceleo.engine.tests.unit.blocks.protectedareablock.ProtectedAreaBlockTest): Could not find public template test_protected_area_for_template_block in module null.
  testProtectedAreaForTemplateLetBlock(org.eclipse.acceleo.engine.tests.unit.blocks.protectedareablock.ProtectedAreaBlockTest): Could not find public template test_protected_area_for_template_let_block in module null.
  testProtectedAreaLetTemplateIfBlockMerge(org.eclipse.acceleo.engine.tests.unit.blocks.protectedareablock.ProtectedAreaBlockTest): Could not find public template test_protected_area_let_template_if_block_merge in module null.
  testProtectedAreaLetTemplateForBlockMerge(org.eclipse.acceleo.engine.tests.unit.blocks.protectedareablock.ProtectedAreaBlockTest): Could not find public template test_protected_area_let_template_for_block_merge in module null.
  testProtectedAreaBlock(org.eclipse.acceleo.engine.tests.unit.blocks.protectedareablock.ProtectedAreaBlockTest): Could not find public template test_protected_area in module null.
  testProtectedAreaForBlockMerge(org.eclipse.acceleo.engine.tests.unit.blocks.protectedareablock.ProtectedAreaBlockTest): Could not find public template test_protected_area_for_block_merge in module null.
  testOrderedSetTemplate(org.eclipse.acceleo.engine.tests.unit.blocks.template.TemplateTest): Could not find public template test_ordered_set_template in module null.
  testFalseGuard(org.eclipse.acceleo.engine.tests.unit.blocks.template.TemplateTest): Could not find public template test_false_guard in module null.
  testTemplateCollectionCollection(org.eclipse.acceleo.engine.tests.unit.blocks.template.TemplateTest): Could not find public template test_template_collection_collection in module null.
  testAfter(org.eclipse.acceleo.engine.tests.unit.blocks.template.TemplateTest): Could not find public template test_after in module null.
  testBagTemplate(org.eclipse.acceleo.engine.tests.unit.blocks.template.TemplateTest): Could not find public template test_bag_template in module null.
  testTemplateCollection(org.eclipse.acceleo.engine.tests.unit.blocks.template.TemplateTest): Could not find public template test_template_collection in module null.
  testProtectedCall(org.eclipse.acceleo.engine.tests.unit.blocks.template.TemplateTest): Could not find public template test_protected_visibility in module null.
  testCollectionTemplate(org.eclipse.acceleo.engine.tests.unit.blocks.template.TemplateTest): Could not find public template test_collection_template in module null.
  testSequenceTemplate(org.eclipse.acceleo.engine.tests.unit.blocks.template.TemplateTest): Could not find public template test_sequence_template in module null.
  testSetTemplate(org.eclipse.acceleo.engine.tests.unit.blocks.template.TemplateTest): Could not find public template test_set_template in module null.
  testTemplateCollectionCollectionCollectionCollection(org.eclipse.acceleo.engine.tests.unit.blocks.template.TemplateTest): Could not find public template test_template_collection_collection_collection_collection in module null.
  testSuperCall(org.eclipse.acceleo.engine.tests.unit.blocks.template.TemplateTest): Could not find public template test_super in module null.
  testBefore(org.eclipse.acceleo.engine.tests.unit.blocks.template.TemplateTest): Could not find public template test_before in module null.
  testProtectOverride(org.eclipse.acceleo.engine.tests.unit.blocks.template.TemplateTest): Could not find public template test_protect_override in module null.
  testPrivateCall(org.eclipse.acceleo.engine.tests.unit.blocks.template.TemplateTest): Could not find public template test_private_visibility in module null.
  testImport(org.eclipse.acceleo.engine.tests.unit.blocks.template.TemplateTest): Could not find public template test_import in module null.
  testTrueGuard(org.eclipse.acceleo.engine.tests.unit.blocks.template.TemplateTest): Could not find public template test_true_guard in module null.
  testDualTemplateInvocation(org.eclipse.acceleo.engine.tests.unit.blocks.templateinvocation.DualTemplateInvocationTest): Could not find public template test in module null.
  testDualTemplateInvocation(org.eclipse.acceleo.engine.tests.unit.blocks.templateinvocation.QueryPropertyInvocationTest): Could not find public template test in module null.
  testRecursiveTemplateInvocation(org.eclipse.acceleo.engine.tests.unit.blocks.templateinvocation.RecursiveTemplateInvocation): Could not find public template recursive_source_is_argument in module null.
  testQueryInvocationWrapping(org.eclipse.acceleo.engine.tests.unit.blocks.queryinvocation.QueryInvocationWrapping): Could not find public template test in module null.
  testEvaluateLatin1Template(org.eclipse.acceleo.engine.tests.unit.encoding.GenerationEncodingTest): Could not find public template generate_ISO_8859_1 in module null.
  testEvaluateWrongEncodingTemplate(org.eclipse.acceleo.engine.tests.unit.encoding.GenerationEncodingTest): Could not find public template generate_wrong_encoding in module null.
  testEvaluateGreekTemplate(org.eclipse.acceleo.engine.tests.unit.encoding.GenerationEncodingTest): Could not find public template generate_ISO_8859_7 in module null.
  testEvaluateUTF8Template(org.eclipse.acceleo.engine.tests.unit.encoding.GenerationEncodingTest): Could not find public template generate_UTF_8 in module null.
  testEvaluateRussianTemplate(org.eclipse.acceleo.engine.tests.unit.encoding.GenerationEncodingTest): Could not find public template generate_ISO_8859_5 in module null.
  testEvaluateGuardedTemplateMismatchingArgs(org.eclipse.acceleo.engine.tests.unit.generation.AcceleoGenericEngineTest): Arguments of a generation cannot be null.
  testEvaluateNullRootNoPreview(org.eclipse.acceleo.engine.tests.unit.generation.AcceleoGenericEngineTest): Arguments of a generation cannot be null.
  testEvaluatePublicTemplateValidArgsNullRootPreview(org.eclipse.acceleo.engine.tests.unit.generation.AcceleoGenericEngineTest): Arguments of a generation cannot be null.
  testEvaluateGuardedTemplate(org.eclipse.acceleo.engine.tests.unit.generation.AcceleoGenericEngineTest): Arguments of a generation cannot be null.
  testEvaluatePublicTemplateValidArgs(org.eclipse.acceleo.engine.tests.unit.generation.AcceleoGenericEngineTest): Arguments of a generation cannot be null.
  testEvaluatePrivateTemplate(org.eclipse.acceleo.engine.tests.unit.generation.AcceleoGenericEngineTest): Arguments of a generation cannot be null.
  testEvaluatePublicTemplateValidArgsPreview(org.eclipse.acceleo.engine.tests.unit.generation.AcceleoGenericEngineTest): Arguments of a generation cannot be null.
  testEvaluatePublicTemplateWrongArgCount(org.eclipse.acceleo.engine.tests.unit.generation.AcceleoGenericEngineTest): Arguments of a generation cannot be null.
  testEvaluatePublicTemplateMismatchingArgs(org.eclipse.acceleo.engine.tests.unit.generation.AcceleoGenericEngineTest): Arguments of a generation cannot be null.
  testNullMonitor(org.eclipse.acceleo.engine.tests.unit.generation.AcceleoProgressMonitorTest): Could not find public template test in module null.
  testCanceledEvaluation(org.eclipse.acceleo.engine.tests.unit.generation.AcceleoProgressMonitorTest): Could not find public template test_cancel in module null.
  testDoGenerateModuleMapNoPreview(org.eclipse.acceleo.engine.tests.unit.service.facade.AcceleoServiceTest): Could not find public template template_1_2 in module null.
  testDoGenerateTemplatePrivateTemplate(org.eclipse.acceleo.engine.tests.unit.service.facade.AcceleoServiceTest): Arguments of a generation cannot be null.
  testDoGenerateModuleMapPreview(org.eclipse.acceleo.engine.tests.unit.service.facade.AcceleoServiceTest): Could not find public template template_2_1 in module null.
  testDoGenerateModuleNoPreviewNoGenerationRoot(org.eclipse.acceleo.engine.tests.unit.service.facade.AcceleoServiceTest): Could not find public template template_1_1 in module null.
  testDoGenerateTemplateNoPreview(org.eclipse.acceleo.engine.tests.unit.service.facade.AcceleoServiceTest): Arguments of a generation cannot be null.
  testDoGenerateModulePreview(org.eclipse.acceleo.engine.tests.unit.service.facade.AcceleoServiceTest): Could not find public template template_1_1 in module null.
  testDoGenerateTemplateMultipleArguments(org.eclipse.acceleo.engine.tests.unit.service.facade.AcceleoServiceTest): Arguments of a generation cannot be null.
  testDoGenerateModuleNoPreview(org.eclipse.acceleo.engine.tests.unit.service.facade.AcceleoServiceTest): Could not find public template template_1_1 in module null.
  testDoGenerateTemplatePreview(org.eclipse.acceleo.engine.tests.unit.service.facade.AcceleoServiceTest): Arguments of a generation cannot be null.
  testDoGenerateModuleNullInput(org.eclipse.acceleo.engine.tests.unit.service.facade.AcceleoServiceTest): Could not find public template template_1_1 in module null.
  testDoGenerateModulePreviewContainedTarget(org.eclipse.acceleo.engine.tests.unit.service.facade.AcceleoServiceTest): Could not find public template template_1_2 in module null.
  testSingleArgumentServiceInvocation(org.eclipse.acceleo.engine.tests.unit.service.java.AcceleoJavaServicesTest): Could not find public template test_call_single_argument in module null.
  testNoArgumentServiceInvocation(org.eclipse.acceleo.engine.tests.unit.service.java.AcceleoJavaServicesTest): Could not find public template test_call_no_argument in module null.
  testInstanceOfServiceInvocation(org.eclipse.acceleo.engine.tests.unit.service.java.AcceleoJavaServicesTest): Could not find public template test_call_instanceofs in module null.
  testSourceAndParametersChoice(org.eclipse.acceleo.engine.tests.unit.service.java.AcceleoJavaServicesTest): Could not find public template test_call_source_and_parameters in module null.
  testMultipleArgumentServiceInvocation(org.eclipse.acceleo.engine.tests.unit.service.java.AcceleoJavaServicesTest): Could not find public template test_call_multiple_argument in module null.
  testAcceleoGenerationEvent(org.eclipse.acceleo.engine.tests.unit.event.AcceleoListenersTest): Could not find public template test_generation_event in module null.
  testAcceleoGenerationListener(org.eclipse.acceleo.engine.tests.unit.event.AcceleoListenersTest): Could not find public template test_generation_listeners in module null.
  testNameResolutionExternalConflict(org.eclipse.acceleo.engine.tests.unit.resolution.namesake.SimpleNamesakeResolutionTest): Could not find public template test_namesake_external in module null.
  testNameResolutionPriority(org.eclipse.acceleo.engine.tests.unit.resolution.namesake.SimpleNamesakeResolutionTest): Could not find public template test_namesake_3 in module null.
  testNameResolutionConflictOnExtended(org.eclipse.acceleo.engine.tests.unit.resolution.namesake.SimpleNamesakeResolutionTest): Could not find public template test_namesake_extend in module null.
  testNameResolutionDistinctParamNames(org.eclipse.acceleo.engine.tests.unit.resolution.namesake.SimpleNamesakeResolutionTest): Could not find public template test_namesake_distinct_param_name in module null.
  testNameResolutionConflictOnImported(org.eclipse.acceleo.engine.tests.unit.resolution.namesake.SimpleNamesakeResolutionTest): Could not find public template test_namesake_import in module null.
  testNamesakeResolutionLocalMostSpecific(org.eclipse.acceleo.engine.tests.unit.resolution.namesake.ParameterTypeNarrowingResolutionTest): Could not find public template test_namesake_3_local_specific in module null.
  testNamesakeResolutionOnExtendExtendSpecific(org.eclipse.acceleo.engine.tests.unit.resolution.namesake.ParameterTypeNarrowingResolutionTest): Could not find public template test_namesake_extend_extend_specific in module null.
  testNamesakeResolutionExtendMostSpecific(org.eclipse.acceleo.engine.tests.unit.resolution.namesake.ParameterTypeNarrowingResolutionTest): Could not find public template test_namesake_3_extend_specific in module null.
  testNamesakeResolutionImportMostSpecific(org.eclipse.acceleo.engine.tests.unit.resolution.namesake.ParameterTypeNarrowingResolutionTest): Could not find public template test_namesake_3_import_specific in module null.
  testNamesakeResolutionOnImportImportSpecific(org.eclipse.acceleo.engine.tests.unit.resolution.namesake.ParameterTypeNarrowingResolutionTest): Could not find public template test_namesake_import_import_specific in module null.
  testNamesakeResolutionOnImportLocalSpecific(org.eclipse.acceleo.engine.tests.unit.resolution.namesake.ParameterTypeNarrowingResolutionTest): Could not find public template test_namesake_import_local_specific in module null.
  testNamesakeResolutionExternalExtendSpecific(org.eclipse.acceleo.engine.tests.unit.resolution.namesake.ParameterTypeNarrowingResolutionTest): Could not find public template test_namesake_external_extend_specific in module null.
  testNamesakeResolutionExternalImportSpecific(org.eclipse.acceleo.engine.tests.unit.resolution.namesake.ParameterTypeNarrowingResolutionTest): Could not find public template test_namesake_external_import_specific in module null.
  testNamesakeResolutionOnExtendLocalSpecific(org.eclipse.acceleo.engine.tests.unit.resolution.namesake.ParameterTypeNarrowingResolutionTest): Could not find public template test_namesake_extend_local_specific in module null.
  testNamesakeGuardImportSpecific(org.eclipse.acceleo.engine.tests.unit.resolution.namesake.NamesakeGuardResolutionTest): Could not find public template test_namesake_guard_import_specific in module null.
  testNamesakeGuardedSpecific(org.eclipse.acceleo.engine.tests.unit.resolution.namesake.NamesakeGuardResolutionTest): Could not find public template test_namesake_guarded_specific in module null.
  testNamesakeGuard(org.eclipse.acceleo.engine.tests.unit.resolution.namesake.NamesakeGuardResolutionTest): Could not find public template test_namesake_guard in module null.
  testLocalOverrideDirectCall(org.eclipse.acceleo.engine.tests.unit.resolution.override.SimpleOverridesResolutionTest): Could not find public template test_local_overriden_direct_call in module null.
  testOverridePriorityIndirectCall(org.eclipse.acceleo.engine.tests.unit.resolution.override.SimpleOverridesResolutionTest): Could not find public template test_override_priority_indirect in module null.
  testOverridePriorityMidIndirectCall(org.eclipse.acceleo.engine.tests.unit.resolution.override.SimpleOverridesResolutionTest): Could not find public template test_override_priority_indirect_extend in module null.
  testExtendOverrideIndirectCall(org.eclipse.acceleo.engine.tests.unit.resolution.override.SimpleOverridesResolutionTest): Could not find public template test_extend_overriden_indirect_call in module null.
  testOverridePriorityDirectCall(org.eclipse.acceleo.engine.tests.unit.resolution.override.SimpleOverridesResolutionTest): Could not find public template test_override_priority_direct in module null.
  testLocalOverrideIndirectCall(org.eclipse.acceleo.engine.tests.unit.resolution.override.SimpleOverridesResolutionTest): Could not find public template test_local_overriden_indirect_call in module null.
  testExtendOverrideDirectCall(org.eclipse.acceleo.engine.tests.unit.resolution.override.SimpleOverridesResolutionTest): Could not find public template test_extend_overriden_direct_call in module null.
  testOverrideParameterNarrowingLocal(org.eclipse.acceleo.engine.tests.unit.resolution.override.OverrideParameterTypeNarrowingResolutionTest): Could not find public template test_resolution_local_override in module null.
  testOverrideParameterNarrowing(org.eclipse.acceleo.engine.tests.unit.resolution.override.OverrideParameterTypeNarrowingResolutionTest): Could not find public template test_resolution_override_specific in module null.
  testOverrideParameterNarrowingExternal(org.eclipse.acceleo.engine.tests.unit.resolution.override.OverrideParameterTypeNarrowingResolutionTest): Could not find public template test_resolution_external_override in module null.
  testOverrideSpecificGuarded(org.eclipse.acceleo.engine.tests.unit.resolution.override.OverrideGuardResolutionTest): Could not find public template test_resolution_override_specific_guarded in module null.
  testOverrideLocalDefinitionGuarded(org.eclipse.acceleo.engine.tests.unit.resolution.override.OverrideGuardResolutionTest): Could not find public template test_resolution_local_override_definition_guarded in module null.
  testOverrideParameterNarrowingExternal(org.eclipse.acceleo.engine.tests.unit.resolution.override.OverrideGuardResolutionTest): Could not find public template test_resolution_external_override_definition_guarded in module null.
  testImplicitSelfVariableInQuery(org.eclipse.acceleo.engine.tests.unit.variables.SelfTest): Could not find public template test_implicit_self_query in module null.
  testSelfVariableInQuery(org.eclipse.acceleo.engine.tests.unit.variables.SelfTest): Could not find public template test_self_query in module null.
  testSelfVariableInTemplate(org.eclipse.acceleo.engine.tests.unit.variables.SelfTest): Could not find public template test_self_template in module null.
  testImplicitSelfVariableInTemplate(org.eclipse.acceleo.engine.tests.unit.variables.SelfTest): Could not find public template test_implicit_self_template in module null.
  testStringToLowerFirst(org.eclipse.acceleo.engine.tests.unit.environment.AcceleoStandardLibraryParsedTest): Could not find public template test_stdlib in module null.
  testStringSubstitute(org.eclipse.acceleo.engine.tests.unit.environment.AcceleoStandardLibraryParsedTest): Could not find public template test_stdlib in module null.
  testStringToUpperFirst(org.eclipse.acceleo.engine.tests.unit.environment.AcceleoStandardLibraryParsedTest): Could not find public template test_stdlib in module null.
  testStringIsAlpha(org.eclipse.acceleo.engine.tests.unit.environment.AcceleoStandardLibraryParsedTest): Could not find public template test_stdlib in module null.
  testStringIsAlphanum(org.eclipse.acceleo.engine.tests.unit.environment.AcceleoStandardLibraryParsedTest): Could not find public template test_stdlib in module null.
  testStringStrcmp(org.eclipse.acceleo.engine.tests.unit.environment.AcceleoStandardLibraryParsedTest): Could not find public template test_stdlib in module null.
  testStringStrstr(org.eclipse.acceleo.engine.tests.unit.environment.AcceleoStandardLibraryParsedTest): Could not find public template test_stdlib in module null.
  testStringStrtok(org.eclipse.acceleo.engine.tests.unit.environment.AcceleoStandardLibraryParsedTest): Could not find public template test_stdlib in module null.
  testStringLast(org.eclipse.acceleo.engine.tests.unit.environment.AcceleoStandardLibraryParsedTest): Could not find public template test_stdlib in module null.
  testStringFirst(org.eclipse.acceleo.engine.tests.unit.environment.AcceleoStandardLibraryParsedTest): Could not find public template test_stdlib in module null.
  testStringIndex(org.eclipse.acceleo.engine.tests.unit.environment.AcceleoStandardLibraryParsedTest): Could not find public template test_stdlib in module null.
  testStringStartsWith(org.eclipse.acceleo.engine.tests.unit.environment.AcceleoNonStandardLibraryParsedTest): Could not find public template test_nonstdlib in module null.
  testOclAnyToString(org.eclipse.acceleo.engine.tests.unit.environment.AcceleoNonStandardLibraryParsedTest): Could not find public template test_nonstdlib in module null.
  testStringReplaceAll(org.eclipse.acceleo.engine.tests.unit.environment.AcceleoNonStandardLibraryParsedTest): Could not find public template test_nonstdlib in module null.
  testCollectionEndsWith(org.eclipse.acceleo.engine.tests.unit.environment.AcceleoNonStandardLibraryParsedTest): Could not find public template test_nonstdlib in module null.
  testStringTokenizeLine(org.eclipse.acceleo.engine.tests.unit.environment.AcceleoNonStandardLibraryParsedTest): Could not find public template test_nonstdlib in module null.
  testOclAnyTypedEInverse(org.eclipse.acceleo.engine.tests.unit.environment.AcceleoNonStandardLibraryParsedTest): Could not find public template test_nonstdlib in module null.
  testOclAnyTypedEAllContents(org.eclipse.acceleo.engine.tests.unit.environment.AcceleoNonStandardLibraryParsedTest): Could not find public template test_nonstdlib in module null.
  testOclAnyLineSeparator(org.eclipse.acceleo.engine.tests.unit.environment.AcceleoNonStandardLibraryParsedTest): Could not find public template test_nonstdlib in module null.
  testCollectionLastIndexOfSlice(org.eclipse.acceleo.engine.tests.unit.environment.AcceleoNonStandardLibraryParsedTest): Could not find public template test_nonstdlib in module null.
  testCollectionStartsWith(org.eclipse.acceleo.engine.tests.unit.environment.AcceleoNonStandardLibraryParsedTest): Could not find public template test_nonstdlib in module null.
  testStringReplace(org.eclipse.acceleo.engine.tests.unit.environment.AcceleoNonStandardLibraryParsedTest): Could not find public template test_nonstdlib in module null.
  testOclAnyAncestors(org.eclipse.acceleo.engine.tests.unit.environment.AcceleoNonStandardLibraryParsedTest): Could not find public template test_nonstdlib in module null.
  testCollectionDrop(org.eclipse.acceleo.engine.tests.unit.environment.AcceleoNonStandardLibraryParsedTest): Could not find public template test_nonstdlib in module null.
  testStringEndsWith(org.eclipse.acceleo.engine.tests.unit.environment.AcceleoNonStandardLibraryParsedTest): Could not find public template test_nonstdlib in module null.
  testOclAnyEInverse(org.eclipse.acceleo.engine.tests.unit.environment.AcceleoNonStandardLibraryParsedTest): Could not find public template test_nonstdlib in module null.
  testOclAnyTypedSiblings(org.eclipse.acceleo.engine.tests.unit.environment.AcceleoNonStandardLibraryParsedTest): Could not find public template test_nonstdlib in module null.
  testCollectionRemoveAll(org.eclipse.acceleo.engine.tests.unit.environment.AcceleoNonStandardLibraryParsedTest): Could not find public template test_nonstdlib in module null.
  testStringTokenize_2(org.eclipse.acceleo.engine.tests.unit.environment.AcceleoNonStandardLibraryParsedTest): Could not find public template test_nonstdlib in module null.
  testOclAnyInvoke(org.eclipse.acceleo.engine.tests.unit.environment.AcceleoNonStandardLibraryParsedTest): Could not find public template test_nonstdlib in module null.
  testCollectionIndexOfSlice(org.eclipse.acceleo.engine.tests.unit.environment.AcceleoNonStandardLibraryParsedTest): Could not find public template test_nonstdlib in module null.
  testOclAnySiblings(org.eclipse.acceleo.engine.tests.unit.environment.AcceleoNonStandardLibraryParsedTest): Could not find public template test_nonstdlib in module null.
  testStringTokenize(org.eclipse.acceleo.engine.tests.unit.environment.AcceleoNonStandardLibraryParsedTest): Could not find public template test_nonstdlib in module null.
  testStringSubstituteAll(org.eclipse.acceleo.engine.tests.unit.environment.AcceleoNonStandardLibraryParsedTest): Could not find public template test_nonstdlib in module null.
  testOclAnyEAllContents(org.eclipse.acceleo.engine.tests.unit.environment.AcceleoNonStandardLibraryParsedTest): Could not find public template test_nonstdlib in module null.
  testCollectionAddAll(org.eclipse.acceleo.engine.tests.unit.environment.AcceleoNonStandardLibraryParsedTest): Could not find public template test_nonstdlib in module null.
  testStringLastIndex(org.eclipse.acceleo.engine.tests.unit.environment.AcceleoNonStandardLibraryParsedTest): Could not find public template test_nonstdlib in module null.
  testOclAnyTypedAncestors(org.eclipse.acceleo.engine.tests.unit.environment.AcceleoNonStandardLibraryParsedTest): Could not find public template test_nonstdlib in module null.
  testStringContains(org.eclipse.acceleo.engine.tests.unit.environment.AcceleoNonStandardLibraryParsedTest): Could not find public template test_nonstdlib in module null.
  testCollectionSep(org.eclipse.acceleo.engine.tests.unit.environment.AcceleoNonStandardLibraryParsedTest): Could not find public template test_nonstdlib in module null.
  testCollectionDropRight(org.eclipse.acceleo.engine.tests.unit.environment.AcceleoNonStandardLibraryParsedTest): Could not find public template test_nonstdlib in module null.
  testStringTrim(org.eclipse.acceleo.engine.tests.unit.environment.AcceleoNonStandardLibraryParsedTest): Could not find public template test_nonstdlib in module null.
  testStringIndex(org.eclipse.acceleo.engine.tests.unit.environment.AcceleoNonStandardLibraryParsedTest): Could not find public template test_nonstdlib in module null.

Tests run: 2521, Failures: 962, Errors: 476, Skipped: 0

09/04/2013 02:23:33 Xvnc version X.org/xf4vnc custom version
09/04/2013 02:23:33 Copyright (C) 2001-2004 Alan Hourihane.
09/04/2013 02:23:33 Copyright (C) 2000-2004 Constantin Kaplinsky
09/04/2013 02:23:33 Copyright (C) 1999 AT&T Laboratories Cambridge
09/04/2013 02:23:33 All Rights Reserved.
09/04/2013 02:23:33 See http://www.tightvnc.com/ for information on TightVNC
09/04/2013 02:23:33 See http://xf4vnc.sf.net for xf4vnc-specific information
09/04/2013 02:23:33 Desktop name 'x11' (hudson-slave1:106)
09/04/2013 02:23:33 Protocol versions supported: 3.7, 3.3
09/04/2013 02:23:33 [ERROR] There are test failures.

Please refer to /opt/users/hudsonbuild/workspace/m2t-acceleo-3.3/tests/org.eclipse.acceleo.tests/target/surefire-reports for the individual test results.
RGB format 8 8 8
09/04/2013 02:23:33 Listening for VNC connections on TCP port 6006
[dix] Could not init font path element /usr/share/fonts/TTF/, removing from list!
[dix] Could not init font path element /usr/share/fonts/OTF, removing from list!
(EE) config/hal: NewInputDeviceRequest failed (2)
(EE) config/hal: NewInputDeviceRequest failed (2)
[INFO]                                                                         
[INFO] ------------------------------------------------------------------------
[INFO] Building Acceleo Documentation Feature 3.3.4-SNAPSHOT
[INFO] ------------------------------------------------------------------------
[INFO] 
[INFO] --- maven-clean-plugin:2.4.1:clean (default-clean) @ org.eclipse.acceleo.doc ---
[INFO] Deleting /opt/users/hudsonbuild/workspace/m2t-acceleo-3.3/features/org.eclipse.acceleo.doc-feature/target
[INFO] 
[INFO] --- tycho-packaging-plugin:0.16.0:build-qualifier-aggregator (default-build-qualifier-aggregator) @ org.eclipse.acceleo.doc ---
[INFO] 
[INFO] --- tycho-packaging-plugin:0.16.0:validate-id (default-validate-id) @ org.eclipse.acceleo.doc ---
[INFO] 
[INFO] --- tycho-packaging-plugin:0.16.0:validate-version (default-validate-version) @ org.eclipse.acceleo.doc ---
[INFO] 
[INFO] --- tycho-source-plugin:0.16.0:plugin-source (plugin-source) @ org.eclipse.acceleo.doc ---
[INFO] 
[INFO] --- tycho-packaging-plugin:0.16.0:package-feature (default-package-feature) @ org.eclipse.acceleo.doc ---
[INFO] Building jar: /opt/users/hudsonbuild/workspace/m2t-acceleo-3.3/features/org.eclipse.acceleo.doc-feature/target/org.eclipse.acceleo.doc-3.3.4-SNAPSHOT.jar
[INFO] 
[INFO] --- tycho-p2-plugin:0.16.0:p2-metadata-default (default-p2-metadata-default) @ org.eclipse.acceleo.doc ---
[INFO] 
[INFO] --- tycho-p2-plugin:0.16.0:feature-p2-metadata (default-feature-p2-metadata) @ org.eclipse.acceleo.doc ---
[INFO] 
[INFO] --- tycho-source-feature-plugin:0.16.0:source-feature (source-feature) @ org.eclipse.acceleo.doc ---
[INFO] 
[INFO] --- tycho-p2-plugin:0.16.0:p2-metadata (attach-p2-metadata) @ org.eclipse.acceleo.doc ---
[INFO]                                                                         
[INFO] ------------------------------------------------------------------------
[INFO] Building Acceleo Feature 3.3.4-SNAPSHOT
[INFO] ------------------------------------------------------------------------
[INFO] 
[INFO] --- maven-clean-plugin:2.4.1:clean (default-clean) @ org.eclipse.acceleo ---
[INFO] Deleting /opt/users/hudsonbuild/workspace/m2t-acceleo-3.3/features/org.eclipse.acceleo-feature/target
[INFO] 
[INFO] --- tycho-packaging-plugin:0.16.0:build-qualifier-aggregator (default-build-qualifier-aggregator) @ org.eclipse.acceleo ---
[INFO] 
[INFO] --- tycho-packaging-plugin:0.16.0:validate-id (default-validate-id) @ org.eclipse.acceleo ---
[INFO] 
[INFO] --- tycho-packaging-plugin:0.16.0:validate-version (default-validate-version) @ org.eclipse.acceleo ---
[INFO] 
[INFO] --- tycho-source-plugin:0.16.0:plugin-source (plugin-source) @ org.eclipse.acceleo ---
[INFO] 
[INFO] --- tycho-packaging-plugin:0.16.0:package-feature (default-package-feature) @ org.eclipse.acceleo ---
[INFO] Building jar: /opt/users/hudsonbuild/workspace/m2t-acceleo-3.3/features/org.eclipse.acceleo-feature/target/org.eclipse.acceleo-3.3.4-SNAPSHOT.jar
[INFO] 
[INFO] --- tycho-p2-plugin:0.16.0:p2-metadata-default (default-p2-metadata-default) @ org.eclipse.acceleo ---
[INFO] 
[INFO] --- tycho-p2-plugin:0.16.0:feature-p2-metadata (default-feature-p2-metadata) @ org.eclipse.acceleo ---
[INFO] 
[INFO] --- tycho-source-feature-plugin:0.16.0:source-feature (source-feature) @ org.eclipse.acceleo ---
[INFO] Building jar: /opt/users/hudsonbuild/workspace/m2t-acceleo-3.3/features/org.eclipse.acceleo-feature/target/org.eclipse.acceleo-sources-feature.jar
[INFO] 
[INFO] --- tycho-p2-plugin:0.16.0:p2-metadata (attach-p2-metadata) @ org.eclipse.acceleo ---
[INFO]                                                                         
[INFO] ------------------------------------------------------------------------
[INFO] Building Acceleo Example Feature 3.3.4-SNAPSHOT
[INFO] ------------------------------------------------------------------------
[INFO] 
[INFO] --- maven-clean-plugin:2.4.1:clean (default-clean) @ org.eclipse.acceleo.examples ---
[INFO] Deleting /opt/users/hudsonbuild/workspace/m2t-acceleo-3.3/features/org.eclipse.acceleo.examples-feature/target
[INFO] 
[INFO] --- tycho-packaging-plugin:0.16.0:build-qualifier-aggregator (default-build-qualifier-aggregator) @ org.eclipse.acceleo.examples ---
[INFO] 
[INFO] --- tycho-packaging-plugin:0.16.0:validate-id (default-validate-id) @ org.eclipse.acceleo.examples ---
[INFO] 
[INFO] --- tycho-packaging-plugin:0.16.0:validate-version (default-validate-version) @ org.eclipse.acceleo.examples ---
[INFO] 
[INFO] --- tycho-source-plugin:0.16.0:plugin-source (plugin-source) @ org.eclipse.acceleo.examples ---
[INFO] 
[INFO] --- tycho-packaging-plugin:0.16.0:package-feature (default-package-feature) @ org.eclipse.acceleo.examples ---
[INFO] Building jar: /opt/users/hudsonbuild/workspace/m2t-acceleo-3.3/features/org.eclipse.acceleo.examples-feature/target/org.eclipse.acceleo.examples-3.3.4-SNAPSHOT.jar
[INFO] 
[INFO] --- tycho-p2-plugin:0.16.0:p2-metadata-default (default-p2-metadata-default) @ org.eclipse.acceleo.examples ---
[INFO] 
[INFO] --- tycho-p2-plugin:0.16.0:feature-p2-metadata (default-feature-p2-metadata) @ org.eclipse.acceleo.examples ---
[INFO] 
[INFO] --- tycho-source-feature-plugin:0.16.0:source-feature (source-feature) @ org.eclipse.acceleo.examples ---
[INFO] 
[INFO] --- tycho-p2-plugin:0.16.0:p2-metadata (attach-p2-metadata) @ org.eclipse.acceleo.examples ---
[INFO]                                                                         
[INFO] ------------------------------------------------------------------------
[INFO] Building Acceleo Runtime Feature 3.3.4-SNAPSHOT
[INFO] ------------------------------------------------------------------------
[INFO] 
[INFO] --- maven-clean-plugin:2.4.1:clean (default-clean) @ org.eclipse.acceleo.runtime ---
[INFO] Deleting /opt/users/hudsonbuild/workspace/m2t-acceleo-3.3/features/org.eclipse.acceleo.runtime-feature/target
[INFO] 
[INFO] --- tycho-packaging-plugin:0.16.0:build-qualifier-aggregator (default-build-qualifier-aggregator) @ org.eclipse.acceleo.runtime ---
[INFO] 
[INFO] --- tycho-packaging-plugin:0.16.0:validate-id (default-validate-id) @ org.eclipse.acceleo.runtime ---
[INFO] 
[INFO] --- tycho-packaging-plugin:0.16.0:validate-version (default-validate-version) @ org.eclipse.acceleo.runtime ---
[INFO] 
[INFO] --- tycho-source-plugin:0.16.0:plugin-source (plugin-source) @ org.eclipse.acceleo.runtime ---
[INFO] 
[INFO] --- tycho-packaging-plugin:0.16.0:package-feature (default-package-feature) @ org.eclipse.acceleo.runtime ---
[INFO] Building jar: /opt/users/hudsonbuild/workspace/m2t-acceleo-3.3/features/org.eclipse.acceleo.runtime-feature/target/org.eclipse.acceleo.runtime-3.3.4-SNAPSHOT.jar
[INFO] 
[INFO] --- tycho-p2-plugin:0.16.0:p2-metadata-default (default-p2-metadata-default) @ org.eclipse.acceleo.runtime ---
[INFO] 
[INFO] --- tycho-p2-plugin:0.16.0:feature-p2-metadata (default-feature-p2-metadata) @ org.eclipse.acceleo.runtime ---
[INFO] 
[INFO] --- tycho-source-feature-plugin:0.16.0:source-feature (source-feature) @ org.eclipse.acceleo.runtime ---
[INFO] Building jar: /opt/users/hudsonbuild/workspace/m2t-acceleo-3.3/features/org.eclipse.acceleo.runtime-feature/target/org.eclipse.acceleo.runtime-sources-feature.jar
[INFO] 
[INFO] --- tycho-p2-plugin:0.16.0:p2-metadata (attach-p2-metadata) @ org.eclipse.acceleo.runtime ---
[INFO]                                                                         
[INFO] ------------------------------------------------------------------------
[INFO] Building Acceleo UI Capabilities Feature 3.3.4-SNAPSHOT
[INFO] ------------------------------------------------------------------------
[INFO] 
[INFO] --- maven-clean-plugin:2.4.1:clean (default-clean) @ org.eclipse.acceleo.ui.capabilities ---
[INFO] Deleting /opt/users/hudsonbuild/workspace/m2t-acceleo-3.3/features/org.eclipse.acceleo.ui.capabilities-feature/target
[INFO] 
[INFO] --- tycho-packaging-plugin:0.16.0:build-qualifier-aggregator (default-build-qualifier-aggregator) @ org.eclipse.acceleo.ui.capabilities ---
[INFO] 
[INFO] --- tycho-packaging-plugin:0.16.0:validate-id (default-validate-id) @ org.eclipse.acceleo.ui.capabilities ---
[INFO] 
[INFO] --- tycho-packaging-plugin:0.16.0:validate-version (default-validate-version) @ org.eclipse.acceleo.ui.capabilities ---
[INFO] 
[INFO] --- tycho-source-plugin:0.16.0:plugin-source (plugin-source) @ org.eclipse.acceleo.ui.capabilities ---
[INFO] 
[INFO] --- tycho-packaging-plugin:0.16.0:package-feature (default-package-feature) @ org.eclipse.acceleo.ui.capabilities ---
[INFO] Building jar: /opt/users/hudsonbuild/workspace/m2t-acceleo-3.3/features/org.eclipse.acceleo.ui.capabilities-feature/target/org.eclipse.acceleo.ui.capabilities-3.3.4-SNAPSHOT.jar
[INFO] 
[INFO] --- tycho-p2-plugin:0.16.0:p2-metadata-default (default-p2-metadata-default) @ org.eclipse.acceleo.ui.capabilities ---
[INFO] 
[INFO] --- tycho-p2-plugin:0.16.0:feature-p2-metadata (default-feature-p2-metadata) @ org.eclipse.acceleo.ui.capabilities ---
[INFO] 
[INFO] --- tycho-source-feature-plugin:0.16.0:source-feature (source-feature) @ org.eclipse.acceleo.ui.capabilities ---
[INFO] 
[INFO] --- tycho-p2-plugin:0.16.0:p2-metadata (attach-p2-metadata) @ org.eclipse.acceleo.ui.capabilities ---
[INFO]                                                                         
[INFO] ------------------------------------------------------------------------
[INFO] Building Acceleo SDK Feature 3.3.4-SNAPSHOT
[INFO] ------------------------------------------------------------------------
[INFO] 
[INFO] --- maven-clean-plugin:2.4.1:clean (default-clean) @ org.eclipse.acceleo.sdk ---
[INFO] Deleting /opt/users/hudsonbuild/workspace/m2t-acceleo-3.3/features/org.eclipse.acceleo.sdk-feature/target
[INFO] 
[INFO] --- tycho-packaging-plugin:0.16.0:build-qualifier-aggregator (default-build-qualifier-aggregator) @ org.eclipse.acceleo.sdk ---
[INFO] 
[INFO] --- tycho-packaging-plugin:0.16.0:validate-id (default-validate-id) @ org.eclipse.acceleo.sdk ---
[INFO] 
[INFO] --- tycho-packaging-plugin:0.16.0:validate-version (default-validate-version) @ org.eclipse.acceleo.sdk ---
[INFO] 
[INFO] --- tycho-source-plugin:0.16.0:plugin-source (plugin-source) @ org.eclipse.acceleo.sdk ---
[INFO] 
[INFO] --- tycho-packaging-plugin:0.16.0:package-feature (default-package-feature) @ org.eclipse.acceleo.sdk ---
[INFO] Building jar: /opt/users/hudsonbuild/workspace/m2t-acceleo-3.3/features/org.eclipse.acceleo.sdk-feature/target/org.eclipse.acceleo.sdk-3.3.4-SNAPSHOT.jar
[INFO] 
[INFO] --- tycho-p2-plugin:0.16.0:p2-metadata-default (default-p2-metadata-default) @ org.eclipse.acceleo.sdk ---
[INFO] 
[INFO] --- tycho-p2-plugin:0.16.0:feature-p2-metadata (default-feature-p2-metadata) @ org.eclipse.acceleo.sdk ---
[INFO] 
[INFO] --- tycho-source-feature-plugin:0.16.0:source-feature (source-feature) @ org.eclipse.acceleo.sdk ---
[INFO] 
[INFO] --- tycho-p2-plugin:0.16.0:p2-metadata (attach-p2-metadata) @ org.eclipse.acceleo.sdk ---
[INFO]                                                                         
[INFO] ------------------------------------------------------------------------
[INFO] Building Acceleo Repository 3.3.4-SNAPSHOT
[INFO] ------------------------------------------------------------------------
[INFO] 
[INFO] --- maven-clean-plugin:2.4.1:clean (default-clean) @ org.eclipse.acceleo-updatesite ---
[INFO] Deleting /opt/users/hudsonbuild/workspace/m2t-acceleo-3.3/releng/org.eclipse.acceleo-updatesite/target
[INFO] 
[INFO] --- tycho-packaging-plugin:0.16.0:build-qualifier (default-build-qualifier) @ org.eclipse.acceleo-updatesite ---
[INFO] 
[INFO] --- maven-resources-plugin:2.4.1:copy-resources (copy-resources) @ org.eclipse.acceleo-updatesite ---
[INFO] Using 'ISO-8859-1' encoding to copy filtered resources.
[INFO] Copying 0 resource
[INFO] 
[INFO] --- maven-clean-plugin:2.4.1:clean (default-clean-1) @ org.eclipse.acceleo-updatesite ---
[INFO] Deleting /opt/users/hudsonbuild/workspace/m2t-acceleo-3.3/releng/org.eclipse.acceleo-updatesite/target
[INFO] 
[INFO] --- tycho-source-plugin:0.16.0:plugin-source (plugin-source) @ org.eclipse.acceleo-updatesite ---
[INFO] 
[INFO] --- tycho-p2-publisher-plugin:0.16.0:publish-products (default-publish-products) @ org.eclipse.acceleo-updatesite ---
[INFO] 
[INFO] --- tycho-p2-publisher-plugin:0.16.0:publish-categories (default-publish-categories) @ org.eclipse.acceleo-updatesite ---
[INFO] 
[INFO] --- tycho-p2-publisher-plugin:0.16.0:attach-artifacts (default-attach-artifacts) @ org.eclipse.acceleo-updatesite ---
[INFO] 
[INFO] --- tycho-p2-repository-plugin:0.16.0:assemble-repository (default-assemble-repository) @ org.eclipse.acceleo-updatesite ---
[INFO] 
[INFO] --- tycho-p2-repository-plugin:0.16.0:archive-repository (default-archive-repository) @ org.eclipse.acceleo-updatesite ---
[INFO] Building zip: /opt/users/hudsonbuild/workspace/m2t-acceleo-3.3/releng/org.eclipse.acceleo-updatesite/target/org.eclipse.acceleo-updatesite.zip
[INFO] 
[INFO] --- tycho-source-feature-plugin:0.16.0:source-feature (source-feature) @ org.eclipse.acceleo-updatesite ---
[INFO] 
[INFO] --- tycho-p2-plugin:0.16.0:p2-metadata (attach-p2-metadata) @ org.eclipse.acceleo-updatesite ---
[INFO] 
[INFO] --- maven-antrun-plugin:1.3:run (prepare_promotion) @ org.eclipse.acceleo-updatesite ---
[INFO] Executing tasks
    [mkdir] Created dir: /opt/users/hudsonbuild/workspace/m2t-acceleo-3.3/releng/org.eclipse.acceleo-updatesite/target/promotion
     [copy] Copying 1 file to /opt/users/hudsonbuild/workspace/m2t-acceleo-3.3/releng/org.eclipse.acceleo-updatesite/target/promotion
     [copy] Copying 1 file to /opt/users/hudsonbuild/workspace/m2t-acceleo-3.3/releng/org.eclipse.acceleo-updatesite/target/promotion
[INFO] Executed tasks
[INFO] ------------------------------------------------------------------------
[INFO] Reactor Summary:
[INFO] 
[INFO] Acceleo Parent .................................... SUCCESS [0.257s]
[INFO] Acceleo Common .................................... SUCCESS [7.561s]
[INFO] Acceleo Common UI ................................. SUCCESS [3.567s]
[INFO] Acceleo Model ..................................... SUCCESS [6.310s]
[INFO] Acceleo Model Edit ................................ SUCCESS [4.655s]
[INFO] Acceleo Profiler .................................. SUCCESS [4.199s]
[INFO] Acceleo Profiler Edit ............................. SUCCESS [4.097s]
[INFO] Acceleo Profiler Editor ........................... SUCCESS [3.874s]
[INFO] Acceleo Parser .................................... SUCCESS [6.524s]
[INFO] Acceleo Engine .................................... SUCCESS [4.924s]
[INFO] Acceleo Traceability Model ........................ SUCCESS [4.836s]
[INFO] Acceleo Traceability .............................. SUCCESS [3.843s]
[INFO] Acceleo UI Interpreter ............................ SUCCESS [4.428s]
[INFO] Acceleo Compatibility ............................. SUCCESS [4.642s]
[INFO] Acceleo IDE UI .................................... SUCCESS [9.441s]
[INFO] Acceleo Compatibility UI .......................... SUCCESS [5.452s]
[INFO] Acceleo UI Capabilities ........................... SUCCESS [4.504s]
[INFO] Acceleo Examples .................................. SUCCESS [4.086s]
[INFO] Acceleo Documentation ............................. SUCCESS [2.078s]
[INFO] Acceleo Common Tests .............................. SUCCESS [19.900s]
[INFO] Acceleo Engine Tests .............................. SUCCESS [1:25.799s]
[INFO] Acceleo Dynamic Tests ............................. SUCCESS [3.739s]
[INFO] Acceleo Compatibility Tests ....................... SUCCESS [24.190s]
[INFO] Acceleo IDE UI Tests .............................. SUCCESS [4.298s]
[INFO] Acceleo Model Tests ............................... SUCCESS [4.279s]
[INFO] Acceleo Parser Tests .............................. SUCCESS [36.433s]
[INFO] Acceleo Traceability Tests ........................ SUCCESS [4.638s]
[INFO] Acceleo Tests ..................................... SUCCESS [1:02.109s]
[INFO] Acceleo Documentation Feature ..................... SUCCESS [3.337s]
[INFO] Acceleo Feature ................................... SUCCESS [7.037s]
[INFO] Acceleo Example Feature ........................... SUCCESS [3.653s]
[INFO] Acceleo Runtime Feature ........................... SUCCESS [6.825s]
[INFO] Acceleo UI Capabilities Feature ................... SUCCESS [3.208s]
[INFO] Acceleo SDK Feature ............................... SUCCESS [3.655s]
[INFO] Acceleo Repository ................................ SUCCESS [1:06.430s]
[INFO] ------------------------------------------------------------------------
[INFO] BUILD SUCCESS
[INFO] ------------------------------------------------------------------------
[INFO] Total time: 12:34.959s
[INFO] Finished at: Tue Apr 09 02:25:10 EDT 2013
[INFO] Final Memory: 205M/1559M
[INFO] ------------------------------------------------------------------------
[DEBUG] Closing connection to remote
[DEBUG] Waiting for process to finish
[DEBUG] Result: 0
Terminating xvnc.
Archiving artifacts
Recording test results
Sending e-mails to: laurent.goubet@obeo.fr stephane.begaudeau@obeo.fr
[DEBUG] Skipping watched dependency update; build not configured with trigger: m2t-acceleo-3.3 #104
Finished: UNSTABLE