FailedConsole Output

Skipping 1,530 KB.. Full Log
random/AcceleoTraceabilityRandomTests.java:233:9: Static variable definition in wrong order.
/jobs/genie.modeling.acceleo/acceleo-master-gerrit/workspace/tests/org.eclipse.acceleo.traceability.tests/src/org/eclipse/acceleo/traceability/tests/unit/random/AcceleoTraceabilityRandomTests.java:233:9: Variable access definition in wrong order.
/jobs/genie.modeling.acceleo/acceleo-master-gerrit/workspace/tests/org.eclipse.acceleo.traceability.tests/src/org/eclipse/acceleo/traceability/tests/unit/random/AcceleoTraceabilityRandomTests.java:233:62: Variable 'contains' must be private and have accessor methods.
/jobs/genie.modeling.acceleo/acceleo-master-gerrit/workspace/tests/org.eclipse.acceleo.traceability.tests/src/org/eclipse/acceleo/traceability/tests/unit/random/AcceleoTraceabilityRandomTests.java:234:9: Missing a Javadoc comment.
/jobs/genie.modeling.acceleo/acceleo-master-gerrit/workspace/tests/org.eclipse.acceleo.traceability.tests/src/org/eclipse/acceleo/traceability/tests/unit/random/AcceleoTraceabilityRandomTests.java:234:9: Static variable definition in wrong order.
/jobs/genie.modeling.acceleo/acceleo-master-gerrit/workspace/tests/org.eclipse.acceleo.traceability.tests/src/org/eclipse/acceleo/traceability/tests/unit/random/AcceleoTraceabilityRandomTests.java:234:9: Variable access definition in wrong order.
/jobs/genie.modeling.acceleo/acceleo-master-gerrit/workspace/tests/org.eclipse.acceleo.traceability.tests/src/org/eclipse/acceleo/traceability/tests/unit/random/AcceleoTraceabilityRandomTests.java:234:62: Variable 'endsWith' must be private and have accessor methods.
/jobs/genie.modeling.acceleo/acceleo-master-gerrit/workspace/tests/org.eclipse.acceleo.traceability.tests/src/org/eclipse/acceleo/traceability/tests/unit/random/AcceleoTraceabilityRandomTests.java:235:9: Missing a Javadoc comment.
/jobs/genie.modeling.acceleo/acceleo-master-gerrit/workspace/tests/org.eclipse.acceleo.traceability.tests/src/org/eclipse/acceleo/traceability/tests/unit/random/AcceleoTraceabilityRandomTests.java:235:9: Static variable definition in wrong order.
/jobs/genie.modeling.acceleo/acceleo-master-gerrit/workspace/tests/org.eclipse.acceleo.traceability.tests/src/org/eclipse/acceleo/traceability/tests/unit/random/AcceleoTraceabilityRandomTests.java:235:9: Variable access definition in wrong order.
/jobs/genie.modeling.acceleo/acceleo-master-gerrit/workspace/tests/org.eclipse.acceleo.traceability.tests/src/org/eclipse/acceleo/traceability/tests/unit/random/AcceleoTraceabilityRandomTests.java:235:62: Variable 'equalsIgnoreCase' must be private and have accessor methods.
/jobs/genie.modeling.acceleo/acceleo-master-gerrit/workspace/tests/org.eclipse.acceleo.traceability.tests/src/org/eclipse/acceleo/traceability/tests/unit/random/AcceleoTraceabilityRandomTests.java:236:9: Missing a Javadoc comment.
/jobs/genie.modeling.acceleo/acceleo-master-gerrit/workspace/tests/org.eclipse.acceleo.traceability.tests/src/org/eclipse/acceleo/traceability/tests/unit/random/AcceleoTraceabilityRandomTests.java:236:9: Static variable definition in wrong order.
/jobs/genie.modeling.acceleo/acceleo-master-gerrit/workspace/tests/org.eclipse.acceleo.traceability.tests/src/org/eclipse/acceleo/traceability/tests/unit/random/AcceleoTraceabilityRandomTests.java:236:9: Variable access definition in wrong order.
/jobs/genie.modeling.acceleo/acceleo-master-gerrit/workspace/tests/org.eclipse.acceleo.traceability.tests/src/org/eclipse/acceleo/traceability/tests/unit/random/AcceleoTraceabilityRandomTests.java:236:62: Variable 'lastIndex' must be private and have accessor methods.
/jobs/genie.modeling.acceleo/acceleo-master-gerrit/workspace/tests/org.eclipse.acceleo.traceability.tests/src/org/eclipse/acceleo/traceability/tests/unit/random/AcceleoTraceabilityRandomTests.java:237:9: Missing a Javadoc comment.
/jobs/genie.modeling.acceleo/acceleo-master-gerrit/workspace/tests/org.eclipse.acceleo.traceability.tests/src/org/eclipse/acceleo/traceability/tests/unit/random/AcceleoTraceabilityRandomTests.java:237:9: Static variable definition in wrong order.
/jobs/genie.modeling.acceleo/acceleo-master-gerrit/workspace/tests/org.eclipse.acceleo.traceability.tests/src/org/eclipse/acceleo/traceability/tests/unit/random/AcceleoTraceabilityRandomTests.java:237:9: Variable access definition in wrong order.
/jobs/genie.modeling.acceleo/acceleo-master-gerrit/workspace/tests/org.eclipse.acceleo.traceability.tests/src/org/eclipse/acceleo/traceability/tests/unit/random/AcceleoTraceabilityRandomTests.java:237:62: Variable 'matches' must be private and have accessor methods.
/jobs/genie.modeling.acceleo/acceleo-master-gerrit/workspace/tests/org.eclipse.acceleo.traceability.tests/src/org/eclipse/acceleo/traceability/tests/unit/random/AcceleoTraceabilityRandomTests.java:238:9: Missing a Javadoc comment.
/jobs/genie.modeling.acceleo/acceleo-master-gerrit/workspace/tests/org.eclipse.acceleo.traceability.tests/src/org/eclipse/acceleo/traceability/tests/unit/random/AcceleoTraceabilityRandomTests.java:238:9: Static variable definition in wrong order.
/jobs/genie.modeling.acceleo/acceleo-master-gerrit/workspace/tests/org.eclipse.acceleo.traceability.tests/src/org/eclipse/acceleo/traceability/tests/unit/random/AcceleoTraceabilityRandomTests.java:238:9: Variable access definition in wrong order.
/jobs/genie.modeling.acceleo/acceleo-master-gerrit/workspace/tests/org.eclipse.acceleo.traceability.tests/src/org/eclipse/acceleo/traceability/tests/unit/random/AcceleoTraceabilityRandomTests.java:238:62: Variable 'startsWith' must be private and have accessor methods.
/jobs/genie.modeling.acceleo/acceleo-master-gerrit/workspace/tests/org.eclipse.acceleo.traceability.tests/src/org/eclipse/acceleo/traceability/tests/unit/random/AcceleoTraceabilityRandomTests.java:239:9: Missing a Javadoc comment.
/jobs/genie.modeling.acceleo/acceleo-master-gerrit/workspace/tests/org.eclipse.acceleo.traceability.tests/src/org/eclipse/acceleo/traceability/tests/unit/random/AcceleoTraceabilityRandomTests.java:239:9: Static variable definition in wrong order.
/jobs/genie.modeling.acceleo/acceleo-master-gerrit/workspace/tests/org.eclipse.acceleo.traceability.tests/src/org/eclipse/acceleo/traceability/tests/unit/random/AcceleoTraceabilityRandomTests.java:239:9: Variable access definition in wrong order.
/jobs/genie.modeling.acceleo/acceleo-master-gerrit/workspace/tests/org.eclipse.acceleo.traceability.tests/src/org/eclipse/acceleo/traceability/tests/unit/random/AcceleoTraceabilityRandomTests.java:239:62: Variable 'tokenize' must be private and have accessor methods.
/jobs/genie.modeling.acceleo/acceleo-master-gerrit/workspace/tests/org.eclipse.acceleo.traceability.tests/src/org/eclipse/acceleo/traceability/tests/unit/random/AcceleoTraceabilityRandomTests.java:240:9: Missing a Javadoc comment.
/jobs/genie.modeling.acceleo/acceleo-master-gerrit/workspace/tests/org.eclipse.acceleo.traceability.tests/src/org/eclipse/acceleo/traceability/tests/unit/random/AcceleoTraceabilityRandomTests.java:240:9: Static variable definition in wrong order.
/jobs/genie.modeling.acceleo/acceleo-master-gerrit/workspace/tests/org.eclipse.acceleo.traceability.tests/src/org/eclipse/acceleo/traceability/tests/unit/random/AcceleoTraceabilityRandomTests.java:240:9: Variable access definition in wrong order.
/jobs/genie.modeling.acceleo/acceleo-master-gerrit/workspace/tests/org.eclipse.acceleo.traceability.tests/src/org/eclipse/acceleo/traceability/tests/unit/random/AcceleoTraceabilityRandomTests.java:240:62: Variable 'concat' must be private and have accessor methods.
/jobs/genie.modeling.acceleo/acceleo-master-gerrit/workspace/tests/org.eclipse.acceleo.traceability.tests/src/org/eclipse/acceleo/traceability/tests/unit/random/AcceleoTraceabilityRandomTests.java:242:9: Missing a Javadoc comment.
/jobs/genie.modeling.acceleo/acceleo-master-gerrit/workspace/tests/org.eclipse.acceleo.traceability.tests/src/org/eclipse/acceleo/traceability/tests/unit/random/AcceleoTraceabilityRandomTests.java:242:9: Static variable definition in wrong order.
/jobs/genie.modeling.acceleo/acceleo-master-gerrit/workspace/tests/org.eclipse.acceleo.traceability.tests/src/org/eclipse/acceleo/traceability/tests/unit/random/AcceleoTraceabilityRandomTests.java:242:9: Variable access definition in wrong order.
/jobs/genie.modeling.acceleo/acceleo-master-gerrit/workspace/tests/org.eclipse.acceleo.traceability.tests/src/org/eclipse/acceleo/traceability/tests/unit/random/AcceleoTraceabilityRandomTests.java:242:59: Variable 'first' must be private and have accessor methods.
/jobs/genie.modeling.acceleo/acceleo-master-gerrit/workspace/tests/org.eclipse.acceleo.traceability.tests/src/org/eclipse/acceleo/traceability/tests/unit/random/AcceleoTraceabilityRandomTests.java:243:9: Missing a Javadoc comment.
/jobs/genie.modeling.acceleo/acceleo-master-gerrit/workspace/tests/org.eclipse.acceleo.traceability.tests/src/org/eclipse/acceleo/traceability/tests/unit/random/AcceleoTraceabilityRandomTests.java:243:9: Static variable definition in wrong order.
/jobs/genie.modeling.acceleo/acceleo-master-gerrit/workspace/tests/org.eclipse.acceleo.traceability.tests/src/org/eclipse/acceleo/traceability/tests/unit/random/AcceleoTraceabilityRandomTests.java:243:9: Variable access definition in wrong order.
/jobs/genie.modeling.acceleo/acceleo-master-gerrit/workspace/tests/org.eclipse.acceleo.traceability.tests/src/org/eclipse/acceleo/traceability/tests/unit/random/AcceleoTraceabilityRandomTests.java:243:59: Variable 'last' must be private and have accessor methods.
/jobs/genie.modeling.acceleo/acceleo-master-gerrit/workspace/tests/org.eclipse.acceleo.traceability.tests/src/org/eclipse/acceleo/traceability/tests/unit/random/AcceleoTraceabilityRandomTests.java:244:9: Missing a Javadoc comment.
/jobs/genie.modeling.acceleo/acceleo-master-gerrit/workspace/tests/org.eclipse.acceleo.traceability.tests/src/org/eclipse/acceleo/traceability/tests/unit/random/AcceleoTraceabilityRandomTests.java:244:9: Static variable definition in wrong order.
/jobs/genie.modeling.acceleo/acceleo-master-gerrit/workspace/tests/org.eclipse.acceleo.traceability.tests/src/org/eclipse/acceleo/traceability/tests/unit/random/AcceleoTraceabilityRandomTests.java:244:9: Variable access definition in wrong order.
/jobs/genie.modeling.acceleo/acceleo-master-gerrit/workspace/tests/org.eclipse.acceleo.traceability.tests/src/org/eclipse/acceleo/traceability/tests/unit/random/AcceleoTraceabilityRandomTests.java:244:59: Variable 'substring' must be private and have accessor methods.
/jobs/genie.modeling.acceleo/acceleo-master-gerrit/workspace/tests/org.eclipse.acceleo.traceability.tests/src/org/eclipse/acceleo/traceability/tests/unit/random/AcceleoTraceabilityRandomTests.java:246:9: Missing a Javadoc comment.
/jobs/genie.modeling.acceleo/acceleo-master-gerrit/workspace/tests/org.eclipse.acceleo.traceability.tests/src/org/eclipse/acceleo/traceability/tests/unit/random/AcceleoTraceabilityRandomTests.java:246:9: Static variable definition in wrong order.
/jobs/genie.modeling.acceleo/acceleo-master-gerrit/workspace/tests/org.eclipse.acceleo.traceability.tests/src/org/eclipse/acceleo/traceability/tests/unit/random/AcceleoTraceabilityRandomTests.java:246:9: Variable access definition in wrong order.
/jobs/genie.modeling.acceleo/acceleo-master-gerrit/workspace/tests/org.eclipse.acceleo.traceability.tests/src/org/eclipse/acceleo/traceability/tests/unit/random/AcceleoTraceabilityRandomTests.java:246:68: Variable 'substitute' must be private and have accessor methods.
/jobs/genie.modeling.acceleo/acceleo-master-gerrit/workspace/tests/org.eclipse.acceleo.traceability.tests/src/org/eclipse/acceleo/traceability/tests/unit/random/AcceleoTraceabilityRandomTests.java:247:9: Missing a Javadoc comment.
/jobs/genie.modeling.acceleo/acceleo-master-gerrit/workspace/tests/org.eclipse.acceleo.traceability.tests/src/org/eclipse/acceleo/traceability/tests/unit/random/AcceleoTraceabilityRandomTests.java:247:9: Static variable definition in wrong order.
/jobs/genie.modeling.acceleo/acceleo-master-gerrit/workspace/tests/org.eclipse.acceleo.traceability.tests/src/org/eclipse/acceleo/traceability/tests/unit/random/AcceleoTraceabilityRandomTests.java:247:9: Variable access definition in wrong order.
/jobs/genie.modeling.acceleo/acceleo-master-gerrit/workspace/tests/org.eclipse.acceleo.traceability.tests/src/org/eclipse/acceleo/traceability/tests/unit/random/AcceleoTraceabilityRandomTests.java:247:68: Variable 'substituteAll' must be private and have accessor methods.
/jobs/genie.modeling.acceleo/acceleo-master-gerrit/workspace/tests/org.eclipse.acceleo.traceability.tests/src/org/eclipse/acceleo/traceability/tests/unit/random/AcceleoTraceabilityRandomTests.java:248:9: Missing a Javadoc comment.
/jobs/genie.modeling.acceleo/acceleo-master-gerrit/workspace/tests/org.eclipse.acceleo.traceability.tests/src/org/eclipse/acceleo/traceability/tests/unit/random/AcceleoTraceabilityRandomTests.java:248:9: Static variable definition in wrong order.
/jobs/genie.modeling.acceleo/acceleo-master-gerrit/workspace/tests/org.eclipse.acceleo.traceability.tests/src/org/eclipse/acceleo/traceability/tests/unit/random/AcceleoTraceabilityRandomTests.java:248:9: Variable access definition in wrong order.
/jobs/genie.modeling.acceleo/acceleo-master-gerrit/workspace/tests/org.eclipse.acceleo.traceability.tests/src/org/eclipse/acceleo/traceability/tests/unit/random/AcceleoTraceabilityRandomTests.java:248:68: Variable 'replace' must be private and have accessor methods.
/jobs/genie.modeling.acceleo/acceleo-master-gerrit/workspace/tests/org.eclipse.acceleo.traceability.tests/src/org/eclipse/acceleo/traceability/tests/unit/random/AcceleoTraceabilityRandomTests.java:249:9: Missing a Javadoc comment.
/jobs/genie.modeling.acceleo/acceleo-master-gerrit/workspace/tests/org.eclipse.acceleo.traceability.tests/src/org/eclipse/acceleo/traceability/tests/unit/random/AcceleoTraceabilityRandomTests.java:249:9: Static variable definition in wrong order.
/jobs/genie.modeling.acceleo/acceleo-master-gerrit/workspace/tests/org.eclipse.acceleo.traceability.tests/src/org/eclipse/acceleo/traceability/tests/unit/random/AcceleoTraceabilityRandomTests.java:249:9: Variable access definition in wrong order.
/jobs/genie.modeling.acceleo/acceleo-master-gerrit/workspace/tests/org.eclipse.acceleo.traceability.tests/src/org/eclipse/acceleo/traceability/tests/unit/random/AcceleoTraceabilityRandomTests.java:249:68: Variable 'replaceAll' must be private and have accessor methods.
/jobs/genie.modeling.acceleo/acceleo-master-gerrit/workspace/tests/org.eclipse.acceleo.traceability.tests/src/org/eclipse/acceleo/traceability/tests/unit/random/AcceleoTraceabilityRandomTests.java:251:9: Missing a Javadoc comment.
/jobs/genie.modeling.acceleo/acceleo-master-gerrit/workspace/tests/org.eclipse.acceleo.traceability.tests/src/org/eclipse/acceleo/traceability/tests/unit/random/AcceleoTraceabilityRandomTests.java:251:9: Static variable definition in wrong order.
/jobs/genie.modeling.acceleo/acceleo-master-gerrit/workspace/tests/org.eclipse.acceleo.traceability.tests/src/org/eclipse/acceleo/traceability/tests/unit/random/AcceleoTraceabilityRandomTests.java:251:9: Variable access definition in wrong order.
/jobs/genie.modeling.acceleo/acceleo-master-gerrit/workspace/tests/org.eclipse.acceleo.traceability.tests/src/org/eclipse/acceleo/traceability/tests/unit/random/AcceleoTraceabilityRandomTests.java:251:65: Variable 'strtok' must be private and have accessor methods.
/jobs/genie.modeling.acceleo/acceleo-master-gerrit/workspace/tests/org.eclipse.acceleo.traceability.tests/src/org/eclipse/acceleo/traceability/tests/unit/random/AcceleoTraceabilityRandomTests.java:253:9: Missing a Javadoc comment.
/jobs/genie.modeling.acceleo/acceleo-master-gerrit/workspace/tests/org.eclipse.acceleo.traceability.tests/src/org/eclipse/acceleo/traceability/tests/unit/random/AcceleoTraceabilityRandomTests.java:253:9: Static variable definition in wrong order.
/jobs/genie.modeling.acceleo/acceleo-master-gerrit/workspace/tests/org.eclipse.acceleo.traceability.tests/src/org/eclipse/acceleo/traceability/tests/unit/random/AcceleoTraceabilityRandomTests.java:253:9: Variable access definition in wrong order.
/jobs/genie.modeling.acceleo/acceleo-master-gerrit/workspace/tests/org.eclipse.acceleo.traceability.tests/src/org/eclipse/acceleo/traceability/tests/unit/random/AcceleoTraceabilityRandomTests.java:253:62: Variable 'substringOcl' must be private and have accessor methods.
/jobs/genie.modeling.acceleo/acceleo-master-gerrit/workspace/tests/org.eclipse.acceleo.traceability.tests/src/org/eclipse/acceleo/traceability/tests/unit/random/AcceleoTraceabilityRandomTests.java:255: First sentence should end with a period.
/jobs/genie.modeling.acceleo/acceleo-master-gerrit/workspace/tests/org.eclipse.acceleo.traceability.tests/src/org/eclipse/acceleo/traceability/tests/unit/random/AcceleoTraceabilityRandomTests.java:262:44: Expected @param tag for 'source'.
/jobs/genie.modeling.acceleo/acceleo-master-gerrit/workspace/tests/org.eclipse.acceleo.traceability.tests/src/org/eclipse/acceleo/traceability/tests/unit/random/AcceleoTraceabilityRandomTests.java:266:9: Missing a Javadoc comment.
/jobs/genie.modeling.acceleo/acceleo-master-gerrit/workspace/tests/org.eclipse.acceleo.traceability.tests/src/org/eclipse/acceleo/traceability/tests/unit/random/AcceleoTraceabilityRandomTests.java:271:9: Missing a Javadoc comment.
/jobs/genie.modeling.acceleo/acceleo-master-gerrit/workspace/tests/org.eclipse.acceleo.traceability.tests/src/org/eclipse/acceleo/traceability/tests/unit/random/AcceleoTraceabilityRandomTests.java:276:9: Missing a Javadoc comment.
/jobs/genie.modeling.acceleo/acceleo-master-gerrit/workspace/tests/org.eclipse.acceleo.traceability.tests/src/org/eclipse/acceleo/traceability/tests/unit/random/AcceleoTraceabilityRandomTests.java:281:9: Missing a Javadoc comment.
/jobs/genie.modeling.acceleo/acceleo-master-gerrit/workspace/tests/org.eclipse.acceleo.traceability.tests/src/org/eclipse/acceleo/traceability/tests/unit/random/AcceleoTraceabilityRandomTests.java:286:9: Missing a Javadoc comment.
/jobs/genie.modeling.acceleo/acceleo-master-gerrit/workspace/tests/org.eclipse.acceleo.traceability.tests/src/org/eclipse/acceleo/traceability/tests/unit/random/AcceleoTraceabilityRandomTests.java:291:9: Missing a Javadoc comment.
/jobs/genie.modeling.acceleo/acceleo-master-gerrit/workspace/tests/org.eclipse.acceleo.traceability.tests/src/org/eclipse/acceleo/traceability/tests/unit/random/AcceleoTraceabilityRandomTests.java:296:9: Missing a Javadoc comment.
/jobs/genie.modeling.acceleo/acceleo-master-gerrit/workspace/tests/org.eclipse.acceleo.traceability.tests/src/org/eclipse/acceleo/traceability/tests/unit/random/AcceleoTraceabilityRandomTests.java:301:9: Missing a Javadoc comment.
/jobs/genie.modeling.acceleo/acceleo-master-gerrit/workspace/tests/org.eclipse.acceleo.traceability.tests/src/org/eclipse/acceleo/traceability/tests/unit/random/AcceleoTraceabilityRandomTests.java:306:9: Missing a Javadoc comment.
/jobs/genie.modeling.acceleo/acceleo-master-gerrit/workspace/tests/org.eclipse.acceleo.traceability.tests/src/org/eclipse/acceleo/traceability/tests/unit/random/AcceleoTraceabilityRandomTests.java:311:9: Missing a Javadoc comment.
/jobs/genie.modeling.acceleo/acceleo-master-gerrit/workspace/tests/org.eclipse.acceleo.traceability.tests/src/org/eclipse/acceleo/traceability/tests/unit/random/AcceleoTraceabilityRandomTests.java:316:9: Missing a Javadoc comment.
/jobs/genie.modeling.acceleo/acceleo-master-gerrit/workspace/tests/org.eclipse.acceleo.traceability.tests/src/org/eclipse/acceleo/traceability/tests/unit/random/AcceleoTraceabilityRandomTests.java:321:9: Missing a Javadoc comment.
/jobs/genie.modeling.acceleo/acceleo-master-gerrit/workspace/tests/org.eclipse.acceleo.traceability.tests/src/org/eclipse/acceleo/traceability/tests/unit/random/AcceleoTraceabilityRandomTests.java:326:9: Missing a Javadoc comment.
/jobs/genie.modeling.acceleo/acceleo-master-gerrit/workspace/tests/org.eclipse.acceleo.traceability.tests/src/org/eclipse/acceleo/traceability/tests/unit/random/AcceleoTraceabilityRandomTests.java:331:9: Missing a Javadoc comment.
/jobs/genie.modeling.acceleo/acceleo-master-gerrit/workspace/tests/org.eclipse.acceleo.traceability.tests/src/org/eclipse/acceleo/traceability/tests/unit/random/AcceleoTraceabilityRandomTests.java:336:9: Missing a Javadoc comment.
/jobs/genie.modeling.acceleo/acceleo-master-gerrit/workspace/tests/org.eclipse.acceleo.traceability.tests/src/org/eclipse/acceleo/traceability/tests/unit/random/AcceleoTraceabilityRandomTests.java:341:9: Missing a Javadoc comment.
/jobs/genie.modeling.acceleo/acceleo-master-gerrit/workspace/tests/org.eclipse.acceleo.traceability.tests/src/org/eclipse/acceleo/traceability/tests/unit/random/AcceleoTraceabilityRandomTests.java:346:9: Missing a Javadoc comment.
/jobs/genie.modeling.acceleo/acceleo-master-gerrit/workspace/tests/org.eclipse.acceleo.traceability.tests/src/org/eclipse/acceleo/traceability/tests/unit/random/AcceleoTraceabilityRandomTests.java:351:9: Missing a Javadoc comment.
/jobs/genie.modeling.acceleo/acceleo-master-gerrit/workspace/tests/org.eclipse.acceleo.traceability.tests/src/org/eclipse/acceleo/traceability/tests/unit/random/AcceleoTraceabilityRandomTests.java:356:9: Missing a Javadoc comment.
/jobs/genie.modeling.acceleo/acceleo-master-gerrit/workspace/tests/org.eclipse.acceleo.traceability.tests/src/org/eclipse/acceleo/traceability/tests/unit/random/AcceleoTraceabilityRandomTests.java:361:9: Missing a Javadoc comment.
/jobs/genie.modeling.acceleo/acceleo-master-gerrit/workspace/tests/org.eclipse.acceleo.traceability.tests/src/org/eclipse/acceleo/traceability/tests/unit/random/AcceleoTraceabilityRandomTests.java:366:9: Missing a Javadoc comment.
/jobs/genie.modeling.acceleo/acceleo-master-gerrit/workspace/tests/org.eclipse.acceleo.traceability.tests/src/org/eclipse/acceleo/traceability/tests/unit/random/AcceleoTraceabilityRandomTests.java:371:9: Missing a Javadoc comment.
/jobs/genie.modeling.acceleo/acceleo-master-gerrit/workspace/tests/org.eclipse.acceleo.traceability.tests/src/org/eclipse/acceleo/traceability/tests/unit/random/AcceleoTraceabilityRandomTests.java:376:9: Missing a Javadoc comment.
/jobs/genie.modeling.acceleo/acceleo-master-gerrit/workspace/tests/org.eclipse.acceleo.traceability.tests/src/org/eclipse/acceleo/traceability/tests/unit/random/AcceleoTraceabilityRandomTests.java:381:9: Missing a Javadoc comment.
/jobs/genie.modeling.acceleo/acceleo-master-gerrit/workspace/tests/org.eclipse.acceleo.traceability.tests/src/org/eclipse/acceleo/traceability/tests/unit/random/AcceleoTraceabilityRandomTests.java:387: First sentence should end with a period.
/jobs/genie.modeling.acceleo/acceleo-master-gerrit/workspace/tests/org.eclipse.acceleo.traceability.tests/src/org/eclipse/acceleo/traceability/tests/unit/random/AcceleoTraceabilityRandomTests.java:393:9: Static variable definition in wrong order.
/jobs/genie.modeling.acceleo/acceleo-master-gerrit/workspace/tests/org.eclipse.acceleo.traceability.tests/src/org/eclipse/acceleo/traceability/tests/unit/random/AcceleoTraceabilityRandomTests.java:393:9: Variable access definition in wrong order.
/jobs/genie.modeling.acceleo/acceleo-master-gerrit/workspace/tests/org.eclipse.acceleo.traceability.tests/src/org/eclipse/acceleo/traceability/tests/unit/random/AcceleoTraceabilityRandomTests.java:393:62: Variable 'asBag' must be private and have accessor methods.
/jobs/genie.modeling.acceleo/acceleo-master-gerrit/workspace/tests/org.eclipse.acceleo.traceability.tests/src/org/eclipse/acceleo/traceability/tests/unit/random/AcceleoTraceabilityRandomTests.java:394:9: Missing a Javadoc comment.
/jobs/genie.modeling.acceleo/acceleo-master-gerrit/workspace/tests/org.eclipse.acceleo.traceability.tests/src/org/eclipse/acceleo/traceability/tests/unit/random/AcceleoTraceabilityRandomTests.java:394:9: Static variable definition in wrong order.
/jobs/genie.modeling.acceleo/acceleo-master-gerrit/workspace/tests/org.eclipse.acceleo.traceability.tests/src/org/eclipse/acceleo/traceability/tests/unit/random/AcceleoTraceabilityRandomTests.java:394:9: Variable access definition in wrong order.
/jobs/genie.modeling.acceleo/acceleo-master-gerrit/workspace/tests/org.eclipse.acceleo.traceability.tests/src/org/eclipse/acceleo/traceability/tests/unit/random/AcceleoTraceabilityRandomTests.java:394:62: Variable 'asSet' must be private and have accessor methods.
/jobs/genie.modeling.acceleo/acceleo-master-gerrit/workspace/tests/org.eclipse.acceleo.traceability.tests/src/org/eclipse/acceleo/traceability/tests/unit/random/AcceleoTraceabilityRandomTests.java:395:9: Missing a Javadoc comment.
/jobs/genie.modeling.acceleo/acceleo-master-gerrit/workspace/tests/org.eclipse.acceleo.traceability.tests/src/org/eclipse/acceleo/traceability/tests/unit/random/AcceleoTraceabilityRandomTests.java:395:9: Static variable definition in wrong order.
/jobs/genie.modeling.acceleo/acceleo-master-gerrit/workspace/tests/org.eclipse.acceleo.traceability.tests/src/org/eclipse/acceleo/traceability/tests/unit/random/AcceleoTraceabilityRandomTests.java:395:9: Variable access definition in wrong order.
/jobs/genie.modeling.acceleo/acceleo-master-gerrit/workspace/tests/org.eclipse.acceleo.traceability.tests/src/org/eclipse/acceleo/traceability/tests/unit/random/AcceleoTraceabilityRandomTests.java:395:62: Variable 'asOrderedSet' must be private and have accessor methods.
/jobs/genie.modeling.acceleo/acceleo-master-gerrit/workspace/tests/org.eclipse.acceleo.traceability.tests/src/org/eclipse/acceleo/traceability/tests/unit/random/AcceleoTraceabilityRandomTests.java:396:9: Missing a Javadoc comment.
/jobs/genie.modeling.acceleo/acceleo-master-gerrit/workspace/tests/org.eclipse.acceleo.traceability.tests/src/org/eclipse/acceleo/traceability/tests/unit/random/AcceleoTraceabilityRandomTests.java:396:9: Static variable definition in wrong order.
/jobs/genie.modeling.acceleo/acceleo-master-gerrit/workspace/tests/org.eclipse.acceleo.traceability.tests/src/org/eclipse/acceleo/traceability/tests/unit/random/AcceleoTraceabilityRandomTests.java:396:9: Variable access definition in wrong order.
/jobs/genie.modeling.acceleo/acceleo-master-gerrit/workspace/tests/org.eclipse.acceleo.traceability.tests/src/org/eclipse/acceleo/traceability/tests/unit/random/AcceleoTraceabilityRandomTests.java:396:62: Variable 'asSequence' must be private and have accessor methods.
/jobs/genie.modeling.acceleo/acceleo-master-gerrit/workspace/tests/org.eclipse.acceleo.traceability.tests/src/org/eclipse/acceleo/traceability/tests/unit/random/AcceleoTraceabilityRandomTests.java:397:9: Missing a Javadoc comment.
/jobs/genie.modeling.acceleo/acceleo-master-gerrit/workspace/tests/org.eclipse.acceleo.traceability.tests/src/org/eclipse/acceleo/traceability/tests/unit/random/AcceleoTraceabilityRandomTests.java:397:9: Static variable definition in wrong order.
/jobs/genie.modeling.acceleo/acceleo-master-gerrit/workspace/tests/org.eclipse.acceleo.traceability.tests/src/org/eclipse/acceleo/traceability/tests/unit/random/AcceleoTraceabilityRandomTests.java:397:9: Variable access definition in wrong order.
/jobs/genie.modeling.acceleo/acceleo-master-gerrit/workspace/tests/org.eclipse.acceleo.traceability.tests/src/org/eclipse/acceleo/traceability/tests/unit/random/AcceleoTraceabilityRandomTests.java:397:62: Variable 'flatten' must be private and have accessor methods.
/jobs/genie.modeling.acceleo/acceleo-master-gerrit/workspace/tests/org.eclipse.acceleo.traceability.tests/src/org/eclipse/acceleo/traceability/tests/unit/random/AcceleoTraceabilityRandomTests.java:398:9: Missing a Javadoc comment.
/jobs/genie.modeling.acceleo/acceleo-master-gerrit/workspace/tests/org.eclipse.acceleo.traceability.tests/src/org/eclipse/acceleo/traceability/tests/unit/random/AcceleoTraceabilityRandomTests.java:398:9: Static variable definition in wrong order.
/jobs/genie.modeling.acceleo/acceleo-master-gerrit/workspace/tests/org.eclipse.acceleo.traceability.tests/src/org/eclipse/acceleo/traceability/tests/unit/random/AcceleoTraceabilityRandomTests.java:398:9: Variable access definition in wrong order.
/jobs/genie.modeling.acceleo/acceleo-master-gerrit/workspace/tests/org.eclipse.acceleo.traceability.tests/src/org/eclipse/acceleo/traceability/tests/unit/random/AcceleoTraceabilityRandomTests.java:398:62: Variable 'isEmpty' must be private and have accessor methods.
/jobs/genie.modeling.acceleo/acceleo-master-gerrit/workspace/tests/org.eclipse.acceleo.traceability.tests/src/org/eclipse/acceleo/traceability/tests/unit/random/AcceleoTraceabilityRandomTests.java:399:9: Missing a Javadoc comment.
/jobs/genie.modeling.acceleo/acceleo-master-gerrit/workspace/tests/org.eclipse.acceleo.traceability.tests/src/org/eclipse/acceleo/traceability/tests/unit/random/AcceleoTraceabilityRandomTests.java:399:9: Static variable definition in wrong order.
/jobs/genie.modeling.acceleo/acceleo-master-gerrit/workspace/tests/org.eclipse.acceleo.traceability.tests/src/org/eclipse/acceleo/traceability/tests/unit/random/AcceleoTraceabilityRandomTests.java:399:9: Variable access definition in wrong order.
/jobs/genie.modeling.acceleo/acceleo-master-gerrit/workspace/tests/org.eclipse.acceleo.traceability.tests/src/org/eclipse/acceleo/traceability/tests/unit/random/AcceleoTraceabilityRandomTests.java:399:62: Variable 'notEmpty' must be private and have accessor methods.
/jobs/genie.modeling.acceleo/acceleo-master-gerrit/workspace/tests/org.eclipse.acceleo.traceability.tests/src/org/eclipse/acceleo/traceability/tests/unit/random/AcceleoTraceabilityRandomTests.java:400:9: Missing a Javadoc comment.
/jobs/genie.modeling.acceleo/acceleo-master-gerrit/workspace/tests/org.eclipse.acceleo.traceability.tests/src/org/eclipse/acceleo/traceability/tests/unit/random/AcceleoTraceabilityRandomTests.java:400:9: Static variable definition in wrong order.
/jobs/genie.modeling.acceleo/acceleo-master-gerrit/workspace/tests/org.eclipse.acceleo.traceability.tests/src/org/eclipse/acceleo/traceability/tests/unit/random/AcceleoTraceabilityRandomTests.java:400:9: Variable access definition in wrong order.
/jobs/genie.modeling.acceleo/acceleo-master-gerrit/workspace/tests/org.eclipse.acceleo.traceability.tests/src/org/eclipse/acceleo/traceability/tests/unit/random/AcceleoTraceabilityRandomTests.java:400:62: Variable 'sizeCollection' must be private and have accessor methods.
/jobs/genie.modeling.acceleo/acceleo-master-gerrit/workspace/tests/org.eclipse.acceleo.traceability.tests/src/org/eclipse/acceleo/traceability/tests/unit/random/AcceleoTraceabilityRandomTests.java:401:9: Missing a Javadoc comment.
/jobs/genie.modeling.acceleo/acceleo-master-gerrit/workspace/tests/org.eclipse.acceleo.traceability.tests/src/org/eclipse/acceleo/traceability/tests/unit/random/AcceleoTraceabilityRandomTests.java:401:9: Static variable definition in wrong order.
/jobs/genie.modeling.acceleo/acceleo-master-gerrit/workspace/tests/org.eclipse.acceleo.traceability.tests/src/org/eclipse/acceleo/traceability/tests/unit/random/AcceleoTraceabilityRandomTests.java:401:9: Variable access definition in wrong order.
/jobs/genie.modeling.acceleo/acceleo-master-gerrit/workspace/tests/org.eclipse.acceleo.traceability.tests/src/org/eclipse/acceleo/traceability/tests/unit/random/AcceleoTraceabilityRandomTests.java:401:62: Variable 'sum' must be private and have accessor methods.
/jobs/genie.modeling.acceleo/acceleo-master-gerrit/workspace/tests/org.eclipse.acceleo.traceability.tests/src/org/eclipse/acceleo/traceability/tests/unit/random/AcceleoTraceabilityRandomTests.java:403:9: Missing a Javadoc comment.
/jobs/genie.modeling.acceleo/acceleo-master-gerrit/workspace/tests/org.eclipse.acceleo.traceability.tests/src/org/eclipse/acceleo/traceability/tests/unit/random/AcceleoTraceabilityRandomTests.java:403:9: Static variable definition in wrong order.
/jobs/genie.modeling.acceleo/acceleo-master-gerrit/workspace/tests/org.eclipse.acceleo.traceability.tests/src/org/eclipse/acceleo/traceability/tests/unit/random/AcceleoTraceabilityRandomTests.java:403:9: Variable access definition in wrong order.
/jobs/genie.modeling.acceleo/acceleo-master-gerrit/workspace/tests/org.eclipse.acceleo.traceability.tests/src/org/eclipse/acceleo/traceability/tests/unit/random/AcceleoTraceabilityRandomTests.java:403:66: Variable 'count' must be private and have accessor methods.
/jobs/genie.modeling.acceleo/acceleo-master-gerrit/workspace/tests/org.eclipse.acceleo.traceability.tests/src/org/eclipse/acceleo/traceability/tests/unit/random/AcceleoTraceabilityRandomTests.java:404:9: Missing a Javadoc comment.
/jobs/genie.modeling.acceleo/acceleo-master-gerrit/workspace/tests/org.eclipse.acceleo.traceability.tests/src/org/eclipse/acceleo/traceability/tests/unit/random/AcceleoTraceabilityRandomTests.java:404:9: Static variable definition in wrong order.
/jobs/genie.modeling.acceleo/acceleo-master-gerrit/workspace/tests/org.eclipse.acceleo.traceability.tests/src/org/eclipse/acceleo/traceability/tests/unit/random/AcceleoTraceabilityRandomTests.java:404:9: Variable access definition in wrong order.
/jobs/genie.modeling.acceleo/acceleo-master-gerrit/workspace/tests/org.eclipse.acceleo.traceability.tests/src/org/eclipse/acceleo/traceability/tests/unit/random/AcceleoTraceabilityRandomTests.java:404:66: Variable 'excludes' must be private and have accessor methods.
/jobs/genie.modeling.acceleo/acceleo-master-gerrit/workspace/tests/org.eclipse.acceleo.traceability.tests/src/org/eclipse/acceleo/traceability/tests/unit/random/AcceleoTraceabilityRandomTests.java:405:9: Missing a Javadoc comment.
/jobs/genie.modeling.acceleo/acceleo-master-gerrit/workspace/tests/org.eclipse.acceleo.traceability.tests/src/org/eclipse/acceleo/traceability/tests/unit/random/AcceleoTraceabilityRandomTests.java:405:9: Static variable definition in wrong order.
/jobs/genie.modeling.acceleo/acceleo-master-gerrit/workspace/tests/org.eclipse.acceleo.traceability.tests/src/org/eclipse/acceleo/traceability/tests/unit/random/AcceleoTraceabilityRandomTests.java:405:9: Variable access definition in wrong order.
/jobs/genie.modeling.acceleo/acceleo-master-gerrit/workspace/tests/org.eclipse.acceleo.traceability.tests/src/org/eclipse/acceleo/traceability/tests/unit/random/AcceleoTraceabilityRandomTests.java:405:66: Variable 'excluding' must be private and have accessor methods.
/jobs/genie.modeling.acceleo/acceleo-master-gerrit/workspace/tests/org.eclipse.acceleo.traceability.tests/src/org/eclipse/acceleo/traceability/tests/unit/random/AcceleoTraceabilityRandomTests.java:406:9: Missing a Javadoc comment.
/jobs/genie.modeling.acceleo/acceleo-master-gerrit/workspace/tests/org.eclipse.acceleo.traceability.tests/src/org/eclipse/acceleo/traceability/tests/unit/random/AcceleoTraceabilityRandomTests.java:406:9: Static variable definition in wrong order.
/jobs/genie.modeling.acceleo/acceleo-master-gerrit/workspace/tests/org.eclipse.acceleo.traceability.tests/src/org/eclipse/acceleo/traceability/tests/unit/random/AcceleoTraceabilityRandomTests.java:406:9: Variable access definition in wrong order.
/jobs/genie.modeling.acceleo/acceleo-master-gerrit/workspace/tests/org.eclipse.acceleo.traceability.tests/src/org/eclipse/acceleo/traceability/tests/unit/random/AcceleoTraceabilityRandomTests.java:406:66: Variable 'includes' must be private and have accessor methods.
/jobs/genie.modeling.acceleo/acceleo-master-gerrit/workspace/tests/org.eclipse.acceleo.traceability.tests/src/org/eclipse/acceleo/traceability/tests/unit/random/AcceleoTraceabilityRandomTests.java:407:9: Missing a Javadoc comment.
/jobs/genie.modeling.acceleo/acceleo-master-gerrit/workspace/tests/org.eclipse.acceleo.traceability.tests/src/org/eclipse/acceleo/traceability/tests/unit/random/AcceleoTraceabilityRandomTests.java:407:9: Static variable definition in wrong order.
/jobs/genie.modeling.acceleo/acceleo-master-gerrit/workspace/tests/org.eclipse.acceleo.traceability.tests/src/org/eclipse/acceleo/traceability/tests/unit/random/AcceleoTraceabilityRandomTests.java:407:9: Variable access definition in wrong order.
/jobs/genie.modeling.acceleo/acceleo-master-gerrit/workspace/tests/org.eclipse.acceleo.traceability.tests/src/org/eclipse/acceleo/traceability/tests/unit/random/AcceleoTraceabilityRandomTests.java:407:66: Variable 'including' must be private and have accessor methods.
/jobs/genie.modeling.acceleo/acceleo-master-gerrit/workspace/tests/org.eclipse.acceleo.traceability.tests/src/org/eclipse/acceleo/traceability/tests/unit/random/AcceleoTraceabilityRandomTests.java:409:9: Missing a Javadoc comment.
/jobs/genie.modeling.acceleo/acceleo-master-gerrit/workspace/tests/org.eclipse.acceleo.traceability.tests/src/org/eclipse/acceleo/traceability/tests/unit/random/AcceleoTraceabilityRandomTests.java:409:9: Static variable definition in wrong order.
/jobs/genie.modeling.acceleo/acceleo-master-gerrit/workspace/tests/org.eclipse.acceleo.traceability.tests/src/org/eclipse/acceleo/traceability/tests/unit/random/AcceleoTraceabilityRandomTests.java:409:9: Variable access definition in wrong order.
/jobs/genie.modeling.acceleo/acceleo-master-gerrit/workspace/tests/org.eclipse.acceleo.traceability.tests/src/org/eclipse/acceleo/traceability/tests/unit/random/AcceleoTraceabilityRandomTests.java:409:66: Variable 'any' must be private and have accessor methods.
/jobs/genie.modeling.acceleo/acceleo-master-gerrit/workspace/tests/org.eclipse.acceleo.traceability.tests/src/org/eclipse/acceleo/traceability/tests/unit/random/AcceleoTraceabilityRandomTests.java:410:9: Missing a Javadoc comment.
/jobs/genie.modeling.acceleo/acceleo-master-gerrit/workspace/tests/org.eclipse.acceleo.traceability.tests/src/org/eclipse/acceleo/traceability/tests/unit/random/AcceleoTraceabilityRandomTests.java:410:9: Static variable definition in wrong order.
/jobs/genie.modeling.acceleo/acceleo-master-gerrit/workspace/tests/org.eclipse.acceleo.traceability.tests/src/org/eclipse/acceleo/traceability/tests/unit/random/AcceleoTraceabilityRandomTests.java:410:9: Variable access definition in wrong order.
/jobs/genie.modeling.acceleo/acceleo-master-gerrit/workspace/tests/org.eclipse.acceleo.traceability.tests/src/org/eclipse/acceleo/traceability/tests/unit/random/AcceleoTraceabilityRandomTests.java:410:66: Variable 'collect' must be private and have accessor methods.
/jobs/genie.modeling.acceleo/acceleo-master-gerrit/workspace/tests/org.eclipse.acceleo.traceability.tests/src/org/eclipse/acceleo/traceability/tests/unit/random/AcceleoTraceabilityRandomTests.java:411:9: Missing a Javadoc comment.
/jobs/genie.modeling.acceleo/acceleo-master-gerrit/workspace/tests/org.eclipse.acceleo.traceability.tests/src/org/eclipse/acceleo/traceability/tests/unit/random/AcceleoTraceabilityRandomTests.java:411:9: Static variable definition in wrong order.
/jobs/genie.modeling.acceleo/acceleo-master-gerrit/workspace/tests/org.eclipse.acceleo.traceability.tests/src/org/eclipse/acceleo/traceability/tests/unit/random/AcceleoTraceabilityRandomTests.java:411:9: Variable access definition in wrong order.
/jobs/genie.modeling.acceleo/acceleo-master-gerrit/workspace/tests/org.eclipse.acceleo.traceability.tests/src/org/eclipse/acceleo/traceability/tests/unit/random/AcceleoTraceabilityRandomTests.java:411:66: Variable 'forAll' must be private and have accessor methods.
/jobs/genie.modeling.acceleo/acceleo-master-gerrit/workspace/tests/org.eclipse.acceleo.traceability.tests/src/org/eclipse/acceleo/traceability/tests/unit/random/AcceleoTraceabilityRandomTests.java:412:9: Missing a Javadoc comment.
/jobs/genie.modeling.acceleo/acceleo-master-gerrit/workspace/tests/org.eclipse.acceleo.traceability.tests/src/org/eclipse/acceleo/traceability/tests/unit/random/AcceleoTraceabilityRandomTests.java:412:9: Static variable definition in wrong order.
/jobs/genie.modeling.acceleo/acceleo-master-gerrit/workspace/tests/org.eclipse.acceleo.traceability.tests/src/org/eclipse/acceleo/traceability/tests/unit/random/AcceleoTraceabilityRandomTests.java:412:9: Variable access definition in wrong order.
/jobs/genie.modeling.acceleo/acceleo-master-gerrit/workspace/tests/org.eclipse.acceleo.traceability.tests/src/org/eclipse/acceleo/traceability/tests/unit/random/AcceleoTraceabilityRandomTests.java:412:66: Variable 'isUnique' must be private and have accessor methods.
/jobs/genie.modeling.acceleo/acceleo-master-gerrit/workspace/tests/org.eclipse.acceleo.traceability.tests/src/org/eclipse/acceleo/traceability/tests/unit/random/AcceleoTraceabilityRandomTests.java:413:9: Missing a Javadoc comment.
/jobs/genie.modeling.acceleo/acceleo-master-gerrit/workspace/tests/org.eclipse.acceleo.traceability.tests/src/org/eclipse/acceleo/traceability/tests/unit/random/AcceleoTraceabilityRandomTests.java:413:9: Static variable definition in wrong order.
/jobs/genie.modeling.acceleo/acceleo-master-gerrit/workspace/tests/org.eclipse.acceleo.traceability.tests/src/org/eclipse/acceleo/traceability/tests/unit/random/AcceleoTraceabilityRandomTests.java:413:9: Variable access definition in wrong order.
/jobs/genie.modeling.acceleo/acceleo-master-gerrit/workspace/tests/org.eclipse.acceleo.traceability.tests/src/org/eclipse/acceleo/traceability/tests/unit/random/AcceleoTraceabilityRandomTests.java:413:66: Variable 'select' must be private and have accessor methods.
/jobs/genie.modeling.acceleo/acceleo-master-gerrit/workspace/tests/org.eclipse.acceleo.traceability.tests/src/org/eclipse/acceleo/traceability/tests/unit/random/AcceleoTraceabilityRandomTests.java:414:9: Missing a Javadoc comment.
/jobs/genie.modeling.acceleo/acceleo-master-gerrit/workspace/tests/org.eclipse.acceleo.traceability.tests/src/org/eclipse/acceleo/traceability/tests/unit/random/AcceleoTraceabilityRandomTests.java:414:9: Static variable definition in wrong order.
/jobs/genie.modeling.acceleo/acceleo-master-gerrit/workspace/tests/org.eclipse.acceleo.traceability.tests/src/org/eclipse/acceleo/traceability/tests/unit/random/AcceleoTraceabilityRandomTests.java:414:9: Variable access definition in wrong order.
/jobs/genie.modeling.acceleo/acceleo-master-gerrit/workspace/tests/org.eclipse.acceleo.traceability.tests/src/org/eclipse/acceleo/traceability/tests/unit/random/AcceleoTraceabilityRandomTests.java:414:66: Variable 'reject' must be private and have accessor methods.
/jobs/genie.modeling.acceleo/acceleo-master-gerrit/workspace/tests/org.eclipse.acceleo.traceability.tests/src/org/eclipse/acceleo/traceability/tests/unit/random/AcceleoTraceabilityRandomTests.java:415:9: Missing a Javadoc comment.
/jobs/genie.modeling.acceleo/acceleo-master-gerrit/workspace/tests/org.eclipse.acceleo.traceability.tests/src/org/eclipse/acceleo/traceability/tests/unit/random/AcceleoTraceabilityRandomTests.java:415:9: Static variable definition in wrong order.
/jobs/genie.modeling.acceleo/acceleo-master-gerrit/workspace/tests/org.eclipse.acceleo.traceability.tests/src/org/eclipse/acceleo/traceability/tests/unit/random/AcceleoTraceabilityRandomTests.java:415:9: Variable access definition in wrong order.
/jobs/genie.modeling.acceleo/acceleo-master-gerrit/workspace/tests/org.eclipse.acceleo.traceability.tests/src/org/eclipse/acceleo/traceability/tests/unit/random/AcceleoTraceabilityRandomTests.java:415:66: Variable 'sortedBy' must be private and have accessor methods.
/jobs/genie.modeling.acceleo/acceleo-master-gerrit/workspace/tests/org.eclipse.acceleo.traceability.tests/src/org/eclipse/acceleo/traceability/tests/unit/random/AcceleoTraceabilityRandomTests.java:417:9: Missing a Javadoc comment.
/jobs/genie.modeling.acceleo/acceleo-master-gerrit/workspace/tests/org.eclipse.acceleo.traceability.tests/src/org/eclipse/acceleo/traceability/tests/unit/random/AcceleoTraceabilityRandomTests.java:417:9: Static variable definition in wrong order.
/jobs/genie.modeling.acceleo/acceleo-master-gerrit/workspace/tests/org.eclipse.acceleo.traceability.tests/src/org/eclipse/acceleo/traceability/tests/unit/random/AcceleoTraceabilityRandomTests.java:417:9: Variable access definition in wrong order.
/jobs/genie.modeling.acceleo/acceleo-master-gerrit/workspace/tests/org.eclipse.acceleo.traceability.tests/src/org/eclipse/acceleo/traceability/tests/unit/random/AcceleoTraceabilityRandomTests.java:417:70: Variable 'excludesAll' must be private and have accessor methods.
/jobs/genie.modeling.acceleo/acceleo-master-gerrit/workspace/tests/org.eclipse.acceleo.traceability.tests/src/org/eclipse/acceleo/traceability/tests/unit/random/AcceleoTraceabilityRandomTests.java:418:9: Missing a Javadoc comment.
/jobs/genie.modeling.acceleo/acceleo-master-gerrit/workspace/tests/org.eclipse.acceleo.traceability.tests/src/org/eclipse/acceleo/traceability/tests/unit/random/AcceleoTraceabilityRandomTests.java:418:9: Static variable definition in wrong order.
/jobs/genie.modeling.acceleo/acceleo-master-gerrit/workspace/tests/org.eclipse.acceleo.traceability.tests/src/org/eclipse/acceleo/traceability/tests/unit/random/AcceleoTraceabilityRandomTests.java:418:9: Variable access definition in wrong order.
/jobs/genie.modeling.acceleo/acceleo-master-gerrit/workspace/tests/org.eclipse.acceleo.traceability.tests/src/org/eclipse/acceleo/traceability/tests/unit/random/AcceleoTraceabilityRandomTests.java:418:70: Variable 'includesAll' must be private and have accessor methods.
/jobs/genie.modeling.acceleo/acceleo-master-gerrit/workspace/tests/org.eclipse.acceleo.traceability.tests/src/org/eclipse/acceleo/traceability/tests/unit/random/AcceleoTraceabilityRandomTests.java:419:9: Missing a Javadoc comment.
/jobs/genie.modeling.acceleo/acceleo-master-gerrit/workspace/tests/org.eclipse.acceleo.traceability.tests/src/org/eclipse/acceleo/traceability/tests/unit/random/AcceleoTraceabilityRandomTests.java:419:9: Static variable definition in wrong order.
/jobs/genie.modeling.acceleo/acceleo-master-gerrit/workspace/tests/org.eclipse.acceleo.traceability.tests/src/org/eclipse/acceleo/traceability/tests/unit/random/AcceleoTraceabilityRandomTests.java:419:9: Variable access definition in wrong order.
/jobs/genie.modeling.acceleo/acceleo-master-gerrit/workspace/tests/org.eclipse.acceleo.traceability.tests/src/org/eclipse/acceleo/traceability/tests/unit/random/AcceleoTraceabilityRandomTests.java:419:70: Variable 'product' must be private and have accessor methods.
/jobs/genie.modeling.acceleo/acceleo-master-gerrit/workspace/tests/org.eclipse.acceleo.traceability.tests/src/org/eclipse/acceleo/traceability/tests/unit/random/AcceleoTraceabilityRandomTests.java:421: First sentence should end with a period.
/jobs/genie.modeling.acceleo/acceleo-master-gerrit/workspace/tests/org.eclipse.acceleo.traceability.tests/src/org/eclipse/acceleo/traceability/tests/unit/random/AcceleoTraceabilityRandomTests.java:428:46: Expected @param tag for 'source'.
/jobs/genie.modeling.acceleo/acceleo-master-gerrit/workspace/tests/org.eclipse.acceleo.traceability.tests/src/org/eclipse/acceleo/traceability/tests/unit/random/AcceleoTraceabilityRandomTests.java:432:9: Missing a Javadoc comment.
/jobs/genie.modeling.acceleo/acceleo-master-gerrit/workspace/tests/org.eclipse.acceleo.traceability.tests/src/org/eclipse/acceleo/traceability/tests/unit/random/AcceleoTraceabilityRandomTests.java:437:9: Missing a Javadoc comment.
/jobs/genie.modeling.acceleo/acceleo-master-gerrit/workspace/tests/org.eclipse.acceleo.traceability.tests/src/org/eclipse/acceleo/traceability/tests/unit/random/AcceleoTraceabilityRandomTests.java:442:9: Missing a Javadoc comment.
/jobs/genie.modeling.acceleo/acceleo-master-gerrit/workspace/tests/org.eclipse.acceleo.traceability.tests/src/org/eclipse/acceleo/traceability/tests/unit/random/AcceleoTraceabilityRandomTests.java:447:9: Missing a Javadoc comment.
/jobs/genie.modeling.acceleo/acceleo-master-gerrit/workspace/tests/org.eclipse.acceleo.traceability.tests/src/org/eclipse/acceleo/traceability/tests/unit/random/AcceleoTraceabilityRandomTests.java:452:9: Missing a Javadoc comment.
/jobs/genie.modeling.acceleo/acceleo-master-gerrit/workspace/tests/org.eclipse.acceleo.traceability.tests/src/org/eclipse/acceleo/traceability/tests/unit/random/AcceleoTraceabilityRandomTests.java:457:9: Missing a Javadoc comment.
/jobs/genie.modeling.acceleo/acceleo-master-gerrit/workspace/tests/org.eclipse.acceleo.traceability.tests/src/org/eclipse/acceleo/traceability/tests/unit/random/AcceleoTraceabilityRandomTests.java:462:9: Missing a Javadoc comment.
/jobs/genie.modeling.acceleo/acceleo-master-gerrit/workspace/tests/org.eclipse.acceleo.traceability.tests/src/org/eclipse/acceleo/traceability/tests/unit/random/AcceleoTraceabilityRandomTests.java:467:9: Missing a Javadoc comment.
/jobs/genie.modeling.acceleo/acceleo-master-gerrit/workspace/tests/org.eclipse.acceleo.traceability.tests/src/org/eclipse/acceleo/traceability/tests/unit/random/AcceleoTraceabilityRandomTests.java:472:9: Missing a Javadoc comment.
/jobs/genie.modeling.acceleo/acceleo-master-gerrit/workspace/tests/org.eclipse.acceleo.traceability.tests/src/org/eclipse/acceleo/traceability/tests/unit/random/AcceleoTraceabilityRandomTests.java:477:9: Missing a Javadoc comment.
/jobs/genie.modeling.acceleo/acceleo-master-gerrit/workspace/tests/org.eclipse.acceleo.traceability.tests/src/org/eclipse/acceleo/traceability/tests/unit/random/AcceleoTraceabilityRandomTests.java:482:9: Missing a Javadoc comment.
/jobs/genie.modeling.acceleo/acceleo-master-gerrit/workspace/tests/org.eclipse.acceleo.traceability.tests/src/org/eclipse/acceleo/traceability/tests/unit/random/AcceleoTraceabilityRandomTests.java:487:9: Missing a Javadoc comment.
/jobs/genie.modeling.acceleo/acceleo-master-gerrit/workspace/tests/org.eclipse.acceleo.traceability.tests/src/org/eclipse/acceleo/traceability/tests/unit/random/AcceleoTraceabilityRandomTests.java:492:9: Missing a Javadoc comment.
/jobs/genie.modeling.acceleo/acceleo-master-gerrit/workspace/tests/org.eclipse.acceleo.traceability.tests/src/org/eclipse/acceleo/traceability/tests/unit/random/AcceleoTraceabilityRandomTests.java:497:9: Missing a Javadoc comment.
/jobs/genie.modeling.acceleo/acceleo-master-gerrit/workspace/tests/org.eclipse.acceleo.traceability.tests/src/org/eclipse/acceleo/traceability/tests/unit/random/AcceleoTraceabilityRandomTests.java:502:9: Missing a Javadoc comment.
/jobs/genie.modeling.acceleo/acceleo-master-gerrit/workspace/tests/org.eclipse.acceleo.traceability.tests/src/org/eclipse/acceleo/traceability/tests/unit/random/AcceleoTraceabilityRandomTests.java:507:9: Missing a Javadoc comment.
/jobs/genie.modeling.acceleo/acceleo-master-gerrit/workspace/tests/org.eclipse.acceleo.traceability.tests/src/org/eclipse/acceleo/traceability/tests/unit/random/AcceleoTraceabilityRandomTests.java:512:9: Missing a Javadoc comment.
/jobs/genie.modeling.acceleo/acceleo-master-gerrit/workspace/tests/org.eclipse.acceleo.traceability.tests/src/org/eclipse/acceleo/traceability/tests/unit/random/AcceleoTraceabilityRandomTests.java:517:9: Missing a Javadoc comment.
/jobs/genie.modeling.acceleo/acceleo-master-gerrit/workspace/tests/org.eclipse.acceleo.traceability.tests/src/org/eclipse/acceleo/traceability/tests/unit/random/AcceleoTraceabilityRandomTests.java:522:9: Missing a Javadoc comment.
/jobs/genie.modeling.acceleo/acceleo-master-gerrit/workspace/tests/org.eclipse.acceleo.traceability.tests/src/org/eclipse/acceleo/traceability/tests/unit/random/AcceleoTraceabilityRandomTests.java:527:9: Missing a Javadoc comment.
/jobs/genie.modeling.acceleo/acceleo-master-gerrit/workspace/tests/org.eclipse.acceleo.traceability.tests/src/org/eclipse/acceleo/traceability/tests/unit/random/AcceleoTraceabilityRandomTests.java:532:9: Missing a Javadoc comment.
/jobs/genie.modeling.acceleo/acceleo-master-gerrit/workspace/tests/org.eclipse.acceleo.traceability.tests/src/org/eclipse/acceleo/traceability/tests/unit/random/AcceleoTraceabilityRandomTests.java:537:9: Missing a Javadoc comment.
/jobs/genie.modeling.acceleo/acceleo-master-gerrit/workspace/tests/org.eclipse.acceleo.traceability.tests/src/org/eclipse/acceleo/traceability/tests/unit/random/AcceleoTraceabilityRandomTests.java:542:9: Missing a Javadoc comment.
/jobs/genie.modeling.acceleo/acceleo-master-gerrit/workspace/tests/org.eclipse.acceleo.traceability.tests/src/org/eclipse/acceleo/traceability/tests/unit/random/AcceleoTraceabilityRandomTests.java:547: First sentence should end with a period.
/jobs/genie.modeling.acceleo/acceleo-master-gerrit/workspace/tests/org.eclipse.acceleo.traceability.tests/src/org/eclipse/acceleo/traceability/tests/unit/random/AcceleoTraceabilityRandomTests.java:553:53: Expected @param tag for 'operation'.
/jobs/genie.modeling.acceleo/acceleo-master-gerrit/workspace/tests/org.eclipse.acceleo.traceability.tests/src/org/eclipse/acceleo/traceability/tests/unit/random/AcceleoTraceabilityRandomTests.java:553:75: Expected @param tag for 'source'.
/jobs/genie.modeling.acceleo/acceleo-master-gerrit/workspace/tests/org.eclipse.acceleo.traceability.tests/src/org/eclipse/acceleo/traceability/tests/unit/random/AcceleoTraceabilityRandomTests.java:559:33: The String "data/random/randomtheories.mtl" appears 4 times in the file.
/jobs/genie.modeling.acceleo/acceleo-master-gerrit/workspace/tests/org.eclipse.acceleo.traceability.tests/src/org/eclipse/acceleo/traceability/tests/unit/random/AcceleoTraceabilityRandomTests.java:559:81: The String "main" appears 4 times in the file.
/jobs/genie.modeling.acceleo/acceleo-master-gerrit/workspace/tests/org.eclipse.acceleo.traceability.tests/src/org/eclipse/acceleo/traceability/tests/unit/random/AcceleoTraceabilityRandomTests.java:559:89: The String "data/random/model.ecore" appears 4 times in the file.
/jobs/genie.modeling.acceleo/acceleo-master-gerrit/workspace/tests/org.eclipse.acceleo.traceability.tests/src/org/eclipse/acceleo/traceability/tests/unit/random/AcceleoTraceabilityRandomTests.java:564:84: ',' is not followed by whitespace.
/jobs/genie.modeling.acceleo/acceleo-master-gerrit/workspace/tests/org.eclipse.acceleo.traceability.tests/src/org/eclipse/acceleo/traceability/tests/unit/random/AcceleoTraceabilityRandomTests.java:568:9: Missing a Javadoc comment.
/jobs/genie.modeling.acceleo/acceleo-master-gerrit/workspace/tests/org.eclipse.acceleo.traceability.tests/src/org/eclipse/acceleo/traceability/tests/unit/random/AcceleoTraceabilityRandomTests.java:572:37: The String "(" appears 6 times in the file.
/jobs/genie.modeling.acceleo/acceleo-master-gerrit/workspace/tests/org.eclipse.acceleo.traceability.tests/src/org/eclipse/acceleo/traceability/tests/unit/random/AcceleoTraceabilityRandomTests.java:572:74: The String ")" appears 6 times in the file.
/jobs/genie.modeling.acceleo/acceleo-master-gerrit/workspace/tests/org.eclipse.acceleo.traceability.tests/src/org/eclipse/acceleo/traceability/tests/unit/random/AcceleoTraceabilityRandomTests.java:584:9: Missing a Javadoc comment.
/jobs/genie.modeling.acceleo/acceleo-master-gerrit/workspace/tests/org.eclipse.acceleo.traceability.tests/src/org/eclipse/acceleo/traceability/tests/unit/random/AcceleoTraceabilityRandomTests.java:600:9: Missing a Javadoc comment.
/jobs/genie.modeling.acceleo/acceleo-master-gerrit/workspace/tests/org.eclipse.acceleo.traceability.tests/src/org/eclipse/acceleo/traceability/tests/unit/random/AcceleoTraceabilityRandomTests.java:612:128: '+' is not preceded with whitespace.
/jobs/genie.modeling.acceleo/acceleo-master-gerrit/workspace/tests/org.eclipse.acceleo.traceability.tests/src/org/eclipse/acceleo/traceability/tests/unit/random/AcceleoTraceabilityTheoriesRunner.java:23: Missing a Javadoc comment.
/jobs/genie.modeling.acceleo/acceleo-master-gerrit/workspace/tests/org.eclipse.acceleo.traceability.tests/src/org/eclipse/acceleo/traceability/tests/unit/random/AcceleoTraceabilityTheoriesRunner.java:30:9: Missing a Javadoc comment.
/jobs/genie.modeling.acceleo/acceleo-master-gerrit/workspace/tests/org.eclipse.acceleo.traceability.tests/src/org/eclipse/acceleo/traceability/tests/unit/random/AcceleoTraceabilityTheoriesSuite.java:21: Missing a Javadoc comment.
/jobs/genie.modeling.acceleo/acceleo-master-gerrit/workspace/tests/org.eclipse.acceleo.traceability.tests/src/org/eclipse/acceleo/traceability/tests/unit/random/AcceleoTraceabilityTheoriesSuite.java:23:9: Missing a Javadoc comment.
/jobs/genie.modeling.acceleo/acceleo-master-gerrit/workspace/tests/org.eclipse.acceleo.traceability.tests/src/org/eclipse/acceleo/traceability/tests/unit/random/AcceleoTraceabilityTheoriesSuite.java:25:9: Missing a Javadoc comment.
/jobs/genie.modeling.acceleo/acceleo-master-gerrit/workspace/tests/org.eclipse.acceleo.traceability.tests/src/org/eclipse/acceleo/traceability/tests/unit/random/AcceleoTraceabilityTheoriesSuite.java:25:72: Throwing 'Throwable' is not allowed.
/jobs/genie.modeling.acceleo/acceleo-master-gerrit/workspace/tests/org.eclipse.acceleo.traceability.tests/src/org/eclipse/acceleo/traceability/tests/unit/random/string/StringSourceNoParameters.java:15: Missing a Javadoc comment.
/jobs/genie.modeling.acceleo/acceleo-master-gerrit/workspace/tests/org.eclipse.acceleo.traceability.tests/src/org/eclipse/acceleo/traceability/tests/unit/random/string/StringSourceNoParameters.java:17:9: Missing a Javadoc comment.
/jobs/genie.modeling.acceleo/acceleo-master-gerrit/workspace/tests/org.eclipse.acceleo.traceability.tests/src/org/eclipse/acceleo/traceability/tests/unit/random/string/StringSourceStringParameter.java:15: Missing a Javadoc comment.
/jobs/genie.modeling.acceleo/acceleo-master-gerrit/workspace/tests/org.eclipse.acceleo.traceability.tests/src/org/eclipse/acceleo/traceability/tests/unit/random/string/StringSourceStringParameter.java:17:9: Missing a Javadoc comment.
/jobs/genie.modeling.acceleo/acceleo-master-gerrit/workspace/tests/org.eclipse.acceleo.traceability.tests/src/org/eclipse/acceleo/traceability/tests/unit/random/string/StringSourceIntIntParameter.java:15: Missing a Javadoc comment.
/jobs/genie.modeling.acceleo/acceleo-master-gerrit/workspace/tests/org.eclipse.acceleo.traceability.tests/src/org/eclipse/acceleo/traceability/tests/unit/random/string/StringSourceIntIntParameter.java:17:9: Missing a Javadoc comment.
/jobs/genie.modeling.acceleo/acceleo-master-gerrit/workspace/tests/org.eclipse.acceleo.traceability.tests/src/org/eclipse/acceleo/traceability/tests/unit/random/string/StringSourceStringStringParameter.java:15: Missing a Javadoc comment.
/jobs/genie.modeling.acceleo/acceleo-master-gerrit/workspace/tests/org.eclipse.acceleo.traceability.tests/src/org/eclipse/acceleo/traceability/tests/unit/random/string/StringSourceStringStringParameter.java:17:9: Missing a Javadoc comment.
/jobs/genie.modeling.acceleo/acceleo-master-gerrit/workspace/tests/org.eclipse.acceleo.traceability.tests/src/org/eclipse/acceleo/traceability/tests/unit/random/string/StringSourceIntParameter.java:15: Missing a Javadoc comment.
/jobs/genie.modeling.acceleo/acceleo-master-gerrit/workspace/tests/org.eclipse.acceleo.traceability.tests/src/org/eclipse/acceleo/traceability/tests/unit/random/string/StringSourceIntParameter.java:17:9: Missing a Javadoc comment.
/jobs/genie.modeling.acceleo/acceleo-master-gerrit/workspace/tests/org.eclipse.acceleo.traceability.tests/src/org/eclipse/acceleo/traceability/tests/unit/random/string/StringSourceStringIntParameter.java:15: Missing a Javadoc comment.
/jobs/genie.modeling.acceleo/acceleo-master-gerrit/workspace/tests/org.eclipse.acceleo.traceability.tests/src/org/eclipse/acceleo/traceability/tests/unit/random/string/StringSourceStringIntParameter.java:17:9: Missing a Javadoc comment.
/jobs/genie.modeling.acceleo/acceleo-master-gerrit/workspace/tests/org.eclipse.acceleo.traceability.tests/src/org/eclipse/acceleo/traceability/tests/unit/random/Argument.java:16: Missing a Javadoc comment.
/jobs/genie.modeling.acceleo/acceleo-master-gerrit/workspace/tests/org.eclipse.acceleo.traceability.tests/src/org/eclipse/acceleo/traceability/tests/unit/random/RandomStatement.java:29: Missing a Javadoc comment.
/jobs/genie.modeling.acceleo/acceleo-master-gerrit/workspace/tests/org.eclipse.acceleo.traceability.tests/src/org/eclipse/acceleo/traceability/tests/unit/random/RandomStatement.java:30:9: Missing a Javadoc comment.
/jobs/genie.modeling.acceleo/acceleo-master-gerrit/workspace/tests/org.eclipse.acceleo.traceability.tests/src/org/eclipse/acceleo/traceability/tests/unit/random/RandomStatement.java:30:21: Variable 'successes' explicitly initialized to '0' (default value for its type).
/jobs/genie.modeling.acceleo/acceleo-master-gerrit/workspace/tests/org.eclipse.acceleo.traceability.tests/src/org/eclipse/acceleo/traceability/tests/unit/random/RandomStatement.java:32:9: Missing a Javadoc comment.
/jobs/genie.modeling.acceleo/acceleo-master-gerrit/workspace/tests/org.eclipse.acceleo.traceability.tests/src/org/eclipse/acceleo/traceability/tests/unit/random/RandomStatement.java:34:9: Missing a Javadoc comment.
/jobs/genie.modeling.acceleo/acceleo-master-gerrit/workspace/tests/org.eclipse.acceleo.traceability.tests/src/org/eclipse/acceleo/traceability/tests/unit/random/RandomStatement.java:36:9: Missing a Javadoc comment.
/jobs/genie.modeling.acceleo/acceleo-master-gerrit/workspace/tests/org.eclipse.acceleo.traceability.tests/src/org/eclipse/acceleo/traceability/tests/unit/random/RandomStatement.java:38:9: Missing a Javadoc comment.
/jobs/genie.modeling.acceleo/acceleo-master-gerrit/workspace/tests/org.eclipse.acceleo.traceability.tests/src/org/eclipse/acceleo/traceability/tests/unit/random/RandomStatement.java:44:39: Throwing 'Throwable' is not allowed.
/jobs/genie.modeling.acceleo/acceleo-master-gerrit/workspace/tests/org.eclipse.acceleo.traceability.tests/src/org/eclipse/acceleo/traceability/tests/unit/random/RandomStatement.java:53:9: Missing a Javadoc comment.
/jobs/genie.modeling.acceleo/acceleo-master-gerrit/workspace/tests/org.eclipse.acceleo.traceability.tests/src/org/eclipse/acceleo/traceability/tests/unit/random/RandomStatement.java:53:82: Throwing 'Throwable' is not allowed.
/jobs/genie.modeling.acceleo/acceleo-master-gerrit/workspace/tests/org.eclipse.acceleo.traceability.tests/src/org/eclipse/acceleo/traceability/tests/unit/random/RandomStatement.java:61:9: Missing a Javadoc comment.
/jobs/genie.modeling.acceleo/acceleo-master-gerrit/workspace/tests/org.eclipse.acceleo.traceability.tests/src/org/eclipse/acceleo/traceability/tests/unit/random/RandomStatement.java:62:49: Throwing 'Throwable' is not allowed.
/jobs/genie.modeling.acceleo/acceleo-master-gerrit/workspace/tests/org.eclipse.acceleo.traceability.tests/src/org/eclipse/acceleo/traceability/tests/unit/random/RandomStatement.java:68:9: Missing a Javadoc comment.
/jobs/genie.modeling.acceleo/acceleo-master-gerrit/workspace/tests/org.eclipse.acceleo.traceability.tests/src/org/eclipse/acceleo/traceability/tests/unit/random/RandomStatement.java:68:78: Throws count is 5 (max allowed is 3).
/jobs/genie.modeling.acceleo/acceleo-master-gerrit/workspace/tests/org.eclipse.acceleo.traceability.tests/src/org/eclipse/acceleo/traceability/tests/unit/random/RandomStatement.java:69:99: Throwing 'Throwable' is not allowed.
/jobs/genie.modeling.acceleo/acceleo-master-gerrit/workspace/tests/org.eclipse.acceleo.traceability.tests/src/org/eclipse/acceleo/traceability/tests/unit/random/RandomStatement.java:70:17: Anonymous inner class length is 36 lines (max allowed is 25).
/jobs/genie.modeling.acceleo/acceleo-master-gerrit/workspace/tests/org.eclipse.acceleo.traceability.tests/src/org/eclipse/acceleo/traceability/tests/unit/random/RandomStatement.java:81:71: Throwing 'Throwable' is not allowed.
/jobs/genie.modeling.acceleo/acceleo-master-gerrit/workspace/tests/org.eclipse.acceleo.traceability.tests/src/org/eclipse/acceleo/traceability/tests/unit/random/RandomStatement.java:87:51: Catching 'Throwable' is not allowed.
/jobs/genie.modeling.acceleo/acceleo-master-gerrit/workspace/tests/org.eclipse.acceleo.traceability.tests/src/org/eclipse/acceleo/traceability/tests/unit/random/RandomStatement.java:105:18: '}' is not followed by whitespace.
/jobs/genie.modeling.acceleo/acceleo-master-gerrit/workspace/tests/org.eclipse.acceleo.traceability.tests/src/org/eclipse/acceleo/traceability/tests/unit/random/RandomStatement.java:108:9: Missing a Javadoc comment.
/jobs/genie.modeling.acceleo/acceleo-master-gerrit/workspace/tests/org.eclipse.acceleo.traceability.tests/src/org/eclipse/acceleo/traceability/tests/unit/random/RandomStatement.java:112:55: Throwing 'Throwable' is not allowed.
/jobs/genie.modeling.acceleo/acceleo-master-gerrit/workspace/tests/org.eclipse.acceleo.traceability.tests/src/org/eclipse/acceleo/traceability/tests/unit/random/RandomStatement.java:123:9: Missing a Javadoc comment.
/jobs/genie.modeling.acceleo/acceleo-master-gerrit/workspace/tests/org.eclipse.acceleo.traceability.tests/src/org/eclipse/acceleo/traceability/tests/unit/random/RandomStatement.java:127:9: Missing a Javadoc comment.
/jobs/genie.modeling.acceleo/acceleo-master-gerrit/workspace/tests/org.eclipse.acceleo.traceability.tests/src/org/eclipse/acceleo/traceability/tests/unit/random/RandomStatement.java:127:87: Throwing 'Throwable' is not allowed.
/jobs/genie.modeling.acceleo/acceleo-master-gerrit/workspace/tests/org.eclipse.acceleo.traceability.tests/src/org/eclipse/acceleo/traceability/tests/unit/random/RandomStatement.java:134:9: Missing a Javadoc comment.
/jobs/genie.modeling.acceleo/acceleo-master-gerrit/workspace/tests/org.eclipse.acceleo.traceability.tests/src/org/eclipse/acceleo/traceability/tests/unit/random/RandomStatement.java:142:9: Missing a Javadoc comment.
/jobs/genie.modeling.acceleo/acceleo-master-gerrit/workspace/tests/org.eclipse.acceleo.traceability.tests/src/org/eclipse/acceleo/traceability/tests/unit/AbstractTraceabilityTest.java:16: Wrong order for 'java.io.File' import.
/jobs/genie.modeling.acceleo/acceleo-master-gerrit/workspace/tests/org.eclipse.acceleo.traceability.tests/src/org/eclipse/acceleo/traceability/tests/unit/AbstractTraceabilityTest.java:62:25: 'static' modifier out of order with the JLS suggestions.
/jobs/genie.modeling.acceleo/acceleo-master-gerrit/workspace/tests/org.eclipse.acceleo.traceability.tests/src/org/eclipse/acceleo/traceability/tests/unit/AbstractTraceabilityTest.java:149:12: Unused @param tag for 'resourceSet'.
/jobs/genie.modeling.acceleo/acceleo-master-gerrit/workspace/tests/org.eclipse.acceleo.traceability.tests/src/org/eclipse/acceleo/traceability/tests/unit/AbstractTraceabilityTest.java:243:12: Unused @param tag for 'resourceSet'.
/jobs/genie.modeling.acceleo/acceleo-master-gerrit/workspace/tests/org.eclipse.acceleo.traceability.tests/src/org/eclipse/acceleo/traceability/tests/unit/AbstractTraceabilityTest.java:294:9: Missing a Javadoc comment.
/jobs/genie.modeling.acceleo/acceleo-master-gerrit/workspace/tests/org.eclipse.acceleo.traceability.tests/src/org/eclipse/acceleo/traceability/tests/unit/AbstractTraceabilityTest.java:324:9: Missing a Javadoc comment.
/jobs/genie.modeling.acceleo/acceleo-master-gerrit/workspace/tests/org.eclipse.acceleo.traceability.tests/src/org/eclipse/acceleo/traceability/tests/unit/model/AcceleoTraceabilityModelTests.java:16: Wrong order for 'java.util.List' import.
/jobs/genie.modeling.acceleo/acceleo-master-gerrit/workspace/tests/org.eclipse.acceleo.traceability.tests/src/org/eclipse/acceleo/traceability/tests/unit/model/AcceleoTraceabilityModelTests.java:34: Missing a Javadoc comment.
/jobs/genie.modeling.acceleo/acceleo-master-gerrit/workspace/tests/org.eclipse.acceleo.traceability.tests/src/org/eclipse/acceleo/traceability/tests/unit/model/AcceleoTraceabilityModelTests.java:36:9: Missing a Javadoc comment.
/jobs/genie.modeling.acceleo/acceleo-master-gerrit/workspace/tests/org.eclipse.acceleo.traceability.tests/src/org/eclipse/acceleo/traceability/tests/unit/model/AcceleoTraceabilityModelTests.java:40:33: The String "main" appears 6 times in the file.
/jobs/genie.modeling.acceleo/acceleo-master-gerrit/workspace/tests/org.eclipse.acceleo.traceability.tests/src/org/eclipse/acceleo/traceability/tests/unit/model/AcceleoTraceabilityModelTests.java:40:41: The String "data/model/model.ecore" appears 4 times in the file.
/jobs/genie.modeling.acceleo/acceleo-master-gerrit/workspace/tests/org.eclipse.acceleo.traceability.tests/src/org/eclipse/acceleo/traceability/tests/unit/model/AcceleoTraceabilityModelTests.java:48:39: The String "class" appears 18 times in the file.
/jobs/genie.modeling.acceleo/acceleo-master-gerrit/workspace/tests/org.eclipse.acceleo.traceability.tests/src/org/eclipse/acceleo/traceability/tests/unit/model/AcceleoTraceabilityModelTests.java:52:54: The String ", feature='name'" appears 3 times in the file.
/jobs/genie.modeling.acceleo/acceleo-master-gerrit/workspace/tests/org.eclipse.acceleo.traceability.tests/src/org/eclipse/acceleo/traceability/tests/unit/model/AcceleoTraceabilityModelTests.java:54:54: The String ".txt" appears 3 times in the file.
/jobs/genie.modeling.acceleo/acceleo-master-gerrit/workspace/tests/org.eclipse.acceleo.traceability.tests/src/org/eclipse/acceleo/traceability/tests/unit/model/AcceleoTraceabilityModelTests.java:66:38: The String "eClass.name" appears 6 times in the file.
/jobs/genie.modeling.acceleo/acceleo-master-gerrit/workspace/tests/org.eclipse.acceleo.traceability.tests/src/org/eclipse/acceleo/traceability/tests/unit/model/AcceleoTraceabilityModelTests.java:67:38: '178' is a magic number.
/jobs/genie.modeling.acceleo/acceleo-master-gerrit/workspace/tests/org.eclipse.acceleo.traceability.tests/src/org/eclipse/acceleo/traceability/tests/unit/model/AcceleoTraceabilityModelTests.java:68:38: '178' is a magic number.
/jobs/genie.modeling.acceleo/acceleo-master-gerrit/workspace/tests/org.eclipse.acceleo.traceability.tests/src/org/eclipse/acceleo/traceability/tests/unit/model/AcceleoTraceabilityModelTests.java:74:38: The String "/plugin/org.eclipse.acceleo.traceability.tests/data/model/model.ecore" appears 4 times in the file.
/jobs/genie.modeling.acceleo/acceleo-master-gerrit/workspace/tests/org.eclipse.acceleo.traceability.tests/src/org/eclipse/acceleo/traceability/tests/unit/model/AcceleoTraceabilityModelTests.java:80:9: Missing a Javadoc comment.
/jobs/genie.modeling.acceleo/acceleo-master-gerrit/workspace/tests/org.eclipse.acceleo.traceability.tests/src/org/eclipse/acceleo/traceability/tests/unit/model/AcceleoTraceabilityModelTests.java:80:9: NCSS for this method is 51 (max allowed is 50).
/jobs/genie.modeling.acceleo/acceleo-master-gerrit/workspace/tests/org.eclipse.acceleo.traceability.tests/src/org/eclipse/acceleo/traceability/tests/unit/model/AcceleoTraceabilityModelTests.java:92:55: The String "EClass" appears 3 times in the file.
/jobs/genie.modeling.acceleo/acceleo-master-gerrit/workspace/tests/org.eclipse.acceleo.traceability.tests/src/org/eclipse/acceleo/traceability/tests/unit/model/AcceleoTraceabilityModelTests.java:111:38: '181' is a magic number.
/jobs/genie.modeling.acceleo/acceleo-master-gerrit/workspace/tests/org.eclipse.acceleo.traceability.tests/src/org/eclipse/acceleo/traceability/tests/unit/model/AcceleoTraceabilityModelTests.java:112:38: '181' is a magic number.
/jobs/genie.modeling.acceleo/acceleo-master-gerrit/workspace/tests/org.eclipse.acceleo.traceability.tests/src/org/eclipse/acceleo/traceability/tests/unit/model/AcceleoTraceabilityModelTests.java:132:38: '195' is a magic number.
/jobs/genie.modeling.acceleo/acceleo-master-gerrit/workspace/tests/org.eclipse.acceleo.traceability.tests/src/org/eclipse/acceleo/traceability/tests/unit/model/AcceleoTraceabilityModelTests.java:133:38: '195' is a magic number.
/jobs/genie.modeling.acceleo/acceleo-master-gerrit/workspace/tests/org.eclipse.acceleo.traceability.tests/src/org/eclipse/acceleo/traceability/tests/unit/model/AcceleoTraceabilityModelTests.java:145:9: Missing a Javadoc comment.
/jobs/genie.modeling.acceleo/acceleo-master-gerrit/workspace/tests/org.eclipse.acceleo.traceability.tests/src/org/eclipse/acceleo/traceability/tests/unit/model/AcceleoTraceabilityModelTests.java:176:38: '193' is a magic number.
/jobs/genie.modeling.acceleo/acceleo-master-gerrit/workspace/tests/org.eclipse.acceleo.traceability.tests/src/org/eclipse/acceleo/traceability/tests/unit/model/AcceleoTraceabilityModelTests.java:177:38: '193' is a magic number.
/jobs/genie.modeling.acceleo/acceleo-master-gerrit/workspace/tests/org.eclipse.acceleo.traceability.tests/src/org/eclipse/acceleo/traceability/tests/unit/model/AcceleoTraceabilityModelTests.java:189:9: Missing a Javadoc comment.
/jobs/genie.modeling.acceleo/acceleo-master-gerrit/workspace/tests/org.eclipse.acceleo.traceability.tests/src/org/eclipse/acceleo/traceability/tests/unit/model/AcceleoTraceabilityModelTests.java:199:39: The String "MyEnum" appears 4 times in the file.
/jobs/genie.modeling.acceleo/acceleo-master-gerrit/workspace/tests/org.eclipse.acceleo.traceability.tests/src/org/eclipse/acceleo/traceability/tests/unit/model/AcceleoTraceabilityModelTests.java:199:39: Unnecessary parentheses around string "MyEnum".
/jobs/genie.modeling.acceleo/acceleo-master-gerrit/workspace/tests/org.eclipse.acceleo.traceability.tests/src/org/eclipse/acceleo/traceability/tests/unit/model/AcceleoTraceabilityModelTests.java:208:39: Unnecessary parentheses around string "MyEnum".
/jobs/genie.modeling.acceleo/acceleo-master-gerrit/workspace/tests/org.eclipse.acceleo.traceability.tests/src/org/eclipse/acceleo/traceability/tests/unit/model/AcceleoTraceabilityModelTests.java:217:38: '164' is a magic number.
/jobs/genie.modeling.acceleo/acceleo-master-gerrit/workspace/tests/org.eclipse.acceleo.traceability.tests/src/org/eclipse/acceleo/traceability/tests/unit/model/AcceleoTraceabilityModelTests.java:218:38: '164' is a magic number.
/jobs/genie.modeling.acceleo/acceleo-master-gerrit/workspace/tests/org.eclipse.acceleo.traceability.tests/src/org/eclipse/acceleo/traceability/tests/unit/model/AcceleoTraceabilityModelTests.java:229:9: Missing a Javadoc comment.
/jobs/genie.modeling.acceleo/acceleo-master-gerrit/workspace/tests/org.eclipse.acceleo.traceability.tests/src/org/eclipse/acceleo/traceability/tests/unit/model/AcceleoTraceabilityModelTests.java:240:39: The String "private" appears 4 times in the file.
/jobs/genie.modeling.acceleo/acceleo-master-gerrit/workspace/tests/org.eclipse.acceleo.traceability.tests/src/org/eclipse/acceleo/traceability/tests/unit/model/AcceleoTraceabilityModelTests.java:240:39: Unnecessary parentheses around string "private".
/jobs/genie.modeling.acceleo/acceleo-master-gerrit/workspace/tests/org.eclipse.acceleo.traceability.tests/src/org/eclipse/acceleo/traceability/tests/unit/model/AcceleoTraceabilityModelTests.java:244:38: The String "myoperation" appears 4 times in the file.
/jobs/genie.modeling.acceleo/acceleo-master-gerrit/workspace/tests/org.eclipse.acceleo.traceability.tests/src/org/eclipse/acceleo/traceability/tests/unit/model/AcceleoTraceabilityModelTests.java:249:39: Unnecessary parentheses around string "private".
/jobs/genie.modeling.acceleo/acceleo-master-gerrit/workspace/tests/org.eclipse.acceleo.traceability.tests/src/org/eclipse/acceleo/traceability/tests/unit/model/AcceleoTraceabilityModelTests.java:257:38: The String "operation.visibility" appears 4 times in the file.
/jobs/genie.modeling.acceleo/acceleo-master-gerrit/workspace/tests/org.eclipse.acceleo.traceability.tests/src/org/eclipse/acceleo/traceability/tests/unit/model/AcceleoTraceabilityModelTests.java:258:38: '185' is a magic number.
/jobs/genie.modeling.acceleo/acceleo-master-gerrit/workspace/tests/org.eclipse.acceleo.traceability.tests/src/org/eclipse/acceleo/traceability/tests/unit/model/AcceleoTraceabilityModelTests.java:259:38: '185' is a magic number.
/jobs/genie.modeling.acceleo/acceleo-master-gerrit/workspace/tests/org.eclipse.acceleo.traceability.tests/src/org/eclipse/acceleo/traceability/tests/unit/model/AcceleoTraceabilityModelTests.java:270:9: Missing a Javadoc comment.
/jobs/genie.modeling.acceleo/acceleo-master-gerrit/workspace/tests/org.eclipse.acceleo.traceability.tests/src/org/eclipse/acceleo/traceability/tests/unit/model/AcceleoTraceabilityModelTests.java:281:39: Unnecessary parentheses around string "private".
/jobs/genie.modeling.acceleo/acceleo-master-gerrit/workspace/tests/org.eclipse.acceleo.traceability.tests/src/org/eclipse/acceleo/traceability/tests/unit/model/AcceleoTraceabilityModelTests.java:290:39: Unnecessary parentheses around string "private".
/jobs/genie.modeling.acceleo/acceleo-master-gerrit/workspace/tests/org.eclipse.acceleo.traceability.tests/src/org/eclipse/acceleo/traceability/tests/unit/model/AcceleoTraceabilityModelTests.java:299:38: '183' is a magic number.
/jobs/genie.modeling.acceleo/acceleo-master-gerrit/workspace/tests/org.eclipse.acceleo.traceability.tests/src/org/eclipse/acceleo/traceability/tests/unit/model/AcceleoTraceabilityModelTests.java:300:38: '183' is a magic number.
/jobs/genie.modeling.acceleo/acceleo-master-gerrit/workspace/tests/org.eclipse.acceleo.traceability.tests/src/org/eclipse/acceleo/traceability/tests/suite/AllTraceabilityTests.java:33:1: Utility classes should not have a public or default constructor.
Audit done.

[INFO] There are 2007 checkstyle errors.
[WARNING] Unable to locate Source XRef to link to - DISABLED
[INFO] 
[INFO] >>> findbugs-maven-plugin:2.3.2:check (default) > :findbugs @ org.eclipse.acceleo.traceability.tests >>>
[INFO] 
[INFO] --- findbugs-maven-plugin:2.3.2:findbugs (findbugs) @ org.eclipse.acceleo.traceability.tests ---
[INFO] ****** FindBugsMojo execute *******
[INFO] canGenerate is true
[INFO] ****** FindBugsMojo executeFindbugs *******
[INFO] Temp File is /jobs/genie.modeling.acceleo/acceleo-master-gerrit/workspace/tests/org.eclipse.acceleo.traceability.tests/target/findbugsTemp.xml
[INFO] Fork Value is true
     [java] Warnings generated: 49
[INFO] xmlOutput is false
[INFO] 
[INFO] <<< findbugs-maven-plugin:2.3.2:check (default) < :findbugs @ org.eclipse.acceleo.traceability.tests <<<
[INFO] 
[INFO] --- findbugs-maven-plugin:2.3.2:check (default) @ org.eclipse.acceleo.traceability.tests ---
[INFO] BugInstance size is 49
[INFO] Error size is 0
[INFO] 
[INFO] >>> maven-pmd-plugin:2.5:cpd-check (default) > :cpd @ org.eclipse.acceleo.traceability.tests >>>
[INFO] 
[INFO] --- maven-pmd-plugin:2.5:cpd (cpd) @ org.eclipse.acceleo.traceability.tests ---
[WARNING] Unable to locate Source XRef to link to - DISABLED
[INFO] 
[INFO] <<< maven-pmd-plugin:2.5:cpd-check (default) < :cpd @ org.eclipse.acceleo.traceability.tests <<<
[INFO] 
[INFO] --- maven-pmd-plugin:2.5:cpd-check (default) @ org.eclipse.acceleo.traceability.tests ---
[INFO] You have 131 CPD duplications. For more details see:/jobs/genie.modeling.acceleo/acceleo-master-gerrit/workspace/tests/org.eclipse.acceleo.traceability.tests/target/cpd.xml
[INFO]                                                                         
[INFO] ------------------------------------------------------------------------
[INFO] Building Acceleo Tests 3.6.0-SNAPSHOT
[INFO] ------------------------------------------------------------------------
[INFO] 
[INFO] --- maven-clean-plugin:2.5:clean (default-clean) @ org.eclipse.acceleo.tests ---
[INFO] 
[INFO] --- tycho-packaging-plugin:0.19.0:build-qualifier (default-build-qualifier) @ org.eclipse.acceleo.tests ---
[INFO] The project's OSGi version is 3.6.0.201501270956
[INFO] 
[INFO] --- tycho-packaging-plugin:0.19.0:validate-id (default-validate-id) @ org.eclipse.acceleo.tests ---
[INFO] 
[INFO] --- tycho-packaging-plugin:0.19.0:validate-version (default-validate-version) @ org.eclipse.acceleo.tests ---
[INFO] 
[INFO] --- jacoco-maven-plugin:0.5.6.201201232323:prepare-agent (default) @ org.eclipse.acceleo.tests ---
[INFO] tycho.testArgLine set to -javaagent:/home/hudson/genie.modeling.acceleo/.hudson/jobs/acceleo-master-gerrit/workspace/.maven/repo/org/jacoco/org.jacoco.agent/0.5.6.201201232323/org.jacoco.agent-0.5.6.201201232323-runtime.jar=destfile=/jobs/genie.modeling.acceleo/acceleo-master-gerrit/workspace/tests/org.eclipse.acceleo.tests/target/jacoco.exec,append=true
[INFO] 
[INFO] --- maven-resources-plugin:2.4.1:resources (default-resources) @ org.eclipse.acceleo.tests ---
[INFO] Using 'ISO-8859-1' encoding to copy filtered resources.
[INFO] skip non existing resourceDirectory /jobs/genie.modeling.acceleo/acceleo-master-gerrit/workspace/tests/org.eclipse.acceleo.tests/src/main/resources
[INFO] 
[INFO] --- tycho-compiler-plugin:0.19.0:compile (default-compile) @ org.eclipse.acceleo.tests ---
[INFO] Compiling 1 source file to /jobs/genie.modeling.acceleo/acceleo-master-gerrit/workspace/tests/org.eclipse.acceleo.tests/target/classes
[INFO] 
[INFO] --- maven-resources-plugin:2.4.1:testResources (default-testResources) @ org.eclipse.acceleo.tests ---
[INFO] Using 'ISO-8859-1' encoding to copy filtered resources.
[INFO] skip non existing resourceDirectory /jobs/genie.modeling.acceleo/acceleo-master-gerrit/workspace/tests/org.eclipse.acceleo.tests/src/test/resources
[INFO] 
[INFO] --- tycho-source-plugin:0.19.0:plugin-source (plugin-source) @ org.eclipse.acceleo.tests ---
[WARNING] bundle localization file /jobs/genie.modeling.acceleo/acceleo-master-gerrit/workspace/tests/org.eclipse.acceleo.tests/plugin.properties not found
[INFO] Building jar: /jobs/genie.modeling.acceleo/acceleo-master-gerrit/workspace/tests/org.eclipse.acceleo.tests/target/org.eclipse.acceleo.tests-3.6.0-SNAPSHOT-sources.jar
[INFO] 
[INFO] --- tycho-packaging-plugin:0.19.0:package-plugin (default-package-plugin) @ org.eclipse.acceleo.tests ---
[INFO] Building jar: /jobs/genie.modeling.acceleo/acceleo-master-gerrit/workspace/tests/org.eclipse.acceleo.tests/target/org.eclipse.acceleo.tests-3.6.0-SNAPSHOT.jar
[INFO] 
[INFO] --- tycho-p2-plugin:0.19.0:p2-metadata-default (default-p2-metadata-default) @ org.eclipse.acceleo.tests ---
[INFO] 
[INFO] --- tycho-source-feature-plugin:0.19.0:source-feature (source-feature) @ org.eclipse.acceleo.tests ---
[INFO] 
[INFO] --- tycho-p2-plugin:0.19.0:p2-metadata (attach-p2-metadata) @ org.eclipse.acceleo.tests ---
[INFO] 
[INFO] --- tycho-surefire-plugin:0.19.0:test (default-test) @ org.eclipse.acceleo.tests ---
[INFO] Expected eclipse log file: /jobs/genie.modeling.acceleo/acceleo-master-gerrit/workspace/tests/org.eclipse.acceleo.tests/target/work/data/.metadata/.log
[INFO] Command line:
	/bin/sh -c cd /jobs/genie.modeling.acceleo/acceleo-master-gerrit/workspace/tests/org.eclipse.acceleo.tests && /opt/public/common/jdk1.7.0_51/jre/bin/java -Dosgi.noShutdown=false -Dosgi.os=linux -Dosgi.ws=gtk -Dosgi.arch=x86_64 -javaagent:/home/hudson/genie.modeling.acceleo/.hudson/jobs/acceleo-master-gerrit/workspace/.maven/repo/org/jacoco/org.jacoco.agent/0.5.6.201201232323/org.jacoco.agent-0.5.6.201201232323-runtime.jar=destfile=/jobs/genie.modeling.acceleo/acceleo-master-gerrit/workspace/tests/org.eclipse.acceleo.tests/target/jacoco.exec,append=true -Dosgi.clean=true -jar /jobs/genie.modeling.acceleo/acceleo-master-gerrit/workspace/.maven/repo/p2/osgi/bundle/org.eclipse.equinox.launcher/1.3.0.v20140415-2008/org.eclipse.equinox.launcher-1.3.0.v20140415-2008.jar -data /jobs/genie.modeling.acceleo/acceleo-master-gerrit/workspace/tests/org.eclipse.acceleo.tests/target/work/data -install /jobs/genie.modeling.acceleo/acceleo-master-gerrit/workspace/tests/org.eclipse.acceleo.tests/target/work -configuration /jobs/genie.modeling.acceleo/acceleo-master-gerrit/workspace/tests/org.eclipse.acceleo.tests/target/work/configuration -application org.eclipse.tycho.surefire.osgibooter.headlesstest -testproperties /jobs/genie.modeling.acceleo/acceleo-master-gerrit/workspace/tests/org.eclipse.acceleo.tests/target/surefire.properties -Xmx1024m -XX:MaxPermSize=256m
Could not acquire PlatformAdmin server

-------------------------------------------------------
 T E S T S
-------------------------------------------------------
Running org.eclipse.acceleo.tests.suite.AllTests
Xlib:  extension "RANDR" missing on display ":511.0".
platform:/resource/org.eclipse.acceleo.parser.tests.module/org/eclipse/acceleo/parser/tests/module/files/moduleValid.emtl
Index of \r\n: 8192
Index of \r\n: 8190
Index of \r\n: 8191
Index of \n: 8192
Index of \n: 8190
Index of \n: 8191
Index of \r: 8192
Index of \r: 8190
Index of \r: 8191
Index of \r: 5
Tests run: 951, Failures: 0, Errors: 0, Skipped: 37, Time elapsed: 36.253 sec

Results :

Tests run: 951, Failures: 0, Errors: 0, Skipped: 37

[INFO] All tests passed!
[INFO] 
[INFO] --- maven-checkstyle-plugin:2.7:checkstyle (check my sources) @ org.eclipse.acceleo.tests ---
27/01/2015 05:05:26 Xvnc version X.org/xf4vnc custom version
27/01/2015 05:05:26 Copyright (C) 2001-2004 Alan Hourihane.
27/01/2015 05:05:26 Copyright (C) 2000-2004 Constantin Kaplinsky
27/01/2015 05:05:26 Copyright (C) 1999 AT&T Laboratories Cambridge
27/01/2015 05:05:26 All Rights Reserved.
27/01/2015 05:05:26 See http://www.tightvnc.com/ for information on TightVNC
27/01/2015 05:05:26 See http://xf4vnc.sf.net for xf4vnc-specific information
27/01/2015 05:05:26 Desktop name 'x11' (hipp4:511)
27/01/2015 05:05:26 Protocol versions supported: 3.7, 3.3
27/01/2015 05:05:26 RGB format 8 8 8
27/01/2015 05:05:26 Listening for VNC connections on TCP port 6411
[WARNING] File encoding has not been set, using platform encoding UTF-8, i.e. build is platform dependent!
[dix] Could not init font path element /usr/share/fonts/TTF/, removing from list!
[dix] Could not init font path element /usr/share/fonts/OTF, removing from list!
(EE) config/hal: NewInputDeviceRequest failed (2)
(EE) config/hal: NewInputDeviceRequest failed (2)
[INFO] Starting audit...
/jobs/genie.modeling.acceleo/acceleo-master-gerrit/workspace/tests/org.eclipse.acceleo.tests/src/org/eclipse/acceleo/tests/suite/AllTests.java:30:1: Utility classes should not have a public or default constructor.
Audit done.

[INFO] There are 1 checkstyle errors.
[WARNING] Unable to locate Source XRef to link to - DISABLED
[INFO] 
[INFO] >>> findbugs-maven-plugin:2.3.2:check (default) > :findbugs @ org.eclipse.acceleo.tests >>>
[INFO] 
[INFO] --- findbugs-maven-plugin:2.3.2:findbugs (findbugs) @ org.eclipse.acceleo.tests ---
[INFO] ****** FindBugsMojo execute *******
[INFO] canGenerate is true
[INFO] ****** FindBugsMojo executeFindbugs *******
[INFO] Temp File is /jobs/genie.modeling.acceleo/acceleo-master-gerrit/workspace/tests/org.eclipse.acceleo.tests/target/findbugsTemp.xml
[INFO] Fork Value is true
[INFO] xmlOutput is false
[INFO] 
[INFO] <<< findbugs-maven-plugin:2.3.2:check (default) < :findbugs @ org.eclipse.acceleo.tests <<<
[INFO] 
[INFO] --- findbugs-maven-plugin:2.3.2:check (default) @ org.eclipse.acceleo.tests ---
[INFO] BugInstance size is 0
[INFO] Error size is 0
[INFO] 
[INFO] >>> maven-pmd-plugin:2.5:cpd-check (default) > :cpd @ org.eclipse.acceleo.tests >>>
[INFO] 
[INFO] --- maven-pmd-plugin:2.5:cpd (cpd) @ org.eclipse.acceleo.tests ---
[WARNING] Unable to locate Source XRef to link to - DISABLED
[INFO] 
[INFO] <<< maven-pmd-plugin:2.5:cpd-check (default) < :cpd @ org.eclipse.acceleo.tests <<<
[INFO] 
[INFO] --- maven-pmd-plugin:2.5:cpd-check (default) @ org.eclipse.acceleo.tests ---
[INFO] 
[INFO]                                                                         
[INFO] ------------------------------------------------------------------------
[INFO] Building Acceleo Documentation Feature 3.6.0-SNAPSHOT
[INFO] ------------------------------------------------------------------------
[INFO] 
[INFO] --- maven-clean-plugin:2.5:clean (default-clean) @ org.eclipse.acceleo.doc ---
[INFO] Deleting /jobs/genie.modeling.acceleo/acceleo-master-gerrit/workspace/features/org.eclipse.acceleo.doc-feature/target
[INFO] 
[INFO] --- tycho-packaging-plugin:0.19.0:build-qualifier-aggregator (default-build-qualifier-aggregator) @ org.eclipse.acceleo.doc ---
[INFO] The project's OSGi version is 3.6.0.201501270956
[INFO] 
[INFO] --- tycho-packaging-plugin:0.19.0:validate-id (default-validate-id) @ org.eclipse.acceleo.doc ---
[INFO] 
[INFO] --- tycho-packaging-plugin:0.19.0:validate-version (default-validate-version) @ org.eclipse.acceleo.doc ---
[INFO] 
[INFO] --- jacoco-maven-plugin:0.5.6.201201232323:prepare-agent (default) @ org.eclipse.acceleo.doc ---
[INFO] argLine set to -javaagent:/home/hudson/genie.modeling.acceleo/.hudson/jobs/acceleo-master-gerrit/workspace/.maven/repo/org/jacoco/org.jacoco.agent/0.5.6.201201232323/org.jacoco.agent-0.5.6.201201232323-runtime.jar=destfile=/jobs/genie.modeling.acceleo/acceleo-master-gerrit/workspace/features/org.eclipse.acceleo.doc-feature/target/jacoco.exec,append=true
[INFO] 
[INFO] --- tycho-source-plugin:0.19.0:plugin-source (plugin-source) @ org.eclipse.acceleo.doc ---
[INFO] 
[INFO] --- tycho-packaging-plugin:0.19.0:package-feature (default-package-feature) @ org.eclipse.acceleo.doc ---
[INFO] Building jar: /jobs/genie.modeling.acceleo/acceleo-master-gerrit/workspace/features/org.eclipse.acceleo.doc-feature/target/org.eclipse.acceleo.doc-3.6.0-SNAPSHOT.jar
[INFO] 
[INFO] --- tycho-p2-plugin:0.19.0:p2-metadata-default (default-p2-metadata-default) @ org.eclipse.acceleo.doc ---
[INFO] 
[INFO] --- tycho-p2-plugin:0.19.0:feature-p2-metadata (default-feature-p2-metadata) @ org.eclipse.acceleo.doc ---
[INFO] 
[INFO] --- tycho-source-feature-plugin:0.19.0:source-feature (source-feature) @ org.eclipse.acceleo.doc ---
[INFO] Building jar: /jobs/genie.modeling.acceleo/acceleo-master-gerrit/workspace/features/org.eclipse.acceleo.doc-feature/target/org.eclipse.acceleo.doc-3.6.0-SNAPSHOT-sources-feature.jar
[INFO] 
[INFO] --- tycho-p2-plugin:0.19.0:p2-metadata (attach-p2-metadata) @ org.eclipse.acceleo.doc ---
[INFO] 
[INFO] --- maven-checkstyle-plugin:2.7:checkstyle (check my sources) @ org.eclipse.acceleo.doc ---
[INFO] 
[INFO] >>> findbugs-maven-plugin:2.3.2:check (default) > :findbugs @ org.eclipse.acceleo.doc >>>
[INFO] 
[INFO] --- findbugs-maven-plugin:2.3.2:findbugs (findbugs) @ org.eclipse.acceleo.doc ---
[INFO] ****** FindBugsMojo execute *******
[INFO] canGenerate is false
[INFO] 
[INFO] <<< findbugs-maven-plugin:2.3.2:check (default) < :findbugs @ org.eclipse.acceleo.doc <<<
[INFO] 
[INFO] --- findbugs-maven-plugin:2.3.2:check (default) @ org.eclipse.acceleo.doc ---
[INFO] 
[INFO] >>> maven-pmd-plugin:2.5:cpd-check (default) > :cpd @ org.eclipse.acceleo.doc >>>
[INFO] 
[INFO] --- maven-pmd-plugin:2.5:cpd (cpd) @ org.eclipse.acceleo.doc ---
[WARNING] Unable to locate Source XRef to link to - DISABLED
[INFO] 
[INFO] <<< maven-pmd-plugin:2.5:cpd-check (default) < :cpd @ org.eclipse.acceleo.doc <<<
[INFO] 
[INFO] --- maven-pmd-plugin:2.5:cpd-check (default) @ org.eclipse.acceleo.doc ---
[INFO] 
[INFO]                                                                         
[INFO] ------------------------------------------------------------------------
[INFO] Building Acceleo Feature 3.6.0-SNAPSHOT
[INFO] ------------------------------------------------------------------------
[INFO] 
[INFO] --- maven-clean-plugin:2.5:clean (default-clean) @ org.eclipse.acceleo ---
[INFO] Deleting /jobs/genie.modeling.acceleo/acceleo-master-gerrit/workspace/features/org.eclipse.acceleo-feature/target
[INFO] 
[INFO] --- tycho-packaging-plugin:0.19.0:build-qualifier-aggregator (default-build-qualifier-aggregator) @ org.eclipse.acceleo ---
[INFO] The project's OSGi version is 3.6.0.201501270956
[INFO] 
[INFO] --- tycho-packaging-plugin:0.19.0:validate-id (default-validate-id) @ org.eclipse.acceleo ---
[INFO] 
[INFO] --- tycho-packaging-plugin:0.19.0:validate-version (default-validate-version) @ org.eclipse.acceleo ---
[INFO] 
[INFO] --- jacoco-maven-plugin:0.5.6.201201232323:prepare-agent (default) @ org.eclipse.acceleo ---
[INFO] argLine set to -javaagent:/home/hudson/genie.modeling.acceleo/.hudson/jobs/acceleo-master-gerrit/workspace/.maven/repo/org/jacoco/org.jacoco.agent/0.5.6.201201232323/org.jacoco.agent-0.5.6.201201232323-runtime.jar=destfile=/jobs/genie.modeling.acceleo/acceleo-master-gerrit/workspace/features/org.eclipse.acceleo-feature/target/jacoco.exec,append=true
[INFO] 
[INFO] --- tycho-source-plugin:0.19.0:plugin-source (plugin-source) @ org.eclipse.acceleo ---
[INFO] 
[INFO] --- tycho-packaging-plugin:0.19.0:package-feature (default-package-feature) @ org.eclipse.acceleo ---
[INFO] Building jar: /jobs/genie.modeling.acceleo/acceleo-master-gerrit/workspace/features/org.eclipse.acceleo-feature/target/org.eclipse.acceleo-3.6.0-SNAPSHOT.jar
[INFO] 
[INFO] --- tycho-p2-plugin:0.19.0:p2-metadata-default (default-p2-metadata-default) @ org.eclipse.acceleo ---
[INFO] 
[INFO] --- tycho-p2-plugin:0.19.0:feature-p2-metadata (default-feature-p2-metadata) @ org.eclipse.acceleo ---
[INFO] 
[INFO] --- tycho-source-feature-plugin:0.19.0:source-feature (source-feature) @ org.eclipse.acceleo ---
[INFO] Building jar: /jobs/genie.modeling.acceleo/acceleo-master-gerrit/workspace/features/org.eclipse.acceleo-feature/target/org.eclipse.acceleo-3.6.0-SNAPSHOT-sources-feature.jar
[INFO] license.html already added, skipping
[INFO] epl-v10.html already added, skipping
[INFO] 
[INFO] --- tycho-p2-plugin:0.19.0:p2-metadata (attach-p2-metadata) @ org.eclipse.acceleo ---
[INFO] 
[INFO] --- maven-checkstyle-plugin:2.7:checkstyle (check my sources) @ org.eclipse.acceleo ---
[INFO] 
[INFO] >>> findbugs-maven-plugin:2.3.2:check (default) > :findbugs @ org.eclipse.acceleo >>>
[INFO] 
[INFO] --- findbugs-maven-plugin:2.3.2:findbugs (findbugs) @ org.eclipse.acceleo ---
[INFO] ****** FindBugsMojo execute *******
[INFO] canGenerate is false
[INFO] 
[INFO] <<< findbugs-maven-plugin:2.3.2:check (default) < :findbugs @ org.eclipse.acceleo <<<
[INFO] 
[INFO] --- findbugs-maven-plugin:2.3.2:check (default) @ org.eclipse.acceleo ---
[INFO] 
[INFO] >>> maven-pmd-plugin:2.5:cpd-check (default) > :cpd @ org.eclipse.acceleo >>>
[INFO] 
[INFO] --- maven-pmd-plugin:2.5:cpd (cpd) @ org.eclipse.acceleo ---
[WARNING] Unable to locate Source XRef to link to - DISABLED
[INFO] 
[INFO] <<< maven-pmd-plugin:2.5:cpd-check (default) < :cpd @ org.eclipse.acceleo <<<
[INFO] 
[INFO] --- maven-pmd-plugin:2.5:cpd-check (default) @ org.eclipse.acceleo ---
[INFO] 
[INFO]                                                                         
[INFO] ------------------------------------------------------------------------
[INFO] Building Acceleo Example Feature 3.6.0-SNAPSHOT
[INFO] ------------------------------------------------------------------------
[INFO] 
[INFO] --- maven-clean-plugin:2.5:clean (default-clean) @ org.eclipse.acceleo.examples ---
[INFO] Deleting /jobs/genie.modeling.acceleo/acceleo-master-gerrit/workspace/features/org.eclipse.acceleo.examples-feature/target
[INFO] 
[INFO] --- tycho-packaging-plugin:0.19.0:build-qualifier-aggregator (default-build-qualifier-aggregator) @ org.eclipse.acceleo.examples ---
[INFO] The project's OSGi version is 3.6.0.201501270956
[INFO] 
[INFO] --- tycho-packaging-plugin:0.19.0:validate-id (default-validate-id) @ org.eclipse.acceleo.examples ---
[INFO] 
[INFO] --- tycho-packaging-plugin:0.19.0:validate-version (default-validate-version) @ org.eclipse.acceleo.examples ---
[INFO] 
[INFO] --- jacoco-maven-plugin:0.5.6.201201232323:prepare-agent (default) @ org.eclipse.acceleo.examples ---
[INFO] argLine set to -javaagent:/home/hudson/genie.modeling.acceleo/.hudson/jobs/acceleo-master-gerrit/workspace/.maven/repo/org/jacoco/org.jacoco.agent/0.5.6.201201232323/org.jacoco.agent-0.5.6.201201232323-runtime.jar=destfile=/jobs/genie.modeling.acceleo/acceleo-master-gerrit/workspace/features/org.eclipse.acceleo.examples-feature/target/jacoco.exec,append=true
[INFO] 
[INFO] --- tycho-source-plugin:0.19.0:plugin-source (plugin-source) @ org.eclipse.acceleo.examples ---
[INFO] 
[INFO] --- tycho-packaging-plugin:0.19.0:package-feature (default-package-feature) @ org.eclipse.acceleo.examples ---
[INFO] Building jar: /jobs/genie.modeling.acceleo/acceleo-master-gerrit/workspace/features/org.eclipse.acceleo.examples-feature/target/org.eclipse.acceleo.examples-3.6.0-SNAPSHOT.jar
[INFO] 
[INFO] --- tycho-p2-plugin:0.19.0:p2-metadata-default (default-p2-metadata-default) @ org.eclipse.acceleo.examples ---
[INFO] 
[INFO] --- tycho-p2-plugin:0.19.0:feature-p2-metadata (default-feature-p2-metadata) @ org.eclipse.acceleo.examples ---
[INFO] 
[INFO] --- tycho-source-feature-plugin:0.19.0:source-feature (source-feature) @ org.eclipse.acceleo.examples ---
[INFO] Building jar: /jobs/genie.modeling.acceleo/acceleo-master-gerrit/workspace/features/org.eclipse.acceleo.examples-feature/target/org.eclipse.acceleo.examples-3.6.0-SNAPSHOT-sources-feature.jar
[INFO] 
[INFO] --- tycho-p2-plugin:0.19.0:p2-metadata (attach-p2-metadata) @ org.eclipse.acceleo.examples ---
[INFO] 
[INFO] --- maven-checkstyle-plugin:2.7:checkstyle (check my sources) @ org.eclipse.acceleo.examples ---
[INFO] 
[INFO] >>> findbugs-maven-plugin:2.3.2:check (default) > :findbugs @ org.eclipse.acceleo.examples >>>
[INFO] 
[INFO] --- findbugs-maven-plugin:2.3.2:findbugs (findbugs) @ org.eclipse.acceleo.examples ---
[INFO] ****** FindBugsMojo execute *******
[INFO] canGenerate is false
[INFO] 
[INFO] <<< findbugs-maven-plugin:2.3.2:check (default) < :findbugs @ org.eclipse.acceleo.examples <<<
[INFO] 
[INFO] --- findbugs-maven-plugin:2.3.2:check (default) @ org.eclipse.acceleo.examples ---
[INFO] 
[INFO] >>> maven-pmd-plugin:2.5:cpd-check (default) > :cpd @ org.eclipse.acceleo.examples >>>
[INFO] 
[INFO] --- maven-pmd-plugin:2.5:cpd (cpd) @ org.eclipse.acceleo.examples ---
[WARNING] Unable to locate Source XRef to link to - DISABLED
[INFO] 
[INFO] <<< maven-pmd-plugin:2.5:cpd-check (default) < :cpd @ org.eclipse.acceleo.examples <<<
[INFO] 
[INFO] --- maven-pmd-plugin:2.5:cpd-check (default) @ org.eclipse.acceleo.examples ---
[INFO] 
[INFO]                                                                         
[INFO] ------------------------------------------------------------------------
[INFO] Building Acceleo Runtime Feature 3.6.0-SNAPSHOT
[INFO] ------------------------------------------------------------------------
[INFO] 
[INFO] --- maven-clean-plugin:2.5:clean (default-clean) @ org.eclipse.acceleo.runtime ---
[INFO] Deleting /jobs/genie.modeling.acceleo/acceleo-master-gerrit/workspace/features/org.eclipse.acceleo.runtime-feature/target
[INFO] 
[INFO] --- tycho-packaging-plugin:0.19.0:build-qualifier-aggregator (default-build-qualifier-aggregator) @ org.eclipse.acceleo.runtime ---
[INFO] The project's OSGi version is 3.6.0.201501270956
[INFO] 
[INFO] --- tycho-packaging-plugin:0.19.0:validate-id (default-validate-id) @ org.eclipse.acceleo.runtime ---
[INFO] 
[INFO] --- tycho-packaging-plugin:0.19.0:validate-version (default-validate-version) @ org.eclipse.acceleo.runtime ---
[INFO] 
[INFO] --- jacoco-maven-plugin:0.5.6.201201232323:prepare-agent (default) @ org.eclipse.acceleo.runtime ---
[INFO] argLine set to -javaagent:/home/hudson/genie.modeling.acceleo/.hudson/jobs/acceleo-master-gerrit/workspace/.maven/repo/org/jacoco/org.jacoco.agent/0.5.6.201201232323/org.jacoco.agent-0.5.6.201201232323-runtime.jar=destfile=/jobs/genie.modeling.acceleo/acceleo-master-gerrit/workspace/features/org.eclipse.acceleo.runtime-feature/target/jacoco.exec,append=true
[INFO] 
[INFO] --- tycho-source-plugin:0.19.0:plugin-source (plugin-source) @ org.eclipse.acceleo.runtime ---
[INFO] 
[INFO] --- tycho-packaging-plugin:0.19.0:package-feature (default-package-feature) @ org.eclipse.acceleo.runtime ---
[INFO] Building jar: /jobs/genie.modeling.acceleo/acceleo-master-gerrit/workspace/features/org.eclipse.acceleo.runtime-feature/target/org.eclipse.acceleo.runtime-3.6.0-SNAPSHOT.jar
[INFO] 
[INFO] --- tycho-p2-plugin:0.19.0:p2-metadata-default (default-p2-metadata-default) @ org.eclipse.acceleo.runtime ---
[INFO] 
[INFO] --- tycho-p2-plugin:0.19.0:feature-p2-metadata (default-feature-p2-metadata) @ org.eclipse.acceleo.runtime ---
[INFO] 
[INFO] --- tycho-source-feature-plugin:0.19.0:source-feature (source-feature) @ org.eclipse.acceleo.runtime ---
[INFO] Building jar: /jobs/genie.modeling.acceleo/acceleo-master-gerrit/workspace/features/org.eclipse.acceleo.runtime-feature/target/org.eclipse.acceleo.runtime-3.6.0-SNAPSHOT-sources-feature.jar
[INFO] license.html already added, skipping
[INFO] epl-v10.html already added, skipping
[INFO] 
[INFO] --- tycho-p2-plugin:0.19.0:p2-metadata (attach-p2-metadata) @ org.eclipse.acceleo.runtime ---
[INFO] 
[INFO] --- maven-checkstyle-plugin:2.7:checkstyle (check my sources) @ org.eclipse.acceleo.runtime ---
[INFO] 
[INFO] >>> findbugs-maven-plugin:2.3.2:check (default) > :findbugs @ org.eclipse.acceleo.runtime >>>
[INFO] 
[INFO] --- findbugs-maven-plugin:2.3.2:findbugs (findbugs) @ org.eclipse.acceleo.runtime ---
[INFO] ****** FindBugsMojo execute *******
[INFO] canGenerate is false
[INFO] 
[INFO] <<< findbugs-maven-plugin:2.3.2:check (default) < :findbugs @ org.eclipse.acceleo.runtime <<<
[INFO] 
[INFO] --- findbugs-maven-plugin:2.3.2:check (default) @ org.eclipse.acceleo.runtime ---
[INFO] 
[INFO] >>> maven-pmd-plugin:2.5:cpd-check (default) > :cpd @ org.eclipse.acceleo.runtime >>>
[INFO] 
[INFO] --- maven-pmd-plugin:2.5:cpd (cpd) @ org.eclipse.acceleo.runtime ---
[WARNING] Unable to locate Source XRef to link to - DISABLED
[INFO] 
[INFO] <<< maven-pmd-plugin:2.5:cpd-check (default) < :cpd @ org.eclipse.acceleo.runtime <<<
[INFO] 
[INFO] --- maven-pmd-plugin:2.5:cpd-check (default) @ org.eclipse.acceleo.runtime ---
[INFO] 
[INFO]                                                                         
[INFO] ------------------------------------------------------------------------
[INFO] Building Acceleo UI Capabilities Feature 3.6.0-SNAPSHOT
[INFO] ------------------------------------------------------------------------
[INFO] 
[INFO] --- maven-clean-plugin:2.5:clean (default-clean) @ org.eclipse.acceleo.ui.capabilities ---
[INFO] Deleting /jobs/genie.modeling.acceleo/acceleo-master-gerrit/workspace/features/org.eclipse.acceleo.ui.capabilities-feature/target
[INFO] 
[INFO] --- tycho-packaging-plugin:0.19.0:build-qualifier-aggregator (default-build-qualifier-aggregator) @ org.eclipse.acceleo.ui.capabilities ---
[INFO] The project's OSGi version is 3.6.0.201501270956
[INFO] 
[INFO] --- tycho-packaging-plugin:0.19.0:validate-id (default-validate-id) @ org.eclipse.acceleo.ui.capabilities ---
[INFO] 
[INFO] --- tycho-packaging-plugin:0.19.0:validate-version (default-validate-version) @ org.eclipse.acceleo.ui.capabilities ---
[INFO] 
[INFO] --- jacoco-maven-plugin:0.5.6.201201232323:prepare-agent (default) @ org.eclipse.acceleo.ui.capabilities ---
[INFO] argLine set to -javaagent:/home/hudson/genie.modeling.acceleo/.hudson/jobs/acceleo-master-gerrit/workspace/.maven/repo/org/jacoco/org.jacoco.agent/0.5.6.201201232323/org.jacoco.agent-0.5.6.201201232323-runtime.jar=destfile=/jobs/genie.modeling.acceleo/acceleo-master-gerrit/workspace/features/org.eclipse.acceleo.ui.capabilities-feature/target/jacoco.exec,append=true
[INFO] 
[INFO] --- tycho-source-plugin:0.19.0:plugin-source (plugin-source) @ org.eclipse.acceleo.ui.capabilities ---
[INFO] 
[INFO] --- tycho-packaging-plugin:0.19.0:package-feature (default-package-feature) @ org.eclipse.acceleo.ui.capabilities ---
[INFO] Building jar: /jobs/genie.modeling.acceleo/acceleo-master-gerrit/workspace/features/org.eclipse.acceleo.ui.capabilities-feature/target/org.eclipse.acceleo.ui.capabilities-3.6.0-SNAPSHOT.jar
[INFO] 
[INFO] --- tycho-p2-plugin:0.19.0:p2-metadata-default (default-p2-metadata-default) @ org.eclipse.acceleo.ui.capabilities ---
[INFO] 
[INFO] --- tycho-p2-plugin:0.19.0:feature-p2-metadata (default-feature-p2-metadata) @ org.eclipse.acceleo.ui.capabilities ---
[INFO] 
[INFO] --- tycho-source-feature-plugin:0.19.0:source-feature (source-feature) @ org.eclipse.acceleo.ui.capabilities ---
[INFO] Building jar: /jobs/genie.modeling.acceleo/acceleo-master-gerrit/workspace/features/org.eclipse.acceleo.ui.capabilities-feature/target/org.eclipse.acceleo.ui.capabilities-3.6.0-SNAPSHOT-sources-feature.jar
[INFO] 
[INFO] --- tycho-p2-plugin:0.19.0:p2-metadata (attach-p2-metadata) @ org.eclipse.acceleo.ui.capabilities ---
[INFO] 
[INFO] --- maven-checkstyle-plugin:2.7:checkstyle (check my sources) @ org.eclipse.acceleo.ui.capabilities ---
[INFO] 
[INFO] >>> findbugs-maven-plugin:2.3.2:check (default) > :findbugs @ org.eclipse.acceleo.ui.capabilities >>>
[INFO] 
[INFO] --- findbugs-maven-plugin:2.3.2:findbugs (findbugs) @ org.eclipse.acceleo.ui.capabilities ---
[INFO] ****** FindBugsMojo execute *******
[INFO] canGenerate is false
[INFO] 
[INFO] <<< findbugs-maven-plugin:2.3.2:check (default) < :findbugs @ org.eclipse.acceleo.ui.capabilities <<<
[INFO] 
[INFO] --- findbugs-maven-plugin:2.3.2:check (default) @ org.eclipse.acceleo.ui.capabilities ---
[INFO] 
[INFO] >>> maven-pmd-plugin:2.5:cpd-check (default) > :cpd @ org.eclipse.acceleo.ui.capabilities >>>
[INFO] 
[INFO] --- maven-pmd-plugin:2.5:cpd (cpd) @ org.eclipse.acceleo.ui.capabilities ---
[WARNING] Unable to locate Source XRef to link to - DISABLED
[INFO] 
[INFO] <<< maven-pmd-plugin:2.5:cpd-check (default) < :cpd @ org.eclipse.acceleo.ui.capabilities <<<
[INFO] 
[INFO] --- maven-pmd-plugin:2.5:cpd-check (default) @ org.eclipse.acceleo.ui.capabilities ---
[INFO] 
[INFO]                                                                         
[INFO] ------------------------------------------------------------------------
[INFO] Building Acceleo SDK Feature 3.6.0-SNAPSHOT
[INFO] ------------------------------------------------------------------------
[INFO] 
[INFO] --- maven-clean-plugin:2.5:clean (default-clean) @ org.eclipse.acceleo.sdk ---
[INFO] Deleting /jobs/genie.modeling.acceleo/acceleo-master-gerrit/workspace/features/org.eclipse.acceleo.sdk-feature/target
[INFO] 
[INFO] --- tycho-packaging-plugin:0.19.0:build-qualifier-aggregator (default-build-qualifier-aggregator) @ org.eclipse.acceleo.sdk ---
[INFO] The project's OSGi version is 3.6.0.201501270956
[INFO] 
[INFO] --- tycho-packaging-plugin:0.19.0:validate-id (default-validate-id) @ org.eclipse.acceleo.sdk ---
[INFO] 
[INFO] --- tycho-packaging-plugin:0.19.0:validate-version (default-validate-version) @ org.eclipse.acceleo.sdk ---
[INFO] 
[INFO] --- jacoco-maven-plugin:0.5.6.201201232323:prepare-agent (default) @ org.eclipse.acceleo.sdk ---
[INFO] argLine set to -javaagent:/home/hudson/genie.modeling.acceleo/.hudson/jobs/acceleo-master-gerrit/workspace/.maven/repo/org/jacoco/org.jacoco.agent/0.5.6.201201232323/org.jacoco.agent-0.5.6.201201232323-runtime.jar=destfile=/jobs/genie.modeling.acceleo/acceleo-master-gerrit/workspace/features/org.eclipse.acceleo.sdk-feature/target/jacoco.exec,append=true
[INFO] 
[INFO] --- tycho-source-plugin:0.19.0:plugin-source (plugin-source) @ org.eclipse.acceleo.sdk ---
[INFO] 
[INFO] --- tycho-packaging-plugin:0.19.0:package-feature (default-package-feature) @ org.eclipse.acceleo.sdk ---
[INFO] Building jar: /jobs/genie.modeling.acceleo/acceleo-master-gerrit/workspace/features/org.eclipse.acceleo.sdk-feature/target/org.eclipse.acceleo.sdk-3.6.0-SNAPSHOT.jar
[INFO] 
[INFO] --- tycho-p2-plugin:0.19.0:p2-metadata-default (default-p2-metadata-default) @ org.eclipse.acceleo.sdk ---
[INFO] 
[INFO] --- tycho-p2-plugin:0.19.0:feature-p2-metadata (default-feature-p2-metadata) @ org.eclipse.acceleo.sdk ---
[INFO] 
[INFO] --- tycho-source-feature-plugin:0.19.0:source-feature (source-feature) @ org.eclipse.acceleo.sdk ---
[INFO] Building jar: /jobs/genie.modeling.acceleo/acceleo-master-gerrit/workspace/features/org.eclipse.acceleo.sdk-feature/target/org.eclipse.acceleo.sdk-3.6.0-SNAPSHOT-sources-feature.jar
[INFO] 
[INFO] --- tycho-p2-plugin:0.19.0:p2-metadata (attach-p2-metadata) @ org.eclipse.acceleo.sdk ---
[INFO] 
[INFO] --- maven-checkstyle-plugin:2.7:checkstyle (check my sources) @ org.eclipse.acceleo.sdk ---
[INFO] 
[INFO] >>> findbugs-maven-plugin:2.3.2:check (default) > :findbugs @ org.eclipse.acceleo.sdk >>>
[INFO] 
[INFO] --- findbugs-maven-plugin:2.3.2:findbugs (findbugs) @ org.eclipse.acceleo.sdk ---
[INFO] ****** FindBugsMojo execute *******
[INFO] canGenerate is false
[INFO] 
[INFO] <<< findbugs-maven-plugin:2.3.2:check (default) < :findbugs @ org.eclipse.acceleo.sdk <<<
[INFO] 
[INFO] --- findbugs-maven-plugin:2.3.2:check (default) @ org.eclipse.acceleo.sdk ---
[INFO] 
[INFO] >>> maven-pmd-plugin:2.5:cpd-check (default) > :cpd @ org.eclipse.acceleo.sdk >>>
[INFO] 
[INFO] --- maven-pmd-plugin:2.5:cpd (cpd) @ org.eclipse.acceleo.sdk ---
[WARNING] Unable to locate Source XRef to link to - DISABLED
[INFO] 
[INFO] <<< maven-pmd-plugin:2.5:cpd-check (default) < :cpd @ org.eclipse.acceleo.sdk <<<
[INFO] 
[INFO] --- maven-pmd-plugin:2.5:cpd-check (default) @ org.eclipse.acceleo.sdk ---
[INFO] 
[INFO]                                                                         
[INFO] ------------------------------------------------------------------------
[INFO] Building OCL Interpreter Feature 3.6.0-SNAPSHOT
[INFO] ------------------------------------------------------------------------
[INFO] 
[INFO] --- maven-clean-plugin:2.5:clean (default-clean) @ org.eclipse.acceleo.ui.interpreter.ocl ---
[INFO] Deleting /jobs/genie.modeling.acceleo/acceleo-master-gerrit/workspace/features/org.eclipse.acceleo.ui.interpreter.ocl-feature/target
[INFO] 
[INFO] --- tycho-packaging-plugin:0.19.0:build-qualifier-aggregator (default-build-qualifier-aggregator) @ org.eclipse.acceleo.ui.interpreter.ocl ---
[INFO] The project's OSGi version is 3.6.0.201501270956
[INFO] 
[INFO] --- tycho-packaging-plugin:0.19.0:validate-id (default-validate-id) @ org.eclipse.acceleo.ui.interpreter.ocl ---
[INFO] 
[INFO] --- tycho-packaging-plugin:0.19.0:validate-version (default-validate-version) @ org.eclipse.acceleo.ui.interpreter.ocl ---
[INFO] 
[INFO] --- jacoco-maven-plugin:0.5.6.201201232323:prepare-agent (default) @ org.eclipse.acceleo.ui.interpreter.ocl ---
[INFO] argLine set to -javaagent:/home/hudson/genie.modeling.acceleo/.hudson/jobs/acceleo-master-gerrit/workspace/.maven/repo/org/jacoco/org.jacoco.agent/0.5.6.201201232323/org.jacoco.agent-0.5.6.201201232323-runtime.jar=destfile=/jobs/genie.modeling.acceleo/acceleo-master-gerrit/workspace/features/org.eclipse.acceleo.ui.interpreter.ocl-feature/target/jacoco.exec,append=true
[INFO] 
[INFO] --- tycho-source-plugin:0.19.0:plugin-source (plugin-source) @ org.eclipse.acceleo.ui.interpreter.ocl ---
[INFO] 
[INFO] --- tycho-packaging-plugin:0.19.0:package-feature (default-package-feature) @ org.eclipse.acceleo.ui.interpreter.ocl ---
[INFO] Building jar: /jobs/genie.modeling.acceleo/acceleo-master-gerrit/workspace/features/org.eclipse.acceleo.ui.interpreter.ocl-feature/target/org.eclipse.acceleo.ui.interpreter.ocl-3.6.0-SNAPSHOT.jar
[INFO] 
[INFO] --- tycho-p2-plugin:0.19.0:p2-metadata-default (default-p2-metadata-default) @ org.eclipse.acceleo.ui.interpreter.ocl ---
[INFO] 
[INFO] --- tycho-p2-plugin:0.19.0:feature-p2-metadata (default-feature-p2-metadata) @ org.eclipse.acceleo.ui.interpreter.ocl ---
[INFO] 
[INFO] --- tycho-source-feature-plugin:0.19.0:source-feature (source-feature) @ org.eclipse.acceleo.ui.interpreter.ocl ---
[INFO] Building jar: /jobs/genie.modeling.acceleo/acceleo-master-gerrit/workspace/features/org.eclipse.acceleo.ui.interpreter.ocl-feature/target/org.eclipse.acceleo.ui.interpreter.ocl-3.6.0-SNAPSHOT-sources-feature.jar
[INFO] 
[INFO] --- tycho-p2-plugin:0.19.0:p2-metadata (attach-p2-metadata) @ org.eclipse.acceleo.ui.interpreter.ocl ---
[INFO] 
[INFO] --- maven-checkstyle-plugin:2.7:checkstyle (check my sources) @ org.eclipse.acceleo.ui.interpreter.ocl ---
[INFO] 
[INFO] >>> findbugs-maven-plugin:2.3.2:check (default) > :findbugs @ org.eclipse.acceleo.ui.interpreter.ocl >>>
[INFO] 
[INFO] --- findbugs-maven-plugin:2.3.2:findbugs (findbugs) @ org.eclipse.acceleo.ui.interpreter.ocl ---
[INFO] ****** FindBugsMojo execute *******
[INFO] canGenerate is false
[INFO] 
[INFO] <<< findbugs-maven-plugin:2.3.2:check (default) < :findbugs @ org.eclipse.acceleo.ui.interpreter.ocl <<<
[INFO] 
[INFO] --- findbugs-maven-plugin:2.3.2:check (default) @ org.eclipse.acceleo.ui.interpreter.ocl ---
[INFO] 
[INFO] >>> maven-pmd-plugin:2.5:cpd-check (default) > :cpd @ org.eclipse.acceleo.ui.interpreter.ocl >>>
[INFO] 
[INFO] --- maven-pmd-plugin:2.5:cpd (cpd) @ org.eclipse.acceleo.ui.interpreter.ocl ---
[WARNING] Unable to locate Source XRef to link to - DISABLED
[INFO] 
[INFO] <<< maven-pmd-plugin:2.5:cpd-check (default) < :cpd @ org.eclipse.acceleo.ui.interpreter.ocl <<<
[INFO] 
[INFO] --- maven-pmd-plugin:2.5:cpd-check (default) @ org.eclipse.acceleo.ui.interpreter.ocl ---
[INFO] 
[INFO]                                                                         
[INFO] ------------------------------------------------------------------------
[INFO] Building Complete OCL Interpreter Feature 3.6.0-SNAPSHOT
[INFO] ------------------------------------------------------------------------
[INFO] 
[INFO] --- maven-clean-plugin:2.5:clean (default-clean) @ org.eclipse.acceleo.ui.interpreter.completeocl ---
[INFO] Deleting /jobs/genie.modeling.acceleo/acceleo-master-gerrit/workspace/features/org.eclipse.acceleo.ui.interpreter.completeocl-feature/target
[INFO] 
[INFO] --- tycho-packaging-plugin:0.19.0:build-qualifier-aggregator (default-build-qualifier-aggregator) @ org.eclipse.acceleo.ui.interpreter.completeocl ---
[INFO] The project's OSGi version is 3.6.0.201501270956
[INFO] 
[INFO] --- tycho-packaging-plugin:0.19.0:validate-id (default-validate-id) @ org.eclipse.acceleo.ui.interpreter.completeocl ---
[INFO] 
[INFO] --- tycho-packaging-plugin:0.19.0:validate-version (default-validate-version) @ org.eclipse.acceleo.ui.interpreter.completeocl ---
[INFO] 
[INFO] --- jacoco-maven-plugin:0.5.6.201201232323:prepare-agent (default) @ org.eclipse.acceleo.ui.interpreter.completeocl ---
[INFO] argLine set to -javaagent:/home/hudson/genie.modeling.acceleo/.hudson/jobs/acceleo-master-gerrit/workspace/.maven/repo/org/jacoco/org.jacoco.agent/0.5.6.201201232323/org.jacoco.agent-0.5.6.201201232323-runtime.jar=destfile=/jobs/genie.modeling.acceleo/acceleo-master-gerrit/workspace/features/org.eclipse.acceleo.ui.interpreter.completeocl-feature/target/jacoco.exec,append=true
[INFO] 
[INFO] --- tycho-source-plugin:0.19.0:plugin-source (plugin-source) @ org.eclipse.acceleo.ui.interpreter.completeocl ---
[INFO] 
[INFO] --- tycho-packaging-plugin:0.19.0:package-feature (default-package-feature) @ org.eclipse.acceleo.ui.interpreter.completeocl ---
[INFO] Building jar: /jobs/genie.modeling.acceleo/acceleo-master-gerrit/workspace/features/org.eclipse.acceleo.ui.interpreter.completeocl-feature/target/org.eclipse.acceleo.ui.interpreter.completeocl-3.6.0-SNAPSHOT.jar
[INFO] 
[INFO] --- tycho-p2-plugin:0.19.0:p2-metadata-default (default-p2-metadata-default) @ org.eclipse.acceleo.ui.interpreter.completeocl ---
[INFO] 
[INFO] --- tycho-p2-plugin:0.19.0:feature-p2-metadata (default-feature-p2-metadata) @ org.eclipse.acceleo.ui.interpreter.completeocl ---
[INFO] 
[INFO] --- tycho-source-feature-plugin:0.19.0:source-feature (source-feature) @ org.eclipse.acceleo.ui.interpreter.completeocl ---
[INFO] Building jar: /jobs/genie.modeling.acceleo/acceleo-master-gerrit/workspace/features/org.eclipse.acceleo.ui.interpreter.completeocl-feature/target/org.eclipse.acceleo.ui.interpreter.completeocl-3.6.0-SNAPSHOT-sources-feature.jar
[INFO] 
[INFO] --- tycho-p2-plugin:0.19.0:p2-metadata (attach-p2-metadata) @ org.eclipse.acceleo.ui.interpreter.completeocl ---
[INFO] 
[INFO] --- maven-checkstyle-plugin:2.7:checkstyle (check my sources) @ org.eclipse.acceleo.ui.interpreter.completeocl ---
[INFO] 
[INFO] >>> findbugs-maven-plugin:2.3.2:check (default) > :findbugs @ org.eclipse.acceleo.ui.interpreter.completeocl >>>
[INFO] 
[INFO] --- findbugs-maven-plugin:2.3.2:findbugs (findbugs) @ org.eclipse.acceleo.ui.interpreter.completeocl ---
[INFO] ****** FindBugsMojo execute *******
[INFO] canGenerate is false
[INFO] 
[INFO] <<< findbugs-maven-plugin:2.3.2:check (default) < :findbugs @ org.eclipse.acceleo.ui.interpreter.completeocl <<<
[INFO] 
[INFO] --- findbugs-maven-plugin:2.3.2:check (default) @ org.eclipse.acceleo.ui.interpreter.completeocl ---
[INFO] 
[INFO] >>> maven-pmd-plugin:2.5:cpd-check (default) > :cpd @ org.eclipse.acceleo.ui.interpreter.completeocl >>>
[INFO] 
[INFO] --- maven-pmd-plugin:2.5:cpd (cpd) @ org.eclipse.acceleo.ui.interpreter.completeocl ---
[WARNING] Unable to locate Source XRef to link to - DISABLED
[INFO] 
[INFO] <<< maven-pmd-plugin:2.5:cpd-check (default) < :cpd @ org.eclipse.acceleo.ui.interpreter.completeocl <<<
[INFO] 
[INFO] --- maven-pmd-plugin:2.5:cpd-check (default) @ org.eclipse.acceleo.ui.interpreter.completeocl ---
[INFO] 
[INFO]                                                                         
[INFO] ------------------------------------------------------------------------
[INFO] Building Acceleo Repository 3.5.0-SNAPSHOT
[INFO] ------------------------------------------------------------------------
[INFO] 
[INFO] --- maven-clean-plugin:2.5:clean (default-clean) @ org.eclipse.acceleo-updatesite ---
[INFO] 
[INFO] --- tycho-packaging-plugin:0.19.0:build-qualifier-aggregator (default-build-qualifier-aggregator) @ org.eclipse.acceleo-updatesite ---
[INFO] The project's OSGi version is 3.5.0.201501270956
[INFO] 
[INFO] --- maven-resources-plugin:2.4.1:copy-resources (copy-resources) @ org.eclipse.acceleo-updatesite ---
[INFO] Using 'ISO-8859-1' encoding to copy filtered resources.
[INFO] Copying 0 resource
[INFO] 
[INFO] --- maven-clean-plugin:2.5:clean (default-clean-1) @ org.eclipse.acceleo-updatesite ---
[INFO] Deleting /jobs/genie.modeling.acceleo/acceleo-master-gerrit/workspace/releng/org.eclipse.acceleo-updatesite/target
[INFO] 
[INFO] --- jacoco-maven-plugin:0.5.6.201201232323:prepare-agent (default) @ org.eclipse.acceleo-updatesite ---
[INFO] argLine set to -javaagent:/home/hudson/genie.modeling.acceleo/.hudson/jobs/acceleo-master-gerrit/workspace/.maven/repo/org/jacoco/org.jacoco.agent/0.5.6.201201232323/org.jacoco.agent-0.5.6.201201232323-runtime.jar=destfile=/jobs/genie.modeling.acceleo/acceleo-master-gerrit/workspace/releng/org.eclipse.acceleo-updatesite/target/jacoco.exec,append=true
[INFO] 
[INFO] --- tycho-source-plugin:0.19.0:plugin-source (plugin-source) @ org.eclipse.acceleo-updatesite ---
[INFO] 
[INFO] --- tycho-p2-publisher-plugin:0.19.0:publish-products (default-publish-products) @ org.eclipse.acceleo-updatesite ---
[INFO] 
[INFO] --- tycho-p2-publisher-plugin:0.19.0:publish-categories (default-publish-categories) @ org.eclipse.acceleo-updatesite ---
[INFO] 
[INFO] --- tycho-p2-publisher-plugin:0.19.0:attach-artifacts (default-attach-artifacts) @ org.eclipse.acceleo-updatesite ---
[INFO] 
[INFO] --- tycho-p2-repository-plugin:0.19.0:assemble-repository (default-assemble-repository) @ org.eclipse.acceleo-updatesite ---
[INFO] 
[INFO] --- tycho-p2-repository-plugin:0.19.0:archive-repository (default-archive-repository) @ org.eclipse.acceleo-updatesite ---
[INFO] Building zip: /jobs/genie.modeling.acceleo/acceleo-master-gerrit/workspace/releng/org.eclipse.acceleo-updatesite/target/org.eclipse.acceleo-updatesite.zip
[INFO] 
[INFO] --- tycho-source-feature-plugin:0.19.0:source-feature (source-feature) @ org.eclipse.acceleo-updatesite ---
[INFO] 
[INFO] --- tycho-p2-plugin:0.19.0:p2-metadata (attach-p2-metadata) @ org.eclipse.acceleo-updatesite ---
[INFO] 
[INFO] --- maven-checkstyle-plugin:2.7:checkstyle (check my sources) @ org.eclipse.acceleo-updatesite ---
[INFO] 
[INFO] >>> findbugs-maven-plugin:2.3.2:check (default) > :findbugs @ org.eclipse.acceleo-updatesite >>>
[INFO] 
[INFO] --- findbugs-maven-plugin:2.3.2:findbugs (findbugs) @ org.eclipse.acceleo-updatesite ---
[INFO] ****** FindBugsMojo execute *******
[INFO] canGenerate is false
[INFO] 
[INFO] <<< findbugs-maven-plugin:2.3.2:check (default) < :findbugs @ org.eclipse.acceleo-updatesite <<<
[INFO] 
[INFO] --- findbugs-maven-plugin:2.3.2:check (default) @ org.eclipse.acceleo-updatesite ---
[INFO] 
[INFO] >>> maven-pmd-plugin:2.5:cpd-check (default) > :cpd @ org.eclipse.acceleo-updatesite >>>
[INFO] 
[INFO] --- maven-pmd-plugin:2.5:cpd (cpd) @ org.eclipse.acceleo-updatesite ---
[WARNING] Unable to locate Source XRef to link to - DISABLED
[INFO] 
[INFO] <<< maven-pmd-plugin:2.5:cpd-check (default) < :cpd @ org.eclipse.acceleo-updatesite <<<
[INFO] 
[INFO] --- maven-pmd-plugin:2.5:cpd-check (default) @ org.eclipse.acceleo-updatesite ---
[INFO] 
[INFO] 
[INFO] --- maven-antrun-plugin:1.3:run (prepare_promotion) @ org.eclipse.acceleo-updatesite ---
[INFO] Executing tasks
    [mkdir] Created dir: /jobs/genie.modeling.acceleo/acceleo-master-gerrit/workspace/releng/org.eclipse.acceleo-updatesite/target/promotion
     [copy] Copying 1 file to /jobs/genie.modeling.acceleo/acceleo-master-gerrit/workspace/releng/org.eclipse.acceleo-updatesite/target/promotion
     [copy] Copying 1 file to /jobs/genie.modeling.acceleo/acceleo-master-gerrit/workspace/releng/org.eclipse.acceleo-updatesite/target/promotion
[INFO] Executed tasks
[INFO] ------------------------------------------------------------------------
[INFO] Reactor Summary:
[INFO] 
[INFO] Acceleo Parent ..................................... SUCCESS [ 26.108 s]
[INFO] org.eclipse.acceleo.query .......................... SUCCESS [ 26.308 s]
[INFO] org.eclipse.acceleo.query.ide.ui ................... SUCCESS [  5.920 s]
[INFO] org.eclipse.acceleo.query .......................... SUCCESS [  0.370 s]
[INFO] Acceleo Common ..................................... SUCCESS [ 12.666 s]
[INFO] org.eclipse.acceleo.query.tests.qmodel ............. SUCCESS [ 10.637 s]
[INFO] org.eclipse.acceleo.query.tests.anydsl ............. SUCCESS [ 11.605 s]
[INFO] org.eclipse.acceleo.query.tests .................... FAILURE [ 30.584 s]
[INFO] org.eclipse.acceleo.query.ide.ui.tests ............. SUCCESS [ 18.501 s]
[INFO] org.eclipse.acceleo.query.tests.anydsl.edit ........ SUCCESS [  6.698 s]
[INFO] org.eclipse.acceleo.query.tests.anydsl.editor ...... SUCCESS [  9.873 s]
[INFO] Acceleo Common UI .................................. SUCCESS [  7.405 s]
[INFO] Acceleo Model ...................................... SUCCESS [ 13.625 s]
[INFO] Acceleo Model Edit ................................. SUCCESS [ 10.098 s]
[INFO] Acceleo Profiler ................................... SUCCESS [  7.581 s]
[INFO] Acceleo Profiler Edit .............................. SUCCESS [  7.312 s]
[INFO] Acceleo Profiler Editor ............................ SUCCESS [  8.253 s]
[INFO] Acceleo Parser ..................................... SUCCESS [ 22.958 s]
[INFO] Acceleo Engine ..................................... SUCCESS [ 16.105 s]
[INFO] Acceleo Traceability Model ......................... SUCCESS [ 11.580 s]
[INFO] Acceleo Traceability ............................... SUCCESS [ 12.686 s]
[INFO] Acceleo UI Interpreter ............................. SUCCESS [ 14.611 s]
[INFO] Acceleo Compatibility .............................. SUCCESS [ 13.026 s]
[INFO] Acceleo IDE UI ..................................... SUCCESS [ 38.862 s]
[INFO] Acceleo Compatibility UI ........................... SUCCESS [  7.621 s]
[INFO] Acceleo UI Capabilities ............................ SUCCESS [  0.708 s]
[INFO] OCL Interpreter .................................... SUCCESS [  7.856 s]
[INFO] CompleteOCL Interpreter ............................ SUCCESS [ 12.170 s]
[INFO] CompleteOCL Interpreter Edit ....................... SUCCESS [  7.898 s]
[INFO] Acceleo Examples ................................... SUCCESS [  6.645 s]
[INFO] Acceleo Documentation .............................. SUCCESS [  0.557 s]
[INFO] Acceleo Common Tests ............................... SUCCESS [ 16.009 s]
[INFO] Acceleo Engine Tests ............................... SUCCESS [ 13.384 s]
[INFO] Acceleo Dynamic Tests .............................. SUCCESS [  0.763 s]
[INFO] Acceleo Compatibility Tests ........................ SUCCESS [  9.387 s]
[INFO] Acceleo IDE UI Tests ............................... SUCCESS [ 10.865 s]
[INFO] Acceleo Model Tests ................................ SUCCESS [  9.608 s]
[INFO] Acceleo Parser Tests ............................... SUCCESS [ 18.819 s]
[INFO] Acceleo Traceability Tests ......................... SUCCESS [ 18.924 s]
[INFO] Acceleo Tests ...................................... SUCCESS [ 54.750 s]
[INFO] Acceleo Documentation Feature ...................... SUCCESS [  0.167 s]
[INFO] Acceleo Feature .................................... SUCCESS [  0.588 s]
[INFO] Acceleo Example Feature ............................ SUCCESS [  0.219 s]
[INFO] Acceleo Runtime Feature ............................ SUCCESS [  0.305 s]
[INFO] Acceleo UI Capabilities Feature .................... SUCCESS [  0.195 s]
[INFO] Acceleo SDK Feature ................................ SUCCESS [  0.297 s]
[INFO] OCL Interpreter Feature ............................ SUCCESS [  0.218 s]
[INFO] Complete OCL Interpreter Feature ................... SUCCESS [  0.253 s]
[INFO] Acceleo Repository ................................. SUCCESS [ 28.797 s]
[INFO] ------------------------------------------------------------------------
[INFO] BUILD FAILURE
[INFO] ------------------------------------------------------------------------
[INFO] Total time: 13:31 min
[INFO] Finished at: 2015-01-27T05:06:02-05:00
[INFO] Final Memory: 208M/2150M
[INFO] ------------------------------------------------------------------------
[INFO] o.h.m.e.h.MavenExecutionResultHandler - Build failed with exception(s)
[INFO] o.h.m.e.h.MavenExecutionResultHandler - [1] org.apache.maven.lifecycle.LifecycleExecutionException: Failed to execute goal org.eclipse.tycho:tycho-surefire-plugin:0.19.0:test (default-test) on project org.eclipse.acceleo.query.tests: There are test failures.

Please refer to /jobs/genie.modeling.acceleo/acceleo-master-gerrit/workspace/query/tests/org.eclipse.acceleo.query.tests/target/surefire-reports for the individual test results.
[DEBUG] Closing connection to remote
[ERROR] Failed to execute goal org.eclipse.tycho:tycho-surefire-plugin:0.19.0:test (default-test) on project org.eclipse.acceleo.query.tests: There are test failures.
[ERROR] 
[ERROR] Please refer to /jobs/genie.modeling.acceleo/acceleo-master-gerrit/workspace/query/tests/org.eclipse.acceleo.query.tests/target/surefire-reports for the individual test results.
[ERROR] -> [Help 1]
org.apache.maven.lifecycle.LifecycleExecutionException: Failed to execute goal org.eclipse.tycho:tycho-surefire-plugin:0.19.0:test (default-test) on project org.eclipse.acceleo.query.tests: There are test failures.

Please refer to /jobs/genie.modeling.acceleo/acceleo-master-gerrit/workspace/query/tests/org.eclipse.acceleo.query.tests/target/surefire-reports for the individual test results.
	at org.apache.maven.lifecycle.internal.MojoExecutor.execute(MojoExecutor.java:212)
	at org.apache.maven.lifecycle.internal.MojoExecutor.execute(MojoExecutor.java:153)
	at org.apache.maven.lifecycle.internal.MojoExecutor.execute(MojoExecutor.java:145)
	at org.apache.maven.lifecycle.internal.LifecycleModuleBuilder.buildProject(LifecycleModuleBuilder.java:116)
	at org.apache.maven.lifecycle.internal.LifecycleModuleBuilder.buildProject(LifecycleModuleBuilder.java:80)
	at org.apache.maven.lifecycle.internal.builder.singlethreaded.SingleThreadedBuilder.build(SingleThreadedBuilder.java:51)
	at org.apache.maven.lifecycle.internal.LifecycleStarter.execute(LifecycleStarter.java:120)
	at org.apache.maven.DefaultMaven.doExecute(DefaultMaven.java:355)
	at org.apache.maven.DefaultMaven.execute(DefaultMaven.java:155)
	at org.apache.maven.cli.MavenCli.execute(MavenCli.java:584)
	at org.apache.maven.cli.MavenCli.doMain(MavenCli.java:216)
	at org.apache.maven.cli.MavenCli.main(MavenCli.java:160)
	at sun.reflect.NativeMethodAccessorImpl.invoke0(Native Method)
	at sun.reflect.NativeMethodAccessorImpl.invoke(NativeMethodAccessorImpl.java:57)
	at sun.reflect.DelegatingMethodAccessorImpl.invoke(DelegatingMethodAccessorImpl.java:43)
	at java.lang.reflect.Method.invoke(Method.java:606)
	at org.codehaus.plexus.classworlds.launcher.Launcher.launchEnhanced(Launcher.java:289)
	at org.codehaus.plexus.classworlds.launcher.Launcher.launch(Launcher.java:229)
	at org.codehaus.plexus.classworlds.launcher.Launcher.mainWithExitCode(Launcher.java:415)
	at org.codehaus.plexus.classworlds.launcher.Launcher.main(Launcher.java:356)
Caused by: org.apache.maven.plugin.MojoFailureException: There are test failures.

Please refer to /jobs/genie.modeling.acceleo/acceleo-master-gerrit/workspace/query/tests/org.eclipse.acceleo.query.tests/target/surefire-reports for the individual test results.
	at org.eclipse.tycho.surefire.TestMojo.runTest(TestMojo.java:966)
	at org.eclipse.tycho.surefire.TestMojo.execute(TestMojo.java:668)
	at org.apache.maven.plugin.DefaultBuildPluginManager.executeMojo(DefaultBuildPluginManager.java:132)
	at org.apache.maven.lifecycle.internal.MojoExecutor.execute(MojoExecutor.java:208)
	... 19 more
[ERROR] 
[ERROR] Re-run Maven using the -X switch to enable full debug logging.
[ERROR] 
[ERROR] For more information about the errors and possible solutions, please read the following articles:
[ERROR] [Help 1] http://cwiki.apache.org/confluence/display/MAVEN/MojoFailureException
[ERROR] 
[ERROR] After correcting the problems, you can resume the build with the command
[ERROR]   mvn <goals> -rf :org.eclipse.acceleo.query.tests
[DEBUG] Waiting for process to finish
[DEBUG] Result: 1
Terminating xvnc.
[FINDBUGS] Collecting findbugs analysis files...
[FINDBUGS] Finding all files that match the pattern **/findbugsXml.xml
[FINDBUGS] Parsing 34 files in /home/hudson/genie.modeling.acceleo/.hudson/jobs/acceleo-master-gerrit/workspace
[FINDBUGS] Successfully parsed file /home/hudson/genie.modeling.acceleo/.hudson/jobs/acceleo-master-gerrit/workspace/examples/org.eclipse.acceleo.examples/target/findbugsXml.xml of module  with 3 warnings.
[FINDBUGS] Successfully parsed file /home/hudson/genie.modeling.acceleo/.hudson/jobs/acceleo-master-gerrit/workspace/plugins/org.eclipse.acceleo.common.ui/target/findbugsXml.xml of module  with 1 warnings.
[FINDBUGS] Successfully parsed file /home/hudson/genie.modeling.acceleo/.hudson/jobs/acceleo-master-gerrit/workspace/plugins/org.eclipse.acceleo.common/target/findbugsXml.xml of module  with 22 warnings.
[FINDBUGS] Successfully parsed file /home/hudson/genie.modeling.acceleo/.hudson/jobs/acceleo-master-gerrit/workspace/plugins/org.eclipse.acceleo.compatibility.ui/target/findbugsXml.xml of module  with 3 warnings.
[FINDBUGS] Successfully parsed file /home/hudson/genie.modeling.acceleo/.hudson/jobs/acceleo-master-gerrit/workspace/plugins/org.eclipse.acceleo.compatibility/target/findbugsXml.xml of module  with 50 warnings.
[FINDBUGS] Successfully parsed file /home/hudson/genie.modeling.acceleo/.hudson/jobs/acceleo-master-gerrit/workspace/plugins/org.eclipse.acceleo.engine/target/findbugsXml.xml of module  with 12 warnings.
[FINDBUGS] Successfully parsed file /home/hudson/genie.modeling.acceleo/.hudson/jobs/acceleo-master-gerrit/workspace/plugins/org.eclipse.acceleo.ide.ui/target/findbugsXml.xml of module  with 123 warnings.
[FINDBUGS] Successfully parsed file /home/hudson/genie.modeling.acceleo/.hudson/jobs/acceleo-master-gerrit/workspace/plugins/org.eclipse.acceleo.model.edit/target/findbugsXml.xml of module  with 2 warnings.
[FINDBUGS] Successfully parsed file /home/hudson/genie.modeling.acceleo/.hudson/jobs/acceleo-master-gerrit/workspace/plugins/org.eclipse.acceleo.model/target/findbugsXml.xml of module  with 18 warnings.
[FINDBUGS] Successfully parsed file /home/hudson/genie.modeling.acceleo/.hudson/jobs/acceleo-master-gerrit/workspace/plugins/org.eclipse.acceleo.parser/target/findbugsXml.xml of module  with 44 warnings.
[FINDBUGS] Successfully parsed file /home/hudson/genie.modeling.acceleo/.hudson/jobs/acceleo-master-gerrit/workspace/plugins/org.eclipse.acceleo.profiler.edit/target/findbugsXml.xml of module  with 2 warnings.
[FINDBUGS] Successfully parsed file /home/hudson/genie.modeling.acceleo/.hudson/jobs/acceleo-master-gerrit/workspace/plugins/org.eclipse.acceleo.profiler.editor/target/findbugsXml.xml of module  with 2 warnings.
[FINDBUGS] Successfully parsed file /home/hudson/genie.modeling.acceleo/.hudson/jobs/acceleo-master-gerrit/workspace/plugins/org.eclipse.acceleo.profiler/target/findbugsXml.xml of module  with 5 warnings.
[FINDBUGS] Successfully parsed file /home/hudson/genie.modeling.acceleo/.hudson/jobs/acceleo-master-gerrit/workspace/plugins/org.eclipse.acceleo.traceability.model/target/findbugsXml.xml of module  with 13 warnings.
[FINDBUGS] Successfully parsed file /home/hudson/genie.modeling.acceleo/.hudson/jobs/acceleo-master-gerrit/workspace/plugins/org.eclipse.acceleo.traceability/target/findbugsXml.xml of module  with 4 warnings.
[FINDBUGS] Successfully parsed file /home/hudson/genie.modeling.acceleo/.hudson/jobs/acceleo-master-gerrit/workspace/plugins/org.eclipse.acceleo.ui.interpreter.completeocl.edit/target/findbugsXml.xml of module  with 0 warnings.
[FINDBUGS] Successfully parsed file /home/hudson/genie.modeling.acceleo/.hudson/jobs/acceleo-master-gerrit/workspace/plugins/org.eclipse.acceleo.ui.interpreter.completeocl/target/findbugsXml.xml of module  with 7 warnings.
[FINDBUGS] Successfully parsed file /home/hudson/genie.modeling.acceleo/.hudson/jobs/acceleo-master-gerrit/workspace/plugins/org.eclipse.acceleo.ui.interpreter.ocl/target/findbugsXml.xml of module  with 3 warnings.
[FINDBUGS] Successfully parsed file /home/hudson/genie.modeling.acceleo/.hudson/jobs/acceleo-master-gerrit/workspace/plugins/org.eclipse.acceleo.ui.interpreter/target/findbugsXml.xml of module  with 10 warnings.
[FINDBUGS] Successfully parsed file /home/hudson/genie.modeling.acceleo/.hudson/jobs/acceleo-master-gerrit/workspace/query/plugins/org.eclipse.acceleo.query.ide.ui/target/findbugsXml.xml of module  with 0 warnings.
[FINDBUGS] Successfully parsed file /home/hudson/genie.modeling.acceleo/.hudson/jobs/acceleo-master-gerrit/workspace/query/plugins/org.eclipse.acceleo.query/target/findbugsXml.xml of module  with 43 warnings.
[FINDBUGS] Successfully parsed file /home/hudson/genie.modeling.acceleo/.hudson/jobs/acceleo-master-gerrit/workspace/query/tests/org.eclipse.acceleo.query.ide.ui.tests/target/findbugsXml.xml of module  with 0 warnings.
[FINDBUGS] Successfully parsed file /home/hudson/genie.modeling.acceleo/.hudson/jobs/acceleo-master-gerrit/workspace/query/tests/org.eclipse.acceleo.query.tests.anydsl.edit/target/findbugsXml.xml of module  with 0 warnings.
[FINDBUGS] Successfully parsed file /home/hudson/genie.modeling.acceleo/.hudson/jobs/acceleo-master-gerrit/workspace/query/tests/org.eclipse.acceleo.query.tests.anydsl.editor/target/findbugsXml.xml of module  with 2 warnings.
[FINDBUGS] Successfully parsed file /home/hudson/genie.modeling.acceleo/.hudson/jobs/acceleo-master-gerrit/workspace/query/tests/org.eclipse.acceleo.query.tests.anydsl/target/findbugsXml.xml of module  with 14 warnings.
[FINDBUGS] Successfully parsed file /home/hudson/genie.modeling.acceleo/.hudson/jobs/acceleo-master-gerrit/workspace/query/tests/org.eclipse.acceleo.query.tests.qmodel/target/findbugsXml.xml of module  with 15 warnings.
[FINDBUGS] Successfully parsed file /home/hudson/genie.modeling.acceleo/.hudson/jobs/acceleo-master-gerrit/workspace/tests/org.eclipse.acceleo.common.tests/target/findbugsXml.xml of module  with 12 warnings.
[FINDBUGS] Successfully parsed file /home/hudson/genie.modeling.acceleo/.hudson/jobs/acceleo-master-gerrit/workspace/tests/org.eclipse.acceleo.compatibility.tests/target/findbugsXml.xml of module  with 3 warnings.
[FINDBUGS] Successfully parsed file /home/hudson/genie.modeling.acceleo/.hudson/jobs/acceleo-master-gerrit/workspace/tests/org.eclipse.acceleo.engine.tests/target/findbugsXml.xml of module  with 19 warnings.
[FINDBUGS] Successfully parsed file /home/hudson/genie.modeling.acceleo/.hudson/jobs/acceleo-master-gerrit/workspace/tests/org.eclipse.acceleo.ide.ui.tests/target/findbugsXml.xml of module  with 22 warnings.
[FINDBUGS] Successfully parsed file /home/hudson/genie.modeling.acceleo/.hudson/jobs/acceleo-master-gerrit/workspace/tests/org.eclipse.acceleo.model.tests/target/findbugsXml.xml of module  with 17 warnings.
[FINDBUGS] Successfully parsed file /home/hudson/genie.modeling.acceleo/.hudson/jobs/acceleo-master-gerrit/workspace/tests/org.eclipse.acceleo.parser.tests/target/findbugsXml.xml of module  with 48 warnings.
[FINDBUGS] Successfully parsed file /home/hudson/genie.modeling.acceleo/.hudson/jobs/acceleo-master-gerrit/workspace/tests/org.eclipse.acceleo.tests/target/findbugsXml.xml of module  with 0 warnings.
[FINDBUGS] Successfully parsed file /home/hudson/genie.modeling.acceleo/.hudson/jobs/acceleo-master-gerrit/workspace/tests/org.eclipse.acceleo.traceability.tests/target/findbugsXml.xml of module  with 49 warnings.
[FINDBUGS] Computing warning deltas based on reference build #1
[CHECKSTYLE] Skipping publisher since build result is FAILURE
[DRY] Skipping publisher since build result is FAILURE
Recording test results
[JaCoCo plugin] Collecting JaCoCo coverage data...
[JaCoCo plugin] **/**.exec;**/classes;**/src; locations are configured
[JaCoCo plugin] Number of found exec files: 3
[JaCoCo plugin] Saving matched execfiles:  /home/hudson/genie.modeling.acceleo/.hudson/jobs/acceleo-master-gerrit/workspace/query/tests/org.eclipse.acceleo.query.ide.ui.tests/target/jacoco.exec /home/hudson/genie.modeling.acceleo/.hudson/jobs/acceleo-master-gerrit/workspace/query/tests/org.eclipse.acceleo.query.tests/target/jacoco.exec /home/hudson/genie.modeling.acceleo/.hudson/jobs/acceleo-master-gerrit/workspace/tests/org.eclipse.acceleo.tests/target/jacoco.exec
[JaCoCo plugin] Saving matched class directories:  /home/hudson/genie.modeling.acceleo/.hudson/jobs/acceleo-master-gerrit/workspace/examples/org.eclipse.acceleo.examples/target/classes /home/hudson/genie.modeling.acceleo/.hudson/jobs/acceleo-master-gerrit/workspace/plugins/org.eclipse.acceleo.common.ui/target/classes /home/hudson/genie.modeling.acceleo/.hudson/jobs/acceleo-master-gerrit/workspace/plugins/org.eclipse.acceleo.common/target/classes /home/hudson/genie.modeling.acceleo/.hudson/jobs/acceleo-master-gerrit/workspace/plugins/org.eclipse.acceleo.compatibility.ui/target/classes /home/hudson/genie.modeling.acceleo/.hudson/jobs/acceleo-master-gerrit/workspace/plugins/org.eclipse.acceleo.compatibility/target/classes /home/hudson/genie.modeling.acceleo/.hudson/jobs/acceleo-master-gerrit/workspace/plugins/org.eclipse.acceleo.engine/target/classes /home/hudson/genie.modeling.acceleo/.hudson/jobs/acceleo-master-gerrit/workspace/plugins/org.eclipse.acceleo.ide.ui/target/classes /home/hudson/genie.modeling.acceleo/.hudson/jobs/acceleo-master-gerrit/workspace/plugins/org.eclipse.acceleo.model.edit/target/classes /home/hudson/genie.modeling.acceleo/.hudson/jobs/acceleo-master-gerrit/workspace/plugins/org.eclipse.acceleo.model/target/classes /home/hudson/genie.modeling.acceleo/.hudson/jobs/acceleo-master-gerrit/workspace/plugins/org.eclipse.acceleo.parser/target/classes /home/hudson/genie.modeling.acceleo/.hudson/jobs/acceleo-master-gerrit/workspace/plugins/org.eclipse.acceleo.profiler.edit/target/classes /home/hudson/genie.modeling.acceleo/.hudson/jobs/acceleo-master-gerrit/workspace/plugins/org.eclipse.acceleo.profiler.editor/target/classes /home/hudson/genie.modeling.acceleo/.hudson/jobs/acceleo-master-gerrit/workspace/plugins/org.eclipse.acceleo.profiler/target/classes /home/hudson/genie.modeling.acceleo/.hudson/jobs/acceleo-master-gerrit/workspace/plugins/org.eclipse.acceleo.traceability.model/target/classes /home/hudson/genie.modeling.acceleo/.hudson/jobs/acceleo-master-gerrit/workspace/plugins/org.eclipse.acceleo.traceability/target/classes /home/hudson/genie.modeling.acceleo/.hudson/jobs/acceleo-master-gerrit/workspace/plugins/org.eclipse.acceleo.ui.capabilities/target/classes /home/hudson/genie.modeling.acceleo/.hudson/jobs/acceleo-master-gerrit/workspace/plugins/org.eclipse.acceleo.ui.interpreter.completeocl.edit/target/classes /home/hudson/genie.modeling.acceleo/.hudson/jobs/acceleo-master-gerrit/workspace/plugins/org.eclipse.acceleo.ui.interpreter.completeocl/target/classes /home/hudson/genie.modeling.acceleo/.hudson/jobs/acceleo-master-gerrit/workspace/plugins/org.eclipse.acceleo.ui.interpreter.ocl/target/classes /home/hudson/genie.modeling.acceleo/.hudson/jobs/acceleo-master-gerrit/workspace/plugins/org.eclipse.acceleo.ui.interpreter/target/classes /home/hudson/genie.modeling.acceleo/.hudson/jobs/acceleo-master-gerrit/workspace/query/plugins/org.eclipse.acceleo.query.ide.ui/target/classes /home/hudson/genie.modeling.acceleo/.hudson/jobs/acceleo-master-gerrit/workspace/query/plugins/org.eclipse.acceleo.query/target/classes /home/hudson/genie.modeling.acceleo/.hudson/jobs/acceleo-master-gerrit/workspace/query/tests/org.eclipse.acceleo.query.ide.ui.tests/target/classes /home/hudson/genie.modeling.acceleo/.hudson/jobs/acceleo-master-gerrit/workspace/query/tests/org.eclipse.acceleo.query.tests.anydsl.edit/target/classes /home/hudson/genie.modeling.acceleo/.hudson/jobs/acceleo-master-gerrit/workspace/query/tests/org.eclipse.acceleo.query.tests.anydsl.editor/target/classes /home/hudson/genie.modeling.acceleo/.hudson/jobs/acceleo-master-gerrit/workspace/query/tests/org.eclipse.acceleo.query.tests.anydsl/target/classes /home/hudson/genie.modeling.acceleo/.hudson/jobs/acceleo-master-gerrit/workspace/query/tests/org.eclipse.acceleo.query.tests.qmodel/target/classes /home/hudson/genie.modeling.acceleo/.hudson/jobs/acceleo-master-gerrit/workspace/query/tests/org.eclipse.acceleo.query.tests/target/classes /home/hudson/genie.modeling.acceleo/.hudson/jobs/acceleo-master-gerrit/workspace/tests/org.eclipse.acceleo.common.tests/target/classes /home/hudson/genie.modeling.acceleo/.hudson/jobs/acceleo-master-gerrit/workspace/tests/org.eclipse.acceleo.compatibility.tests/target/classes /home/hudson/genie.modeling.acceleo/.hudson/jobs/acceleo-master-gerrit/workspace/tests/org.eclipse.acceleo.dynamic.tests/target/classes /home/hudson/genie.modeling.acceleo/.hudson/jobs/acceleo-master-gerrit/workspace/tests/org.eclipse.acceleo.engine.tests/target/classes /home/hudson/genie.modeling.acceleo/.hudson/jobs/acceleo-master-gerrit/workspace/tests/org.eclipse.acceleo.ide.ui.tests/target/classes /home/hudson/genie.modeling.acceleo/.hudson/jobs/acceleo-master-gerrit/workspace/tests/org.eclipse.acceleo.model.tests/target/classes /home/hudson/genie.modeling.acceleo/.hudson/jobs/acceleo-master-gerrit/workspace/tests/org.eclipse.acceleo.parser.tests/target/classes /home/hudson/genie.modeling.acceleo/.hudson/jobs/acceleo-master-gerrit/workspace/tests/org.eclipse.acceleo.tests/target/classes /home/hudson/genie.modeling.acceleo/.hudson/jobs/acceleo-master-gerrit/workspace/tests/org.eclipse.acceleo.traceability.tests/target/classes
[JaCoCo plugin] Saving matched source directories:  /home/hudson/genie.modeling.acceleo/.hudson/jobs/acceleo-master-gerrit/workspace/benchmark/org.eclipse.acceleo.benchmark.ecore2unittests.acceleo2/src /home/hudson/genie.modeling.acceleo/.hudson/jobs/acceleo-master-gerrit/workspace/benchmark/org.eclipse.acceleo.benchmark.ecore2unittests.acceleo3/src /home/hudson/genie.modeling.acceleo/.hudson/jobs/acceleo-master-gerrit/workspace/benchmark/org.eclipse.acceleo.benchmark.ecore2unittests.xpand/src /home/hudson/genie.modeling.acceleo/.hudson/jobs/acceleo-master-gerrit/workspace/examples/org.eclipse.acceleo.examples.uml2java.ui/src /home/hudson/genie.modeling.acceleo/.hudson/jobs/acceleo-master-gerrit/workspace/examples/org.eclipse.acceleo.examples.uml2java/src /home/hudson/genie.modeling.acceleo/.hudson/jobs/acceleo-master-gerrit/workspace/examples/org.eclipse.acceleo.examples/src /home/hudson/genie.modeling.acceleo/.hudson/jobs/acceleo-master-gerrit/workspace/examples/org.eclipse.acceleo.module.example.android.application/src /home/hudson/genie.modeling.acceleo/.hudson/jobs/acceleo-master-gerrit/workspace/examples/org.eclipse.acceleo.module.example.android/src /home/hudson/genie.modeling.acceleo/.hudson/jobs/acceleo-master-gerrit/workspace/examples/org.eclipse.acceleo.module.example.ecore2python.ui/src /home/hudson/genie.modeling.acceleo/.hudson/jobs/acceleo-master-gerrit/workspace/examples/org.eclipse.acceleo.module.example.ecore2python/src /home/hudson/genie.modeling.acceleo/.hudson/jobs/acceleo-master-gerrit/workspace/examples/org.eclipse.acceleo.module.example.ecore2unittests/src /home/hudson/genie.modeling.acceleo/.hudson/jobs/acceleo-master-gerrit/workspace/examples/org.eclipse.acceleo.module.example.uml2java.helios.ui/src /home/hudson/genie.modeling.acceleo/.hudson/jobs/acceleo-master-gerrit/workspace/examples/org.eclipse.acceleo.module.example.uml2java.helios/src /home/hudson/genie.modeling.acceleo/.hudson/jobs/acceleo-master-gerrit/workspace/examples/org.eclipse.acceleo.module.example.uml2java.ui/src /home/hudson/genie.modeling.acceleo/.hudson/jobs/acceleo-master-gerrit/workspace/examples/org.eclipse.acceleo.module.example.uml2java/src /home/hudson/genie.modeling.acceleo/.hudson/jobs/acceleo-master-gerrit/workspace/maven/acceleo.eclipse.archetype/src /home/hudson/genie.modeling.acceleo/.hudson/jobs/acceleo-master-gerrit/workspace/maven/acceleo.eclipse.archetype/src/main/resources/archetype-resources/__rootArtifactId__.ui/src /home/hudson/genie.modeling.acceleo/.hudson/jobs/acceleo-master-gerrit/workspace/maven/acceleo.eclipse.archetype/src/main/resources/archetype-resources/__rootArtifactId__/src /home/hudson/genie.modeling.acceleo/.hudson/jobs/acceleo-master-gerrit/workspace/maven/org.eclipse.acceleo.maven.compatibility/src /home/hudson/genie.modeling.acceleo/.hudson/jobs/acceleo-master-gerrit/workspace/maven/org.eclipse.acceleo.maven.launcher.compatibility/src /home/hudson/genie.modeling.acceleo/.hudson/jobs/acceleo-master-gerrit/workspace/maven/org.eclipse.acceleo.maven.launcher/src /home/hudson/genie.modeling.acceleo/.hudson/jobs/acceleo-master-gerrit/workspace/maven/org.eclipse.acceleo.maven/src /home/hudson/genie.modeling.acceleo/.hudson/jobs/acceleo-master-gerrit/workspace/plugins/org.eclipse.acceleo.common.ui/src /home/hudson/genie.modeling.acceleo/.hudson/jobs/acceleo-master-gerrit/workspace/plugins/org.eclipse.acceleo.common/src /home/hudson/genie.modeling.acceleo/.hudson/jobs/acceleo-master-gerrit/workspace/plugins/org.eclipse.acceleo.compatibility.ui/src /home/hudson/genie.modeling.acceleo/.hudson/jobs/acceleo-master-gerrit/workspace/plugins/org.eclipse.acceleo.compatibility/src /home/hudson/genie.modeling.acceleo/.hudson/jobs/acceleo-master-gerrit/workspace/plugins/org.eclipse.acceleo.engine/src /home/hudson/genie.modeling.acceleo/.hudson/jobs/acceleo-master-gerrit/workspace/plugins/org.eclipse.acceleo.ide.ui/src /home/hudson/genie.modeling.acceleo/.hudson/jobs/acceleo-master-gerrit/workspace/plugins/org.eclipse.acceleo.model.edit/src /home/hudson/genie.modeling.acceleo/.hudson/jobs/acceleo-master-gerrit/workspace/plugins/org.eclipse.acceleo.model/src /home/hudson/genie.modeling.acceleo/.hudson/jobs/acceleo-master-gerrit/workspace/plugins/org.eclipse.acceleo.parser/src /home/hudson/genie.modeling.acceleo/.hudson/jobs/acceleo-master-gerrit/workspace/plugins/org.eclipse.acceleo.profiler.edit/src /home/hudson/genie.modeling.acceleo/.hudson/jobs/acceleo-master-gerrit/workspace/plugins/org.eclipse.acceleo.profiler.editor/src /home/hudson/genie.modeling.acceleo/.hudson/jobs/acceleo-master-gerrit/workspace/plugins/org.eclipse.acceleo.profiler/src /home/hudson/genie.modeling.acceleo/.hudson/jobs/acceleo-master-gerrit/workspace/plugins/org.eclipse.acceleo.traceability.model/src /home/hudson/genie.modeling.acceleo/.hudson/jobs/acceleo-master-gerrit/workspace/plugins/org.eclipse.acceleo.traceability/src /home/hudson/genie.modeling.acceleo/.hudson/jobs/acceleo-master-gerrit/workspace/plugins/org.eclipse.acceleo.ui.capabilities/src /home/hudson/genie.modeling.acceleo/.hudson/jobs/acceleo-master-gerrit/workspace/plugins/org.eclipse.acceleo.ui.interpreter.completeocl.edit/src /home/hudson/genie.modeling.acceleo/.hudson/jobs/acceleo-master-gerrit/workspace/plugins/org.eclipse.acceleo.ui.interpreter.completeocl/src /home/hudson/genie.modeling.acceleo/.hudson/jobs/acceleo-master-gerrit/workspace/plugins/org.eclipse.acceleo.ui.interpreter.ocl/src /home/hudson/genie.modeling.acceleo/.hudson/jobs/acceleo-master-gerrit/workspace/plugins/org.eclipse.acceleo.ui.interpreter/src /home/hudson/genie.modeling.acceleo/.hudson/jobs/acceleo-master-gerrit/workspace/query/plugins/org.eclipse.acceleo.query.ide.ui/src /home/hudson/genie.modeling.acceleo/.hudson/jobs/acceleo-master-gerrit/workspace/query/plugins/org.eclipse.acceleo.query/src /home/hudson/genie.modeling.acceleo/.hudson/jobs/acceleo-master-gerrit/workspace/query/tests/org.eclipse.acceleo.query.compat.tests/src /home/hudson/genie.modeling.acceleo/.hudson/jobs/acceleo-master-gerrit/workspace/query/tests/org.eclipse.acceleo.query.ide.ui.tests/src /home/hudson/genie.modeling.acceleo/.hudson/jobs/acceleo-master-gerrit/workspace/query/tests/org.eclipse.acceleo.query.tests.anydsl/src /home/hudson/genie.modeling.acceleo/.hudson/jobs/acceleo-master-gerrit/workspace/query/tests/org.eclipse.acceleo.query.tests.qmodel.editor/src /home/hudson/genie.modeling.acceleo/.hudson/jobs/acceleo-master-gerrit/workspace/query/tests/org.eclipse.acceleo.query.tests.qmodel/src /home/hudson/genie.modeling.acceleo/.hudson/jobs/acceleo-master-gerrit/workspace/query/tests/org.eclipse.acceleo.query.tests/src /home/hudson/genie.modeling.acceleo/.hudson/jobs/acceleo-master-gerrit/workspace/tests/org.eclipse.acceleo.common.tests/src /home/hudson/genie.modeling.acceleo/.hudson/jobs/acceleo-master-gerrit/workspace/tests/org.eclipse.acceleo.compatibility.tests/src /home/hudson/genie.modeling.acceleo/.hudson/jobs/acceleo-master-gerrit/workspace/tests/org.eclipse.acceleo.dynamic.tests/src /home/hudson/genie.modeling.acceleo/.hudson/jobs/acceleo-master-gerrit/workspace/tests/org.eclipse.acceleo.engine.tests/src /home/hudson/genie.modeling.acceleo/.hudson/jobs/acceleo-master-gerrit/workspace/tests/org.eclipse.acceleo.ide.ui.tests/src /home/hudson/genie.modeling.acceleo/.hudson/jobs/acceleo-master-gerrit/workspace/tests/org.eclipse.acceleo.maven.plugin.tests/src /home/hudson/genie.modeling.acceleo/.hudson/jobs/acceleo-master-gerrit/workspace/tests/org.eclipse.acceleo.maven.tests/src /home/hudson/genie.modeling.acceleo/.hudson/jobs/acceleo-master-gerrit/workspace/tests/org.eclipse.acceleo.parser.tests/src /home/hudson/genie.modeling.acceleo/.hudson/jobs/acceleo-master-gerrit/workspace/tests/org.eclipse.acceleo.standalone.generators.tests/src /home/hudson/genie.modeling.acceleo/.hudson/jobs/acceleo-master-gerrit/workspace/tests/org.eclipse.acceleo.standalone.tests/data/workspace/o.e.a.p.eigth/src /home/hudson/genie.modeling.acceleo/.hudson/jobs/acceleo-master-gerrit/workspace/tests/org.eclipse.acceleo.standalone.tests/data/workspace/o.e.a.p.fifth/src /home/hudson/genie.modeling.acceleo/.hudson/jobs/acceleo-master-gerrit/workspace/tests/org.eclipse.acceleo.standalone.tests/data/workspace/o.e.a.p.first/src /home/hudson/genie.modeling.acceleo/.hudson/jobs/acceleo-master-gerrit/workspace/tests/org.eclipse.acceleo.standalone.tests/data/workspace/o.e.a.p.fourth/plugin/o.e.a.p.fourth.java/src /home/hudson/genie.modeling.acceleo/.hudson/jobs/acceleo-master-gerrit/workspace/tests/org.eclipse.acceleo.standalone.tests/data/workspace/o.e.a.p.fourth/plugin/o.e.a.p.fourth.maven/src /home/hudson/genie.modeling.acceleo/.hudson/jobs/acceleo-master-gerrit/workspace/tests/org.eclipse.acceleo.standalone.tests/data/workspace/o.e.a.p.second/src /home/hudson/genie.modeling.acceleo/.hudson/jobs/acceleo-master-gerrit/workspace/tests/org.eclipse.acceleo.standalone.tests/data/workspace/o.e.a.p.seventh/src /home/hudson/genie.modeling.acceleo/.hudson/jobs/acceleo-master-gerrit/workspace/tests/org.eclipse.acceleo.standalone.tests/data/workspace/o.e.a.p.sixth/src /home/hudson/genie.modeling.acceleo/.hudson/jobs/acceleo-master-gerrit/workspace/tests/org.eclipse.acceleo.standalone.tests/data/workspace/o.e.a.p.third/src /home/hudson/genie.modeling.acceleo/.hudson/jobs/acceleo-master-gerrit/workspace/tests/org.eclipse.acceleo.standalone.tests/src /home/hudson/genie.modeling.acceleo/.hudson/jobs/acceleo-master-gerrit/workspace/tests/org.eclipse.acceleo.tests/src /home/hudson/genie.modeling.acceleo/.hudson/jobs/acceleo-master-gerrit/workspace/tests/org.eclipse.acceleo.traceability.tests/src /home/hudson/genie.modeling.acceleo/.hudson/jobs/acceleo-master-gerrit/workspace/unit/plugins/org.eclipse.acceleo.unit.core/src /home/hudson/genie.modeling.acceleo/.hudson/jobs/acceleo-master-gerrit/workspace/unit/plugins/org.eclipse.acceleo.unit.ui/src /home/hudson/genie.modeling.acceleo/.hudson/jobs/acceleo-master-gerrit/workspace/unit/tests/org.eclipse.acceleo.unit.sample.tests/src /home/hudson/genie.modeling.acceleo/.hudson/jobs/acceleo-master-gerrit/workspace/unit/tests/org.eclipse.acceleo.unit.sample/src
[JaCoCo plugin] Loading inclusions files..
[JaCoCo plugin] inclusions: []
[JaCoCo plugin] exclusions: []
[JaCoCo plugin] Thresholds: JacocoHealthReportThresholds [minClass=0, maxClass=0, minMethod=0, maxMethod=0, minLine=0, maxLine=0, minBranch=0, maxBranch=0, minInstruction=0, maxInstruction=0, minComplexity=0, maxComplexity=0]
[JaCoCo plugin] Publishing the results..
[JaCoCo plugin] Loading packages..
[JaCoCo plugin] Done.
Sending e-mails to: stephane.begaudeau@obeo.fr laurent.goubet@obeo.fr cedric.brun@obeo.fr
Finished: FAILURE